##TITLE=31Pdec_LR-641-C1-IPSK
 CDCl3, 124 sc
 26.3.2020
##JCAMPDX= 6.0         $$ Bruker NMR JCAMP-DX V2.0
##DATA TYPE= NMR SPECTRUM
##DATA CLASS= NTUPLES
##ORIGIN= UXNMR, Bruker Analytische Messtechnik GmbH
##OWNER= root
$$ XWIN-NMR		Version 3.5
$$ Thu Mar 26 13:50:34 2020 Russian Standard Time (UT+4h)  she@DPX200
##.OBSERVE FREQUENCY= 81.013821
##.OBSERVE NUCLEUS= ^31P
##.ACQUISITION MODE= SIMULTANEOUS
##.ACQUISITION SCHEME= undefined
##.AVERAGES= 124
##.DIGITISER RES= 17
##SPECTROMETER/DATA SYSTEM= spect
##.PULSE SEQUENCE= zgpg30
##.SOLVENT NAME= CDCl3
##.SHIFT REFERENCE= (INTERNAL, CDCl3, 0, 182.463)
##AUDIT TRAIL= $$ (NUMBER, WHEN, WHO, WHERE, WHAT)
$$ ##TITLE= Audit trail, XWIN-NMR		Version 3.5
$$ ##JCAMPDX= 5.01
$$ ##ORIGIN= Bruker BioSpin GmbH
$$ ##OWNER= she
$$ F:/spectra/data/she/nmr/P31/1/pdata/1/auditp.txt
$$ ##AUDIT TRAIL=  $$ (NUMBER, WHEN, WHO, WHERE, WHAT)
(   1,<2020-03-26 13:45:43.40 +0400>,<she>,<DPX200>,
      <continue with go, POWCHK disabled, PULCHK disabled
       configuration hash MD5:
       00 E9 B6 7A A2 85 ED C7 34 08 36 98 17 FE 4E 26
       data hash MD5: 32K
       F3 89 AA 45 D9 23 1F A9 7F 3C 71 6B 00 27 AC B1>)
(   2,<2020-03-26 13:49:55.48 +0400>,<she>,<DPX200>,
      <Start of raw data processing
       efp BC_mod = 2 LB = 1 FT_mod = 6 PKNL = 1 PHC0 = -1383.411 PHC1 = 190.6017 SI = 64K 
       data hash MD5: 64K
       39 9F 11 52 DA CE 41 28 B2 48 BA BC 73 CD D7 73>)
(   3,<2020-03-26 13:50:01.65 +0400>,<she>,<DPX200>,
      <abs ABSG = 5 
       data hash MD5: 64K
       7A 51 1B 03 43 E0 2E 87 57 65 00 C4 00 B5 76 84>)
$$ ##END=
$$ 
$$ hash MD5
$$ DA C3 64 F1 E2 FB 6D 32 15 81 AB DB EB A9 CD 02
##$RELAX= 
##$RELAX= 
##$RELAX= 
##$RELAX= 
##$RELAX= 
##$RELAX= 
##$RELAX= 
##$RELAX= 
$$ Bruker specific parameters
$$ --------------------------
##$DU= <F:/spectra>
##$EXPNO= 1
##$NAME= <P31>
##$PROCNO= 1
##$TYPE= <nmr>
##$USER= <she>
##$AMP= (0..31)
100 100 100 100 100 100 100 100 100 100 100 100 100 100 100 100 100 100 
100 100 100 100 100 100 100 100 100 100 100 100 100 100 
##$AQSEQ= 0
##$AQ_mod= 1
##$AUNM= <au_zg>
##$AUTOPOS= <>
##$BF1= 81.014009
##$BF2= 200.13
##$BF3= 200.13
##$BF4= 200.13
##$BF5= 200.13
##$BF6= 200.13
##$BF7= 200.13
##$BF8= 200.13
##$BYTORDA= 1
##$CFDGTYP= 0
##$CFRGTYP= 5
##$CHEMSTR= <none>
##$CNST= (0..31)
1 1 145 1 1 1 1 1 1 1 1 1 1 1 1 1 1 1 1 1 1 1 1 1 1 1 1 1 1 1 1 1 
##$CPDPRG= <waltz16>
##$CPDPRG1= <>
##$CPDPRG2= <waltz16>
##$CPDPRG3= <>
##$CPDPRG4= <mlev>
##$CPDPRG5= <mlev>
##$CPDPRG6= <mlev>
##$CPDPRG7= <mlev>
##$CPDPRG8= <mlev>
##$CPDPRGB= <>
##$CPDPRGT= <>
##$D= (0..31)
0 1 0 0 0 0 0 0 0 0 0 0.03 2e-05 3e-06 0 0 0 0 0 0 0 0 0 0 0 0 0 0 0 0 
0 0 
##$DATE= 1585215735
##$DBL= (0..7)
120 120 120 11 120 120 24 19 
##$DBP= (0..7)
150 150 150 150 150 150 150 150 
##$DBP07= 0
##$DBPNAM0= <>
##$DBPNAM1= <>
##$DBPNAM2= <>
##$DBPNAM3= <>
##$DBPNAM4= <>
##$DBPNAM5= <>
##$DBPNAM6= <>
##$DBPNAM7= <>
##$DBPOAL= (0..7)
0.5 0.5 0.5 0.5 0.5 0.5 0.5 0.5 
##$DBPOFFS= (0..7)
0 0 0 0 0 0 0 0 
$$ [...]
##$SUBNAM3= <"">
##$SUBNAM4= <"">
##$SUBNAM5= <"">
##$SUBNAM6= <"">
##$SUBNAM7= <"">
##$SUBNAM8= <"">
##$SUBNAM9= <"">
##$SW= 369.568048894756
##$SWIBOX= (0..15)
0 1 3 0 0 0 0 0 0 0 0 0 0 0 0 0 
##$SW_h= 29940.119760479
##$TD= 32768
##$TD0= 1
##$TE= 0
##$TE2= 300
##$TE3= 300
##$TEG= 300
##$TL= (0..7)
0 120 53 12 22 120 120 120 
##$TP= (0..7)
150 150 150 150 150 150 150 150 
##$TP07= 0
##$TPNAME0= <>
##$TPNAME1= <>
##$TPNAME2= <>
##$TPNAME3= <>
##$TPNAME4= <>
##$TPNAME5= <>
##$TPNAME6= <>
##$TPNAME7= <>
##$TPOAL= (0..7)
0.5 0.5 0.5 0.5 0.5 0.5 0.5 0.5 
##$TPOFFS= (0..7)
0 0 0 0 0 0 0 0 
##$TUNHIN= 0
##$TUNHOUT= 0
##$TUNXOUT= 0
##$USERA1= <user>
##$USERA2= <user>
##$USERA3= <user>
##$USERA4= <user>
##$USERA5= <user>
##$V9= 5
##$VALIST= <valist>
##$VCLIST= <CCCCCCCCCCCCCCC>
##$VD= 0
##$VDLIST= <DDDDDDDDDDDDDDD>
##$VPLIST= <PPPPPPPPPPPPPPP>
##$VTLIST= <TTTTTTTTTTTTTTT>
##$WBST= 1024
##$WBSW= 4
##$XGAIN= (0..3)
0 0 0 0 
##$XL= 0
##$YL= 0
##$YMAX_a= 31760
##$YMIN_a= -9402
##$ZGOPTNS= <>
##$ZL1= 120
##$ZL2= 120
##$ZL3= 120
##$ZL4= 120
##$ABSF1= 182.463
##$ABSF2= -187.1042
##$ABSG= 5
##$ABSL= 3
##$ALPHA= 0
##$AQORDER= 0
##$ASSFAC= 0
##$ASSFACI= 0
##$ASSFACX= 0
##$ASSWID= 0
##$AUNMP= <proc_1d>
##$AZFE= 0.1
##$AZFW= 0.5
##$BCFW= 0
##$BC_mod= 2
##$BYTORDP= 0
##$COROFFS= 0
##$CY= -3
##$DATMOD= 1
##$DC= 0
##$DFILT= <>
##$DTYPP= 0
##$F1P= 0
##$F2P= 0
##$FCOR= 1
##$FTSIZE= 65536
##$FT_mod= 6
##$GAMMA= 0
##$GB= 0
##$INTBC= 1
##$INTSCL= 5.30512e-09
##$ISEN= 30
##$LB= 1
##$LEV0= 0
##$LPBIN= 0
##$MAXI= 10000
##$MC2= 0
##$MEAN= 0
##$ME_mod= 0
##$MI= 50
##$NCOEF= 0
##$NC_proc= -8
##$NLEV= 6
##$NOISF1= 182.463
##$NOISF2= 159.3651
##$NSP= 0
##$NTH_PI= 0
##$NZP= 0
##$OFFSET= 182.463
##$PC= 4
##$PHC0= -1383.411
##$PHC1= 190.6017
##$PH_mod= 1
##$PKNL= yes
##$PPARMOD= 0
##$PSCAL= 0
##$PSIGN= 0
##$REVERSE= no
##$SF= 81.0140089999434
##$SI= 65536
##$SIGF1= 159.3651
##$SIGF2= -187.1042
##$SINO= 113.3802
##$SIOLD= 16384
##$SREGLST= <1H.CDCl3>
##$SSB= 0
##$STSI= 65536
##$STSR= 0
##$SW_p= 29940.119760479
##$SYMM= 0
##$S_DEV= 0
##$TDeff= 32768
##$TDoff= 0
##$TI= <>
##$TILT= no
##$TM1= 0
##$TM2= 0
##$TOPLEV= 0
##$USERP1= <user>
##$USERP2= <user>
##$USERP3= <user>
##$USERP4= <user>
##$USERP5= <user>
##$WDW= 1
##$XDIM= 65536
##$YMAX_p= 79330401
##$YMIN_p= -316161875
$$ End of Bruker specific parameters
$$ ---------------------------------
##NTUPLES= NMR SPECTRUM
##VAR_NAME=  FREQUENCY,     SPECTRUM/REAL,   SPECTRUM/IMAG
##SYMBOL=    X,             R,               I
##VAR_TYPE=  INDEPENDENT,   DEPENDENT,       DEPENDENT
##VAR_FORM=  AFFN,          ASDF,            ASDF
##VAR_DIM=   65536,         65536,           65536
##UNITS=     HZ,            ARBITRARY UNITS, ARBITRARY UNITS
##FACTOR=    0.456856943014862, 1,           1
##FIRST=     14782.0589164792, 0,            0
##LAST=      -15158.0608439998, 0,           0
##MIN=       -15158.0608439998, -316161875,  0
##MAX=       14782.0589164792, 79330401,     0
$$ Real data points
##PAGE= N=1
##DATA TABLE= (X++(R..R)), XYDATA
$$ [...]
##PAGE= N=2
##DATA TABLE= (X++(I..I)), XYDATA
$$ plain form
4820 -29943310 -24959329 -15437919 -14352045 -12953533 -1528999 10727243 10748837 2311180
4812 2311180 -3163106 -5286034 -9588723 -13514588 -12529240 -12092377 -18481803 -24361996 -18317587
4803 -18317587 -3281738 8470747 12991941 13387119 7632691 -6126191 -17766386 -16732808
4795 -16732808 -11873504 -20787748 -40650829 -49281568 -37117889 -19411475 -12268546 -13500836
4787 -13500836 -13257138 -9061900 -3772651 -365853 -3262739 -13597820 -20999135 -13477493
4779 -13477493 2253616 5627531 -9163192 -25915040 -32550766 -36126514 -43554737 -45901604
4771 -45901604 -34366733 -16357062 -1916124 12125134 29671677 39655814 30198302
4764 30198302 10009480 -1332497 764690 4726267 3124012 -171538 -491173 2727656
$$ packed form
4820b9943310M983981R521410J085874J398512J1424534J2256242K1594q437657
4812B311180n474286k122928m302689l925865R85348M36863o389426n880193O044409
4803a8317587J5035849J1752485M521194L95178n754428j3758882j1640195J033578
4795a6732808M859304q914244j9863081q630739J2163679J7706414P142929j232290
4787a3500836K43698M195238N289249L406798k896886j0335081p401315P521642
4779a3477493J5731109L373915j4790723j6751848o635726l575748p428223k346867
4771d5901604J1534871J8009671J4440938J4041258J7546543R984137r457512
4764C0198302k0188822j1341977K097187L961577j602255l295550l19635L218829
$$ plain form
4756 2727656 9771439 18593865 21149370 11807825 -2693993 -10427419 -8560550 -2933786
4748 -2933786 1820883 3433319 -960089 -9513005 -13094950 -7522634 -1930293 -5020214
4740 -5020214 -10895264 -10266244 -6796770 -7874196 -8181894 -149351 7273941 1375344 -8590256
4731 -8590256 -2721109 14592974 17770055 918643 -11994438 -6151023 1968211 -4675298
4723 -4675298 -15716243 -15664857 -13404530 -25232981 -42713624 -43570486 -27231791 -14394482
4715 -14394482 -13593321 -11885127 -811626 10080555 11914808 10559251 13324607 16208290
4707 16208290 14381716 13327996 17919751 19707204 8722841 -7098283 -8758920 7263152
4699 7263152 21972213 17731782 -449941 -14422122 -16903858 -16572462 -21544277 -28043424
$$ packed form
4756B727656P043783Q822426K555505r341545j4501818p733426J866869N626764
4748b933786M754669J612436m393408q552916l581945N572316N592341l089921
4740e020214n875050O29020L469474j077426l07698Q032543P423292n898597r965600
4731h590256N869147J7314083L177081j6851412j2913081N843415Q119234o643509
4723d675298j1040945N1386K260327j1828451j7480643q56862J6338695J2837309
4715a4394482Q01161J708194J1073501J0892181J834253j355557K765356K883683
4707A6208290j826574j053720M591755J787453j0984363j5821124j660637J6022072
4699G263152J4709061m240431j8181723j3972181k481736L31396m971815o499147
$$ plain form
4691 -28043424 -28641750 -24357422 -22481966 -25623163 -28514230 -24908129 -13759797 814505
4683 814505 12486671 16313992 12452136 5853134 149189 -6518604 -16923642 -28404441
4675 -28404441 -35068053 -34670502 -29343407 -21251759 -11791048 -3198013 3564350 10270730
4667 10270730 16149456 15028939 4618950 -5658108 -6013799 -2396619 -8436787 -21705254
4659 -21705254 -23487510 -7150580 8191096 2575409 -17070994 -26540699 -15437275 3521074
4651 3521074 13708211 12446762 9012585 11744343 18768104 19747181 9020105 -3018698
4643 -3018698 538724 18917859 29394690 15168292 -12402353 -30772415 -36124145 -40391321
4635 -40391321 -44771070 -36957906 -15929944 734633 1570554 -3430357 -2000659 907642
$$ packed form
4691b8043424n98326M284328J875456l141197k891067L606101J1148332J4574302
4683H14505J1672166L827321l861856o599002n703945o667793j0405038j1480799
4675b8404441o663612L97551N327095Q091648R460711Q593035O762363O706380
4667A0270730N878726j120517j0409989j0277058l55691L617180o040168j3268467
4659b1705254j782256J6336930J5341676n615687j9646403r469705J1103424J8958349
4651C521074J0187137j261449l434177K731758P023761R79077j0727076j2038803
4643c018698L557422J8379135J0476831j4226398k7570645j8370062n351730m267176
4635d0391321m379749P813164K1027962J6664577Q35921n000911J429698K908301
$$ plain form
4627 907642 -3557951 -7456171 3161303 22224241 27362867 11140008 -7428704 -8188323
4619 -8188323 5841285 17383073 18507917 15067600 13069944 11716422 9292442 7197263
4611 7197263 6827830 8868149 16251563 30436945 42705350 37675022 11681811 -18006699
4603 -18006699 -29947103 -21763876 -9786476 -7763826 -14121665 -20149586 -21807630 -20049976
4595 -20049976 -16372019 -13049750 -13720327 -19423340 -26607041 -31613199 -33847370 -32256641
4587 -32256641 -23230955 -6043923 12954068 25645914 29350041 26169788 19131468 12574943
4579 12574943 11773230 16580171 18684917 10966124 -2972401 -14154846 -20025178 -24084977
4571 -24084977 -26526246 -23895748 -17380193 -12347242 -8546395 194843 13811686 22570100
$$ packed form
4627I07642m465593l898220J0617474J9062938N138626j6222859j8568712p59619
4619h188323J4029608J1541788J124844l440317j997656j353522k423980k095179
4611G197263l69433K040319P383414J4185382J2268405n030328k5993211k9688510
4603a8006699j1940404Q183227J1977400K022650o357839o027921j658044J757654
4595b0049976L677957L322269o70577n703013p183701n006158k234171J590729
4587c2256641R025686J7187032J8997991J2691846L704127l180253p038320o556525
4579A2574943q01713M806941K104746p718793j3938525j1182445n870332m059799
4571b4084977k441269K630498O515555N032951L800847Q741238J3616843Q758414
$$ plain form
4563 22570100 20678923 15283487 15076098 16663160 11281138 1066836 -1690379 8545359
4555 8545359 23413947 32585305 35088463 34701798 30660624 19943831 6112270 -1268683
4547 -1268683 2948083 14187068 24693664 31492497 35244496 34133170 23436416 2227656
4539 2227656 -21529044 -34825023 -30363835 -14462495 -2612844 -4260329 -12700608 -14243892
4531 -14243892 -7103036 -3946314 -12312866 -20852435 -13977364 5003018 17337373 14432789
4523 14432789 7252462 7124891 9563527 4470369 -7283423 -17075014 -21798186 -23969521
4515 -23969521 -23021810 -16828902 -9777905 -9441228 -15460958 -20324711 -21191178 -22121281 -23352718
4506 -23352718 -17535857 -898440 18090492 25784455 15893280 -6663949 -29875401 -40987092
$$ packed form
4563B2570100j891177n395436k07389J587062n382022j0214302k757215J0235738
4555H545359J4868588R171358K503158l86665m041174j0716793j3831561p380953
4547a268683M216766J1238985J0506596O798833L751999j111326j0696754k1208760
4539B227656k3756700j3295979M461188J5901340J1849651j647485q440279j543284
4531a4243892P140856L156722q366552q539569O875071J8980382J2334355k904584
4523A4432789p180327j27571K438636n093158j1753792r791591m723172k171335
4515b3969521R47711O192908P050997L36677o019730m863753q66467r30103j231437
4506b3352718N816861J6637417J8988932P693963r891175k2557229k3211452j1111691
$$ plain form
4498 -40987092 -34629219 -18756475 -8827730 -12143253 -20390046 -20932176 -12977432 -8035768
4490 -8035768 -14202910 -23692375 -19499123 4533742 33072764 43533057 31341284 14751837
4482 14751837 11300953 16982834 16414467 7106370 1194197 5001432 10788575 11669938
4474 11669938 11895717 15971706 18351360 12779504 3991071 399629 598701 -2882762
4466 -2882762 -9695133 -11593101 -5608160 1267049 1554408 -4957644 -13840505 -21063330
4458 -21063330 -24575602 -25203738 -26183784 -27972836 -24731707 -11484327 5622977 12768776
4450 12768776 3973710 -11924432 -21606901 -19631511 -8427438 8132681 26103207 39697338
4442 39697338 43969489 39580516 31983635 25803733 21793077 18662402 15820079 14400170
$$ packed form
4498d0987092O357873J5872744R928745l315523q246793n42130P954744M941664
4490h035768o167142r489465M193252K4032865K8539022J0460293j2191773j6589447
4482A4751837l450884N681881n68367r308097n912173L807235N787143Q81363
4474A1669938K25779M075989K379654n571856q788433l591442J99072l481463
4466b882762o812371j897968N984941O875209K87359o512052q882861p222825
4458b1063330l512272o28136r80046j789052L241129J3247380J7107304P145799
4450A2768776q795066j5898142r682469J975390J1204073J6560119J7970526J3594131
4442C9697338M272151m388973p596881o179902m010656l130675k842323j419909
$$ plain form
4434 14400170 16819549 24450670 34101482 38086095 30911275 16332160 5180009 4929279
4426 4929279 13033823 21273027 24240657 21934522 16933157 12852739 14119802 22117914
4418 22117914 30463298 28708574 13861058 -4399293 -13093495 -9056970 -261548 4435608
4410 4435608 4175625 5564433 15336025 32812388 48542832 52227693 43177467 30406124
4402 30406124 21576783 16528230 13587570 14676908 17825113 11975203 -9537273 -33767451
4394 -33767451 -39346969 -23548611 -5936418 -2256534 -7236988 -8961678 -7514693 -8756953
4386 -8756953 -9169935 -1182988 9767638 7175474 -15313092 -43600158 -57212314 -48239520
4378 -48239520 -24784169 -1187855 12402321 14694584 11294960 7980071 5251051 -402825
$$ packed form
4434A4400170K419379P631121R650812L984613p174820j4579115j1152151k50730
4426D929279Q104544Q239204K967630k306135n001365m080418J267063P998112
4418B2117914Q345384j754724j4847516j8260351q694202M036525Q795422M697156
4410D435608k59983J388808R771592J7476363J5730444L684861r050226j2771343
4402C0406124q829341n048553k940660J089338L148205n849910k1512476k4230178
4394c3767451n579518J5798358J7612193L679884m980454j724690J446985j242260
4386h756953m12982P986947J0950626k592164k2488566k8287066j3612156Q972794
4378d8239520K3455351K3596314J3590176K292263l399624l314889k729020n653876
$$ plain form
4370 -402825 -11006439 -23901306 -32967997 -32608171 -22478864 -8652065 2323164 9834973
4362 9834973 15488882 14646859 681762 -20008611 -27903268 -12960043 10538674 21176400
4354 21176400 16491780 11256143 14199453 19206566 18970589 15118222 12157119 10908124
4346 10908124 11123760 13020118 13563371 8009096 -2747652 -12550004 -18578898 -22679500
4338 -22679500 -24213622 -20870206 -17734457 -24445030 -39287373 -46848864 -37575897 -20025541
4330 -20025541 -7011953 210237 5287917 5136613 -2082045 -5636123 4807774 18715353
4322 18715353 14884039 -6683842 -20257356 -7735104 18112788 32806621 30165945
4315 30165945 21107312 12327130 2477176 -4121097 2533713 20710171 33293848 28879701
$$ packed form
4370d02825j0603614j2894867r066691L59826J0129307J3826799J0975229P511809
4362I834973N653909q42023j3965097k0690373p894657J4943225K3498717J0637726
4354B1176400m684620n235637K943310N007113k35977l852367k961103j248995
4346A0908124K15636J896358N43253n554275j0756748r802352o028894m100602
4338b2679500j534122L343416L135749o710573j4842343p561491R272967J7550356
4330b0025541J3013588P222190N077680j51304p218658l554078J0443897J3907579
4322A8715353l831314k1567881j3573514J2522252K5847892J4693833k640676
4315C0165945r058633q780182r849954o598273O654810J8176458J2583677m414147
$$ plain form
4307 28879701 16670253 11819684 13825582 10625104 104329 -5063752 4325953 20405345
4299 20405345 26801757 15077424 -9842458 -34943375 -47110640 -41675021 -27218156
4292 -27218156 -18202013 -19876131 -24003064 -21003086 -10741990 1151364 10839881 15814019
4284 15814019 13547529 6367703 1851590 2404785 541505 -8708703 -17411738 -15370058
4276 -15370058 -4967822 4615334 12232280 21934968 29918431 27922861 17526908 7872257
4268 7872257 909728 -7438497 -13721631 -11159063 -6969605 -16571499 -37621405 -49643981
4260 -49643981 -45284208 -41049884 -47343885 -49163634 -31580758 -5550022 10139153 16609082
4252 16609082 23909437 26683765 15623832 3069955 9142606 26106266 24950068 -3578
$$ packed form
4307B8879701j2209448m850569K005898l200478j0520775n168081R389705J6079392
4299B0405345O396412j1724333k4919882k5100917j2167265N435619J4456865
4292b7218156R016143j674118m126933K999978J0261096J1893354R688517M974138
4284A5814019k266490p179826m516113N53195j863280r250208q703035K041680
4276a5370058J0402236R583156P616946R702688P983463j995570j0395953r654651
4268G872257o962529q348225o283134K562568M189458r601894k1049906j2022576
4260d9643981M359773M234324o294001j819749J7582876K6030736J5689175O469929
4252A6609082P300355K774328j1059933j2553877O072651J6963660j156198k4953646
$$ plain form
4244 -3578 -19473426 -9938676 16118836 30885737 24272845 6118313 -8939202 -8320551
4236 -8320551 12597693 40187383 49886967 34167444 12453977 4197737 4825955 -92769
4228 -92769 -9663557 -12245620 -6534117 -2073846 -3499992 -7774287 -12684003 -15450538 -7989969
4219 -7989969 12338025 31244327 32026933 19552319 14099367 21591883 26698360 18641129
4211 18641129 7354382 6434384 13159470 15295406 9078265 1013214 -3117490 -3914188
4203 -3914188 -6340414 -15703557 -30926063 -39794211 -28724718 -1421919 20196768 19304700
4195 19304700 1273703 -17490122 -28481718 -31079031 -23562584 -6972128 7647866
4188 7647866 9441067 3196972 2611351 9674778 13724827 11167221 11872343 21935853
$$ packed form
4244c578j9469848R534750K6057512J4766901o612892j8154532j5057515O18651
4236h320551K0918244K7589690R699584j5719523k1713467q256240O28218m918724
4228i2769r570788k582063N711503M460271j426146m274295m909716k766535P460569
4219g989969K0327994J8906302P82606j2474614n452952P492516N106477q057231
4211A8641129j1286747r19998O725086K135936o217141q065051m130704p96698
4203c914188k426226r363143j5222506q868148J1069493K7302799K1618687q92068
4195A9304700j8030997j8763825j0991596k597313P516447J6590456J4619994
4188G647866J793201o244095n85621P063427M050049k557606P05122J0063510
$$ plain form
4180 21935853 32940178 35061070 30490660 26453449 23927085 21335907 21106898 23205101
4172 23205101 19396673 4755348 -10691080 -13714605 -7571238 -7077537 -15542738 -20390006
4164 -20390006 -13406679 -1828066 5533350 10891914 18542656 23314050 17989947 6220948
4156 6220948 -1553015 -1633364 1406323 3617542 4488932 3588419 2050240 4929201 13896951
4147 13896951 19916324 13055405 -1086602 -5984128 2679357 10023661 3672647 -8053194
4139 -8053194 -8923442 1406092 7765595 969780 -11816813 -18838634 -16839475 -9952668
4131 -9952668 -3047771 -78541 -3311459 -9633528 -11772294 -7603862 -4510506 -9416454
4123 -9416454 -17931749 -20253217 -16021881 -14629071 -19282843 -20020967 -8703916 5891149
$$ packed form
4180B1935853J1004325K120892m570410m037211k526364k591178k29009K098203
4172B3205101l808428j4641325j5446428l023525O143367M93701q465201m847268
4164b0390006O983327J1578613P361416N358564P650742M771394n324103j1768999
4156F220948p773963q0349L039687K211219Q71390r00513j538179K878961Q967750
4147A3896951O019373o860919j4142007m897526Q663485P344304o351014j1725841
4139h053194q70248J0329534O359503o795815j2786593p021821J999159O886807
4131i952668O904897K969230l232918o322069k138766M168432L093356m905948
4123i416454q515295k321468M231336J392810m653772p38124J1317051J4595065
$$ plain form
4115 5891149 7723168 -3683531 -10220338 2195312 25814647 41039396 38857222 27066325
4107 27066325 17568852 14938980 17057042 19716871 18250749 10137227 -460160 -4752914
4099 -4752914 184585 6280409 4504803 -2619096 -4868484 127254 2960600 -3289576
4091 -3289576 -12192742 -13452913 -8152221 -6178294 -10761510 -15432211 -17484534 -23959145
4083 -23959145 -38593950 -51338644 -49660241 -35136289 -19330951 -6681708 7231559
4076 7231559 21128912 24912422 15888629 7191828 11541541 23658545 28412214 22303082
4068 22303082 16358527 18352044 22713881 21902940 19657734 25533472 39541838 50030799
4060 50030799 47829669 36199465 23290928 10474875 -4368238 -14926120 -9133630
$$ packed form
4115E891149J832019j1406699o536807J2415650K3619335J5224749k182174j1790897
4107B7066325r497473k629872K118062K659829j466122q113522j0597387m292754
4099d752914M937499O095824j775606p123899k249388M995738K833346o250176
4091c289576q903166j260171N300692J973927m583216m670701k052323o474611
4083b3959145j4634805j2744694J678403J4523952J5805338J2649243J3913267
4076G231559J3897353L783510r023793q696801M349713J2117004M753669o109132
4068B2303082n944555J993517M361837q10941k245206N875738J4008366J0488961
4060E0030799k201130j1630204j2908537j2816053j4843113j0557882N792490
$$ plain form
4053 -9133630 12820804 33343253 37683395 31347223 28402099 30662297 31247263 31722899
4045 31722899 37955700 41810521 28003289 2078532 -10123992 950047 13634238
4038 13634238 9407423 1548668 10233875 25922942 22581459 -1750536 -22867395 -25450544
4030 -25450544 -17107938 -8255334 -435832 3214122 -2874791 -12252374 -9866293 4821359
4022 4821359 15629281 15490078 15981967 24366065 30129021 24304247 14876826 11160688
4014 11160688 8156327 -767541 -9091475 -8204230 -1630351 3934916 10103218 17368801
4006 17368801 17268623 8029571 4999598 18579852 33202039 27493456 6583290 -5949631
3998 -5949631 -1974387 6071133 9350120 9890706 5336042 -10469297 -28601850 -28534642
$$ packed form
4053i133630K1954434K0522449M340142o336172k945124K260198N84966M75636
4045C1722899O232801L854821j3807232k5924757j2202524J1074039J2684191
4038A3634238m226815p858755Q685207J5689067l341483k4331995k1116859k583149
4030b5450544Q342606Q852604P819502L649954o088913r377583K386081J4687652
4022D821359J0807922j39203M91889Q384098N762956n824774r427421l716138
4014A1160688l004361q923868q323934Q87245O573879N565267O168302P265583
4006A7368801j00178r239052l029973J3580254J4622187n708583k0910166j2532921
3998e949631L975244Q045520L278987N40586m554664j5805339j8132553O7208
$$ plain form
3990 -28534642 -7930574 9139349 3326010 -15081847 -22853697 -14458069 -4868989 -7805074
3982 -7805074 -20264676 -27224268 -18149929 379696 10921187 8040320 8400549 27449971
3974 27449971 52024431 53117703 25469394 -3985430 -11612758 -3672949 224810 -5848705
3966 -5848705 -14712764 -20530484 -19834510 -7958189 12295476 25475604 20069748 5858135
3958 5858135 2571217 13829037 24052840 21310692 12807299 14154779 29317585 45585646
3950 45585646 47502162 33820051 18525560 13772604 15800070 13311703 5919976 4170947
3942 4170947 12143905 22131508 28614927 34407891 38133363 29606094 6839608 -14078904
3934 -14078904 -17481974 -7770247 360193 2923341 5418994 7584970 3730313 -4760708
$$ packed form
3990b8534642K0604068J7069923n813339j8407857p771850Q395628R589080k936085
3982g805074j2459602o959592R074339J8529625J0541491k880867L60229J9049422
3974B7449971K4574460J093272k7648309k9454824p627328P939809L897759o073515
3966e848705q864059n817720O95974J1876321K0253665J3180128n405856j4211613
3958E858135l286918J1257820J0223803k742148q503393J347480J5162806J6268061
3950D5585646J916516j3682111j5294491m752956K027466k488367p391727j749029
3942D170947P972958R987603O483419N792964L725472q527269k2766486k0918512
3934a4078904l403070R711727Q130440K563148K495653K165976l854657q491021
$$ plain form
3926 -4760708 -10088481 -10129113 -9439870 -9595814 -8182303 -5907446 -5535985 -5294825 -1856659
3917 -1856659 2404279 3600459 4451975 8999180 13412753 13061768 14514854 27215935
3909 27215935 45966749 56247555 55453561 52795591 48239772 30585565 1240999 -18891803
3901 -18891803 -15873562 -792409 9150302 13189693 17820963 18759328 9623379 -60071
3893 -60071 5117448 21404415 29009342 21098343 12817700 16747431 24148810 19243308
3885 19243308 1830622 -14075575 -17862372 -9596707 5873419 22589546 32570126 29999921
3877 29999921 18263805 7302097 2458986 596519 -1801921 -2596352 994680 6649584
3869 6649584 10591020 12651062 12705117 6656889 -6633719 -17792690 -16089051 -5585412
$$ packed form
3926d760708n327773m0632O89243j55944J413511K274857L71461K41160L438166
3917a856659M260938J196180Q51516M547205M413573l50985J453086J2701081
3909B7215935J8750814J0280806p93994k657970m555819j7654207k9344566k0132802
3901a8891803L018241J5081153R942711M039391M631270R38365r135949r683450
3893f0071N177519J6286967P604927p910999q280643L929731P401379m905502
3885A9243308j7412686j5906197l786797Q265665J5470126J6716127R980580k570205
3877B9999921j1736116j0961708m843111j862467k398440p94431L591032N654904
3869F649584L941436K060042N4055o048228j3290608j1158971J703639J0503639
$$ plain form
3861 -5585412 -1495436 -8488958 -14027327 -8356847 320071 -567260 -9052751 -15187137
3853 -15187137 -19128357 -28151129 -39176641 -40125954 -29704951 -21032537 -21181294 -20253432
3845 -20253432 -8044748 9087023 17351928 14542677 10595100 13064860 20048822 25396515
3837 25396515 24339175 15040363 -214469 -15571731 -26064171 -29995074 -25696559 -10963599
3829 -10963599 10008118 23893909 19557457 988255 -16399263 -21664923 -16115501 -6768481
3821 -6768481 1757432 7935217 11237877 12185369 11927788 9956003 4298303 -4273386 -10123887
3812 -10123887 -7819131 260857 3907223 -4292500 -18239220 -22009682 -7378479 14766687
3804 14766687 25173704 17387829 2612220 -6631510 -10153340 -13729997 -16252563 -11296410
$$ packed form
3861e585412M089976o993522n538369N670480Q676918q87331q485491o134386
3853a5187137l941220r022772j1025512r49313J0421003Q672414j48757R27862
3845b0253432J2208684J7131771Q264905k809251l947577K469760O983962N347693
3837B5396515j057340r298812j5254832j5357262j0492440l930903M298515J4732960
3829a0963599K0971717J3885791m336452j8569202j7387518n265660N549422R347020
3821f768481Q525913O177785L302660R47492k57581j971785n657700q571689n850501
3812a0123887K304756Q079988L646366q199723j3946720l770462J4631203K2145166
3804A4766687J0407017p785875j4775609r243730l521830l576657k522566M956153
$$ plain form
3796 -11296410 1121571 12744543 18153340 20952109 25625959 28217854 20742564 3595088
3788 3595088 -12044863 -16310848 -11324332 -5710003 -802224 10611431 29661850 42935301
3780 42935301 36498237 15697422 1828195 7249749 21294088 24804311 12376741 -5894272
3772 -5894272 -20316017 -30466336 -37670762 -36737594 -21610740 2426146 18606771 14663532
3764 14663532 -3182912 -16939721 -17610569 -13559091 -15629976 -20839004 -18417722 -8115509
3756 -8115509 -2017496 -7047042 -14930631 -13795270 -3117068 7878736 12110041 10106181
3748 10106181 6783607 6970458 11949296 17305892 16251594 7421049 -2800857 -7202279
3740 -7202279 -4103296 4103073 14298288 22561312 25585336 25112975 26345370 28638849
$$ packed form
3796a1296410J2417981J1622972N408797K798769M673850K591895p475290j7147476
3788C595088j5639951m265985M986516N614329M907779J1413655J9050419J3273451
3780D2935301o437064k0800815j3869227N421554J4044339L510223j2427570j8271013
3772e894272j4421745j0150319p204426R33168J5126854K4036886J6180625l943239
3764A4663532j7846444j3756809o70848M051478k070885n209028K421282J0302213
3756h115509O098013n029546p883589J135361J0678202J0995804M231305k003860
3748A0106181l322574J86851M978838N356596j054298q830545j0221906m401422
3740g202279L098983Q206369J0195215Q263024L024024m72361J232395K293479
$$ plain form
3732 28638849 22969128 3860916 -19800868 -31722017 -24810406 -7158222 7117825
3725 7117825 10171290 5403273 2692743 7356554 13592747 12366571 5265120 3488533
3717 3488533 11248825 18799271 16967219 10325269 8310449 10322050 9562749 7048482
3709 7048482 10586725 21032353 29866352 31735740 30996760 33032298 35218752 30352692
3701 30352692 16828999 3572942 4261224 23751081 49210314 59852514 48700011
3694 48700011 29030225 15246780 5482048 -8858418 -24300338 -28983537 -21864343 -14881991
3686 -14881991 -15245085 -16866137 -11734070 -451525 11155914 17962749 15849926 3626439
3678 3626439 -12656592 -23177796 -23805623 -17629266 -8556737 63944 3011776 -1381957
$$ packed form
3732B8638849n669721j9108212k3661784j1921149O911611J7652184J4276047
3725G117825L053465m768017k710530M663811O236193j226176p101451j776587
3717C488533P760292P550446j832052o641950k014820K011601p59301k514267
3709G048482L538243J0445628Q833999J869388p38980K035538K186454m866060
3701C0352692j3523693j3256057O88282J9489857K5459233J0642200j1152503
3694D8700011j9669786j3783445r764732j4340466j5441920m683199P119194O982352
3686a4881991l63094j621052N132067J1282545J1607439O806835k112823j2223487
3678C626439j6283031j0521204o27827O176357R072529Q620681K947832m393733
$$ plain form
3670 -1381957 -4979350 664204 9940868 10272867 2188585 -2961859 -6052186 -21633869
3662 -21633869 -49515211 -64499412 -48394631 -17172532 734855 2144951 6280538
3655 6280538 21449959 35451075 38201113 34603171 31375357 27479499 23411863 25342493
3647 25342493 31498938 27034972 4558515 -18490968 -17325392 7371055 27296921 20269472
3639 20269472 -4013374 -18134917 -9948748 7363278 15576769 11817807 5878364 5073150
3631 5073150 8676738 14240941 22271120 33572865 45634933 52782900 49352147 35164167
3623 35164167 19557093 15245229 23468342 29727547 20944994 2773372 -8805436 -9656386
3615 -9656386 -10050783 -16491701 -24308561 -30452577 -39918851 -53541764 -61407819 -56475485
$$ packed form
3670a381957l597393N643554R276664L31999q084282n150444l090327j5581683
3662b1633869k7881342j4984201J6104781L1222099J7907387J410096M135587
3655F280538J5169421J4001116K750038l597942l227814l895858m067636J930630
3647B5342493O156445m463966k2476457k3049483J165576K4696447J9925866p027449
3639B0269472k4282846j4121543Q186169J7312026Q213491l758962n939443q05214
3631E073150L603588N564203Q030179J1301745J2062068P147967l430753j4187980
3623C5164167j5607074m311864Q223113O259205q782553j8171622j1578808q50950
3615i656386l94397o440918p816860o144016r466274j3622913p866055M932334
$$ plain form
3607 -56475485 -45025988 -35300725 -25025876 -9874364 3916167 6666755 -624467 -9726533
3599 -9726533 -17700318 -25729112 -30766880 -30066017 -29639983 -35135428 -37391177 -22252678
3591 -22252678 5037600 21020011 13972471 -1110327 -4264599 4994015 14456771 20114277
3583 20114277 26631592 31518861 23849188 2095854 -17579931 -18705218 -5402608 2494446
3575 2494446 -4996218 -15598584 -12518283 1568584 7191000 -6251722 -26691205 -34200090
3567 -34200090 -22252917 31747 20041660 29758775 26795481 15161734 3784197
3560 3784197 -545818 2350529 10217448 21883412 33364712 37633640 34581562 34490388
3552 34490388 43461196 51683757 46305192 30735308 19206616 15630516 11341088 2902325
$$ packed form
3607e6475485J1449497R725263J0274849J5151512J3790531K750588p291222r102066
3599i726533p973785q028794n037768P00863M26034n495445k255749J5138499
3591b2252678K7290278J5982411p047540j5082798l154272R258614R462756N657506
3583B0114277O517315M887269p669673k1753334j9675785j125287J3302610P897054
3575B494446p490664j0602366L080301J4086867N622416j3442722k0439483p508885
3567c4200090J1947173K2284664K0009913R717115k963294j1633747j1377537
3560C784197m330015K896347P866919J1665964J1481300M268928l052078r1174
3552C4490388Q970808Q222561n378565j5569884j1528692l576100m289428q438763
$$ plain form
3544 2902325 -2181607 -133305 1709120 -2508393 -7238404 -4261467 5712897 14798079
3536 14798079 15744100 5916212 -9678016 -17839395 -8174024 12592670 25634527 22216491
3528 22216491 12127215 7206101 7121385 6513379 5128307 3066516 -4077734 -15569872
3520 -15569872 -19304381 -6610251 12174697 18256162 7316250 -8166251 -16633132 -17078061
3512 -17078061 -12884673 -7377118 -6396992 -14983498 -28177076 -32833750 -22380766 -4520692
3504 -4520692 8107562 9832295 2747274 -8231719 -17387430 -20039696 -17018531 -14800266
3496 -14800266 -17622724 -21693824 -20888879 -16380496 -15831213 -22381801 -28454633 -23539421
3488 -23539421 -6991927 9907475 15729024 11073589 7068716 12167186 22876100 28807891
$$ packed form
3544B902325n083932K048302J842425m217513m730011K976937R974364R085182
3536A4798079R46021r827888j5594228q161379R665371K0766694J3041857l418036
3528B2216491j0089276m921114q4716o08006j385072k061791p144250j1492138
3520a5569872l734509J2694130J8784948O081465j0939912j5482501q466881m44929
3512a7078061M193388N507555R80126q586506j3193578m656674J0452984J7860074
3504d520692J2628254J724733p085021j0978993r155711k652266L021165K218265
3496a4800266k822458m071100Q04945M508383N49283o550588o072832M915212
3488b3539421J6547494J6899402N821549m655435m004873N098470J0708914N931791
$$ plain form
3480 28807891 24937057 15864230 8019607 1647072 -5911159 -11157628 -5482656 11750913
3472 11750913 27084795 27132546 16281317 11304825 17718397 21354147 8017558 -16925767
3464 -16925767 -35539262 -37621189 -26823926 -12473603 -4073901 -9140831 -26109791 -41396221
3456 -41396221 -42458259 -31776155 -19765526 -8384222 6423325 19555336 19595561 7796453
3448 7796453 -1081957 -804637 -1927286 -11745095 -19977560 -14392226 -279946 6704911
3440 6704911 786055 -9951920 -15070897 -10202129 1441558 10218873 7474223 -3667949
3432 -3667949 -10324169 -5951010 2814754 8627007 13240653 19715621 24598264 24379964
3424 24379964 20753299 13823681 890912 -11894911 -10398792 5421991 14698782 4038940
$$ packed form
3480B8807891l870834r072827p844623o372535p558231n246469N674972J7233569
3472A1750913J5333882M7751j0851229m976492O413572L635750j3336589k4943325
3464a6925767j8613495k081927J0797263J4350323Q399702n066930j6968960j5286430
3456d1396221j062038J0682104J2010629J1381304J4807547J3132011M0225j1799108
3448G796453q878410K77320j122649r817809q232465N585334J4112280O984857
3440F704911n918856j0737975n118977M868768J1643687Q777315k744650j1142172
3432c667949o656220M373159Q765764N812253M613646O474968M882643k18300
3424B4379964l626665o929618j2932769j2785823J496119J5820783R276791j0659842
$$ plain form
3416 4038940 -11129580 -10199180 360448 -533958 -12633716 -15032954 -480962 13904002
3408 13904002 12839785 733552 -10519485 -15106771 -10666600 2756821 16436662 18673838
3400 18673838 10665508 4907511 5880286 5594733 515852 -1723851 3295558 9319081
3392 9319081 11172185 11658545 12690381 11791212 10471326 12658247 12356860 -933532 -20447260
3383 -20447260 -24333095 -7187128 9385015 8542350 1996413 7380301 18870782 19488545
3375 19488545 10114597 5013752 5752942 460431 -13539844 -24794430 -25512991 -18946866
3367 -18946866 -8562599 5774271 19106341 22199556 14693286 6778698 4035216 -4972
3359 -4972 -11432658 -23617026 -23626584 -8312587 10027282 14283641 -1192472 -24649507
$$ packed form
3416D038940j5168520R30400J0559628q94406j2099758k399238J4551992J4384964
3408A3904002j064217j2106233j1253037m587286M440171J3423421J3679841K237176
3400A8673838q008330n757997R72775k85553n078881k239703N019409O023523
3392I319081J853104M86360J031836q99169j319886K186921l01387j3290392j9513728
3383b0447260l885835J7145967J6572143q42665o545937N383888J1490481O17763
3375A9488545r373948n100845P39190n292511j4000275j1254586p18561O566125
3367a8946866J0384267J4336870J3332070L093215p506270p914588k743482m040188
3359d972j1427686j2184368r558J5313997J8339869M256359j5476113k3457035
$$ plain form
3351 -24649507 -38636138 -37313178 -28846957 -21938895 -17321236 -13422025 -10819747 -7318392
3343 -7318392 1439747 11109720 9250634 -5787802 -18106206 -16359676 -10815289 -15124370
3335 -15124370 -22460412 -17581972 -4705770 -2643567 -14730761 -23611174 -17265447 -2682784
3327 -2682784 8690802 12714951 7261944 -7759028 -20635634 -15064040 5894719 18326071
3319 18326071 7937324 -12066882 -21973720 -19907248 -14523086 -7522342 2006572 6322439
3311 6322439 -1642440 -13633797 -15586160 -7964005 -2821076 -3455143 -1610798 5099779
3303 5099779 7563857 1037820 -4972831 664677 15391874 26433599 25537282 15924269
3295 15924269 7504815 8201503 17322920 25096333 21344092 6902130 -5915492 -6348095
$$ packed form
3351b4649507j3986631J322960Q466221O908062M617659L899211K602278L501355
3343g318392Q758139R669973j859086j5038436j2318404J746530N544387m309081
3335a5124370p336042M878440J2876202K062203j2087194q880413O345727J4582663
3327b682784J1373586M024149n453007j5020972j2876606N571594K0958759J2431352
3319A8326071j0388747k0004206r906838K066472N384162P000744R528914M315867
3311F322439p964879j1991357j952363P622155N142929o34067J844345O710577
3303E099779K464078o526037o010651N637508J4727197J1041725q96317r613013
3295A5924269q419454O96688R121417P773413l752241j4441962j2817622m32603
$$ plain form
3287 -6348095 3613177 13214456 15315729 11109222 4550824 -2236296 -7018050 -6324751
3279 -6324751 -26759 6380651 8565072 9858224 15338465 21249692 18119338 5275385
3271 5275385 -6125314 -8113101 -6221709 -9433809 -16863297 -21557978 -21695318 -19752241
3263 -19752241 -15304362 -7778507 -2752761 -5903822 -13335082 -17470460 -19449742 -24382863
3255 -24382863 -27063879 -16941401 1813715 10433230 699446 -13166143 -14516313 -4799543
3247 -4799543 3767499 6036308 5234767 3990022 3155161 4327433 6224337 3885355 -1908828
3238 -1908828 -731426 13871928 31917987 36797575 24585473 6334724 -6122715 -9704056
3230 -9704056 -7409958 -2928515 1504911 4905477 5426700 -139112 -10404456 -15095449
$$ packed form
3287f348095R961272R601279K101273m206507o558398o787120m781754O93299
3279f324751O297992O407410K184421J293152N480241N911227l130354j2843953
3271E275385j1400699j987787J891392l212100p429488m694681j37340J943077
3263a9752241M447879P525855N025746l151061p431260m135378j979282m933121
3255b4382863k681016J0122478J8755116Q619515r733784j3865589j350170R716770
3247d799543Q567042K268809q01541j244745q34861J172272J896904k338982n794183
3238a908828J177402J4603354J8046059M879588j2212102j8250749j2457439l581341
3230i704056K294098M481443M433426L400566N21223n565812j0265344m690993
$$ plain form
3222 -15095449 -5844014 8705216 10775497 -328055 -3865264 13142149 36032735 42685524
3214 42685524 31646628 17219098 7041054 -288428 -3295399 341928 4806498 4053353
3206 4053353 4193857 13565379 25631462 27837448 23022678 24137219 30380241 27988779
3198 27988779 14871840 4930155 5088054 6643168 3920216 3523766 8710067 11385831
3190 11385831 7500666 5362933 10492610 16094433 16554527 16597131 18691933 15641979 5758671
3181 5758671 1848141 13354636 31112563 41382021 43900056 43949989 37809323 20777216
3173 20777216 1409972 -6998532 -3846351 1956541 6597663 10891426 11553062 5858490
3165 5858490 66841 962275 3915606 1493597 -1643835 3753949 13742930 16070476
$$ packed form
3222a5095449R251435J4549230K070281j1103552l537209J7007413K2890586O652789
3214D2685524j1038896j4427530j0178044p329482l006971L637327M464570p53145
3206D053353J40504R371522J2066083K205986m814770J114541O243022k391462
3198B7988779j3116939r941685J57899J555114k722952l96450N186301K675764
3190A1385831l885165k137733N129677N601823M60094M2604K094802l049954r883308
3181E758671l910530J1506495J7757927J0269458K518035M9933o140666j7032107
3173B0777216j9367244q408504L152181N802892M641122M293763O61636n694572
3165E858490n791649Q95434K953331k422009l137432N397784R988981K327546
$$ plain form
3157 16070476 10404377 8248091 12750356 13523085 4184546 -7656331 -12040415 -8696360
3149 -8696360 -3704435 -1035405 229077 4650395 15510866 27465518 29400842 20674776
3141 20674776 16219114 25157402 33342717 22380012 -842796 -12170117 -4292163 6765947
3133 6765947 8338415 3705890 -3458992 -15261031 -25053235 -18663597 1013454 11147132
3125 11147132 1852081 -7792308 -388461 12433626 11482959 2195684 3222867 14683323
3117 14683323 21819981 23240110 30262823 39609606 31931077 3020574 -24574213 -30536136
3109 -30536136 -21057947 -13332255 -9448338 -160574 13119813 15976910 1005989 -21079322
3101 -21079322 -34189854 -33982407 -27869756 -22806472 -19793912 -19303983 -23958048 -31797051
$$ packed form
3157A6070476n666099k156286M502265P72729r338539j1840877m384084L344055
3149h696360M991925K669030J264482M421318J0860471J1954652J935324q726066
3141B0674776m455662Q938288Q185315j0962705k3222808j1327321P877954J1058110
3133F765947J572468m632525p164882j1802039r792204O389638J9677051J0133678
3125A1147132r295051r644389P403847J2822087r50667r287275J027183J1460456
3117A4683323P136658J420129P022713R346783p678529k8910503k7594787n961923
3109c0536136R478189P725692L883917R287764J3280387K857097j4970921k2085311
3101b1079322j3110532K07447O112651N063284L012560M89929m654065p839003
$$ plain form
3093 -31797051 -33418871 -23565754 -12063715 -13707303 -27945265 -38858014 -36806347 -29062182
3085 -29062182 -24869510 -21446154 -12577127 -1517754 4662315 6906257 10506894 14998558
3077 14998558 17354783 20315838 27194297 32520874 29021839 21062598 19437117 24117130
3069 24117130 24232275 15728319 7136701 5190344 5866727 4600822 5947163 15858771
3061 15858771 29956227 36761466 31242013 20794235 17357064 24743396 34300883 34563684
3053 34563684 25233998 17578130 19160722 23930235 21848070 12552658 3370141 -522691
3045 -522691 3233968 16554001 33791444 38478846 20833893 -4384199 -11939753 2283502
3037 2283502 17855589 18672495 9789497 1753576 -6025258 -17865188 -29759688 -34284438
$$ packed form
3093c1797051j621820R853117J1502039j643588j4237962j0912749K051667P744165
3085b9062182M192672L423356Q869027J1059373O180069K243942L600637M491664
3077A4998558K356225K961055O878459N326577l499035p959241j625481M680013
3069B4117130J15145q503956q591618j946357O76383j265905J346341R911608
3061A5858771J4097456O805239n519453j0447778l437171P386332R557487K62801
3053C4563684r329686p655868J582592M769513k082165r295412r182517l892832
3045e22691L756659J3320033J7237443M687402j7644953k5218092p555554J4223255
3037B283502J5572087Q16906q882998q035921p778834j1839930j1894500m524750
$$ plain form
3029 -34284438 -29796384 -18068522 -900351 14990149 19204166 11454377 5434135 10543162
3021 10543162 17942800 14266733 1873471 -5390061 -1228344 9346551 21289750 32744700
3013 32744700 38422258 31460077 14177304 -1462079 -7207674 -6579229 -7143819 -9806584
3005 -9806584 -9496604 -4072115 1391729 546593 -5240287 -6901053 1342020 13699150
2997 13699150 19322850 14739563 4830658 -5614742 -13749672 -14380518 -4239644 9067347
2989 9067347 13285201 8528163 6728248 11717372 13530823 7662419 4789537 11822446
2981 11822446 17379375 9088638 -6352011 -15082003 -18070841 -24753206 -32765236 -32690612
2973 -32690612 -28118812 -30978489 -37906218 -31454128 -8213239 12704788 16092366 10134227
$$ packed form
3029c4284438M488054J1727862J7168171J5890500M214017p749789o020242N109027
3021A0543162P399638l676067j2393262p263532M161717J0574895J1943199J1454950
3013C2744700N677558o962181j7282773j5639383n745595O28445n64590k662765
3005i806584L09980N424489N463844q45136n786880j660766Q243073J2357130
2997A3699150N623700m583287r908905j0445400q134930o30846J0140874J3306991
2989I067347M217854m757038j799915M989124J813451n868404k872882P032909
2981A1822446N556929q290737j5440649q729992k988838o682365q012030P4624
2973c2690612M571800k859677o927729O452090K3240889K0918027L387578n958139
$$ plain form
2965 10134227 10890320 20079695 28517475 32070666 32972529 30755604 22271241 9135003
2957 9135003 -2221391 -7947630 -9841776 -11101143 -12019288 -10790552 -8019227 -9185719
2949 -9185719 -19374994 -33917691 -38868661 -25893005 -3831908 10100135 8450034 -2272948
2941 -2272948 -11920782 -13944819 -5318476 11402588 26091356 29481899 24621750 23211308
2933 23211308 30164096 38229289 38151116 28402084 15414945 9146610 15438824 26575379
2925 26575379 24600632 3483367 -17411957 -14971339 6240138 19766550 13212632 599802
2917 599802 -3623060 -3735451 -7791879 -10335424 -2812562 9675196 14663338 9157104
2909 9157104 768690 -3041948 -181251 6319985 8866060 1806804 -9257176 -12718490
$$ packed form
2965A0134227P56093R189375Q437780L553191R01863k216925q484363j3136238
2957I135003j1356394n726239j894146j259367r18145J228736K771325j166492
2949i185719j0189275j4542697m950970J2975656K2061097J3932043j650101j0722982
2941b272948r647834k024037Q626343J6721064J4688768L390543m860149j410442
2933B3211308O952788Q065193p8173r749032j2987139o268335O292214J1136555
2925B6575379j974747k1117265k0895324K440618K1211477J3526412o553918j2612830
2917E99802m222862j12391m056428k543545P522862J2487758M988142n506234
2909I157104q388414l810638K860697O501236K546075p059256j1063980l461314
$$ plain form
2901 -12718490 -7827700 -4861063 -5058301 3988377 24397145 35841714 22337259 -696651
2893 -696651 -3592219 20092557 49305618 63881750 61526073 49519607 35355780 26053278
2885 26053278 23788907 21060017 10418799 -1911488 -3205516 6075702 12256050 8801692
2877 8801692 4020411 5550899 9142837 8176108 4399634 2165704 -956933 -9892072
2869 -9892072 -21635289 -26171496 -18448188 -5505912 1043734 -668508 542231 14273353
2861 14273353 33362071 40934882 32414900 20336175 14352480 8788577 -2289764 -9974873
2853 -9974873 -3533341 9966480 14015105 5895531 -2990545 -6891140 -10844597 -17063834
2845 -17063834 -20750334 -20351869 -18821868 -13824806 -134033 16664700 22779372 15572790
$$ packed form
2901a2718490M890790K966637j97238R046678K0408768J1444569j3504455k3033910
2893f96651k895568K3684776K9213061J4576132k355677j2006466j4163827r302502
2885B6053278k264371k728890j0641218j2330287j294028R281218O180348l454358
2877H801692m781281J530488L591938r66729l776474k233930l122637q935139
2869i892072j1743217m536207P723308J2942276O549646j712242J210739J3731122
2861A4273353J9088718P572811q519982j2078725n983695n563903j1078341p685109
2853i974873O441532J3499821M048625q119574q886076l900595l953457o219237
2845a7063834l686500L98465J530001M997062J3690773J6798733O114672p206582
$$ plain form
2837 15572790 7062057 4729821 2854754 -2188612 -2854613 5028948 11359367 5490440
2829 5490440 -8860841 -21755560 -30937322 -37840957 -38360420 -29161345 -17392543 -12984277
2821 -12984277 -14946693 -14774592 -9848722 -4247311 227863 3834784 2114117 -9753448
2813 -9753448 -25255297 -28883483 -13327010 11821400 30933997 37042529 33747531 27132873
2805 27132873 19375684 9190768 -3262360 -12968017 -13765075 -6640134 -1164062 -5206157
2797 -5206157 -15098847 -19859761 -14108579 -2886000 5854988 9224866 8963220 7051461
2789 7051461 4714537 3960137 6461291 10049406 9095236 1260491 -7318356 -7833708 -728901
2780 -728901 2874916 -5178722 -19168591 -26976176 -25066954 -19793101 -16019614 -12163428
$$ packed form
2837A5572790q510733k332236j875067n043366o66001P883561O330419n868927
2829E490440j4351281j2894719r181762o903635n19463R199075J1768802M408266
2821a2984277j962416J72101M925870N601411M475174L606921j720667j1867565
2813i753448j5501849l628186J5556473K5148410J9112597O108532l294998o614658
2805B7132873p757189j0184916j2453128r705657p97058P124941N476072m042095
2797e206157r892690m760914N751182J1222579Q740988L369878k61646j911759
2789G051461k336924p54400K501154L588115r54170p834745q578847n15352P104807
2780g28901L603817q053638j3989869p807585J909222N273853L773487L856186
$$ plain form
2772 -12163428 -6859338 -3350570 -4936990 -10992128 -19035912 -26463774 -29910191 -28242923
2764 -28242923 -26600884 -31163764 -38694242 -38173908 -25533800 -10421450 -4614982 -8797866
2756 -8797866 -14383376 -13912421 -6225886 4380096 10460305 6398505 -5305306 -14855363
2748 -14855363 -14419827 -4976266 5902320 10012945 3578002 -8482607 -14214825 -6812850
2740 -6812850 5521035 9079526 3101565 -557049 3726864 8373993 7442178 6396529
2732 6396529 10690121 14556601 8966889 -6401805 -25355765 -42312882 -52225001 -51829545
2724 -51829545 -46471923 -46277942 -49495303 -40881303 -15100053 10251399 16662631 8961935
2716 8961935 3711454 3205571 -1860391 -10475305 -11237260 -2370606 5833828 9266073 14525588
$$ packed form
2772a2163428N304090L508768j586420o055138q043784p427862l446417J667268
2764b8242923J642039m562880p530478N20334J2640108J5112350N806468m182884
2756h797866n585510M70955P686535J0605982O080209m061800j1703811r550057
2748a4855363M35536R443561J0878586M110625o434943j2060609n732218P401975
2740f812850J2333885L558491n977961l658614M283913M647129r31815j045649
2732F396529M293592L866480n589712j5368694j8953960j6957117r912119L95456
2724e1829545N357622J93981l217361Q614000K5781250K5351452O411232p700696
2716H961935n250481n05883n065962q614914p61955Q866654Q204434L432245N259515
$$ plain form
2707 14525588 23000733 25513873 16873514 2993057 -10086295 -21825772 -28130838 -19909989
2699 -19909989 2814356 25904259 36421007 34028125 23149301 5620449 -12001678
2692 -12001678 -15916261 -1134268 17280239 19560170 3181016 -18482028 -33269737
2685 -33269737 -36725480 -27747262 -10352266 2524322 -438916 -13463192 -19286431 -12365988
2677 -12365988 -5915844 -11371238 -21213469 -20926059 -11056675 -6138063 -13863490 -26399961
2669 -26399961 -33630109 -34423591 -30521357 -19764725 -4217974 3114284 -7527317 -25163460
2661 -25163460 -28485982 -14043285 -220146 -208705 -6025657 -6584998 -6440029 -13449891
2653 -13449891 -19761448 -12628639 2141497 6112368 -4038438 -12892945 -12490546 -14063797
$$ packed form
2707A4525588Q475145K513140q640359j3880457j3079352j1739477o305066Q220849
2699a9909989K2724345K3089903J0516748k392882j0878824j7528852j7622127
2692a2001678l914583J4781993J8414507K279931j6379154k1663044j4787709
2685c3269737l455743Q978218J7394996J2876588k963238j3024276n823239O920443
2677a2365988O450144n455394r842231K87410R869384M918612p725427j2536471
2669b6399961p230148p93482L902234J0756632J5546751P332258j0641601j7636143
2661b5163460l322522J4442697J3823139J1441n816952n59341J44969p009862
2653a3449891o311557P132809J4770136L970871j0150806q854507M02399j573251
$$ plain form
2645 -14063797 -26519427 -38842800 -35430045 -18299280 -1529925 9393477 19336040
2638 19336040 27770002 25345986 9476268 -6816379 -8719367 1894335 8568868 836751
2630 836751 -12497518 -13697695 2891663 24693156 35697336 32570345 23953238 18468291
2622 18468291 17910352 19527630 19959687 17652249 14795202 15584314 19669216 19934058 10924307
2613 10924307 -2938251 -12375170 -14493072 -13838563 -13797221 -12525120 -7107084 2538990
2605 2538990 13117497 18054871 11155273 -4846201 -16639967 -14004648 -3147704 611550
2597 611550 -7625269 -17100728 -15602940 -2962546 9778910 10612250 -2106468 -14602145
2589 -14602145 -8507253 17103304 39908362 38897138 19176933 1958930 -4093573 -7234828
$$ packed form
2645a4063797j2455630j2323373L412755J7130765J6769355J0923402R942563
2638A9336040Q433962k424016j5869718j6292647j902988J0613702O674533p732117
2630H36751j3334269j200177J6589358K1801493J1004180l126991q617107n484947
2622A8468291n57939J617278M32057k307438k857047P89112M084902K64842r009751
2613A0924307j3862558r436919k117902O54509M1342J272101N418036R646074
2605B538990J0578507M937374o899598j6001474j1793766K635319J0856944L759254
2597F11550q236819r475459J497788J2640394J2741456Q33340j2718718j2495677
2589a4602145O094892K5610557K2805058j011224j9720205j7218003o052503l141255
$$ plain form
2581 -7234828 -12379112 -14228303 -11822579 -12881959 -18944903 -21037235 -15728779 -11248570
2573 -11248570 -10844799 -4330046 14465413 34569275 43553755 45884656 52814724 61642184
2565 61642184 58954744 41132457 19099436 2821663 -8877037 -21028333 -32281523
2558 -32281523 -35934385 -28728685 -15569716 -4417569 2263822 7190739 8753079 -888024
2550 -888024 -22483573 -41667262 -43980993 -32881355 -22059761 -15217925 -7047503 201355
2542 201355 -2081006 -12398478 -20398621 -23927186 -28118886 -29413324 -20545830 -10372088
2534 -10372088 -15181104 -29228402 -30272406 -17434419 -13291076 -21933557 -19799304 -848829
2526 -848829 6884352 -9909496 -22974540 -12370700 -4751177 -25209104 -48870034 -49146229
$$ packed form
2581g234828n144284j849191K405724j059380o062944k092332N308456M480209
2573a1248570M03771O514753J8795459K0103862Q984480K330901O930068Q827460
2565F1642184k687440j7822287k2033021j6277773j1698700j2151296j1253190
2558c2281523l652862P205700J3158969J1152147O681391M926917J562340r641103
2550h88024k1595549j9183689k313731J1099638J0821594O841836Q170422P248858
2542B01355k282361j0317472q000143l528565m191700j294438Q867494J0173742
2534a0372088m809016j4047298j044004J2837987M143343q642481K134253J8950475
2526h48829P733181j6793848j3065044J0603840P619523k0457927k3660930k76195
$$ plain form
2518 -49146229 -60033589 -124866900 -201556235 -194981973 -89979508 17923626 46295162
2511 46295162 19696153 8696727 29158682 47043315 45502146 37062595 28308359 16085988
2503 16085988 9852941 22235614 41922996 44897403 29337447 14989766 11553424 10241702
2495 10241702 3745488 -6180426 -18428759 -30736908 -31403589 -12146340 13075256 21300492
2487 21300492 11393261 2631353 3150678 724117 -11455659 -20185738 -12485192 4673703
2479 4673703 15377739 15542935 13249718 14923870 19229796 21172920 16784921 5739628
2471 5739628 -7779717 -18298272 -23607327 -24324325 -20808814 -14231528 -8393801 -5461626
2463 -5461626 -2028830 4857219 9980986 5352598 -7538933 -17887865 -18203703 -10798060
$$ packed form
2518d9146229j0887360o4833311p6689335O574262J05002465J07903134K8371536
2511D6295162k6599009j0999426K0461955J7884633j541169q439551q754236j2222371
2503A6085988o233047J2382673J9687382K974407j5559956j4347681l436342j311722
2495A0241702o496214r925914j2248333j2308149o66681J9257249K5221596Q225236
2487B1300492r907231q761908N19325k426561j2179776q730079P700546J7158895
2479D673703J0704036J65196k293217J674152M305926J943124m387999j1045293
2471E739628j3519345j0518555n309055p16998L515511O577286N837727K932175
2463e461626L432796O886049N123767m628388j2891531j0348932l15838P405643
$$ plain form
2455 -10798060 -1951883 3968713 4472373 -176549 -4707290 -3314385 2130218 3524866
2447 3524866 -2543439 -10528961 -14107016 -13463496 -12199963 -11646454 -11272694 -11241502 -11269718
2438 -11269718 -9052490 -2683109 6163680 13077520 14446447 9660472 878156 -8789904
2430 -8789904 -17705645 -26771465 -37398946 -47923443 -52546900 -45293421 -26818024 -7184579
2422 -7184579 1426761 -2790401 -8881421 -6743588 247792 2068793 -1713792 -2033270
2414 -2033270 3384541 5059400 -2563943 -10683417 -9111160 -2030652 -1203889 -7920880
2406 -7920880 -11781177 -6580153 985493 247806 -10449556 -21146340 -19253259 -2535794
2398 -2535794 16005200 19929071 7476961 -7402953 -13949680 -16168930 -20441703 -21169523
$$ packed form
2455a0798060Q846177N920596N03660m648922m530741J392905N444603J394648
2447C524866o068305p985522l578055O43520J263533N53509L73760L1192k8216
2438a1269718K217228O369381Q846789O913840J368927m785975q782316r668060
2430h789904q915741r065820j0627481j0524497m623457P253479J8475397J9633445
2422g184579Q611340m217162o091020K137833O991380J821001l782585l19478
2414b033270N417811J674859p623343q119474J572257P080508Q26763o716991
2406g920880l860297N201024P565646p37687j0697362j0696784J893081J6717465
2398b535794J8540994L923871j2452110j4879914o546727k219250m272773p27820
$$ plain form
2390 -21169523 -9253489 10947278 24903831 25738310 18432269 8635497 -1255168 -6071869
2382 -6071869 -1349718 4730900 -4021704 -28964467 -49152327 -45570498 -25326156 -11545881
2374 -11545881 -13529103 -18203917 -11384782 3084031 10585224 5371018 -4857904 -11833699
2366 -11833699 -15604637 -18014138 -14892658 -2078954 14135546 21267966 16041467 8335323
2358 8335323 7736602 12520547 14774444 10561811 1550303 -8334443 -14605924 -15378657 -15252344
2349 -15252344 -20370924 -27715175 -26976267 -15919653 -4584449 193308 3711355 10418809
2341 10418809 14169059 11372971 11669119 21657652 28812098 18988518 1688107 -2456280
2333 -2456280 5504283 4988056 -10097559 -23456623 -26381082 -30993185 -43434659 -46569061
$$ packed form
2390b1169523J1916034K0200767J3956553Q34479p306041r796772r890665m816701
2382f071869M722151O080618q752604k4942763k0187860L581829K0244342J3780275
2374a1545881j983222m674814O819135J4468813P501193n214206j0228922o975795
2366a1833699l770938k409501L121480J2813704J6214500P132420n226499p706144
2358H335323n98721M783945K253897m212633r011508r884746o271481p72733J26313
2349a5252344n118580p344251P38908J1056614J1335204M777757L518047O707454
2341A0418809L750250k796088K96148R988533P154446r823580j7300411m144387
2333b456280P960563n16227j5085615j3359064k924459m612103j2441474l134402
$$ plain form
2325 -46569061 -25901346 4365280 20219932 20812852 22686548 29152718 27041993 12080637
2317 12080637 -3185656 -10816766 -19455479 -36434967 -50680013 -45311619 -21534100 1040906
2309 1040906 7483048 2927257 2417190 10767514 17914276 13703802 2010517 -3862349
2301 -3862349 1932340 10507848 9302088 -3137888 -16189911 -19241764 -12046112 -3287820
2293 -3287820 -848623 -4692340 -9317233 -11553450 -13085448 -15010988 -14304822 -9188339
2285 -9188339 -4856977 -8606749 -20030905 -30632824 -33350015 -28960387 -23132828 -20391411
2277 -20391411 -21128141 -22289625 -21267014 -19689765 -20557697 -21083466 -14480991 -1645948
2269 -1645948 7064230 7388858 9107024 19192978 27132262 21347579 11752672 16467301
$$ packed form
2325d6569061K0667715L0266626J5854652N92920J873696O466170k110725j4961356
2317A2080637j5266293p631110q638713j6979488j4245046N368394K3777519K2575006
2309A040906O442142m555791n10067Q350324P146762m210474j1693285n872866
2301c862349N794689Q575508j205760j2439976j3052023l051853P195652Q758292
2293c287820K439197l843717m624893k236217j531998j925540P06166N116483
2285i188339M331362l749772j1424156j0601919k717191M389628N827559K741417
2277b0391411p36730j161484J022611J577249q67932n25769O602475J2835043
2269a645948Q710178L24628J718166J0085954P939284n784683r594907M714629
$$ plain form
2261 16467301 30298332 29313515 8257304 -10490793 -12200519 -10387699 -19736243 -30502880
2253 -30502880 -28261163 -21251726 -25407597 -34482562 -30114513 -15560895 -14171608 -33824436
2245 -33824436 -55099865 -59110783 -48376157 -34434677 -22059649 -13903697 -15426232 -23797696
2237 -23797696 -22888832 -1734169 28026498 43470299 35576818 15286799 -1767787 -8375824
2229 -8375824 -6080814 -1161324 -1151535 -9186792 -19928559 -24699993 -21305384 -15073080 -9607843
2220 -9607843 -1492676 12494499 26716592 31276507 24988644 17488263 15864205 15213597
2212 15213597 7988658 -2284920 -5335587 15975 4654386 4508687 6011849 12657163
2204 12657163 17500292 15841379 14517030 18640631 18829528 5133135 -13264294 -18412781
$$ packed form
2261A6467301J3831031r84817k1056211j8748097j709726J812820r348544j0766637
2253c0502880K241717P009437m155871r074965M368049J4553618J389287j9652828
2245c3824436k1275429m010918J0734626J3941480J2375028Q155952j522535q371464
2237b3797696R08864K1154663K9760667J5443801p893481k0290019j7054586o608037
2229h375824K295010M919490R789q035257j0741767m771434L394609O232304N465237
2220i607843Q115167J3987175J4222093M559915o287863p500381j624058o50608
2212A5213597p224939j0273578l050667N351562M638411j45699J503162O645314
2204A2657163M843129j658913j324349M123601J88897j3696393j8397429n148487
$$ plain form
2196 -18412781 -10491650 -6716803 -12492871 -12591047 1839644 14900229 8243074 -9897256
2188 -9897256 -14855075 -15254 15636222 15930188 8716821 11267318 24246108 31259734
2180 31259734 21845782 4915366 -3703271 -646770 3665914 192520 -8947116 -16485423
2172 -16485423 -19398482 -18304143 -12037997 654357 14895102 21390193 16482132 6586158
2164 6586158 85442 -2257373 -5420376 -10344297 -10912787 -2790269 8036411 10481478
2156 10481478 2370118 -5975620 -5256692 461953 841064 -4682314 -6615144 -1040702
2148 -1040702 3905540 454641 -7828944 -12067900 -8519487 1215798 13276575 19942347
2140 19942347 13210870 -3040105 -12736178 -8404801 -3983999 -14991696 -33243327 -36901110
$$ packed form
2196a8412781P921131L774847n776068r8176J4430691J3060585o657155j8140330
2188i897256m957819J4839821J5651476K93966p213367K550497J2978790P013626
2180C1259734r413952j6930416q618637L056501M312684l473394r139636p538307
2172a6485423k913059J094339O266146J2692354J4240745O495091m908061r895974
2164F586158o500716k342815l163003m923921n68490Q122518J0826680K445067
2156A0481478q111360q345738P18928N718645L79111n523378j932830N574442
2148a040702M946242l450899q283585m238956L548413R735285J2060777O665772
2140A9942347o731477j6250975r696073M331377M420802j1007697j8251631l657783
$$ plain form
2132 -36901110 -21818696 -5253378 1808921 7282686 17609934 22613606 12187408 -4421044
2124 -4421044 -9834904 -2453725 3319665 -2313191 -14317773 -22648976 -24062075 -22998151
2116 -22998151 -25642532 -33788366 -42192125 -43325716 -36591670 -29789886 -29023629 -31181038
2108 -31181038 -29904219 -24586711 -18416566 -11155011 -261383 12129782 19029362 15908277
2100 15908277 5161252 -6319000 -12144675 -10911030 -7709830 -8400871 -10274470 -2906021
2092 -2906021 17636317 40153916 50162714 46927687 41044055 37154842 28733222 11711276
2084 11711276 -5859611 -13243320 -10385422 -5605395 -3327685 -1027588 2303453 1781340
2076 1781340 -6171650 -16722023 -21310737 -17611286 -10505017 -4334638 174420 878152
$$ packed form
2132c6901110J5082414J6565318P062299N473765J0327248N003672j0426198j6608452
2124d421044n413860P381179N773390n632856j2004582q331203j413099J063924
2116b2998151k644381q145834q403759j133591O734046O801784P66257k157409
2108c1181038J276819N317508O170145P261555J0893628J2391165O899580l121085
2100A5908277j0747025j1480252n825675J233645L201200o91041j873599P368449
2092b906021K0542338K2517599J0008798l235027n883632l889213q421620j7021946
2084A1711276j7570887p383709K857898M780027K277710K300097L331041n22113
2076A781340p952990j0550373m588714L699451P106269O170379M509058P03732
$$ plain form
2068 878152 -6422684 -19152681 -24915310 -14889984 3440109 15379660 18209335 20932619
2060 20932619 25586459 21927537 5220756 -12905364 -20144003 -20936227 -27398980 -38827599
2052 -38827599 -42198078 -30958834 -12720511 1499448 6598652 2028498 -9495215 -20131571
2044 -20131571 -21881739 -16090205 -11583598 -11694079 -10332888 -3466058 3082796 1754788
2036 1754788 -6817922 -16934175 -25964630 -33798056 -37300536 -31051508 -13656642 8795923
2028 8795923 25161137 26208006 13389934 535081 787314 10663440 13999405 3692009
2020 3692009 -9347708 -13358293 -11946731 -14985846 -22011151 -25907309 -26907755 -30175173
2012 -30175173 -33672647 -32681036 -34190694 -50259551 -74936450 -84595822 -68275417 -43652661
$$ packed form
2068H78152p300836j2729997n762629J0025326J8330093J1939551K829675K723284
2060B0932619M653840l658922j6706781j8126120p238639p92224o462753j1428619
2052c8827599l370479J1239244J8238323J4219959N099204m570154j1523713j0636356
2044b0131571j750168N791534M506607j10481J361191O866830O548854j328008
2036A754788q572710j0116253r030455p833426l502480O249028J7394866K2452565
2028H795923J6365214J046869j2818072j2854853K52233R876126L335965j0307396
2020C692009j3039717m010585J411562l039115p025305l896158j000446l267418
2012c0175173l497474R91611j509658j6068857k4676899r659372J6320405K4622756
$$ plain form
2004 -43652661 -33517032 -38010240 -40965777 -33886055 -20927322 -6969017 5933886 13715007
1996 13715007 13713373 11058398 12035284 13782550 9996479 3072453 -469117 -2899900 -10193869
1987 -10193869 -16052793 -6706452 16234179 32681450 29228983 15240075 7935918 12194215
1979 12194215 21186434 26738781 22131576 4101704 -19943493 -34096070 -30486032 -17633844
1971 -17633844 -7719180 -3700248 -3790387 -8170378 -13746933 -12271635 -2595515 4382357
1963 4382357 1981206 -1141334 3310135 7336932 366360 -10453880 -10426218 -1497081
1955 -1497081 1546827 -4164154 -6652292 -817763 3885119 110121 -7398422 -11658488
1947 -11658488 -11138025 -5510208 4522822 11906004 9992142 5447258 10810797 22937000
$$ packed form
2004d3652661J0135629m493208k955537P079722J2958733J3958305J2902903P781121
1996A3715007j634k654975R76886J747266l786071o924026l541570k430783p293969
1987a0193869n858924R346341K2940631J6447271l452467j3988908p304157M258297
1979A2194215Q992219N552347m607205j8029872k4045197j4152577L610038J2852188
1971a7633844R914664M018932r0139m379991n576555J475298R676120O977872
1963D382357k401151l122540M451469M026797o970572j0820240K7662Q929137
1955a497081L043908n710981k488138N834529M702882l774998p508543m260066
1947a1658488N20463N627817J0033030P383182j913862m544884N363539J2126203
$$ plain form
1939 22937000 24507612 10740186 -1799304 37262 7770962 7457532 725768 -2190543
1931 -2190543 -518921 -1623173 -7748030 -14748077 -19955312 -22680242 -20192519 -10680811
1923 -10680811 1520066 8518004 5571370 -5641614 -16887990 -17793527 -7363607 384518
1915 384518 -7778562 -23780681 -26425242 -10837230 5732304 10903819 12309145 18189776
1907 18189776 20923352 12511855 1361513 -1414131 -446744 -5383180 -11854453 -9434780
1899 -9434780 -840740 2867249 532980 -393766 1715303 3220656 4742031 6873279
1891 6873279 2939527 -9661642 -18061430 -10121841 4684824 8686080 4149105 7106830
1883 7106830 17076788 16816161 3047650 -6648260 -2881522 1944101 -2691174 -8718229
$$ packed form
1939B2937000J570612j3767426j2539490J836566P733700l13430o731764k916311
1931b190543J671622j104252o124857p000047n207235k724930K487723R511708
1923a0680811J2200877O997938k946634j1212984j1246376r05537J0429920P748125
1915C84518q163080j6002119k644561J5588012J6569534N171515J405326N880631
1907A8189776K733576q411497j1150342k775644R67387m936436o471273K419673
1899i434780Q594040L707989k334269r26746K109069J505353J521375K131248
1891F873279l933752j2601169q399788P939589J4806665M001256m536975K957725
1883G106830R969958k60627j3768511r695910L766738M825623m635275o027055
$$ plain form
1875 -8718229 -7582452 -7019848 -16131145 -27884346 -30653512 -26460202 -24547572 -25768958
1867 -25768958 -25992620 -27257254 -32724260 -36448244 -30699475 -19523599 -13540493 -14055099
1859 -14055099 -13153244 -7920908 -4093834 -5327222 -7896369 -7664457 -5067730 -1030989
1851 -1030989 5975176 15369416 20815702 15375245 -53073 -15977248 -23229555 -21440937
1843 -21440937 -16439589 -10393098 -200858 12265744 16121558 5219889 -9864538 -14511058
1835 -14511058 -11557711 -16791676 -32780300 -42547360 -34996772 -22661016 -23892820 -37457188
1827 -37457188 -46891854 -43919126 -35330548 -29578400 -27970058 -29051481 -32023060 -33824311
1819 -33824311 -29776145 -19419770 -7324811 2468236 8410905 8346299 790571 -9009320
$$ packed form
1875h718229J135777N62604r111297j1753201k769166M193310J912630j221386
1867b5768958k23662j264634n467006l723984N748769J1175876N983106n14606
1859a4055099R01855N232336L827074j233388k569147K31912K596727M036741
1851a030989P006165R394240N446286n440457j5428318j5924175p252307J788618
1843b1440937N001348O046491J0192240J2466602L855814j0901669j5084427m646520
1835a4511058K953347n233965j5988624r767060P550588J2335756j231804j3564368
1827c7457188r434666K972728Q588578N752148J608342j081423k971579j801251
1819c3824311M048166J0356375J2094959R793047N942669o4606p555728r799891
$$ plain form
1811 -9009320 -10634877 -758312 9950221 8192255 -4242394 -10046303 3520723 28178483
1803 28178483 43173965 38603467 24284146 14994532 14114345 16016603 18147063 22327107
1795 22327107 25879006 20079446 687913 -23838920 -37936121 -33224696 -17787414 -10234024
1787 -10234024 -20755552 -37850497 -39875219 -21582639 -943926 5028769 1423178 3498660
1779 3498660 12854861 19012689 18976904 19178308 19331710 10901697 -5132739 -13575702 -4718401
1770 -4718401 11724620 19245882 13734159 4279208 274199 2357179 3020223 -5445691
1762 -5445691 -21091599 -32393465 -32210734 -26659956 -23226464 -17488683 -3513116 9583503
1754 9583503 8028151 -3877859 -10463813 -12114716 -23819836 -44328737 -51122475 -34318487
$$ packed form
1811i009320j625557R876565J0708533j757966j2434649n803909J3567026K4657760
1803B8178483J4995482m570498j4319321r289614q80187J902258K130460M180044
1795B2327107L551899n799560j9391533k4526833j4097201M711425J5437282P553390
1787a0234024j0521528j7094945k024722J8292580K0638713N972695l605591K075482
1779C498660R356201O157828l5785K01404J53402q430013j6034436q442963Q857301
1770d718401J6443021P521262n511723r454951m005009K082980O63044q465914
1762e445691j5645908j1301866J82731N550778L433492N737781J3975567J3096619
1754I583503j555352j1906010o585954j650903j1705120k0508901o793738J6803988
$$ plain form
1746 -34318487 -13039848 -6035772 -6274226 587163 10527648 11341519 4396020 -1327011
1738 -1327011 -5997018 -13452315 -18645256 -16238759 -12968516 -16278891 -19134775 -11679084
1730 -11679084 -273213 1245288 -6729354 -12347584 -12204315 -13532748 -19596023 -26099560
1722 -26099560 -29914308 -30623854 -26309508 -16569345 -5596797 4142458 13867090 18621034
1714 18621034 7760045 -16303842 -34188493 -35382440 -32576475 -37543109 -40808196 -32223112
1706 -32223112 -22924657 -25323708 -28931390 -20898641 -13956210 -25657678 -44489760 -47249166
1698 -47249166 -37173352 -32945751 -33465441 -28664841 -30089728 -49106735 -60741948 -41357547
1690 -41357547 -28066221 -70652340 -123690200 -72111423 102832707 261058721 265030244
$$ packed form
1746c4318487K1278639P004076k38454O861389R940485Q13871o945499n723031
1738a327011m670007p455297n192941K406497L270243l310375k855884P455691
1730a1679084J1405871J518501p974642n618230J43269j328433o063275o503537
1722b6099560l814748p09546M314346R740163J0972548R739255R724632M753944
1714A8621034j0860989k4063887j7884651j193947K805965m966634l265087Q585084
1706c2223112R298455k399051l607682Q032749O942431j1701468j8832082k759406
1698d7249166J0075814M227601n19690M800600j424887j9017007j1635213J9384401
1690d1357547J3291326m2586119n3037860N1578777J74944130J58226014L971523
$$ plain form
1683 265030244 146867992 48265024 37373330 63156839 67696604 57064223 52419839
1676 52419839 43900817 22418163 8642348 19393185 37028269 37879447 27154593 23928608
1668 23928608 30963062 38776815 43924248 46122757 40429268 27748987 21901668 31603621
1660 31603621 44145195 40419074 20085045 586517 -4124614 5456934 20446259 31539298
1652 31539298 32557189 23008487 8518416 -2727913 -4162879 5474476 18586604 22692009
1644 22692009 15199537 10819052 24467318 49106217 62556134 55928731 41767401 32012776
1636 32012776 22955510 8529600 -5050825 -8469639 -4385697 -3047090 -8184281 -15519206
1628 -15519206 -20718572 -21336430 -14897377 -2521968 8078617 9599091 3720696 -1420994
$$ packed form
1683B65030244j18162252r8602968j0891694K5783509M539765j0632381m644384
1676E2419839q519022k1482654j3775815J0750837J7635084Q51178j0724854l225985
1668B3928608P034454P813753N147433K198509n693489j2680281n847319R701953
1660C1603621J2541574l726121k0334029j9498528m711131R581548J4989325J1093039
1652C1539298J017891r548702j4490071j1246329j434966R637355J3112128M105405
1644B2692009p492472m380485J3648266K4638899J3449917o627403j4161330r754625
1636C2012776r057266j4425910j3580425l418814M083942J338607n137191p334925
1628a5519206n199366o17858O439053J2375409J0600585J520474n878395n141690
$$ plain form
1620 -1420994 59889 8785506 21528203 31117493 29393051 16506875 4541853 5583494
1612 5583494 17565518 27392645 26638461 17969870 6488915 -7640835 -24240602 -36135155
1604 -36135155 -34270688 -20639609 -10789617 -18511648 -39147592 -53547490 -49864028 -35262972
1596 -35262972 -22369299 -11993737 1303846 12437622 9966688 -1985190 -2577612 16761182
1588 16761182 36055073 32490883 12160313 -508480 1042441 16297 -12453536 -21795786
1580 -21795786 -14653948 -1445317 218787 -7573159 -9938862 -5467347 -6151439 -12967423
1572 -12967423 -11587487 3077768 15787189 13253846 3135076 -508277 994597 -2717608
1564 -2717608 -11134895 -14108351 -8687499 -1205464 4773535 9913671 10971294 4749144
$$ packed form
1620a420994J480883Q725617J2742697R589290j724442j2886176j1965022J041641
1612E583494J1982024R827127p54184q668591j1480955j4129750j6599767j1894553
1604c6135155J864467J3631079R849992p722031k0635944j4399898L683462J4601056
1596c5262972J2893673J0375562J3297583J1133776k470934j1951878n92422J9338794
1588A6761182J9293891l564190k0330570j2668793J550921j026144j2469833r342250
1580b1795786P141838J3208631J664104p791946k365703M471515o84092o815984
1572a2967423J379936J4665255J2709421k533343j0118770l643353J502874l712205
1564b717608q417287k973456N420852P482035N978999N140136J057623o222150
$$ plain form
1556 4749144 -1088506 4316364 15961103 16707599 2687791 -10468495 -11721697 -9227018
1548 -9227018 -12707535 -15919429 -8458362 6144282 16997021 22575289 28559033 34869586
1540 34869586 36481536 32977614 27272655 18890780 7690944 -311255 -251618 3031869
1532 3031869 3143752 3487249 9569653 14897081 7598234 -10905209 -26107322 -28549811
1524 -28549811 -20646791 -6677420 11384532 26942133 30006300 19608292 6645307
1517 6645307 1267925 3842440 9149398 12301393 10101955 3867381 923518 6417013
1509 6417013 15434229 21191043 26880657 37176677 41631381 24366650 -7501660 -24131255
1501 -24131255 -10338856 13159328 17869225 3617352 -8791529 -11212335 -14845068 -25024176
$$ packed form
1556D749144n837650N404870J1644739P46496j4019808j3156286j253202K494679
1548i227018l480517l211894P461067J4602644J0852739N578268N983744O310553
1540C4869586J611950l503922n704959q381875j1199836q002199N9637L283487
1532C031869J11883L43497O082404N327428p298847j8503443j5202113k442489
1524b8549811P903020J3969371J8061952J5557601L064167j0398008j2962985
1517F645307n377382K574515N306958L151995k199438o234574k943863N493495
1509F417013R017216N756814N689614J0296020M454704j7264731l1868310j6629595
1501b4131255J3792399K3498184M709897j4251873j2408881k420806l632733j0179108
$$ plain form
1493 -25024176 -28623641 -14053856 8595914 18584219 10909156 1071973 2854378 10722149
1485 10722149 10403276 779497 -5453982 -2508231 -544131 -8211529 -17100200 -14566246
1477 -14566246 -4630864 -2020006 -8470611 -10220919 -449307 10381538 11707416 7818566
1469 7818566 7748859 9905158 6588618 -1727309 -6127567 -1519908 7750724 14494148 16343200
1460 16343200 15950088 15671509 13686181 6896771 -2361810 -6518582 -2297927 4491932
1452 4491932 7782535 9191977 11261672 10016511 3723953 1797979 11582707 21718993
1444 21718993 14933491 -5726800 -21599876 -27684680 -35541481 -45057113 -38881718 -14644681
1436 -14644681 2129289 -5854790 -19137990 -10249375 14818517 28092872 22319804 16314595
$$ packed form
1493b5024176l599465J4569785K2649770R988305p675063r837183J782405P867771
1485A0722149l18873r623779o233479K945751J964100p667398q888671K533954
1477a4566246R935382K610858o450605j750308R771612J0830845J325878l888850
1469G818566o9707K156299l316540q315927m400258M607659R270632O743424J849052
1460A6343200l93112k78579j985328o789410r258581m156772M220655O789859
1452D491932L290603J409442K069695j245161o292558j925974R784728J0136286
1444B1718993o785502k0660291j5873076o084804p856801r515632O175395K4237037
1436a4644681J6773970p984079j3283200Q888615K5067892J3274355n773068o005209
$$ plain form
1428 16314595 21357829 27183586 24011281 17420309 15008491 14630037 13169634 14114304
1420 14114304 18800109 20010321 11816196 -816006 -8048582 -5997372 2193556 11370236
1412 11370236 17143795 17348109 13205453 6824166 -2170205 -13999855 -24178802 -27270683
1404 -27270683 -25195568 -25967209 -32698447 -38383675 -33595568 -17030270 2063506 10521459
1396 10521459 2104381 -15605971 -27062010 -24306903 -14553135 -10098222 -14556520 -22276055
1388 -22276055 -26708641 -24846706 -17876396 -12298035 -15589147 -25738403 -31020496 -25964998
1380 -25964998 -19664912 -19485972 -15297704 6089000 35931637 49654871 38274516 18645013
1372 18645013 9204252 9316670 8645761 5183710 4893413 10231201 17298677 21502487 20900340
$$ packed form
1428A6314595N043234N825757l172305o590972k411818l78454j460403R44670
1420A4114304M685805J210212q194125j2632202p232576K051210Q190928R176680
1412A1370236N773559K04314m142656o381287q994371j1829650j0178947l091881
1404b7270683K075115p71641o731238n685228M788107J6565298J9093776Q457953
1396A0521459q417078j7710352j1456039K755107R753768M454913m458298p719535
1388b2276055m432586J861935O970310N578361l291112j0149256n282093N055498
1380b5964998O300086J78940M188268K1386704K9842637J3723234j1380355j9629503
1372A8645013r440761J12418o70909l462051k90297N337788P067476M203810o02147
$$ plain form
1363 20900340 15819472 8013945 -1106412 -11361300 -20506342 -22660527 -15782886 -8414970
1355 -8414970 -10468524 -17617199 -14851834 1813236 17011325 15192346 809164 -7988428
1347 -7988428 -1785881 11107217 17070073 12715232 5999482 4531052 6697665 6495475
1339 6495475 3927493 3743279 3776525 -5209001 -22560250 -31350220 -20052715 -2316477
1331 -2316477 -92190 -11938688 -16129871 -4960920 3842022 -4208197 -18582198 -21912723
1323 -21912723 -15823025 -14045683 -18515882 -17714235 -5818969 9445002 18427178 19482065
1315 19482065 16078011 11436165 8212440 8481228 11634034 14643755 15283466 13459033
1307 13459033 9378398 2342846 -7420906 -15825108 -15659494 -3965424 10337936 11607034
$$ packed form
1363B0900340n080868p805527r120357j0254888r145042k154185O877641P367916
1355h414970k053554p148675K765365J6665070J5198089j818979j4383182q797592
1347g988428O202547J2893098N962856m354841o715750j468430K166613k02190
1339F495475k567982j84214L3246q985526j7351249q789970J1297505J7736238
1331b316477K224287j1846498m191183J1168951Q802942q050219j4374001l330525
1323b1912723O089698J777342m470199Q01647J1895266J5263971Q982176J054887
1315A9482065l404054m641846l223725K68788L152806L009721O39711j824433
1307A3459033m080635p035552r763752q404202J65614J1694070J4303360J269098
$$ plain form
1299 11607034 -4873647 -24610916 -30010125 -21590762 -15108895 -19950291 -30091285 -35852285
1291 -35852285 -34143039 -25910137 -13808566 -4795273 -5099949 -9772587 -7043333 4229010
1283 4229010 12402384 11668878 10106266 13224696 12726111 1195435 -13115005 -17347358
1275 -17347358 -11216334 -2295061 7498128 18421528 22725499 11568398 -11020466 -31990398
1267 -31990398 -43682723 -45106616 -35239612 -17755745 -6882102 -12853938 -23967604 -19655307
1259 -19655307 -1502535 6568376 -6754487 -22570386 -18418210 1523346 15326593
1252 15326593 12806729 2533596 -5196865 -8424198 -7290041 -346832 9043327 11212784
1244 11212784 863679 -14921270 -23905709 -21455970 -12369885 -2475469 6105741 11247611
$$ packed form
1299A1607034j6480681j9737269n399209Q419363O481867m841396j0140994n761000
1291c5852285J709246Q232902J2101571R013293l04676m672638K729254J1272343
1283D229010Q173374p33506j562612L118430m98585j1530676j4310440m232353
1275a7347358O131024Q921273R793189J0923400M303971j1157101k2588864k0969932
1267c1990398j1692325j423893R867004J7483867J0873643n971836j1113666M312297
1259a9655307J8152772Q070911j3322863j5815899M152176J9941556J3803247
1252A5326593k519864j0273133p730461l227333J134157O943209R390159K169457
1244A1212784j0349105j5784949q984439K449739R086085R894416Q581210N141870
$$ plain form
1236 11247611 8438371 -3699939 -18267796 -25422469 -23116756 -19126849 -21299263 -27910702
1228 -27910702 -29016490 -16922131 4604738 21777012 23707802 14692525 9974801 17324925
1220 17324925 28014518 30145458 24422240 18980583 14488421 5831868 -4658630 -9216158
1212 -9216158 -9600236 -15615870 -26199362 -27146034 -13780147 -1602187 -5175415 -18348931
1204 -18348931 -25651423 -22606113 -13610206 -55324 15692179 22533620 12350500 -4623583
1196 -4623583 -10353035 -2787683 3716694 288556 -6924206 -9696467 -8905236 -10319371
1188 -10319371 -16924096 -26651291 -32467158 -26721868 -11308765 546553 69635 -4655959
1180 -4655959 -1560904 5621282 2933507 -11610288 -24706831 -25922071 -17303307 -5659625
$$ packed form
1236A1247611k809240j2138310j4567857p154673K305713L989907k172414o611439
1228b7910702j105788J2094359K1526869J7172274J930790r015277m717724P350124
1220A7324925J0689593K130940n723218n441657m492162q656553j0490498m557528
1212i216158l84078o015634j0583492r46672J3365887J2177960l573228j3173516
1204a8348931p302492L045310Q995907J3554882J5747503O841441j0183120j6974083
1196d623583n729452P565352O504377l428138p212762k772261P91231j414135
1188a0319371o604725r727195n815867N745290J5413103J1855318m76918m725594
1180d655959L095055P182186k687775j4543795j3096543j215240Q618764J1643682
$$ plain form
1172 -5659625 2895753 1524541 -11591985 -25741296 -27653293 -18751159 -10766525 -6320639
1164 -6320639 1204599 9705159 8415221 -1814359 -6844997 -2583456 -1240320 -7601320
1156 -7601320 -9147797 -448447 3039041 -8281444 -15612080 2271101 32623301 42767682
1148 42767682 25540758 6850526 6772879 14930199 11552748 -4339800 -18736374 -23282351
1140 -23282351 -20089863 -11393718 4284656 25146290 42292690 45967183 33841008 12279917
1132 12279917 -8968626 -22289731 -24424397 -17136351 -7154318 -2162065 -3550143 -5236616
1124 -5236616 -2820833 -650712 -4779629 -12457484 -16375180 -17251998 -22470540 -31775242
1116 -31775242 -34510356 -23995917 -5802816 11389213 24054525 29124105 21182042 1362429
$$ packed form
1172e659625Q555378j371212j3116526j4149311j911997Q902134P984634M445886
1164f320639P525238Q500560j289938j0229580n030638M261541J343136o361000
1156g601320j546477Q699350L487488j1320485p330636J7883181L0352200J0144381
1148D2767682j7226924j8690232p7647Q157320l377451j5892548j4396574m545977
1140b3282351L192488Q696145J5678374K0861634J7146400L674493j2126175k1561091
1132A2279917k1248543j3321105k134666P288046R982033M992253j388078j686473
1124e236616K415783K170121m128917p677855l917696q76818n218542r304702
1116c1775242k735114J0514439J8193101J7192029J2665312N069580p942063j9819613
$$ plain form
1108 1362429 -18385024 -26759828 -23101078 -11328140 7639437 30076869 43926002 39297950
1100 39297950 21161482 4031487 -2928309 281843 10687821 24624819 36483304
1093 36483304 41577668 38819756 27715345 7832386 -14710187 -27184237 -23696422 -13663508
1085 -13663508 -10056667 -13546380 -14571047 -6637768 8481864 24008529 30755401 21994306
1077 21994306 2303918 -13168358 -13634539 -1588908 16027617 35238926 48173396
1070 48173396 42769972 20993976 5161988 11096152 24787075 22408843 4961077 -6362081
1062 -6362081 -3555685 512627 -4046777 -12896381 -20592157 -25935642 -23166584 -7273492
1054 -7273492 9628897 7504814 -11749828 -24192619 -19387370 -13975178 -20385138 -25231094
$$ packed form
1108A362429j9747453q374804L658750J1772938J8967577K2437432J3849133m628052
1100C9297950j8136468j7129995o959796L210152J0405978J3936998J1858485
1093C6483304N094364k757912j1104411j9882959k2542573j2474050L487815J0032914
1085a3663508L606841l489713j024667P933279J5119632J5526665O746872q761095
1077B1994306j9690388j5472276m66181J2045631J7616525J9211309J2934470
1070D8173396n403424k1775996j5831988N934164J3690923k378232j7447766j1323158
1062f362081K806396M068312m559404q849604p695776n343485K769058J5893092
1054g273492J6902389k124083j9254642j2442791M805249N412192o409960m845956
$$ plain form
1046 -25231094 -14564522 -270679 -593713 -9489696 -8371163 1726259 3955702 -3248582
1038 -3248582 -3419282 8417121 16220234 9856895 2497560 9405401 22684732 21672225
1030 21672225 2356665 -17247924 -20911704 -12779531 -8543648 -14804875 -22838659 -20243873
1022 -20243873 -3796071 18231758 31703635 25610969 2892950 -16127881 -10373781
1015 -10373781 16163305 34091084 23171053 -1241748 -9351660 2656015 11739068
1008 11739068 5098432 -4060332 -3152890 -822244 -7872370 -14415970 -3661318 20920012
1000 20920012 38902495 38708094 26571340 13496074 5675148 5103984 8123660 4995353
992 4995353 -9129102 -24816024 -29077257 -22504864 -15915810 -13316965 -9794298 -4376092
$$ packed form
1046b5231094J0666572J4293843l23034q895983J118533J0097422K229443p204284
1038c248582j70700J1836403P803113o363339p359335O907841J3279331j012507
1030B1672225j9315560j9604589l663780Q132173M235883o261227q033784K594786
1022b0243873J6447802K2027829J3471877o092666k2718019j9020831N754100
1015a0373781K6537086J7927779j0920031k4412801q109912J2007675R083053
1008A1739068o640636r158764R07442K330646p050126o543600J0754652K4581330
1000B0920012J7982483j94401j2136754j3075266p820926n71164L019676l128307
992D995353j4124455j5686922m261233O572393O589054K598845L522667N418206
$$ plain form
984 -4376092 -2271634 -3563965 -1533942 5020211 7883153 1568574 -8616915 -14387167
976 -14387167 -14254165 -12417591 -12323012 -13129978 -9843537 1707832 16617659 21911283 12313676
967 12313676 392538 1934233 15209092 25763954 28405025 30629850 35207430 34973656
959 34973656 27680740 20937616 17266463 8869715 -5187202 -10588099 2501177 22207733
951 22207733 29726494 23481764 16193756 13451325 8087906 -5927578 -24670719 -39587744
943 -39587744 -44499619 -38063502 -25102250 -13932247 -7392549 766804 15721753 31759113
935 31759113 38328626 31713901 14763249 -9316584 -34450735 -48107199 -41394317 -21335979
927 -21335979 -3652869 5363534 10668978 14477936 12289159 3614464 -4752371 -9118076
$$ packed form
984d376092K104458j292331K030023O554153K862942o314579j0185489n770252
976a4387167J33002J836574R4579q06966L286441J1551369J4909827N293624r597607
967A2313676j1921138J541695J3274859J0554862K641071K224825M577580k33774
959C4973656p292916o743124l671153q396748j4056917n400897J3089276J9706556
951B2207733P518761o244730p288008k742431n363419j4015484j8743141j4917025
943c9587744m911875O436117J2961252J1170003O539698Q159353J4954949J6037360
935C1759113O569513o614725j6950652k4079833k5134151j3656464O712882K0058338
927b1335979J7683110R016403N305444L808958k188777q674695q366835m365705
$$ plain form
919 -9118076 -12966874 -17828010 -19406214 -16101593 -12352691 -10106567 -6243238 -1863845
911 -1863845 -3302388 -8993508 -7658339 2464990 5378755 -9397535 -26235043 -22313080
903 -22313080 -82060 17456016 20572278 21495983 27245446 25185782 5942879 -15944242
895 -15944242 -19425438 -5510925 6450638 5951685 484700 -1064959 -727406 -4060598
887 -4060598 -10180679 -14406180 -15990299 -19249422 -28508538 -42427128 -52126489 -47792207
879 -47792207 -30890218 -16069259 -14434833 -18186328 -11094490 7130675 18636629 12211523
871 12211523 -1376713 -5286008 2016285 10477084 15924548 21799629 26799461 23563715
863 23563715 11526243 1073236 422113 5006380 4970639 -976033 -4635957 -55894
$$ packed form
919i118076l848798m861136j578204L304621L748902K246124L863329M379393
911a863845j438543n691120J335169J0123329K913765j4776290j6837508L921963
903b2313080K2231020J7538076L116262R23705N749463k059664j9242903k1887121
895a5944242l481196J3914513J1961563m98953n466985j549659L37553l333192
887d060598o120081m225501j584119l259123r259116j3918590r699361M334282
879d7792207J6901989J4820959J634426l751495P091838J8225165J1505954o425106
871A2211523j3588236l909295P302293Q460799N447464N875081M999832l235746
863B3563715j2037472j0453007o51123M584267l5741n946672l659924M580063
$$ plain form
855 -55894 8216029 10262605 2807785 -6252997 -6966097 473655 6490308 5365807 2230051
846 2230051 3896975 8454872 9690771 7266321 4735195 279543 -11388989 -28194075
838 -28194075 -40792162 -44933629 -45358949 -45356836 -41516160 -32822409 -25952983 -25055379 -23682707
829 -23682707 -14821270 -3226693 1300721 -537861 1737043 12584499 23236403 21480183
821 21480183 3822963 -21466701 -38756387 -34888642 -11838953 11384894 17249575 10097260
813 10097260 9664335 23582547 37094013 34713847 21437854 13064469 12846143 10270085
805 10270085 919272 -5323710 461964 12140963 16195831 8675147 -1553890 -4226284
797 -4226284 2559405 12776163 18238386 14275750 3727943 -4177224 -2502097 4774414
$$ packed form
855e5894Q271923K046576p454820r060782p13100P439752O016653j124501l135756
846B230051J666924M557897J235899k424450k531126m455652j1668532j6805086
838b8194075j2598087m141467m25320K113L840676Q693751O869426Q97604J372672
829b3682707Q861437J1594577M527414j838582K274904J0847456J0651904j756220
821B1480183j7657220k5289664j7289686L867745K3049689K3223847N864681p152315
813A0097260m32925J3918212J3511466k380166j3275993q373385k18326k576058
805A0270085r350813o242982N785674J1678999M054868p520684j0229037k672394
797d226284O785689J0216758N462223l962636j0547807p905167J675127P276511
$$ plain form
789 4774414 6192081 -3332038 -15326678 -17429265 -7712010 4790028 12706935 18305044
781 18305044 27189356 38087262 42872688 36298859 23144690 14526118 17164962 26524589
773 26524589 31365382 25707510 14863166 7856787 5791268 1880946 -7250423 -15717430
765 -15717430 -16175077 -8978647 88350 7527098 12878492 14712208 12005858 8657951
757 8657951 10416645 16394169 19003430 13872881 4596636 -4583535 -14853002 -26800760
749 -26800760 -33170332 -25187672 -5218917 13740831 22455977 23376552 21687880 14818260
741 14818260 -2504063 -25432973 -39413625 -35788400 -21653689 -10536828 -7257462 -6916835
733 -6916835 -5915822 -6580718 -10045977 -11770171 -8617735 -5710372 -10064566 -19191991 -22307024
$$ packed form
789D774414J417667r524119j1994640k102587R717255J2502038P916907N598109
781A8305044Q884312J0897906M785426o573829j3154169q618572K638844R359627
773B6524589M840793n657872j0844344p006379k065519l910322r131369q467007
765a5717430m57647P196430R066997P438748N351394J833716k706350l347907
757H657951J758694N977524K609261n130549r276245r180171j0269467j1947758
749b6800760o369572P982660J9968755J8959748Q715146R20575j688672o869620
741A4818260j7322323k2928910j3980652L625225J4134711J1116861L279366L40627
733f916835J001013o64896l465259j724194L152436K907363m354194r127425l115033
$$ plain form
724 -22307024 -13628471 676476 10732252 13507312 11743801 6414995 -3393338 -13387493
716 -13387493 -13676157 47928 18002270 24407481 14068852 -3579253 -17558805 -26732629
708 -26732629 -34798019 -39916119 -37376989 -30826060 -31476377 -42856783 -53002229 -47243242
700 -47243242 -25726351 -3902569 2973513 -6586771 -20311787 -24091535 -16118917 -9335843
692 -9335843 -15576267 -27737671 -25979390 -4306226 19299438 26446177 22264439 24312090
684 24312090 34872784 39404001 30165869 15999169 7115917 4282177 6683625 16839612
676 16839612 30969852 35700772 22907874 805061 -15684664 -18880318 -9106072 8663381
668 8663381 23392707 23593483 11732354 3598598 6397947 8876528 1759243 -6039367
$$ packed form
724b2307024Q678553J4304947J0055776K775060j763511n328806r808333r994155
716a3387493k88664J3724085J7954342O405211j0338629j7648105j3979552r173824
708b6732629q065390n118100K539130O550929o50317j1380406j0145446N758987
700d7243242K1516891K1823782O876082r560284j3725016l779748P972618O783074
692i335843o240424j2161404J758281K1673164K3605664P146739m181738K047651
684B4312090J0560694M531217r238132j4166700q883252k833740K401448J0155987
676A6839612J4130240M730920j2792898k2102813j6489725l195654R774246J7769453
668H663381J4729326K00776j1861129q133756K799349K478581p117285p798610
$$ plain form
660 -6039367 -5065801 -5328580 -19547444 -36846172 -36277254 -20937644 -13258769 -17166426
652 -17166426 -12288690 8388120 22172487 11098083 -10178428 -18683329 -17268931 -23564206
644 -23564206 -37569095 -43109714 -35341088 -25301121 -18966816 -11390323 -2784885 -2117778
636 -2117778 -9937507 -13120581 -4011338 7081762 6649041 -3402901 -9926907 -5502997
628 -5502997 5754998 15263837 16878165 9659390 -1100728 -7248376 -5704338 -1518954
620 -1518954 -801962 -3389265 -5606044 -7544290 -12839336 -21507031 -27317945 -24534133 -15404121
611 -15404121 -8123255 -7106407 -8132814 -5194722 843386 5188908 8638357 16068345
603 16068345 24205425 20988511 3542511 -11868329 -8125374 9862831 22106975 20101312
$$ packed form
660f039367R73566k62779j4218864j7298728N68918J5339610P678875l907657
652a7166426M877736K0676810J3784367j1074404k1276511q504901J414398o295275
644b3564206j4004889n540619P768626J0039967O334305P576493Q605438O67107
636b117778p819729l183074R109243J1093100m32721j0051942o524006M423910
628e502997J1257995R508839J614328p218775j0760118o147648J544038M185384
620a518954P16992k587303k216779j938246n295046q667695n810914K783812R130012
611a5404121P280866J016848j026407K938092O038108M345522L449449P429988
603A6068345Q137080l216914j7446000j5410840L742955J7988205J2244144k005663
$$ plain form
595 20101312 13212575 9051468 2734262 -9106873 -16937329 -10709067 4356687 13964254
587 13964254 12063152 4034526 -3572477 -8483000 -9828818 -6923587 -935093 6299338
579 6299338 14078355 20747710 22925478 20493529 18715139 20676825 21137578 13573997 649979
570 649979 -8329808 -8618379 -3249703 2735515 5158434 -155264 -13420465 -25837835
562 -25837835 -25707937 -12014722 2764286 5528483 -4519263 -16040804 -15842278 -139813
554 -139813 20539305 29016432 18503553 560390 -8590455 -6703909 -3363776 -2366989
546 -2366989 2314027 11808564 15954331 8015750 -3326514 -5087991 2527774 7860033
538 7860033 3727984 -5489649 -10903997 -7571079 2636639 12004777 12425826 3738312
$$ packed form
595B0101312o888737m161107o317206j1841135p830456O228262J5065754R607567
587A3964254j901102q028626p607003m910523j345818K905231N988494P234431
579F299338P779017O669355K177768k431949j778390J961686M60753p563581j2924018
570F49979q979787k88571N368676N985218K422919n313698j3265201j2417370
562b5837835J29898J3693215J4779008K764197j0047746j1521541J98526J5702465
554a39813K0679118Q477127j0512879j7943163r150845J886546L340133R96787
546b366989M681016R494537M145767p938581j1342264j761477P615765N332259
538G860033m132049r217633n414348L332918J0207718R368138M21049q687514
$$ plain form
530 3738312 -5359606 -7812907 -6269891 -7131091 -11187837 -15276112 -18264732 -18477471 -9901755
521 -9901755 9614348 28857507 32137984 17691983 -1714321 -16225433 -26669181 -34096021
513 -34096021 -33882871 -25411792 -17236314 -15452803 -15045539 -10162750 -5464359 -8512983 -16887567
504 -16887567 -22326952 -23169738 -22901219 -19907815 -9598171 4521901 12482909 11132498
496 11132498 6538405 2661831 -2492861 -7950614 -7804531 -2368786 -1685455 -11926507
488 -11926507 -25667600 -31268699 -25231919 -10552149 8690690 24419682 25474417 11490485
480 11490485 -1404952 -236691 5831060 -80572 -14239081 -16292183 -1458539 10967478
472 10967478 7530253 464001 5482407 15026038 11103052 -4365338 -11569661 -2479725
$$ packed form
530C738312r097918k453301J543016q61200m056746m088275k988620k12739Q575716
521i901755J9516103J9243159L280477j4446001j9406304j4511112j0443748p426840
513c4096021K13150Q471079Q175478J783511M07264M882789M698391l048624q374584
504a6887567n439385q42786K68519K993404J0309644J4120072P961008j350411
496A1132498m594093l876574n154692n457753J46083N435745O83331j0241052
488a1926507j3741093n601099O036780J4679770J9242839J5728992J054735j3983932
480A1490485j2895437J168261O067751n911632j4158509k053102J4833644J2426017
472A0967478l437225p066252N018406R543631l922986j5468390p204323R089936
$$ plain form
464 -2479725 10028884 14618221 15986770 20801786 23760446 17685898 7456569 2914162
456 2914162 4092100 3534234 -989376 -5378621 -7359796 -6619316 78458 13630734 24216145
447 24216145 19659915 3087098 -8787189 -7409610 -1372209 227122 1215266 7322291
439 7322291 12635794 8758159 469072 -563991 6022045 10137612 8838525 10088061
431 10088061 17478307 23370033 21457641 16097349 13598672 12145902 6273811 -4369556
423 -4369556 -15434294 -22165418 -20670933 -11589837 -5081184 -13102091 -31770988 -41075368
415 -41075368 -29615915 -10472689 -2940130 -7320881 -10380591 -8541774 -9413240 -12863421
407 -12863421 -7852426 8744693 24322981 27200524 20502297 14051662 11708045 12507496
$$ packed form
464b479725J2508609M589337J368549M815016K958660o074548j0229329m542407
456B914162J177938n57866m523610m389245j981175P40480O697774J3552276J0585411
447B4216145m556230j6572817j1874287J377579O037401J599331R88144O107025
439G322291N313503l877635q289087j033063O586036M115567j299087J249536
431A0088061P390246N891726j912392n360292k498677j452770n872091j0643367
423d369556j1064738o731124J494485R081096O508653q020907j8668897r304380
415d1075368J1459453J9143226P532559m380751l059710J838817q71466l450181
407a2863421N010995J6597119J5578288K877543o698227o450635k343617P99451
$$ plain form
399 12507496 16143223 20600507 20282860 12645783 2826210 -2193666 -104680 7794827
391 7794827 18078653 23561291 17812665 4747414 -4014740 -5172826 -8261155 -18913074
383 -18913074 -27714407 -24445935 -14589305 -10095656 -9813255 -2382244 13593982 25319400
375 25319400 23544232 14361097 9670475 12866097 17835185 18049597 13657500 10884734
367 10884734 14458481 19933419 16800479 1947522 -14278465 -20055229 -15934778 -10969672
359 -10969672 -9257432 -7820056 -4796616 -1350911 3106831 9569398 14063636 11212072
351 11212072 2691273 -4814620 -8756205 -10112507 -5731947 8328017 25412127 30983317
343 30983317 19910350 2681133 -8156562 -9451927 -3264028 8675721 21369569 26193205
$$ packed form
399A2507496L635727M457284l17647p637077r819573n019876K088986P899507
391G794827J0283826N482638n748626j3065251q762154j158086l088329j0651919
383a8913074q801333L268472R856630M493649K82401P431011J5976226J1725418
375B5319400j775168r183135m690622L195622M969088K14412m392097k772766
367A0884734L573747N474938l132940j4852957j6225987n776764M120451M965106
359a0969672J712240J437376L023440L445705M457742O462567M494238k851564
351A1212072q520799p505893l941585j356302M380560J4059964J7084110N571190
343C0983317j1072967j7229217j0837695j295365O187899J1939749J2693848M823636
$$ plain form
335 26193205 20785191 13407641 12101275 14910695 15436231 12037393 6159186 -2871778
327 -2871778 -15179267 -26432740 -31956663 -31671344 -27548048 -20913700 -15944966 -19341947
319 -19341947 -30193782 -35566330 -24339179 -2884269 10541073 6383267 -7062538 -14933367
311 -14933367 -11403995 -3262332 -733212 -5703372 -9436449 -3698525 7397677 11817221
303 11817221 5480211 -3745645 -9348142 -14070712 -20039986 -21039595 -13128226 -4990227
295 -4990227 -6845353 -14124627 -13681307 -3476233 5669652 7465380 7683053 12034246 16643121
286 16643121 15309065 9250604 4653912 4876006 8868640 14062671 17613683 16983710 11961776
277 11961776 5585507 2333000 5437635 14372201 23606958 26126207 20517694 12504158
$$ packed form
335B6193205n408014p377550j306366K809420N25536l398838n878207r030964
327b871778j2307489j1253473n523923K85319M123296O634348M968734l396981
319a9341947j0851835n372548J1227151K1454910J3425342m157806j3445805p870829
311a4933367L529372Q141663K529120m970160l733077N737924J1096202M419544
303A1817221o337010r225856n602497m722570n969274r99609P911369Q137999
295d990227j855126p279274M43320J0205074R145885J795728K17673M351193M608875
286A6643121j334056o058461m596692K22094L992634N194031L551012o29973n021934
277A1961776o376269l252507L104635Q934566R234757K519249n608513q013536
$$ plain form
269 12504158 7637990 6006182 6448831 10334034 16096094 15831342 5278055 -6678509
261 -6678509 -7412826 2710111 11942931 13711343 11328792 6518275 -4853542 -21876520
253 -21876520 -33561329 -30985197 -18123502 -5468002 1658385 3518074 -196682 -10566312
245 -10566312 -24905128 -35884931 -35586082 -21383544 -781501 11295846 6047090 -8208795
237 -8208795 -14663559 -7636620 3794411 11635083 17788548 23747926 23139717 12584676
229 12584676 1177460 -710044 3912859 4988090 1536621 745109 4029377 5485439
221 5485439 3585220 3111745 4024599 -473212 -10769426 -15906515 -8650463 2081016
213 2081016 2312436 -7998363 -15849215 -13230766 -5767233 -2635661 -5326225 -9239122
$$ packed form
269A2504158m866168j631808M42649L885203N762060k64752j0553287j1956564
261f678509p34317J0122937R232820J768412k382551m810517j1371817j7022978
253b1876520j1684809K576132J2861695J2655500P126387J859689l714756j0369630
245a0566312j4338816j0979803K98849J4202538K0602043J2077347n248756j4255885
237h208795o454764P026939J1431031P840672O153465N959378o08209j0555041
229A2584676j1407216j887504M622903J075231l451469p91512L284268J456062
221E485439j900219m73475R12854m497811j0296214n137089P256052J0731479
213B081016K31420j0310799p850852K618449P463533L131572k690564l912897
$$ plain form
205 -9239122 -10814182 -9410474 -6192463 -4607802 -7960947 -12569971 -8084873 8932986
197 8932986 25461735 25005528 9182546 -3511137 -1915101 5592023 7574451 6973365
189 6973365 12865139 23296270 28439661 26459350 24076737 23277415 19547959 13510220
181 13510220 12425741 17682821 21370236 18720020 14178220 11155176 5793817 -3190311
173 -3190311 -7690808 -1215311 9908874 14487710 11192004 8157431 11226578 18788775
165 18788775 25534801 26354381 19743643 11653753 11520000 19550547 23171720 12479933
157 12479933 -5622816 -16139630 -14584290 -8510790 -4008128 -743869 690013 -2820432
149 -2820432 -8869799 -8661093 1340718 12391952 12603870 464376 -13629380 -18090119
$$ packed form
205i239122j575060J403708L218011J584661l353145m609024M485098J7017859
197H932986J6528749m56207j5822982j2693683J596036P507124J982428o01086
189F973365N891774J0431131N143391j980311k382613p99322l729456o037739
181A3510220j084479N257080L687415k650216m541800l023044n361359q984128
173c190311m500497O475497J1124185M578836l295706l034573L069147P562197
165A8788775O746026Q19580o610738q089890j33753Q030547L621173j0691787
157A2479933j8102749j0516814J555340O073500M502662L264259J433882l510445
149b820432o049367K08706J0001811J1051234K11918j2139494j4093756m460739
$$ plain form
141 -18090119 -11270561 -2660658 -2684761 -11103592 -18137611 -17868843 -15320960 -16871899 -19918039
132 -19918039 -18869958 -16296563 -18847034 -24904024 -26338768 -21524867 -16321110 -12165404
124 -12165404 -4723669 3583731 2271344 -10405025 -20634040 -17152163 -6735691 -2094916
116 -2094916 -2725781 159072 5872391 6085806 2234367 5499186 16885680 21954856 12128619
107 12128619 -1156001 -3444708 1412216 -211514 -8136267 -8772808 1823993 11045004
99 11045004 10344331 8770748 16884073 27952871 27585714 15839949 6325297 5662975 7084445
90 7084445 5011305 2822338 2360557 -1914882 -11270745 -15520065 -7064846 5192804 6674344
81 6674344 -2589682 -9486102 -7678702 -4728965 -8011372 -13390971 -12379385 -4161250 4402658
$$ packed form
141a8090119O819558Q609903k4103q418831p034019K68768K547883j550939l046140
132a9918039J048081K573395k550471o056990j434744M813901N203757M155706
124a2165404P441735Q307400j312387j2676369j0229015L481877J0416472M640775
116b094916o30865K884853N713319K13415l851439L264819J1386494N069176r826237
107A2128619j3284620k288707M856924j623730p924753o36541J0596801R221011
99A1045004p00673j573583Q113325J1068798l67157j1745765r514652o62322J421470
90G084445k073140k188967m61781m275439r355863m249320Q455219J2257650J481540
81F674344r264026o896420J807400K949737l282407n379599J011586Q218135Q563908
$$ plain form
72 4402658 7317968 4343789 -614731 -3623247 -4572216 -7703211 -16134503 -25423532 -26005077
63 -26005077 -14286573 951938 6268998 -2498130 -16019658 -21927096 -18131416 -13683563
55 -13683563 -16271274 -22105288 -21255438 -10645983 3360596 14403935 21515176 24124564
47 24124564 19645346 10283491 5238155 9620599 16289490 15772049 10128336 9029059 14980451
38 14980451 20923636 21097368 16085829 7796384 -2163676 -8813721 -6947473 472457 4679910
29 4679910 3649898 4557381 11149202 16650892 13710534 4764730 -2802078 -6648071 -9195352
20 -9195352 -11491582 -12957539 -14418523 -16052682 -14192446 -5356475 7131607 15142615
12 15142615 15063811 11790962 11951190 15271266 15127791 7749134 -1590616 -4219528 1028939
$$ packed form
72D402658K915310k974179m958520l008516r48969l130995q431292r289029n81545
63b6005077J1718504J5238511N317060q767128j3521528n907438L795680M447853
55a3683563k587711n834014Q49850J0609455J4006579J1043339P111241K609388
47B4124564m479218r361855n045336M382444O668891n17441n643713j099277N951392
38A4980451N943185J73732n011539q289445r960060o650045J866248P419930M207453
29D679910j030012R07483O591821N501690k940358q945804p566808l845993k547281
20i195352k296230j465957j460984j634159J860236Q835971J2488082Q011008
12A5142615p8804l272849J60228L320076j43475p378657r339750k628912N248467
$$ plain form
3 1028939 6835338 8204998 8633787
0 8633787
$$ packed form
3A028939N806399J369660M28789
0H633787
##END NTUPLES=NMR SPECTRUM
##END=
