##TITLE=31Pdec_LR-640-0-2
 CDCl3, 24 sc
 25.12.2019
##JCAMPDX= 6.0         $$ Bruker NMR JCAMP-DX V2.0
##DATA TYPE= NMR SPECTRUM
##DATA CLASS= NTUPLES
##ORIGIN= UXNMR, Bruker Analytische Messtechnik GmbH
##OWNER= root
$$ XWIN-NMR		Version 3.5
$$ Wed Dec 25 14:11:28 2019 Russian Standard Time (UT+4h)  she@DPX200
##.OBSERVE FREQUENCY= 81.013821
##.OBSERVE NUCLEUS= ^31P
##.ACQUISITION MODE= SIMULTANEOUS
##.ACQUISITION SCHEME= undefined
##.AVERAGES= 24
##.DIGITISER RES= 17
##SPECTROMETER/DATA SYSTEM= spect
##.PULSE SEQUENCE= zgpg30
##.SOLVENT NAME= CDCl3
##.SHIFT REFERENCE= (INTERNAL, CDCl3, 0, 182.463)
##AUDIT TRAIL= $$ (NUMBER, WHEN, WHO, WHERE, WHAT)
$$ ##TITLE= Audit trail, XWIN-NMR		Version 3.5
$$ ##JCAMPDX= 5.01
$$ ##ORIGIN= Bruker BioSpin GmbH
$$ ##OWNER= she
$$ F:/spectra/data/she/nmr/P31/1/pdata/1/auditp.txt
$$ ##AUDIT TRAIL=  $$ (NUMBER, WHEN, WHO, WHERE, WHAT)
(   1,<2019-12-25 14:10:08.25 +0400>,<she>,<DPX200>,
      <created by zg, POWCHK disabled, PULCHK disabled
       configuration hash MD5:
       00 E9 B6 7A A2 85 ED C7 34 08 36 98 17 FE 4E 26
       data hash MD5: 32K
       C9 8E 92 CF F6 26 66 9B 73 94 40 FE 13 AC A9 4D>)
(   2,<2019-12-25 14:10:11.76 +0400>,<she>,<DPX200>,
      <Start of raw data processing
       efp BC_mod = 2 LB = 1 FT_mod = 6 PKNL = 1 PHC0 = -1658.318 PHC1 = 76.40119 SI = 64K 
       data hash MD5: 64K
       79 40 F7 BA 5B 58 36 C1 12 37 97 E8 4C 09 C8 A4>)
(   3,<2019-12-25 14:10:36.09 +0400>,<she>,<DPX200>,
      <pk PHC0 = -7.074773 PHC1 = 18.6 
       data hash MD5: 64K
       19 10 51 9A 26 95 A4 63 5C 30 41 BA 7C AC AC F7>)
(   4,<2019-12-25 14:10:39.92 +0400>,<she>,<DPX200>,
      <abs ABSG = 5 
       data hash MD5: 64K
       46 1E 62 AD 13 83 DB 0C D1 85 17 6C 9D 79 DF A4>)
(   5,<2019-12-25 14:10:59.65 +0400>,<she>,<DPX200>,
      <pk PHC0 = -3.601777 PHC1 = 0 
       data hash MD5: 64K
       B3 AF 11 E6 53 D4 AB AE A6 5F F8 26 BB AA 2B 74>)
(   6,<2019-12-25 14:11:03.28 +0400>,<she>,<DPX200>,
      <abs ABSG = 5 
       data hash MD5: 64K
       39 12 C9 A0 E5 63 81 FB A9 86 02 8F B0 C2 27 9A>)
$$ ##END=
$$ 
$$ hash MD5
$$ 6B 22 B7 7F 6F B5 7A 9D E5 55 87 FB 39 D9 DE A1
##$RELAX= 
##$RELAX= 
##$RELAX= 
##$RELAX= 
##$RELAX= 
##$RELAX= 
##$RELAX= 
##$RELAX= 
$$ Bruker specific parameters
$$ --------------------------
##$DU= <F:/spectra>
##$EXPNO= 1
##$NAME= <P31>
##$PROCNO= 1
##$TYPE= <nmr>
##$USER= <she>
##$AMP= (0..31)
100 100 100 100 100 100 100 100 100 100 100 100 100 100 100 100 100 100 
100 100 100 100 100 100 100 100 100 100 100 100 100 100 
##$AQSEQ= 0
##$AQ_mod= 1
##$AUNM= <au_zg>
##$AUTOPOS= <>
##$BF1= 81.014009
##$BF2= 200.13
##$BF3= 200.13
##$BF4= 200.13
##$BF5= 200.13
##$BF6= 200.13
##$BF7= 200.13
##$BF8= 200.13
##$BYTORDA= 1
##$CFDGTYP= 0
##$CFRGTYP= 5
##$CHEMSTR= <none>
##$CNST= (0..31)
1 1 145 1 1 1 1 1 1 1 1 1 1 1 1 1 1 1 1 1 1 1 1 1 1 1 1 1 1 1 1 1 
##$CPDPRG= <waltz16>
##$CPDPRG1= <>
##$CPDPRG2= <waltz16>
##$CPDPRG3= <>
##$CPDPRG4= <mlev>
##$CPDPRG5= <mlev>
##$CPDPRG6= <mlev>
$$ [...]
##$SUBNAM3= <"">
##$SUBNAM4= <"">
##$SUBNAM5= <"">
##$SUBNAM6= <"">
##$SUBNAM7= <"">
##$SUBNAM8= <"">
##$SUBNAM9= <"">
##$SW= 369.568048894756
##$SWIBOX= (0..15)
0 1 3 0 0 0 0 0 0 0 0 0 0 0 0 0 
##$SW_h= 29940.119760479
##$TD= 32768
##$TD0= 1
##$TE= 0
##$TE2= 300
##$TE3= 300
##$TEG= 300
##$TL= (0..7)
0 120 53 12 22 120 120 120 
##$TP= (0..7)
150 150 150 150 150 150 150 150 
##$TP07= 0
##$TPNAME0= <>
##$TPNAME1= <>
##$TPNAME2= <>
##$TPNAME3= <>
##$TPNAME4= <>
##$TPNAME5= <>
##$TPNAME6= <>
##$TPNAME7= <>
##$TPOAL= (0..7)
0.5 0.5 0.5 0.5 0.5 0.5 0.5 0.5 
##$TPOFFS= (0..7)
0 0 0 0 0 0 0 0 
##$TUNHIN= 0
##$TUNHOUT= 0
##$TUNXOUT= 0
##$USERA1= <user>
##$USERA2= <user>
##$USERA3= <user>
##$USERA4= <user>
##$USERA5= <user>
##$V9= 5
##$VALIST= <valist>
##$VCLIST= <CCCCCCCCCCCCCCC>
##$VD= 0
##$VDLIST= <DDDDDDDDDDDDDDD>
##$VPLIST= <PPPPPPPPPPPPPPP>
##$VTLIST= <TTTTTTTTTTTTTTT>
##$WBST= 1024
##$WBSW= 4
##$XGAIN= (0..3)
0 0 0 0 
##$XL= 0
##$YL= 0
##$YMAX_a= 31014
##$YMIN_a= -31507
##$ZGOPTNS= <>
##$ZL1= 120
##$ZL2= 120
##$ZL3= 120
##$ZL4= 120
##$ABSF1= 182.463
##$ABSF2= -187.1042
##$ABSG= 5
##$ABSL= 3
##$ALPHA= 0
##$AQORDER= 0
##$ASSFAC= 0
##$ASSFACI= 0
##$ASSFACX= 0
##$ASSWID= 0
##$AUNMP= <proc_1d>
##$AZFE= 0.1
##$AZFW= 0.5
##$BCFW= 0
##$BC_mod= 2
##$BYTORDP= 0
##$COROFFS= 0
##$CY= -3
##$DATMOD= 1
##$DC= 0
##$DFILT= <>
##$DTYPP= 0
##$F1P= 0
##$F2P= 0
##$FCOR= 1
##$FTSIZE= 65536
##$FT_mod= 6
##$GAMMA= 0
##$GB= 0
##$INTBC= 1
##$INTSCL= 5.30512e-09
##$ISEN= 30
##$LB= 1
##$LEV0= 0
##$LPBIN= 0
##$MAXI= 10000
##$MC2= 0
##$MEAN= 0
##$ME_mod= 0
##$MI= 50
##$NCOEF= 0
##$NC_proc= -5
##$NLEV= 6
##$NOISF1= 182.463
##$NOISF2= 159.3651
##$NSP= 0
##$NTH_PI= 0
##$NZP= 0
##$OFFSET= 182.463
##$PC= 4
##$PHC0= -1668.995
##$PHC1= 95.00119
##$PH_mod= 1
##$PKNL= yes
##$PPARMOD= 0
##$PSCAL= 0
##$PSIGN= 0
##$REVERSE= no
##$SF= 81.0140089999434
##$SI= 65536
##$SIGF1= 159.3651
##$SIGF2= -187.1042
##$SINO= 113.3802
##$SIOLD= 16384
##$SREGLST= <1H.CDCl3>
##$SSB= 0
##$STSI= 65536
##$STSR= 0
##$SW_p= 29940.119760479
##$SYMM= 0
##$S_DEV= 0
##$TDeff= 32768
##$TDoff= 0
##$TI= <>
##$TILT= no
##$TM1= 0
##$TM2= 0
##$TOPLEV= 0
##$USERP1= <user>
##$USERP2= <user>
##$USERP3= <user>
##$USERP4= <user>
##$USERP5= <user>
##$WDW= 1
##$XDIM= 65536
##$YMAX_p= 475754126
##$YMIN_p= -5009128
$$ End of Bruker specific parameters
$$ ---------------------------------
##NTUPLES= NMR SPECTRUM
##VAR_NAME=  FREQUENCY,     SPECTRUM/REAL,   SPECTRUM/IMAG
##SYMBOL=    X,             R,               I
##VAR_TYPE=  INDEPENDENT,   DEPENDENT,       DEPENDENT
##VAR_FORM=  AFFN,          ASDF,            ASDF
##VAR_DIM=   65536,         65536,           65536
##UNITS=     HZ,            ARBITRARY UNITS, ARBITRARY UNITS
##FACTOR=    0.456856943014862, 1,           1
##FIRST=     14782.0589164792, 0,            0
##LAST=      -15158.0608439998, 0,           0
##MIN=       -15158.0608439998, -5009128,    0
##MAX=       14782.0589164792, 475754126,    0
$$ Real data points
##PAGE= N=1
##DATA TABLE= (X++(R..R)), XYDATA
$$ [...]
42496c66898Q42970K11838k5027K49613J28974o35713j000778k97724N39078L52483
42486a184m35484n24881K46988P80303M64166m5641L5067N56682Q13681M15254
42476B304951m61442j267888j394964o71825L44471Q96679Q30694N16429J07928
42467A205033n23218j113337r87004j2685R77135J125873N38690l4898j78055
42458I97534p5520m5845k01138m46270n14261j44607M88148P09175Q7422q64778
42448a0140j166262n46205K68516N30587L08072J24462J55894J75218N8592j10335
42438b11601l53861p37574r58826n14953M96730J213278J009820K94692j48304
42429H9401k50678m49977o41847k29248O91379J104885M66643m30527n85025j73734
$$ plain form
42496 -366898 476072 687910 662883 912496 1041470 405757 -595021 -892745 -353667 -1184
42486 -1184 -436668 -961549 -714561 65742 529908 484267 519334 1076016 1889697 2304951
42476 2304951 1843509 575621 -819343 -1491168 -1146697 -250018 580676 1097105 1205033
42467 1205033 681815 -431522 -1418526 -1431211 -454076 671797 1210487 1175589 997534
42458 997534 922014 876169 675031 228761 -285500 -430107 58041 767216 854638 -10140
42448 -10140 -1176402 -1722607 -1454091 -923504 -615432 -490970 -335076 -159858 -101266 -211601
42438 -211601 -565462 -1303036 -2261862 -2776815 -2280085 -1066807 -56987 237705 89401
42429 89401 -161277 -611254 -1253101 -1482349 -790970 313915 780558 350031 -234994 -408728
42419d08728m3797k68593j70046L53667N21592q6127q01222q28190l48370j20382
42409b200196l21218l58005K28532J110966J540150J148081K66470m62679o58313
42400B93788l61881J89035O91296P40415J02090p85905j010911k57793O71639
42391B71773Q56810L96957l5125l54347q78011j230421o14568O77459J228305
42382C18832M54007m87306m33791J58255K69550O9304L43030Q00917M53887n27280
42372A419405q41576j17399M61462M9763o02761n11408r754Q942l64639l39835
42362h47800J74550M78963K28728k05059m72596n66744l95339K13460R40727J086081
42352F34971M86994k15727m64026m13351m02434l28547M334L15350J80574k40997
$$ plain form
42419 -408728 -452525 -721118 -891164 -537497 -15905 -102032 -903254 -1731444 -2079814 -2200196
42409 -2200196 -2521414 -2879419 -2650887 -1539921 229 1148310 1414780 952101 293788
42400 293788 -68093 120942 812238 1552653 1654743 868838 -142073 -399866 271773
42391 271773 1128583 1525540 1490415 1136068 258057 -972364 -1586932 -909473 318832
42382 318832 772839 285533 -148258 9997 279547 348851 691881 1492798 1946685 1419405
42372 1419405 577829 460430 921892 971655 368894 -142514 -152268 -143326 -507965 -847800
42362 -847800 -673250 -194287 34441 -170618 -643214 -1209958 -1605297 -1391837 -451110 634971
42352 634971 1121965 906238 442212 28861 -373573 -702120 -697786 -382436 -201862 -442859
42342d42859l41079P9630N17679M44106m1633m18005m04656j91515n6852J3934
42332h41250J95626M21997L72594m2995m09467k61161K96675P12677O96731M73078
42322A614505K88703L9206m28250r18837j048589o73393k1373M84480N12769J62349
42312A1570J3413M78871J072105Q45256k63598j146740r72812k69725L4922K3345
42302a73393L51321Q61730P61367N5763l55634j67527j35461o81864j077410o20968
42292a182076K17346N53899L29743N5979j25785l52915m36038j29913K67700K92751
42282e09309N9062j6414K5953j19866l09317j57572J80861J81491j56704k81223
42272a103038M6230M72836O52549N58845K36251k08077m39725k76229q5612k13755
$$ plain form
42342 -442859 -783938 -704308 -186629 257477 215844 -202161 -606817 -798332 -855184 -841250
42332 -841250 -645624 -223627 148967 105972 -303495 -564656 -267981 444696 1141427 1614505
42322 1614505 1903208 1942414 1514164 595327 -453262 -1126655 -1148028 -663548 -150779 11570
42312 11570 24983 503854 1575959 2421215 2157617 1010877 38065 -231660 -196738 -173393
42302 -173393 177928 1039658 1801025 1856788 1501154 1333627 1198166 516302 -561108 -1182076
42292 -1182076 -964730 -410831 -81088 -25109 -150894 -503809 -939847 -1069760 -802060 -509309
42282 -509309 -450247 -466661 -440708 -560574 -869891 -1027463 -846602 -665111 -821815 -1103038
42272 -1103038 -1056808 -583972 68577 627422 863673 655596 215871 -60358 -145970 -359725
42262c59725k73227K21320P72005M61971m98077r12509l75407K57194L87326M32639
42252A13510O44472M41713l61050p97810j48146Q10031R01489J65394n52818r04569
42242C12216r61055n18606M24891J045588O70741n5970r0660L64336L32232k05133
42232A318580m11853k27425m20431r78344r30729o9650N59725L64068Q2007L25438
42222c88614M83423o3445o99756n69242O168J83032N9852L42658R14280Q97668
42212A166024J03672n90615m94230L9919K94287J53708K9546J38797K28032j926
42202A067214l91032m29144K9199L80076O34p29653p69471O7330O81052K58339
42192A64544m23928j12433R30087J138092r8884j431798j307771J045Q86665N85939
$$ plain form
42262 -359725 -632952 -411632 360373 822344 324267 -588242 -963649 -706455 -319129 113510
42252 113510 757982 1199695 838645 40835 -107311 702720 1604209 1769603 1216785 312216
42242 312216 -648839 -1167445 -742554 303034 973775 917805 827145 1191481 1523713 1318580
42232 1318580 906727 679302 258871 -719473 -1650202 -1719852 -1160127 -796059 -714052 -388614
42222 -388614 94809 31364 -668392 -1237634 -1231466 -1048434 -988582 -645924 268356 1166024
42212 1166024 1269696 679081 184851 224770 519057 672765 702311 841108 1069140 1067214
42202 1067214 676182 247038 276237 656313 656947 -72706 -842177 -774847 -93795 164544
42192 164544 -259384 -371817 558270 1696362 1597478 165680 -1142091 -1141046 -254381 331558
42182C31558p796J44571O96265N38356m34147j089396p16485k3260O4782j65264
42172f60816J01902O26724M46923l52590n73545J30255N86023K3218o20349k85748
42162e78003M09080K37583n53330o85217N0235N95863M05865K9186j44932l93077
42152f26747o74178m05757L66095P16072K68066j70731K7718L31760J26295j84467
42142b25874n561L20996J72857j93745j26199K53330L26265O5188r4466j58614
42132C34177l95250n16137n8991N78949N60943P604j44655K58020L28705k64567
42122F88798o78843l70335O180r6825m9693P00607J287125O52670n47334p72741
42112H19609q426K53084n09178j021391l72207N21104N18665O9331J69572M52109
$$ plain form
42182 331558 323762 468333 1164598 1702954 1268807 179411 -537074 -560334 -495552 -660816
42172 -660816 -558914 67810 514733 162143 -411402 -281147 304876 328094 -292255 -578003
42162 -578003 -168923 68660 -484670 -1169887 -1119652 -523789 -117924 -88738 -233670 -626747
42152 -626747 -1300925 -1706682 -1340587 -624515 -356449 -527180 -499462 -167702 -41407 -225874
42142 -225874 -231435 89561 262418 68673 -57526 195804 522069 587257 492791 334177
42132 334177 -61073 -577210 -636201 -57252 503691 511295 366640 624660 953365 688798
42122 688798 9955 -360380 -354200 -451025 -500718 199889 1487014 2139684 1592350 819609
42112 819609 811183 1064267 555089 -466302 -838509 -317405 201260 270591 440163 892272
42102H92272j43169j261529j370839j67230Q30548N72596m0520J83384P64133
42093B59646M79782m85205p77217n4724M80199l621p22691n67133K46050O26176
42083e18738K12397l13531l35499J6651L44825N48305O91980O90617M11189n1109
42073A697087l96318m08978j64827M9872K8598j61799l31139m38648n28298m45053
42063a099503K4255O29738P25002J54243l59701j90011K22569N3748n31316o05968
42053i76944m7818K16561j32178o1362J069669J989083J059619j107737k103903
42044i5010r19465P20689Q20051k73407p19357J09721J009101Q25986j53603r16196
42034D08510j010110p23465m45584k43586Q7563P00852J315994J283798L66799
$$ plain form
42102 892272 749103 -512426 -1883265 -2050495 -1219947 -647351 -687871 -504487 259646
42093 259646 739428 254223 -522994 -577718 -97519 -101140 -823831 -1390964 -1144914 -518738
42083 -518738 -306341 -619872 -955371 -938720 -593895 -45590 646390 1337007 1748196 1697087
42073 1697087 1300769 891791 726964 776836 805434 643635 312496 -126152 -654450 -1099503
42063 -1099503 -1075248 -445510 279492 433735 74034 -115977 106592 160340 -370976 -976944
42053 -976944 -1024762 -808201 -940379 -1001741 67928 2057011 3116630 2008893 -95010
42044 -95010 -1014475 -293786 526265 252858 -466499 -356778 652323 1478309 1324706 408510
42034 408510 -601600 -1325065 -1770649 -2014235 -1926672 -1225820 90174 1373972 1740771
42025A740771o74446q18332j27055K77600k25283q98538p71160L345N68434O86919
42015b37745P97520R41971N83466l26612r42526o58993n3878o8793n94512n98881
42005a158983L56258J391585J382603L31370p16878r13459l67294K58395M89824
41996A053421K72903j92704o05625p41270o85436p20876q18873n38918K54372
41987b723006R05147P32476O9910j50455K02938K98118k55906p28821m49349J47993
41977a950955L38003K71790M62856O59990K84713l33761l16304K60104M03884
41968H0320j07986l07807K87758P49921K13286o88794q12264k27806J03388m6096
41958g56080P412N11910Q13015M50236j08362k13055N2549J32915j59259m66256
$$ plain form
42025 1740771 1066325 247993 120938 398538 173255 -725283 -1496443 -1493098 -924664 -237745
42015 -237745 559775 1501746 2085212 1758600 816074 157081 103203 34410 -560102 -1158983
42005 -1158983 -802725 588860 1971463 2302833 1585955 672496 305202 563597 1053421
41996 1053421 1326324 1133620 527995 -213275 -898711 -1619587 -2438460 -2977378 -2723006
41987 -2723006 -1817859 -1085383 -1015473 -1165928 -962990 -664872 -920778 -1649599 -2098948 -1950955
41977 -1950955 -1612952 -1341162 -878306 -218316 66397 -267364 -583668 -323564 80320
41968 80320 -27666 -335473 -47715 702206 915492 226698 -585566 -813372 -709984 -756080
41958 -756080 -748668 -236758 576257 1026493 918131 705076 757625 890540 731281 265025
41948B65025m21830p7961K08214J76054r5887l26232l43589j74672J14596M50423
41938b25859O21724M16284j4888k34219j00806M8482k9165j13627K7627K28401
41928F23954K87395L24869L89184J66556m09372p23256l09254K92640K90206j05050
41918H27872j16143J50492j52546r83274j163632j81136Q65239Q09655L6125k95442
41908b02790p070P9743m05277q29501n19217L44197R64697P73687k7705o35124
41898d64360m33572L19538Q30706P94003O21847N46026J58375p30552j401214
41889B40797j081387j12910M49918J94003l55047o26803n34286j81217L14088
41880a692844O61342N86850K18465j20411l89618o35926n33800J94233J004447
$$ plain form
41948 265025 -156805 -234766 -26552 149502 53615 -272617 -616206 -790878 -676282 -225859
41938 -225859 395865 812149 797261 563042 462236 510718 481553 367926 395553 623954
41928 623954 911349 1236218 1625402 1791958 1382586 659330 350076 642716 932922 827872
41918 827872 711729 862221 709675 -273599 -1437231 -1618367 -753128 56527 92652 -202790
41908 -202790 -209860 -130117 -535394 -1364895 -1884112 -1539915 -575218 198469 170764 -464360
41898 -464360 -897932 -578394 252312 1046315 1668162 2214188 2372563 1642011 240797
41889 240797 -840590 -953500 -503582 -309579 -664626 -1291429 -1825715 -2006932 -1692844
41880 -1692844 -1031502 -444652 -226187 -346598 -736216 -1372142 -1905942 -1711709 -707262
41871g07262R83286J52857m61252k57390K27536L30189K01712K58400L76914K50919
41861A355909L7728J5952p430l22809o72806o13118k65742p6939l0784K16632
41851c63407N45625M46674r9872n22625n55522n55905p12700o15081M07O41161
41841a791245P11351L78456K54828M84436O77230N79414K88769r6057n22480p21709
41831B42993m37080M0203J03739k72821m23568k85M71011M24315J21915J39198
41821D09620L82136L00513j29160l51315j32566J48974J86761J05920K0837j64845
41811G76875l37345j48478L38662N39616J59289m22692q11472j007102q99344
41802a811991j78257P90396R26680J2361o11751O1839R90114O19944n49784o96177
$$ plain form
41871 -707262 276024 428881 -32371 -289761 -62225 267964 469676 728076 1104990 1355909
41861 1355909 1393637 1409589 1402159 1079350 406544 -206574 -472316 -549255 -580039 -363407
41851 -363407 182218 628892 529020 6395 -549127 -1105032 -1817732 -2432813 -2432406 -1791245
41841 -1791245 -1079894 -701438 -446610 37826 715056 1294470 1583239 1487182 964702 242993
41831 242993 -194087 -153884 -50145 -322966 -746534 -746819 -275808 148507 270422 409620
41821 409620 791756 1092269 963109 611794 479228 628202 814963 920883 941720 776875
41811 776875 439530 291052 629714 1169330 1328619 905927 94455 -912647 -1811991
41802 -1811991 -1990248 -1199852 -273172 -260811 -872562 -810723 179391 799335 249551 -446626
41792d46626L27309P10987l21707j231004o92309L32897L13562m13730m29869
41783a850490M29932J055220Q91349M11299K5869k47920k01623L30996P50708
41774A595340L09512n66178o56218K55850J016905P63970j2145m12836l23553
41765A970647k24123l98788p15565q16203l84379M05522P95929L37371l18749
41756F51662k62548K45181J90429m28730n04147K93195Q46530L64748m03055m93896
41746D99369j65749n8972Q4349O94841J128712M66385q49002j423299q04862J11801
41736c16427M98503M19762K35790O0384r0252k65196o50854j105453r23018J71823
41726a964938J167417R19079j25347n49372j36357J7894l78140k41272Q00894
$$ plain form
41792 -446626 -119317 591670 269963 -961041 -1653350 -1320453 -1006891 -1420621 -1850490
41783 -1850490 -1420558 -365338 526011 937310 963179 715259 513636 844632 1595340
41774 1595340 1904852 1338674 682456 938306 1955211 2719181 2707036 2294200 1970647
41765 1970647 1746524 1347736 632171 -184032 -568411 -162889 633040 970411 651662
41756 651662 389114 634295 824724 395994 -108153 185042 1031572 1396320 993265 499369
41746 499369 333620 274648 358997 1053838 2182550 2648935 1799933 376634 -428228 -316427
41736 -316427 182076 601838 837628 898012 807760 542564 -108290 -1213743 -2136761 -1964938
41726 -1964938 -797521 121558 -3789 -553161 -689518 -671624 -1049764 -1291036 -490142
41717d90142J369086M02917j014927j178172j65526O27523O92996O88758Q49920
41708A782433N89883k43079r34013r83467o74834l37290Q4566M75731M11414p8524
41698I2820l42667p1572K56420K61980K64481M91152M18714l51222j109609q41817
41688i31320K45867R04144N21556k07687m46431k60585j33949q5925J43884M02414
41678A51968K56868k62841n98466m23829m7640J10987R0556J36928J25724l28477
41668g88222j144573j536034q09308O86838J720819J438365L16211l67209l060
41659d86173O71612N44491m30881j137989o77623N28069J261358R01091m4101
41650A129854o80496o35614j98972J12023J8661k54008j30463O27365J377670
$$ plain form
41717 -490142 878944 1281861 266934 -911238 -1076764 -449241 243755 932513 1782433
41708 1782433 2372316 2129237 1195224 211757 -463077 -800367 -715801 -240070 171344 92820
41698 92820 -249847 -321419 -64999 196981 461462 952614 1371328 1020106 -89503 -931320
41688 -931320 -685453 218691 740247 532560 86129 -174456 -308405 -394330 -250446 151968
41678 151968 408836 145995 -452471 -876300 -923940 -812953 -722397 -585469 -459745 -788222
41668 -788222 -1932795 -3468829 -4278137 -3591299 -1870480 -432115 -115904 -483113 -486173
41659 -486173 185439 729930 299049 -838940 -1516563 -988494 272864 1173955 1129854
41650 1129854 449358 -186256 -385228 -273205 -254544 -508552 -639015 -11650 1366020
41641A366020J180565P2928p64971m97594K11802J58349o58987j104625o39861
41632f76374l6237q2871m44418l64559J52292N64661P28670Q21670O36251j66193
41622A132892j162231j403009p01414P7395K49233R2809N2280o6863m93868p11124
41612b933900j06624R09570J276057O94224n9640k80438j21532o8018k01303k76231
41602a167835j44777J50254M46514M96892J97550j61563j85594O5696J83761P2496
41592d6606J0528J5102k27746o20230n48521R9228N01933P3303n28545l01756
41582a573310O10731J166507R26743M62018L01576K90918J35509r1164k13373
41573B016155k34060j78493o5511j03734m68830q47111p18080j66354J54599J1412
$$ plain form
41641 1366020 2546585 2619513 1854542 1356948 1568750 1727099 1068112 -36513 -676374
41632 -676374 -712611 -795482 -1239900 -1604459 -1452167 -887506 -158836 662834 1299085 1132892
41622 1132892 -29339 -1432348 -2133762 -2056367 -1807134 -1714325 -1662045 -1728908 -2222776 -2933900
41612 -2933900 -3040524 -2130954 -854897 -160673 -220313 -500751 -622283 -690301 -891604 -1167835
41602 -1167835 -1312612 -1162358 -715844 -218952 -21402 -182965 -368559 -302863 -119102 -46606
41592 -46606 -36078 -20976 -248722 -868952 -1417473 -1318245 -816312 -743009 -1271554 -1573310
41582 -1573310 -962579 203928 1130671 1592689 1894265 2185183 2320692 2229528 2016155
41573 2016155 1782095 1603602 1538091 1434357 965527 118416 -599664 -766018 -611419 -600007
41563f00007n7568L57200Q48990Q05376K93836q9600k5758K04393J00364m78304
41553A358922j009272p13091M17995J236502P14422n50289r80577k09760M50265
41544G15117N8514o10660m90303Q3802J64627j21871N2510O33480P65165K72960
41534A523341j42840j78000k48380m42664k69145K77673M27158j61528p69262
41525A6353o76456j19293L01475M95573O17578N02251k195n05183m60914R3049
41515B62238N78876N20254p7212p71868r79926n22617M0202J4720m56227n82787
41505a974347j60754J28280j05136l25014r5344J02974j94105m21891J43782J029181
41495a872374J138703M15172j41566m5597J18878j60105n59228n94255l12319
$$ plain form
41563 -600007 -657575 -300375 548615 1353991 1647827 1558227 1532469 1736862 1837226 1358922
41553 1358922 349650 -363441 54554 1291056 2005478 1455189 474612 264852 715117
41544 715117 773631 162971 -327332 -243530 -78903 -200774 -148264 485216 1250381 1523341
41534 1523341 1380501 1202501 954121 511457 242312 519985 947143 785615 16353
41525 16353 -660103 -779396 -477921 17652 635230 1137481 1135286 630103 169189 262238
41515 262238 841114 1361368 1284156 512288 -467638 -990255 -950053 -935333 -1391560 -1974347
41505 -1974347 -2135101 -2006821 -2111957 -2436971 -2532315 -2429341 -2623446 -3045337 -2901555 -1872374
41495 -1872374 -733671 -318499 -460065 -505662 -386784 -546889 -1106117 -1700372 -2012691
41486b012691M743K22029J94961j61169m32354k8315P65511Q41311j29380r27700
41476a663054l97698P97325J060919J87471l96119J78634R72674P59583j51430
41467A348305n64210l10976l35344r23470j085357j91077P97075O49173k16026
41458h31907l01715O97396J448837J012425J08741k31623k13911n20431q21028
41449C46784l08804O52268P67119k35618j099619q35907J5575M33949L26031J94694
41439B56472J09232j59047m09017k47492J53721K61628L5807p1769Q4792J79120
41429A93447O4213k6878m0862k65083o98950q05839k57585M74771O96040L85192
41419b81534Q1480M0044q266k45578l95577j90483J21938R6958k14975k90181
$$ plain form
41486 -2012691 -2007948 -1785919 -1590958 -1752127 -2184481 -2212796 -1447285 -605974 -735354 -1663054
41476 -1663054 -2060752 -1263427 -202508 -15037 -411156 -232522 740152 1499735 1348305
41467 1348305 784095 473119 137775 -785695 -1871052 -2062129 -1265054 -615881 -831907
41458 -831907 -1133622 -436226 1012611 2025036 2133777 1902154 1688243 1167812 346784
41449 346784 37980 690248 1457367 1221749 122130 -713777 -698202 -264253 61778 256472
41439 256472 365704 206657 -202360 -449852 -296131 -34503 1304 -70465 14327 193447
41429 193447 257660 230782 189920 -75163 -774113 -1579952 -1837537 -1362766 -666726 -281534
41419 -281534 -200054 -160010 -168276 -413854 -809431 -999914 -877976 -781018 -995993 -1286174
41409a286174R6986M94675M03961J5097o5031K99621O01131M36258j2426l91880
41399E92218o31946p12521m14365K57797P40298N48915L9574o9355K02511J76590
41389G29716l09019o01791l28337J4093j5827l9738L43635O64664L45002j42374
41379F60024O6732O58720M55039o05888j078009j40301J001813P75259m81664
41370A311725j045146k43073Q13873R62534L81463r3541k10722k87646m60974
41361A128493n53961m90845l76188k19272Q1013M57298O08878L02517l23630q06607
41351a92304p70950l36409m583m2901j76467j03245l8565k96353n28448o7032
41341b557257R15072J332373O13248m44217p50607l32646j5345q1464m5007L40959
$$ plain form
41409 -1286174 -1189188 -694513 -290552 -275455 -340486 -40865 560266 996524 984098 592218
41399 592218 -39728 -752249 -1166614 -908817 -168519 380396 419970 350615 553126 729716
41389 729716 420697 -181094 -509431 -495338 -511165 -550903 -207268 457396 802398 660024
41379 660024 726756 1385476 1840515 1234627 156618 16317 1018130 1793389 1311725
41370 1311725 266579 23506 837379 1799913 2181376 2087835 1877113 1589467 1128493
41361 1128493 574532 83687 -292501 -511773 -430760 26538 635416 937933 614303 -192304
41351 -192304 -963254 -1299663 -1304246 -1347147 -1523614 -1626859 -1665424 -1961777 -2490225 -2557257
41341 -2557257 -1642185 -309812 303436 -140781 -891388 -1224034 -1239379 -1320843 -1365850 -1024891
41331a024891O29104L99955j35420n09100n71063m40678j82523K06456O40650
41322i87510R58727J019733P39156J65762m28201o80949m60832q385K63351J18613
41312F99465k62643l97224l7700L86738K05497m95117p83911j43928O71986O46643
41302D89806j9793k41541L09592Q11067O15246M0716m54789r81163j541185j443118
41292b415162k24633J291032J740537Q80067k24487o19970m01136j52672j05197
41283b31621j35137j67842k15524k05402m7635J86591L18568K73169J45796N6546
41273b2491j7705k20118n82307q61268p36278j91212M27668P70367P67083N42138
41263a24123K42017P223r3635j77742l72999m69363p1442P36928J240395R16341
$$ plain form
41331 -1024891 -395787 4168 -131252 -640352 -1211415 -1652093 -1834616 -1628160 -987510
41322 -987510 -28783 990950 1730106 1895868 1467667 786718 325886 317501 580852 699465
41312 699465 436822 39598 1898 388636 594133 99016 -684895 -828823 -156837 489806
41302 489806 470013 228472 538064 1349131 1964377 2005093 1550304 569141 -972044 -2415162
41292 -2415162 -2639795 -1348763 391774 1271841 1047354 427384 26248 -126424 -231621
41283 -231621 -366758 -534600 -750124 -955526 -1003161 -816570 -498002 -224833 -79037 -22491
41273 -22491 -40196 -260314 -842621 -1703889 -2440167 -2631379 -2203711 -1433344 -666261 -124123
41263 -124123 117894 125117 31482 -146260 -519259 -988622 -1060064 -323136 917259 1833600
41253A833600J41220k90952j60183O3876k2478l00702m27465k53261R4730L11162
41243I89547J15699m08617p41555m63747J86947N98082N68888M46549M66675L87835
41233B146303l7569n70253p46062m64389p2977P6992N420L8265M06420Q78448
41223A660598Q71073J13156q33818j028604k61209N71308M85593l53275p92496
41214D32326j13973J059377J493584P59187l81487r18766n95604Q6213N29380
41205B350237N06544J77498j19462j92025k29128n21317q58206o11816K79731
41196G82056Q90750M47681m91302p67858k73883Q1767n0118p7004J66558l9959
41186F68688q37312j120632k55408O48538L89106l18509M725J044422J061552
$$ plain form
41253 1833600 1974820 1683868 1523685 1587561 1565083 1264381 836916 583655 678385 989547
41243 989547 1105246 696629 -44926 -508673 -321726 276356 845244 1291793 1758468 2146303
41233 2146303 2108734 1538481 792419 328030 255053 332045 337465 375730 782150 1660598
41223 1660598 2531671 2644827 1811009 782405 521196 1092504 1578097 1224822 432326
41214 432326 318353 1377730 2871314 3630501 3249014 2330248 1734644 1820857 2350237
41205 2350237 2856781 3034279 2914817 2722792 2493664 1972347 1114141 502325 782056
41196 782056 1672806 2120487 1629185 861327 587444 669211 619093 542089 708647 668688
41186 668688 -168624 -1289256 -1544664 -896126 -507020 -825529 -820804 223618 1285170
41177A285170k82710j261807o61936N26453P63906Q4546m15507l55870k63399
41168e81154m12254m38224o7465M08168M98932J00297l33045k12181M37304Q19102
41158B19480L42368m56502n90633n7670K54748P4468J01599O27124R26210N48298
41148A989490J30158J86425J09307o53664j312392q34565K90033O99704K09941
41139H14437j45216R542r4298p24864q70377J86878J461461J367281j71081j537683
41129B96080j356470k4286R37144P50410J23426J2395K07717j55957r43958r79379
41119a132878N6222Q36117K90565o94028o32792K38887M53587k52062o05548J0585
41109a431345O10328L54794j08519J24270O78402N80999j69667o73589m53170
$$ plain form
41177 1285170 1002460 -259347 -921283 -394830 369076 453622 38115 -317755 -581154
41168 -581154 -993408 -1431632 -1499097 -1090929 -591997 -491700 -824745 -1036926 -599622 219480
41158 219480 561848 105346 -485287 -542957 -288209 -213741 -112142 514982 1441192 1989490
41148 1989490 2119648 2306073 2415380 1761716 449324 -385241 -95208 604496 814437
41139 814437 669221 678763 584465 -140399 -1010776 -823898 637563 2004844 1833763 296080
41129 296080 -1060390 -1084676 -147532 602878 726304 738699 946416 790459 -153499 -1132878
41119 -1132878 -1076656 -240539 50026 -644002 -1276794 -1037907 -584320 -836382 -1441930 -1431345
41109 -1431345 -821017 -466223 -574742 -450472 227930 808929 639262 -34327 -487497
41100d87497P8942L62423L20949K46206L73453N77084M37213k09648q56036q71153
41090b8064m19831k47171n03493n23854O674M78253L76404J22266K97513O61079
41080B19776O27224K35004o0187j70720k60994j87545K26730O10761M52840p2149
41070A620740l45529k31125r7909m1075K00371N54533N49952O7517m21926n21115
41060A334434l11829J8410M47059Q43754Q99329N62933J78978k1434k16208n53376
41050C182050p53830m73123J39188N57771M89746J21476k29258m79052o83127
41041A871841p22236l54584L32213P82357N83591P8857k8742L61376O53868M74418
41031D032959J18798r5573l03417n56652m35357K41144Q05365N16556l79907j008092
$$ plain form
41100 -487497 -408555 -46132 274817 521023 894476 1471560 1908773 1699125 843089 -28064
41090 -28064 -447895 -695066 -1198559 -1722413 -1715739 -1237486 -861082 -738816 -441303 219776
41080 219776 847000 1082004 1021817 851097 590103 402558 629288 1240049 1692889 1620740
41070 1620740 1275211 1044086 946177 905102 1105473 1660006 2209958 2277475 1855549 1334434
41060 1334434 1022605 1041015 1488074 2331828 3231157 3794090 3973068 3951634 3735426 3182050
41050 3182050 2428220 1955097 2094285 2652056 3141802 3263278 3034020 2554968 1871841
41041 1871841 1149605 795021 1127234 1909591 2493182 2572039 2543297 2904673 3558541 4032959
41031 4032959 4151757 4056184 3752767 3196115 2760758 3001902 3807267 4323823 3943916 2935824
41021B935824r95860o20064j19677L96408N73846J45873m53245n66113l17675
41012I79317l51880o42537m86420K43325P87923O85424L67118K38001L2402m39992
41002A412681o96509l43609J66387J68478k57999n11065k96052K12173O93584
40993E48069P89239K61142n75023r46031n03093K47397O53694N95148K05980m45994
40983H30528j019340r18918j90978K48952j02949m93915r4404O38689P26509K63268
40973a12558J43059N15107O67184L34245m053j59954m71292q44924o55238P7139
40963e11285M28861j5749m15178J8088P11865N51426m52898j134292o80901M35367
40953a064696J085609O86344k73332p57018k60991O28822R27826M34749j32375
$$ plain form
41021 2935824 1939964 1319900 1200223 1596631 2170477 2316350 1863105 1296992 979317
41012 979317 627437 -15100 -501520 -258195 529728 1215152 1582270 1820271 1852673 1412681
41002 1412681 716172 372563 538950 707428 449429 -61636 -357688 -145515 548069
40993 548069 1337308 1598450 1023427 77396 -425697 -178300 475394 1070542 1276522 830528
40983 830528 -188812 -1107730 -1298708 -1049756 -1152705 -1646620 -1741024 -1102335 -375826 -112558
40973 -112558 30501 545608 1212792 1547037 1542984 1383030 911738 66814 -588424 -511285
40963 -511285 -82424 -98173 -513351 -495263 216602 768028 315130 -819162 -1500063 -1064696
40953 -1064696 20913 707257 433925 -323093 -584084 44738 972564 1407313 1274938
40944A274938j81941O3155J03858q3938j73110l1417K06020L99915M51854K51669
40934B281003j63410n07557n03986j89685J20586R9107l47351r35159j151167
40925a297619p50829n4232M65440P34947R15250R11524N51626J09597M6962K64455
40915A897121K20427k08873o21143q19521r22748p52888m150Q64352R11746J71638
40905G35961k34523J34663L12095l60717r53417m00495P19823J065806N01819
40896A521015m4355j82958k88454m77968n38100n98106p82074n34850N13937J376219
40886c5694Q06116o15376j039465m7940P87261L56317n12356o10625l2601M38652
40876e05711N14627K54364k93151o68677j98068P95956J027998J50206n29854
$$ plain form
40944 1274938 1092997 1156152 1260010 1176072 1002962 971545 1177565 1577480 2029334 2281003
40934 2281003 2117593 1610036 1106050 916365 1036951 1136058 788707 -146452 -1297619
40925 -1297619 -2048448 -2102680 -1637240 -902293 12957 924481 1476107 1585704 1632666 1897121
40915 1897121 2117548 1908675 1287532 468011 -454737 -1207625 -1211775 -347423 564323 735961
40905 735961 501438 636101 948196 587479 -365938 -766433 -46610 1019196 1521015
40896 1521015 1476660 1293702 1005248 527280 -10820 -608926 -1391000 -1925850 -1411913 -35694
40886 -35694 770422 155046 -884419 -932359 -145098 211219 -301137 -911762 -944363 -505711
40876 -505711 8916 263280 -29871 -698548 -896616 -100660 927338 1077544 547690
40867E47690o1669O01989J83147q35554j042003k64303M66669O19651N07977K76794
40857A000388j92582n57683l30873K00665L53193J53392J20698K24463Q8110n2020
40847A007751K76848O75176L41728m83666p75998l44629N8983J85735M63606P09979
40837B115513K01546p43715q54860k6427K78215n64202j151311l02013R89356
40828e7898J164155M63469J84030M57190L57799k85610o96200n49296k90677j65996
40818E80966k1423M8002j45813k31286K27828P45577M63664m05215p55329k31479
40808B75492L39913K75886j74502n28542o50232m45011J67561P73451P60090K60136
40798A054242K720J22919L0742l98318n44659k30690q9508l25418k42076L74380
$$ plain form
40867 547690 486021 1088010 1271157 435603 -606400 -870703 -404034 215617 723594 1000388
40857 1000388 807806 250123 -80750 119915 473108 626500 747198 971661 1059771 1007751
40847 1007751 1284599 1959775 2301503 1817837 1041839 697210 756193 941928 1405534 2115513
40837 2115513 2317059 1573344 718484 692057 970272 406070 -745241 -1047254 -57898
40828 -57898 1106257 1569726 1753756 2210946 2568745 2283135 1586935 1037639 746962 580966
40818 580966 559543 607545 461732 230446 458274 1203851 1667515 1262300 506971 275492
40808 275492 615405 891291 716789 188247 -461985 -906996 -739435 34016 794106 1054242
40798 1054242 1056962 1179881 1210623 812305 267646 36956 -52552 -377970 -620046 -245666
40788b45666N42882l47832j249826q38139N41770J460800J393901R27330L80811
40779B566031m55833j287330j288056l74174M80684N31748R4559j94044k25114
40770a51529j86231j00778J7592K3442k3221K00599P12893J006529P00265O1588
40760B261149l97769n15786m00331j03802K76886M38552J82368k47920m28550
40751A064797k69574n7467p5981l44742o34542o22550j62268M85164Q18358N92890
40741G94085M3827l99550m43772k2498O15979Q90941L78668n40181r49458n22036
40731a53995P5803J77341j8149k2661L6698k05016m53089j17444N60839O89407
40721E69734J33812j89444K40902P04487M21114j84142k22141J72669Q3518o37695
$$ plain form
40788 -245666 297216 -50616 -1300442 -2138581 -1596811 -136011 1257890 2185220 2566031
40779 2566031 2110198 822868 -465188 -839362 -358678 173070 267629 73585 -151529
40770 -151529 -337760 -438538 -420946 -397504 -420725 -220126 492767 1499296 2199561 2261149
40760 2261149 1863380 1347594 947263 843461 1120347 1558899 1741267 1493347 1064797
40751 1064797 795223 737756 661775 317033 -317509 -940059 -1102327 -617163 201195 794085
40741 794085 837912 438362 -5410 -27908 588071 1479012 1857680 1317499 368041 -153995
40731 -153995 -78192 99149 81000 58339 95037 -109979 -563068 -680512 -119673 569734
40721 569734 703546 514102 755004 1459491 1880605 1696463 1474322 1646991 1730509 1092814
40711A092814j048954n10367M06201P49857L56017k12505m73264l76476j15085
40702a31762Q6277J47359K54711N69601P49820K30610p96592j263786n67673M67547
40692b53888O41351K7972k51650K50955P44647M79262k48970p04992o57190l24014
40682b96517O8893K83425R5514l07976m08955j37262k2927k40704k09511L34049
40672h41971O43602J44460m05958p648Q63680R01120M5402m80121j97045M1119
40662G06640k32889k99211K04199L55266m52854j173464n98041O96015J224772
40653D30433P94697M18556M43069K49881k78854m67841k04319k35178p41179q73298
40643d64033k53147K46127l1231l32470K40469J104112J002488m3107p91391o14548
$$ plain form
40711 1092814 43860 -466507 -60306 689551 1045568 833063 359799 -16677 -131762
40702 -131762 -45485 101874 356585 926186 1676006 1906616 1110024 -153762 -721435 -253888
40692 -253888 387463 415435 163785 414740 1159387 1638649 1389679 684687 27497 -296517
40682 -296517 -227624 55801 151315 -156661 -565616 -702878 -725805 -966509 -1176020 -841971
40672 -841971 -198369 -53909 -459867 -467515 396165 1297285 1342687 862566 665521 706640
40662 706640 473751 174540 378739 734005 281151 -892313 -1490354 -794339 430433
40653 430433 1225130 1643686 2086755 2336636 2057782 1589941 1385622 1150444 409265 -464033
40643 -464033 -717180 -471053 -502284 -834754 -594285 509827 1512315 1469208 677817 63269
40633F3269j53802p7386k04462j59425m7261k2223J70612O85222J048524P09340
40623B012408j19669o70846n75019j85530K4067p97l9813K0599J16086J57444
40613G38930J07818k9103k01895l07555k35753O3911M96771P65576N28952j93844
40603A733808q33403p55683j2767O35989N92688P8615k74016k42844j03310o6693
40593G52384n8536m2451j45955l61652m69232l85230k83095k38857q1519K39695
40583a074448M64282M10004K65892K78012M06957M89215M52049K06010l06410
40574A591563p71562o90326j74129L033m55195p98716l71890L24013M90510L40900
40564e11799N22996P24683J46110q41588r33228P0795Q31061M72163k43776l18365
$$ plain form
40633 63269 -90533 -167919 -372381 -531806 -579067 -601290 -430678 254544 1303068 2012408
40623 2012408 1892739 1221893 646874 461344 485411 484614 444801 465400 581486 738930
40613 738930 846748 817645 615750 308195 72442 136353 633124 1398700 1927652 1733808
40603 1733808 900405 144722 131955 767944 1360632 1439247 1165231 922387 819077 752384
40593 752384 693848 651397 505442 143790 -325442 -710672 -993767 -1232624 -1314143 -1074448
40583 -1074448 -610166 -200162 65730 343742 750699 1239914 1691963 1897973 1591563
40574 1591563 820001 129675 -44454 -41421 -496616 -1295332 -1667222 -1343209 -852699 -511799
40564 -511799 11197 735880 881990 40402 -892826 -822031 9030 481193 237417 -80948
40554h0948O8286K69878K76038K80172L9753m66600n51724J09373O83235M06439
40544A033902j37184l6615L68843J98925k60931l0432O85440O37076l96494j125103
40534I37427o66137K88608O81227M28677M5687k16168l25278k19165j9714K2659
40524I57823J3639K55988N21507K52225l85868n52437p2559K42513l7227l07735
40514H87869j50570j20992n78955p73542r3208O46902L73792m19697l60516O24116
40504C5199J190918O50416j38857k47517O8145J36837M9871L32256Q84493R59385
40494C921146J50529r97096j459084p53191M81906J015964L16476q04984j126726
40485G44940m69200K44064L39720J63579K40365L21825q0885n94465l05064P44186
$$ plain form
40554 -80948 -12662 257216 533254 813426 853179 386579 -165145 -55772 627463 1033902
40544 1033902 896718 860103 1228946 1427871 1166940 1136508 1821948 2459024 2062530 937427
40534 937427 271290 559898 1241125 1669802 1715489 1499321 1174043 954878 935164 957823
40524 957823 971462 1227450 1748957 2001182 1615314 1062877 990318 1232831 1195604 887869
40514 887869 737299 616307 37352 -736190 -829398 -182496 191296 -228401 -588917 35199
40504 35199 1226117 1876533 1737676 1490159 1558304 1695141 1745012 2077268 2961761 3921146
40494 3921146 4071675 3074579 1615495 862304 1344210 2360174 2676650 1871666 744940
40485 744940 275740 519804 859524 1023103 1263468 1585293 1504408 909943 604879 1349065
40475A349065J252101L62844r80064j190113k02914N17921J56652l78127k0148
40466H67217Q04274R50541K90170l53295n81347o52232n64189m5227N56365M93409
40456A765686j23141l64406k543J32047l18433n13290J61173R77428R61091K59856
40446B935468l66690o74746p65062m96033R5663M14251J55925p0509K41562N54510
40436B024339K38403k67817k79659j46225n08108q94357m26182N17050P78009
40427A035453L00389O3162K82116K06857k58539l08669J34961R4085o82597j045930
40417a78712k49828Q26217J074138P13659N61190O15505L36316k47444n79637
40408B871404l97706R3259N67123O99814L27893k13089l54312j07768m8918l11459
$$ plain form
40475 1349065 2601166 2964010 1983946 793833 590919 1108840 1265492 887365 867217
40466 867217 1671491 2622032 2912202 2558907 1977560 1325328 761139 715912 1272277 1765686
40456 1765686 1642545 1278139 1275596 1407643 1089210 575920 737093 1714521 2675612 2935468
40446 2935468 2568778 1894032 1128970 632937 728600 1142851 1298776 1228267 1469829 2024339
40436 2024339 2262742 1994925 1715266 1569041 1060933 166576 -259606 257444 1035453
40427 1035453 1335842 1399004 1681120 1887977 1629438 1320769 1455730 1549815 867218 -178712
40417 -178712 -428540 397677 1471815 2185474 2746664 3362169 3698485 3451041 2871404
40408 2871404 2473698 2566957 3134080 3833894 4161787 3948698 3594386 3486618 3437700 3126241
40398C126241l35940J00219M13241J80148k17288l80767n23380p67280o36248
40389I58946O4811O04904L40141k52795l63000j16358j84161n22092m17336L37632
40379D50692J056917R76920M8790j017778j305024n44118M61909P08550L22734
40370A159592L13656Q96791J097161M10034l01473k75078p9650m09416p20864
40361B090753l18282J15999m19316j288389r79047M45381J292106P03974l02924
40352A340255n54751j74710J38505K28938L14955M23177M44134K90513j53759
40343B297257p68414r59865l47393M33412M28651k08039m25690P3167M47895J86628
40333A157609j31307J8696J85427j81650o96896o30834n9221K81784M8494l61380
$$ plain form
40398 3126241 2790301 2890520 3303761 3483909 3266621 2885854 2362474 1595194 958946
40389 958946 1023757 1628661 1968802 1716007 1353007 1236649 1052488 530396 113060 450692
40379 450692 1507609 2484529 2533319 1515541 210517 -333601 128308 836858 1159592
40370 1159592 1473248 2370039 3467200 3877234 3575761 3300683 3221033 2811617 2090753
40361 2090753 1772471 1888470 1469154 180765 -798282 -352901 939205 1643179 1340255
40352 1340255 785504 610794 749299 978237 1293192 1716369 2160503 2451016 2297257
40343 2297257 1528843 568978 221585 654997 1083648 875609 449919 523086 970981 1157609
40333 1157609 1026302 1044998 1230425 1048775 351879 -278955 -338176 -56392 -7898 -369278
40323c69278m37498j62794N0359q3091k73678N0682Q69186J336616Q29634j11765
40313A698373m69331r7996L07861L75525L34135K20528k53316r07191j046710
40304A61878m93081P1213Q9564j57575j12294L19505Q15910R89898O03772j32544
40294B156246n52427l45858j55289o34211j217748q71093J24511M38037j77336
40285a235168m39704L66673J236638J076210K76073j99564k69510l45145l27844
40276A38659L6892M36253M77013L52212L11797Q3472m69370p76846m26024M3818
40266B07876J6321j62533J12064N58075N12245Q9504j15843p7919j65362k98597
40256F75831j97048j06035l40558m52705J33452R23009Q66126l2299o72925m76291
$$ plain form
40323 -369278 -806776 -969570 -919211 -1002302 -1275980 -1225298 -356112 980504 1810138 1698373
40313 1698373 1229042 1131046 1438907 1814432 2148567 2369095 2115779 1208588 161878
40304 161878 -331203 -259990 -170426 -328001 -440295 -120790 695120 1685018 2288790 2156246
40294 2156246 1603819 1257961 1102672 468461 -749287 -1620380 -1495869 -1057832 -1235168
40285 -1235168 -1674872 -1308199 -71561 1004649 1280722 1081158 811648 466503 138659
40276 138659 175551 611804 1088817 1441029 1752826 1836298 1366928 590082 164058 207876
40266 207876 224197 61664 173728 731803 1244048 1333552 1217709 1139790 974428 675831
40256 675831 478783 372748 32190 -420515 -287063 635946 1502072 1469773 796848 320557
40246C20557n4703q0172l34085k29861K91140P17309N51055j66520p82799o56629
40236d24708P954L60173J44513P5672N31412P04745j20341j179250j196970k47022
40226a343822N18855O54738P04564Q65412O41141m9203n19019l35428J39363M07281
40216A683882L41382j730m10703m50508l7774J68768k68617o30573j02107O77530
40206I69550M74885m34572o30137M4705K26087n30964r01278n3351R50495R76314
40196A091734N13466M02690K47184n31577j180705p14001K51545L24648m64117
40187e9133p98915j94304M45275M27771J86376L13912O47814O95514L37855j85229
40177A816936n82239o69876n16766l89860l19344K7052O95132J061590O43077
$$ plain form
40246 320557 265854 185682 -148403 -378264 -87124 630185 1181240 1014720 231921 -424708
40236 -424708 -416754 -56581 87932 163604 695016 1399761 1279420 100170 -1096800 -1343822
40226 -1343822 -824967 -170229 534335 1399747 2040888 1991685 1472666 1137238 1276601 1683882
40216 1683882 2025264 2023534 1612831 1162323 1124549 1293317 1024700 394127 292020 969550
40206 969550 1444435 1009863 379726 424431 650518 119554 -781724 -835075 115420 1091734
40196 1091734 1605200 2007890 2255074 1723497 542792 -171209 80336 404984 -59133
40187 -59133 -858048 -1052352 -607077 -179306 7070 320982 968796 1664310 2002165 1816936
40177 1816936 1234697 564821 48055 -341805 -661149 -634097 61035 1122625 1765702
40168A765702o9425k64563k4810j01982o23972q88588n10833M8830L40189N68804
40158B39352R79157J178418O40804m09182j151087j127918o31435j19162L26128
40149g4925P38965Q36191L44715l09082k68088N38865J060221N40290k81350k39939
40139B885863L88535K84907o88822j060683l2257J109023Q04569n13669j143301
40130B034165m99952M17529O69313L45918p4167l53404l42217L5011M70836N20443
40120C223475K16605o2642k55541n40326o98552l01295M23420O62374J45617m53182
40110B359953m80862q5706K18814K29805R155l52097o16555m69634o624K26577
40100A032826l7868l89340l58931p0189P7325M8166Q8156K30988K96891K44474
$$ plain form
40168 1765702 1696277 1431714 1406904 1304922 680950 -207638 -718471 -669641 -329452 239352
40158 239352 1218509 2396927 3037731 2628549 1477462 349544 -281891 -401053 -74925
40149 -74925 664040 1500231 1844946 1535864 1267776 1806641 2866862 3407152 3125802 2885863
40139 2885863 3274398 3559305 2870483 1809800 1777543 2886566 3691135 3177466 2034165
40130 2034165 1534213 1951742 2621055 2966973 2892806 2539402 2197185 2232196 2703032 3223475
40120 3223475 3440080 3377438 3121897 2581571 1883019 1581724 2005144 2667518 2813135 2359953
40110 2359953 1879091 1793385 2012199 2242004 2251159 1899062 1282507 812873 806249 1032826
40100 1032826 994958 605618 246687 176498 253823 301989 390145 621133 918024 1162498
40090A162498J50297o1129m83163q51034o93800K2711O96547P25298J91673k50421
40080F09477r6379N29429J050976R69412K69168n42569q24196m24874O5185n6527
40070A549102o62321q47868j62629O32193N35049k73432o94429l03428J75349
40061e2414J76212J69998O72782J117242N98476n99994j158974m38870P04965
40052A189423J056906M58008k38570l09191J02460L27441J0491n19829p12833
40043A364306m77561j99111j29517r3781J02475L21354L62580K87073K12808N8301
40033A808927k13404l45511j43944R4717q6810n99975p97592k55001O46826J058755
40023A166988N76815k51492m82225J20316Q13088Q93224N52412K67756j28287
$$ plain form
40090 1162498 1312795 1251666 768503 -82531 -776331 -753620 -57073 668225 859898 609477
40080 609477 513098 1042527 2093503 3062915 3332083 2789514 1965318 1540444 1605629 1549102
40070 1549102 886781 38913 -123716 508477 1043526 770094 75665 -227763 -52414
40061 -52414 123798 293796 966578 2083820 2682296 2082302 923328 484458 1189423
40052 1189423 2246329 2704337 2465767 2156576 2259036 2586477 2596968 2077139 1364306
40043 1364306 886745 687634 558117 464336 566811 888165 1250745 1537818 1750626 1808927
40033 1808927 1595523 1250012 1106068 1200785 1113975 514000 -283592 -538593 108233 1166988
40023 1166988 1743803 1492311 1010086 1130402 1943490 2836714 3389126 3656882 3528595
40014C528595r19957j464137q98741K10037L70947m51046n52316P67248J823823
40005B414453J060956n03566q87483r4378L24505p9525l39077p5016L0154k33934
39995A617089k51760P3679J02019k08005j35731L80968N19241P7288j07582L74524
39985B441730Q72659R10564Q41653Q77978P26528O26296J373153K680864K894132
39976A4245557J220205r37592j834332j524734j161026j140843j107573j046181
39968F713481j189033j274652q90944k34131K27324M55889N72042L74133k18507
39959D535602p42415q11892o36615m23362K0158N34489L73354n08887q81261N0934
39949A510105J221436J157565J11808n52305m81482m11674n47882l74520N8424
$$ plain form
40014 3528595 2608638 1144501 245760 455797 826744 375698 -176618 590630 2414453
40005 2414453 3475409 2971843 2084360 1989982 2314487 2234962 1895885 1820869 1851023 1617089
39995 1617089 1365329 1439008 1541027 1333022 1197291 1578259 2097500 2174788 2067206 2441730
39985 2441730 3314389 4224953 5066606 5944584 6671112 7297408 8670561 11351425 14245557
39976 14245557 15465762 14528170 12693838 11169104 10008078 8867235 7759662 6713481
39968 6713481 5524448 4249796 3358852 3124721 3352045 3807934 4379976 4754109 4535602
39959 4535602 3793187 2981295 2344680 1921318 1941476 2475965 2849319 2340432 1459171 1510105
39949 1510105 2731541 3889106 4000914 3448609 2967127 2555453 2007571 1633051 1691475
39940A691475R3647k34624j58865M10958O38215J73200k79041j47494J94090J89263
39930B570824j07479l56244m20883k67977Q5970L84298L87195L11210M56549N32086
39920C575549Q1060n40226m94158K10107O33502K88356k76393m72424l95086k72180
39910B338107k846L96443N78159M24489K09803q383m63708r44552q04195l7395
39900A685922M94397L61736K33144O20265P99072p6219j338710j423442m3383
39891A312782J258708J050547k03255q40501j43801Q82402R72401K26299k64912
39882D250670p9937J10823j43937l27658k4146J78327k92399q02599m47416L38156
39872B759884L71854l41568o25441o3193M44169K58131j48241k71345k94265k85964
$$ plain form
39940 1691475 1785122 1550498 1391633 1802591 2440806 2614006 2334965 2187471 2381561 2570824
39930 2570824 2463345 2107101 1686218 1418241 1504211 1888509 2275704 2586914 3043463 3575549
39920 3575549 3656609 3116383 2622225 2832332 3465834 3754190 3477797 3005373 2610287 2338107
39910 2338107 2335261 2731704 3309863 3734352 3944155 3935772 3472064 2527512 1723317 1685922
39900 1685922 2180319 2542055 2775199 3395464 4194536 4118317 2779607 1356165 1312782
39891 1312782 2571490 3622037 3418782 2578281 2434480 3316882 4289283 4515582 4250670
39882 4250670 4170733 4281556 4137619 3809961 3785815 3964142 3671743 2869144 2421728 2759884
39872 2759884 3131738 2790170 2164729 2101536 2545705 2803836 2655595 2384250 2089985 1804021
39862A804021J40742Q46068R84578M10181J08681N21936O39321k90386j254575
39853C910567q95154M02311J121885P52077P5198k78494l81419l41690j47798
39844D217483n7023k62442l60352M0428M78332K95597j93563k00589J44962L4006
39834D136839n23583o47273j02111L15425J52441m4632J65436L62726J23213k23060
39824C715421k51648j43192j63768q9300K59906M69489J49668l32192l61083J7497
39814C270798K87599K85252K47578K51204J90788J88422M33347O48766L14726
39805F118480m70201q94999m62757L02541N26135Q9138l47075l12375o2814j9520
39795D466553o8672K10330P79658J057598O94412O2729k62631k23157j31984k6754
$$ plain form
39862 1804021 1944763 2790831 3775409 4185590 4294271 4816207 5455528 5165142 3910567
39853 3910567 3015413 3417724 4539609 5291686 5366884 5088390 4706971 4365281 4217483
39844 4217483 4160460 3898018 3537666 3578094 4056426 4352023 4158460 3957871 4102833 4136839
39834 4136839 3613256 2965983 2863872 3179297 3331738 3287106 3452542 3815268 3938481 3715421
39824 3715421 3463773 3320581 3156813 3067513 3327419 3796908 3946576 3614384 3253301 3270798
39814 3270798 3558397 3843649 4091227 4342431 4533219 4721641 5154988 5803754 6118480
39805 6118480 5648279 4753280 4290523 4593064 5119199 5208337 4861262 4548887 4486073 4466553
39795 4466553 4397881 4608211 5387869 6445467 7139879 7202608 6939977 6716820 6584836 6558082
39785F558082L41029Q82782J066549O52890J16343j0863J12414K423k58064j07499
39775I356086N02780Q50355M36112l20068p79772r63264j146152j047671k73655
39766F614751O67271P97510J59588j66560K25496M46867r2532n90787j93568N44530
39756H412566N99556R8339j64506j54501k64907j67101N53706J121509N73828
39747A0608489l36975j10237Q60630P77131l64123n39647P59069J399771K31050
39738A3285158p75520J30286J345277O22748r54570p10381J092009J691753L85976
39729A6112736n69589J06957Q79090L69531l87382j1959Q95286J014589M74056
39720A8883315L06871P25283J179201J415140J461163J158756N57445K55194O50657
$$ plain form
39785 6558082 6899111 7781893 8848442 9501332 9617675 9606812 9719226 9721649 9463585 9356086
39775 9356086 9858866 10709221 11145333 10825265 10045493 9082229 7936077 6888406 6614751
39766 6614751 7282022 8079532 8239120 8072560 8298056 8744923 8652391 8061604 7868036 8412566
39756 8412566 9012122 9110461 8945955 8791454 8526547 8359446 8913152 10034661 10608489
39747 10608489 10271514 10161277 11021907 11799038 11434915 10895268 11654337 13054108 13285158
39738 13285158 12509638 12639924 13985201 14607949 13653379 12942998 14035007 15726760 16112736
39729 16112736 15543147 15650104 16529194 16898725 16511343 16499384 17394670 18409259 18883315
39720 18883315 19190186 19915469 21094670 22509810 23970973 25129729 25687174 25942368 26593025
39711B6593025J311314J586500J371492R48874O74702J017822K106389L040620
39703C8650738K672412J394604J011968K317901L969111M455878M037511L862817
39695F2372940M255828M904743N828152P051975Q073586Q689978R661065J1542291
39687A22380558J3588989J4901434J5940517J7713138K0081879K2142334K3732783
39680B50481632K5245368K6386342K6513896K5905245K5310216K4459988K2389268
39673D26691955J9057934J5193263J0598472M212502l928485j2266312j9583121
39666D39976208k5861705l0881454l3512630l3278965l1441762k9564019k7822545
39659B27613128k5539191k2603053j9538359j6766909j4520584j2953202j1751968
$$ plain form
39711 26593025 27904339 29490839 30862331 31811205 32485907 33503729 35610118 38650738
39703 38650738 41323150 42717754 43729722 46047623 50016734 54472612 58510123 62372940
39695 62372940 66628768 71533511 77361663 84413638 92487224 101177202 110838267 122380558
39687 122380558 135969547 150870981 166811498 184524636 204606515 226748849 250481632
39680 250481632 275727000 302113342 328627238 354532483 379842699 404302687 426691955
39673 426691955 445749889 460943152 471541624 475754126 471825641 459559329 439976208
39666 439976208 414114503 383233049 349720419 316441454 284999692 255435673 227613128
39659 227613128 202073937 179470884 159932525 143165616 128645032 115691830 103939862
39652A03939862j0222884q317579o925764o562391o488158n844886m937069m502498
39644E0138633m334317l659293k479663j518501j092616j002285j302102k123496
39636C2626360k810063k340576q14163M17624L98292m20562j072723j205172r54900
39627B3824117m43928P8740J50616k98740o60989m66078j30718l71534j136087
39618B0545399j646871j379069n65243J65745K93380k96958j136085j438853r53117
39609A3588328l84281n13922j065656j066079k90297L91714L05678j17932j66218
39600A0681335K0891k14551r11012j377298j158511n51333r7182N623j18632l01367
39590E977963m59053o22794q61988j056859q81692k39371M47185O68977M06296
$$ plain form
39652 103939862 93716978 85399399 78473635 71911244 65423086 59578200 54641131 50138633
39644 50138633 45804316 42145023 39665360 38146859 37054243 36051958 34749856 32626360
39636 32626360 29816297 27475721 26661558 27079182 27477474 27056912 25984189 24779017 23824117
39627 23824117 23380189 23458929 23609545 23310805 22649816 22183738 22053020 21681486 20545399
39618 20545399 18898528 17519459 16954216 17119961 17413341 17116383 15980298 14541445 13588328
39609 13588328 13204047 12690125 11624469 10558390 10268093 10659807 10965485 10847553 10681335
39600 10681335 10702226 10487675 9576663 8199365 7040854 6489521 6392339 6397962 6279330 5977963
39590 5977963 5518910 4896116 4034128 2977269 2095577 1856206 2303391 2972368 3378664
39581C378664j6049l96993n86077k77086M92873R02344K48492p96615q18674L13278
39571B444157J125834O61999j56126m7359O62640O73624k34815r53202p18893
39562C457859l5621K11259j83196p65687j009526p26675k03856O2235m1185j24562
39552F41045J2330P868l37381m99390l4319N53266N59125K58002L42777N26593
39542B029916p5730j235507j584053n79074O57724R22787L57444k19775m89284
39533b15552n18774k59394J65642K77704l8721j81980K46671P35433O58041K21403
39523A090473j9937q4786l05724n70135n31142k62112n4091J39420M27819M71121
39513C00906n7284p20080p43770j03342M50810M13865L0655k11482j33826J11287
$$ plain form
39581 3378664 3362615 2965622 2379545 2102459 2595332 3497676 3746168 2949553 2130879 2444157
39571 2444157 3569991 4231990 4075864 4028505 4691145 5364769 5129954 4176752 3457859
39562 3457859 3422238 3633497 3450301 2684614 1675088 948413 744557 806792 765607 641045
39552 641045 653375 661243 323862 -175528 -209847 343419 902544 1160546 1503323 2029916
39542 2029916 1954186 718679 -865374 -1444448 -786724 136063 493507 273732 -215552
39533 -215552 -734326 -993720 -828078 -550374 -589095 -771075 -524404 211029 869070 1090473
39523 1090473 1070536 985750 680026 109891 -421251 -683363 -737454 -598034 -170215 300906
39513 300906 243622 -476458 -1220228 -1323570 -872760 -458895 -428240 -639722 -773548 -662261
39503f62261K58608K02089J81722M51569O85219K66390n86230p49816K13087J194509
39493A454886J064413K82373o5370j22559p34778j496473j045945N77403J537093
39484A451043P33672o42482q94333n7416N79927L93115j25144l60700j86435J73278
39474A064525K98627j46692q66011j036764l98879K14647l4433p83903r73358
39465b662241k75668N88113Q38389M35505p3682j70312J38708L05988q2571o11840
39455a569611m81144K71604O79116K74244j82518M4372M75109L00889j93691j40096
39445e21726L84283M69212j07839n49302l11575K20320N03430M70866K07755k54853
39435E10571o09547m27651J39930M51755L17345J66954J53085r4941n58709n60733
$$ plain form
39503 -662261 -403653 -201564 -19842 431727 1116946 1383336 797106 47290 260377 1454886
39493 1454886 2519299 2801672 2736302 2613743 1878965 382492 -663453 -86050 1451043
39484 1451043 2184715 1542233 647900 590484 1170411 1563526 1438382 1077682 891247 1064525
39474 1064525 1363152 1216460 350449 -686315 -1085194 -870547 -904980 -1688883 -2662241
39465 -2662241 -2937909 -2349796 -1511407 -1075902 -1149584 -1319896 -1181188 -875200 -957771 -1569611
39455 -1569611 -2050755 -1779151 -1100035 -825791 -1008309 -963937 -488828 -187939 -381630 -521726
39445 -521726 -137443 331769 223930 -325372 -636947 -416627 86803 557669 765424 510571
39435 510571 -98976 -526627 -386697 65058 382403 549357 702442 607501 48792 -511941
39425e11941J21530O76757M08891k11980l38334k2733O0636k18112l32609K5527
39415c42368N85381R10974P47110J38739m55319m91854j19325j28186o89616q25660
39405f70124J18085J141025Q17011n63079j332610p96952N7908L06914K12812
39396g09010K30877J46534j40675o0067N79968Q98917K41239n98719n12639J66913
39386B43338K63182k67059l21233L77292O79842j35950j058949p45263M77154
39377d87646J011074J82203r04483r14505j065N59709J44337m79093l31835M25478
39367g95826Q27053M86023k9301j84488j31090j50815j33524k9276k03066p41076
39357a085386r10827p3860J167618J539477P02954m30018r40798p56566k49116
$$ plain form
39425 -511941 -390411 286346 695237 483257 144923 122190 182826 -35286 -367895 -342368
39415 -342368 243013 1153987 1901097 2039836 1584517 1092663 973338 845152 155536 -670124
39405 -670124 -552039 588986 1405997 842918 -489692 -1286644 -1228736 -921822 -709010
39396 -709010 -478133 -331599 -472274 -532341 47627 946544 1187783 589064 76425 243338
39386 243338 506520 239461 -81772 295520 975362 839412 -219537 -964800 -487646
39377 -487646 523428 705631 -198852 -1113357 -1114422 -554713 -410376 -889469 -1221304 -795826
39367 -795826 31227 517250 487949 303461 172371 21556 -111968 -141244 -344310 -1085386
39357 -1085386 -1996213 -2070073 -902455 637022 1339976 909958 -30840 -787406 -1036522
39348a036522K83577N65065L81015r6589m41101n02113m09314j57636K40453L38105
39338h35060k26110q38280m75430P06464J347652P60733j59627l63904j2496J97175
39328A01117J52070L2234k82733p23683p19011j83082J6421m91679o12552M79489
39318b231409J534738Q36825r46751j480342k36380P84049K21468p13679m29327
39309b660808N71906P67477P3076k58131L25038J032516J015890L43752l43879
39300H66837n60835l42874j92692m91361q50771n36659L05519O28312R9591j77407
39290a252340O55300J642887J259990k94738j307289q92021O6130M01467K8412
39281C07798m67839p08301n82780q8725N04200P76032O76366N22155M02827J10620
$$ plain form
39348 -1036522 -752945 -187880 193135 96546 -344555 -846668 -1255982 -1413618 -1173165 -835060
39338 -835060 -1061170 -1899450 -2374880 -1668416 -320764 439969 280342 -83562 -96058 101117
39328 101117 253187 285421 2688 -720995 -1440006 -1623088 -1606667 -2098346 -2710898 -2231409
39318 -2231409 -696671 140154 -806597 -2286939 -2523319 -1739270 -1517802 -2231481 -2660808
39309 -2660808 -2088902 -1321425 -1248349 -1506480 -1181442 -148926 866964 1210716 866837
39300 866837 306002 -36872 -229564 -720925 -1571696 -2108355 -1802836 -1174524 -1074933 -1252340
39290 -1252340 -597040 1045847 2305837 2011099 703810 -188211 -122081 279386 307798
39281 307798 -160041 -868342 -1451122 -1539847 -1035647 -259615 416751 938906 1341733 1452353
39271A452353k53403k28959K39513N71065L48045j62720n30152o80413o50446
39262A04883l74357k2897r436l16454l76401L950K41982O129n9541N91269J209497
39251I98624O70586p09506j423182q58252k1179J26988O148M44782J172051J190172
39241A597232L07477n58941o13675p5530L10792K11661p5515j15431J43850L17700
39231A449620N2411m52086n77129q6828M52662L71700j71725m08787n5403L26814
39221I01249J93638k43799m30121k40476K1228J48683J75933J36283K6328o5185
39211F23761p5675j27457k99907l61914n0994M63400P24228N39609Q9429m09285
39201A115195p66546o71410N225P55960Q28068J90863l81285l33185P6569L77176
$$ plain form
39271 1452353 1198950 969991 1209504 1780569 2128614 1965894 1435742 755329 104883
39262 104883 -269474 -292371 -301807 -618261 -994662 -990712 -748730 -742601 -802142 -210873 998624
39251 998624 1669210 959704 -463478 -1321730 -1342909 -1215921 -1209773 -764991 407060 1597232
39241 1597232 1904709 1345768 732093 656563 967355 1179016 1103501 988070 1131920 1449620
39231 1449620 1502031 1049945 472816 385988 838650 1210350 1038625 629838 574435 901249
39221 901249 1094887 851088 420967 180491 201719 350402 526335 662618 688946 623761
39211 623761 548086 420629 120722 -241192 -292186 171214 895442 1435051 1524480 1115195
39201 1115195 348649 -322761 -317536 438424 1266492 1457355 1076070 742885 819454 1196630
39191A196630M94334M50941N0885o57688j069546p23889J962L97676L19245R9211
39181E59761j11537l40351m03196j43987J14825l8794m24056n65986m78838m63489
39171b295648l09610M33388J393350J523038N60090m93757p34419m65440m59534
39162h48542p30754o65020k1704P47152J034325O22517j39821n50014k11793M19052
39152c44602N30900N9755k48566o955K80342J54867p9704p3069j28604n08683
39142c64319o87455j40789O14323P01903K50718P8926K49248N1989n63413o91114
39132d99983O5017Q13932O20463j98185o36740l56784J44005L96008L79282J87569
39122I14584k00230o86120q85618m43369M41798R57245M43515o80705j144102
$$ plain form
39191 1196630 1690964 2141905 2192790 1535102 465556 -258333 -256371 141305 460550 559761
39181 559761 448224 107873 -295323 -439310 -324485 -363279 -787335 -1353321 -1832159 -2295648
39171 -2295648 -2605258 -2171870 -778520 744518 1304608 810851 76432 -389008 -848542
39162 -848542 -1579296 -2244316 -2266020 -1518868 -484543 137974 -1847 -551861 -763654 -344602
39152 -344602 186298 246053 -2513 -9468 270874 425741 346037 272968 144364 -364319
39142 -364319 -1051774 -1192563 -578240 123663 374381 453307 702555 754544 191131 -499983
39132 -499983 -434966 378966 999429 801244 164504 -192280 -48275 347733 727015 914584
39122 914584 714354 28234 -857384 -1300753 -858955 98290 541805 -138900 -1283002
39113a283002l13450Q94567J117299K68984n45137o48402m18847k49865Q6415
39104a091438O42915Q04665K59220k67763l3352N24219M85284n4708j84731K77880
39094A362191M85109l4027n98598m53021Q3752J59304l38447p11393n23990j31780
39084g00900r366l5144J92656N71627N19446j48279q08578q06988l23971j8794
39074a568291l6259J0270J39434j05712o34011n25143O29470J777586J631430
39065A318774M29609m30363k97133J57902K28916K2526j94768n28217q99805p95678
39055i88237j30596L50292J70373m6195L85011R50041P25996R543o4323N49398
39045A911303N75847n27262j497721j018563L39453R07054J52518q63176j064712
$$ plain form
39113 -1283002 -1596452 -701885 415414 684398 139261 -509141 -927988 -1177853 -1091438
39104 -1091438 -448523 356142 615362 347599 314247 838466 1323750 1269042 1084311 1362191
39094 1362191 1847300 1813273 1214675 761654 845406 1004710 666263 -45130 -569120 -700900
39084 -700900 -710266 -745410 -552754 18873 538319 390040 -418538 -1225526 -1549497 -1568291
39074 -1568291 -1604550 -1594280 -1454846 -1560558 -2194569 -2719712 -2090242 -312656 1318774
39065 1318774 1748383 1318020 1020887 1178789 1407705 1430231 1235463 707246 -192559 -988237
39055 -988237 -1118833 -768541 -598168 -644363 -259352 690689 1416685 1426228 1361905 1911303
39045 1911303 2487150 1959888 462167 -556396 -216943 690111 842629 -20547 -1085259
39036a085259m70210K97164P77700P53675K23802m11177o14782l85483k20296
39027a134866k64379o3406N68368J032945P51276k006n64412p54058p26411m04771
39017a561720K35581O46280L04482l31620l42901K21634L94715j13993m35098
39008i82640n7145K31458l15016r81315n91018N71013J036428K78680n68057l97791
38998a775403L92572O78602K25184k04485j17362O0146k15986o43732l99891O18703
38988a381652J381133R21986l11923r10367l18153M79436M12851k06208l45015
38979b77912R9276K44306k71582o84950k99647M62677P00859K55622k31640k39913
38969b42904J15344M06592L72586M4672l67484o22761n64012j80103L61031P22905
$$ plain form
39036 -1085259 -1555469 -1258305 -480605 273070 496872 85695 -529087 -914570 -1134866
39027 -1134866 -1399245 -1462651 -894283 138662 889938 887932 323520 -430538 -1156949 -1561720
39017 -1561720 -1326139 -679859 -375377 -706997 -1049898 -828264 -433549 -547542 -982640
39008 -982640 -1039785 -808327 -1123343 -2104658 -2695676 -2124663 -1088235 -809555 -1377612 -1775403
38998 -1775403 -1382831 -704229 -479045 -683530 -800892 -740746 -956732 -1600464 -2000355 -1381652
38988 -1381652 -519 921467 609544 -300823 -618976 -139540 273311 67103 -277912
38979 -277912 -178636 65670 -205912 -890862 -1190509 -727832 -26973 228649 -2991 -242904
38969 -242904 -127560 279032 651618 696290 328806 -293955 -857967 -1038070 -677039 45866
38959D5866O05255R1819l34256l12342p458K16238L15920M36739M74610K46875
38949A779266k0909Q0550M57203N97109L62982J26612O0922p0922l06012l41715
38939B725086j93525k77917n85268n41236k6738L11674K06269K51266O13787L78588
38929B861986q09291j553150o39662O95585L44292j258128j514853L26849J848765
38920C02393J062449p16304j113819k11600J55053l90259m65403M16796R94970
38911C4276M28386l99918m57895j06198j82961n41521m71903O6337N37956P29432
38901c64009P54333N09445q0715n19116k49783L74171M15380l15026r74141q73826
38891a323287k66635K81197O26705P79838N12840j85698o88636m18047K60763
$$ plain form
38959 45866 651121 742940 408684 96342 88884 305122 621042 1057781 1532391 1779266
38949 1779266 1758357 1838907 2296110 2893219 3256201 3382813 3443735 3372813 3066801 2725086
38939 2725086 2531561 2253644 1668376 1127140 1100402 1412076 1618345 1869611 2483398 2861986
38929 2861986 2052695 499545 -140117 555468 899760 -358368 -1873221 -1546372 302393
38920 302393 1364842 648538 -465281 -676881 -521828 -912087 -1377490 -960694 34276
38911 34276 462662 62744 -395151 -501349 -684310 -1225831 -1697734 -1631397 -1093441 -364009
38901 -364009 390324 899769 819054 299938 50155 424326 839706 524680 -449461 -1323287
38891 -1323287 -1589922 -1308725 -682020 97818 610658 424960 -263676 -681723 -420960
38882d20960M68403M6410k76688j2112M23237M15009J6705k67528k28965q5628
38872G7883o0339j83366m03446n87749m95362m5472M40632N50954L09241J03217
38862b93807R1982J6296l05407o06890n12248m0742M61341P62910Q62179P20236
38852A155850K13203n09464q84277m95662K51220M12009l18084j026992o50440
38843a852637N06551R48123r0627j495133j585612k15664J138252J282633N63578
38834h00536M8501J20387L26585K23316j29776l81273k50488K42252O92450N96899
38824F88317p6663p69488r66723p27835l75391J7318M61113O83325M54409J10658
38814e00960J80936N69307P02149M58408K70744K27054j29878q07721r85127k04483
$$ plain form
38882 -420960 47443 93853 -182835 -194947 228290 643299 660004 392476 163511 77883
38872 77883 17544 -165822 -569268 -1157017 -1652379 -1697851 -1257219 -706265 -397024 -293807
38862 -293807 -201825 -185529 -490936 -1097826 -1610074 -1650816 -1189475 -426565 435614 1155850
38852 1155850 1369053 859589 -24688 -520350 -269130 142879 -175205 -1202197 -1852637
38843 -1852637 -1346086 -397963 -488590 -1983723 -3569335 -3784999 -2646747 -1364114 -800536
38834 -800536 -752035 -631648 -305063 -81747 -211523 -592796 -843284 -601032 91418 688317
38824 688317 611654 -157834 -1124557 -1852392 -2227783 -2210465 -1749352 -1066027 -611618 -500960
38814 -500960 -320024 249283 951432 1409840 1680584 1907638 1777760 970039 -15088 -219571
38804b19571P14564O93669j42031q03779q60000o29817k32885M91543J132702
38795A44395R01181l0452m12927L22536J079822N88025q00111j606863j088395
38786i02789J46511J043804R60753n2736j151160j197099o5133R20542O28245
38777C30938k48783k43885N79339P72441p7901o62429j49371M41845j5722q82120
38767a55648q46649k7584L89614J17452n457L98563P04047M61640M7281j56181
38757I27078l40714o53289p08330j83850N74359R56634P82897K97500k43888o87383
38747G21014q55364n80449R8067Q04640R71276L54430n09681p30298j73594K90074
38737C90115K6967m07255j96768L55649L20694k70460m52378M3057L34602j14864
$$ plain form
38804 -219571 494993 1188662 1046631 242852 -617148 -1246965 -1479850 -988307 144395
38795 144395 1045576 1015124 602197 924733 2004555 2592580 1792469 185606 -902789
38786 -902789 -756278 287526 1248279 1195543 44383 -1152716 -1217849 -297307 330938
38777 330938 82155 -161730 417609 1190050 1112149 449720 300349 742194 726472 -155648
38767 -155648 -1002297 -1029881 -640267 -522815 -528272 -129709 574338 1035978 1083259 927078
38757 927078 586364 -66925 -775255 -959105 -384746 571888 1354785 1652285 1408397 721014
38747 721014 -134350 -714799 -616732 187908 1159184 1513614 1003933 273635 100041 390115
38737 390115 417082 9827 -186941 168708 489402 218942 -233436 -190379 144223 29359
38727B9359o18217m37206N4037J06576j63566q6875L99594O82738M29937J89j26513
38716B70053O5844K10534Q1747l6151L33628J024270J082697N004j221685j206102
38706F09839j48145L92640j33795m68344L11746J176703P32929n84462j217639
38697F71472p61589j90818j17472j12483K35722O60104P69319M91870r0930p24657
38687H30538r01810m55605k0711j69301l91708J32362J007768J020376K8845p42185
38677C38569m98080J79736N22713N97325O17850K68152n43670j035322m90920
38668d3647O15226J142359O38204l43914r99367r25824k97559K74991L06144K3292
38658C89905K2645K75538J24694n20023p97014j98966N03605L67141l15235n77331
$$ plain form
38727 29359 -588858 -1026064 -972027 -865451 -1029017 -1115892 -716298 -33560 396377 396566 270053
38716 270053 335897 546431 628178 592027 925655 1949925 3032622 3037626 1815941 609839
38706 609839 461694 854334 720539 252195 563941 1740644 2473573 1889111 671472
38697 671472 -90117 -280935 -398407 -510890 -275168 384936 1154255 1646125 1555195 830538
38687 830538 -71272 -526877 -547588 -716889 -1108597 -976235 31533 1051909 1080754 338569
38677 338569 -159511 20225 542938 1140263 1758113 2026265 1482595 447273 -43647
38668 -43647 571579 1713938 2352142 2008228 1008861 83037 -214522 60469 366613 389905
38658 389905 412550 688088 812782 292759 -504255 -703221 -199616 167525 -147710 -725041
38648g25041l05671k05245m37541l52138K76353O93092L00934l33970k65305M04031
38638i50501O15313r8747q45581n68666M40653R33520M86460J2409K11695M55012
38628F91567k9863o37367k36653Q41717J049433r5116j289681j361770o82362
38619a750095j33083J93760N18322N93851K95949J92957O20852Q86348L24078
38610A742939m97612o35229k64287k09891m30966j85978N05300P70332K80619
38601A075227k97311l77286j20163R5539J30084n6790l39413k64032L66342Q91756
38591A103953N77746j75715l68720l2307j72979r84376j361781o26301M03083
38582a637397P16127N42900O70341J041981R50901K47911m63185p11644o30049
$$ plain form
38648 -725041 -1030712 -1235957 -1673498 -2025636 -1749283 -1056191 -755257 -1089227 -1354532 -950501
38638 -950501 -335188 -433935 -1279516 -1848182 -1407529 -474009 12451 24860 236555 691567
38628 691567 661704 24337 -212316 629401 1678834 1583718 294037 -1067733 -1750095
38619 -1750095 -1883178 -1689418 -1171096 -577245 -281296 -88339 532513 1418861 1742939
38610 1742939 1245327 610098 345811 135920 -295046 -481024 24276 794608 1075227
38601 1075227 777916 400630 280467 376006 506090 449300 109887 -154145 212197 1103953
38591 1103953 1681699 1505984 1137264 1104957 931978 -52398 -1414179 -2040480 -1637397
38582 -1637397 -921270 -378370 291971 1333952 2284853 2532764 2069579 1357935 727886
38573G27886n50466n51345m73787k07503Q2284P6042k30153l68122k7805L90340
38563a132629L55268J06406K62878O62703M85901l79504j027155q59549l41776
38554a867457n2448J54794N33114P74008N68277J93685l0997k67391n83772n25507
38544a103694R0726N77863L02187l33254n66198m22033l92983m35462j52968L48472
38534b087344O13266N89320M89865K11566l40766o78203l24838K92122M34229
38525h00783K61839M70908R30771Q04363K2032m90665k50146J45359J14538r1455
38515A116761n5466J11869J42452K9300k19046o20654q36452m67285J08319N7986
38505f32216n19690n52785K57270P68551J77444o09484l83997M56388O19469n8926
$$ plain form
38573 727886 177420 -373925 -847712 -1055215 -972931 -896889 -1127042 -1495164 -1522969 -1132629
38563 -1132629 -777361 -670955 -408077 254626 740527 361023 -666132 -1525681 -1867457
38554 -1867457 -1919905 -1765111 -1231997 -457989 110288 303973 272976 5585 -578187 -1103694
38544 -1103694 -1012968 -435105 -132918 -466172 -1032370 -1454403 -1847386 -2282848 -2435816 -2087344
38534 -2087344 -1474078 -884758 -394893 -183327 -524093 -1202296 -1527134 -1235012 -800783
38525 -800783 -538944 -68036 862735 1667098 1689130 1198465 948319 1093678 1208216 1116761
38515 1116761 1061295 1173164 1315616 1344916 1125870 505216 -331236 -798521 -690202 -632216
38505 -632216 -1151906 -1704691 -1447421 -678870 -501426 -1110910 -1494907 -1038519 -419050 -477976
38495d77976o00217n61887m16739l39770P7514P16682P52520J3549n17802j47816
38485a501942M68491M27380P250J04393O96693Q66084K58161l93799m03018o0170
38475D69523k8172l02991l17690J11942M76161K91605k40300n34765l90497j49982
38465f15166j14712j31948M3163K17323k9391o27430r37831n91193n2292L2809
38455b806668j84026K7585Q01129J346150J052141L51021j097m0411l03933p10010
38445d68119o19232l0947K25995j69255l91696K09765R12744O43174k93779n81012
38435e62362J51475Q19037N24656k46088n11524j43302K33993K10795r0544l83216
38425B920m57950k42862P6994J98394J46282K58730N27270M12608l19727j034455
$$ plain form
38495 -477976 -1078193 -1640080 -2056819 -2396589 -2319075 -1602393 -849873 -836324 -1354126 -1501942
38485 -1501942 -1033451 -606071 -598821 -494428 202265 1068349 1326510 932711 529693 469523
38475 469523 441351 138360 -179330 -67388 408773 700378 460078 -74687 -465184 -615166
38465 -615166 -729878 -861826 -818663 -601340 -630731 -1258161 -2195992 -2787185 -2839477 -2806668
38455 -2806668 -2990694 -2963109 -2161980 -815830 236311 587332 586235 545824 241891 -468119
38445 -468119 -1087351 -1118298 -892303 -1061558 -1453254 -1243489 -330745 312429 18650 -562362
38435 -562362 -410887 408150 932806 686718 175194 31892 265885 476680 386136 2920
38425 2920 -455030 -697892 -620898 -422504 -276222 -17492 509778 922386 602659 -431796
38415d31796j010979m44270q8192j61777k38310o4464J66943L19002M50785M23325
38405a079733p599n92743p06668k75372J8080k11813l59489K91214J374902J756655
38395B07434R47633k92674q37684l54536M97294Q05006K49433o60303j118290
38386e56687p91464l4959O03815Q87365Q31079M38282k12008p44897p15813j37369
38376d32656M32960M42843j15166p59927j014789p84194l17367R9793L69333N09823
38366a569347M74214K14883o8312j0094M06157O35837J96394o05699r68959o27531
38356a922457j31033N7515K11457O63803R55424M31274m64611m44851P59406J655302
38346A771229Q16017j121616k199937j607217l92050K80752M69400O58646O74066
$$ plain form
38415 -431796 -1442775 -1887045 -1975237 -2137014 -2375324 -2439788 -2272845 -1953843 -1503058 -1079733
38405 -1079733 -1087332 -1680075 -2386743 -2662115 -2644035 -2855848 -3215337 -2924123 -1549221 207434
38395 207434 1155067 862393 24709 -329827 167467 972473 1221906 561603 -556687
38386 -556687 -1348151 -1383110 -779295 108070 939149 1377431 1165423 420526 -295287 -432656
38376 -432656 304 443147 327981 -431946 -1446735 -2230929 -2548296 -2448503 -2079170 -1569347
38366 -1569347 -1095133 -880250 -948562 -958656 -552499 83338 279732 -325967 -1294926 -1922457
38356 -1922457 -2053490 -1995975 -1784518 -1120715 -165291 265983 -198628 -643479 115927 1771229
38346 1771229 2587246 1465630 -734307 -2341524 -2733574 -2452822 -1983422 -1324776 -650710
38337f50710K01455l19800k68725J17644K09046J65194O15267J311179J267916
38328B648466L75522k87743j13440J80666q7293m32768k49990N821k45674m23005
38318A370562K44555J047094O45670o43422j078170j57871O05473J25938o31899
38309A527930m17223K85939L04960j73985j26985L70013L44188j86677j71121
38300A757039N06393O05955l90130j199655o42970M79574N84906l05640o80523
38291G14949J61049J151860J056004Q6139o14514n36722k02887j85797l37460
38282A292621j88884K34073L83321l8741o20674p43318l09611K80486O79341P59885
38272A728499M14167k92261p98051m98849L18948O19515M262o62349n03097Q3680
$$ plain form
38337 -650710 -449255 -769055 -1037780 -920136 -711090 -545896 69371 1380550 2648466
38328 2648466 3023988 2736245 2622805 2803471 2716178 2283410 2033420 2039241 1793567 1370562
38318 1370562 1615117 2662211 3307881 2664459 1586289 1428418 2033891 2159829 1527930
38309 1527930 1110707 1396646 1701606 1527621 1400636 1770649 2114837 1928160 1757039
38300 1757039 2263432 2869387 2479257 1279602 636632 1116206 1701112 1395472 714949
38291 714949 875998 2027858 3083862 3170001 2555487 2018765 1815878 1630081 1292621
38282 1292621 1103737 1337810 1721131 1682390 1061716 318398 8787 289273 968614 1728499
38272 1728499 2142666 1850405 1052354 553505 872453 1491968 1496230 833881 330784 414464
38262D14464J20413l84641n19752k2613K58908k48749q50295n58975M71711J179829
38252a39700J010000M27105L6013j70891m34326n89151l01883K38244M12391M3475
38242E31277l09286j90452O1254p8843l93618k91593R4989N9210l69620k69027
38232a155709O10358J114749L12982r38410j104489j48742N54486K60743l61305
38223h55337n08441j99034K52768P29755R89801P34679K74431K44285M27219r2836
38213A997290j237068j604175n25525P24984P50179K0041j53711K56018L29641
38204E57674L3289J08201M37295J68456n55359o22504P8138L35214k86342o43006
38194c88944n8658L96166k10717q90870l10194R01151J119423L42144j3042L53101
$$ plain form
38262 414464 534877 150236 -369516 -392129 -133221 -381970 -1232265 -1791240 -1319529 -139700
38252 -139700 870300 1297405 1333418 1162527 728201 139050 -162833 75411 487802 531277
38242 531277 221991 31539 92793 13950 -379668 -671261 -576272 -517062 -886682 -1155709
38232 -1155709 -545351 569398 882380 -56030 -1160519 -1309261 -754775 -494032 -855337
38223 -855337 -1363778 -1562812 -1310044 -580289 409512 1144191 1418622 1662907 2090126 1997290
38213 1997290 760222 -843953 -1369478 -644494 105685 125726 -27985 228033 557674
38204 557674 590963 699164 1136459 1304915 749556 127052 205190 540404 254062 -388944
38194 -388944 -447602 -51436 -262153 -1153023 -1463217 -562066 557357 899501 886459 1239560
38184A239560K47178o24659q30487L97966J573535J020171o08449j348680p75253
38175B90882k46389n14834o90467N3482J048896J166282M39129j86886k51921
38166A108174j33652k19822m28474n27951m06161j1724N38461Q13672M87606q4640
38156A135489j99469J98092L78253r8043o96473o96196k30270O146j60567k16231
38146e79269J39792N20072M78597J62574L038L6998n9747l54141m74757j70711
38136b97554K38383K31060k20307o16854n96519l15264n6916J79236M15824L62033
38126f76878j62198o71119n26670K3968P4846m98461o64555K08980J214506J132853
38116e44728K30889k05333J58749L85989k1626l11313J36857O57178L59901l58396
$$ plain form
38184 1239560 1486738 862079 31592 429558 2003093 3023264 2414815 1066135 290882
38175 290882 44493 -470341 -1160808 -1107326 -58430 1107852 1546981 1360095 1108174
38166 1108174 974522 754700 326226 -201725 -607886 -619610 -81149 732523 1220129 1135489
38156 1135489 936020 1134112 1512365 1414322 717849 21653 -208617 -202471 -363038 -579269
38146 -579269 -439477 80595 559192 721766 724804 761802 702055 347914 -126843 -297554
38136 -297554 -59171 171889 -48418 -665272 -1261791 -1577055 -1633971 -1454735 -1038911 -676878
38126 -676878 -839076 -1510195 -2036865 -2012897 -1938051 -2436512 -3101067 -2892087 -1677581 -544728
38116 -544728 -313839 -519172 -360423 25566 3940 -307373 -170516 486662 846563 488167
38106D88167l75777L90086P95431J34127q55782j017628k50810N25290O03736
38097D36840J89487j13447r4138n569o7536k02213k47634j66137M0663L70797
38087A41113O20434M13062k83518q78903p73670j26138L97390N32280N70752O29877
38077A242679L86486k58033q07711q05010m10805l1021K15161K99495J9480n68677
38067g17956q42631l61228L41966L96226j09399k17283M46817J061321P70409
38058G68242j18607n88198k53877K46765J68790m10307p33953l12585M72326Q32568
38048G1164N38116J10118k1690j19035n34921r02178n63252L24352Q35129N33873
38038B71676L166j48760j39986m01538o66043l54777L97013Q03606M95607n6724
$$ plain form
38106 488167 112390 502476 1297907 1432034 576252 -441376 -692186 -166896 436840
38097 436840 626327 512880 418742 413173 345637 143424 -104210 -270347 -229684 141113
38087 141113 761547 1174609 891091 12188 -761482 -887620 -490230 42050 612802 1242679
38077 1242679 1629165 1371132 563421 -241589 -652394 -683415 -468254 -168759 -149279 -717956
38067 -717956 -1560587 -1921815 -1579849 -1183623 -1293022 -1510305 -1063488 -2167 768242
38058 768242 649635 61437 -192440 54325 223115 -187192 -921145 -1233730 -761404 71164
38048 71164 609280 719398 697708 578673 43752 -858426 -1421678 -1097326 -262197 271676
38038 271676 274842 126082 -13904 -415442 -1081485 -1436262 -1039249 -235643 259964 203240
38028B03240k79512j72495p4271j29680k30288k48274j19931J46695L90472L69566
38018a44478P2532j63394k0609L67803N14666J26110n28188q32153m27046L79628
38008f55129Q55880N80190j09705n28027m34416j79671p5395j575J62351J10346
37998b75151m25163r86446p71524K21342R78129O63831l83697j168787j163008
37989c310474n20410M38616J343870J595550Q22225m10043j008917o67930j74670
37980a892183j86770l72207j75324K29902L92904M54984P60756R75079N22317
37971G09458k63229m38887N1581K45304k03743l62852L86880J105535O34654n11039
37961A353662q04690K8940O61561J79457o84267p78175j10642M30956L57776p5865
$$ plain form
38028 203240 -76272 -248767 -323038 -452718 -683006 -931280 -1051211 -904516 -514044 -144478
38018 -144478 -71946 -235340 -255949 111854 626520 752630 224442 -607711 -1034757 -655129
38008 -655129 200751 780941 671236 143209 -291207 -470878 -546273 -547848 -385497 -275151
37998 -275151 -700314 -1686760 -2458284 -2236942 -1258813 -594982 -978679 -2147466 -3310474
37989 -3310474 -3830884 -3392268 -2048398 -452848 369377 -40666 -1049583 -1717513 -1892183
37980 -1892183 -2078953 -2451160 -2626484 -2396582 -2003678 -1548694 -787938 187141 709458
37971 709458 446229 7342 58923 304227 100484 -262368 124512 1230047 1864701 1353662
37961 1353662 548972 577912 1239473 1418930 734663 -43512 -154154 276802 634578 558713
37951E58713m59056n67005l10072J70476M73690L84512J94857K25912K59306q1162
37941H50171n63504n64539l8544L41152J48877k43439l35579k17578k43976l75980
37931a242939l09462m2245J32457J12756Q9952J75935K33680J21633q7245j58564
37921i74042J06809O29213R38659N52793l55746r62247p49696j70251L1023j70810
37911a124295k81913k11218k41118k02358M19331J399452J694035Q48204k72544
37902B027576o67766m38112k40802j71412K1919J21351k36134p02085o04101n5452
37892i45018K02681K806j06266O5307Q4183j46406j46943J15528l0609o93616
37882a598353q76680K9631J044193Q65744k31398q45544m55386J27413K09649
$$ plain form
37951 558713 99657 -467348 -777420 -606944 -133254 251258 446115 672027 931333 850171
37941 850171 286667 -277872 -316416 24736 173613 -69826 -405405 -622983 -866959 -1242939
37931 -1242939 -1552401 -1594646 -1462189 -1349433 -1259481 -1083546 -849866 -728233 -815478 -974042
37921 -974042 -867233 -238020 700639 1253432 897686 -64561 -814257 -984508 -953485 -1124295
37911 -1124295 -1406208 -1617426 -1858544 -2060902 -1641571 -242119 1451916 2300120 2027576
37902 2027576 1359810 921698 680896 509484 531403 652754 416620 -285465 -889566 -945018
37892 -945018 -742337 -739531 -845797 -780490 -696307 -842713 -989656 -874128 -904737 -1598353
37882 -1598353 -2475033 -2445402 -1401209 -535465 -766863 -1612407 -2067793 -1940380 -1730731
37873a730731J6852j06481k78605m89798k90973L96414Q28289M08093l79286o42658
37863b268884l39422j65399l80272m81920j14628L55781M44278K30085N4662j12996
37853b778715n02789q76155o18901L22711J069692P90317j79488o90216k30294
37844c693838M87298N70359J05082j41555J17508L67213J09506m55875p20913
37835c255215l57632M25098J116549J283991Q74813K44939j85154k94234j97781
37826c44626K8508L07192L72120K8915m09598m09813k5460R2452l01462n95347
37816a257119k63946K70603L22819P1368K09421O69852O19093j68839q18415o10331
37806i55494J0792K38019J08854J91336M60290L28803k89319p27928n11855O2774
$$ plain form
37873 -1730731 -1713879 -1820360 -2098965 -2588763 -2879736 -2483322 -1655033 -1246940 -1626226 -2268884
37863 -2268884 -2608306 -2773705 -3153977 -3635897 -3750525 -3394744 -2950466 -2720381 -2665719 -2778715
37853 -2778715 -3281504 -4157659 -4776560 -4453849 -3384157 -2593840 -2773328 -3463544 -3693838
37844 -3693838 -3206540 -2636181 -2531099 -2672654 -2555146 -2187933 -2078427 -2534302 -3255215
37835 -3255215 -3612847 -3187749 -2071200 -787209 87604 332543 147389 -146845 -344626
37826 -344626 -316118 -8926 363194 392109 -17489 -427302 -452762 -360310 -661772 -1257119
37816 -1257119 -1521065 -1250462 -927643 -856275 -646854 22998 642091 473252 -345163 -955494
37806 -955494 -944702 -706683 -597829 -406493 53797 382600 93281 -634647 -1146502 -1083728
37796a083728M82393O19848N57354L06981J2692o840K30981K15989k99583p67775
37786B68312n71070K0913K18013j48272m90921m17906j59045K0237J84246L32968
37776g42525K56455L6741J03497M63461M80217j20529o09588k47639N45481P66963
37766I32534K69436j92222j99171r5361j48397j27411O8676J04943j52939l37062
37756A23026k57965k74093n65581o36453r5758N60017O07375J96987Q4596M39347
37746A81498O42275K91187k34302l91021j80148O055n5074k39142l21622k63019
37736e63313k55110m38576n77957k61573M44914Q81710O29551J28103K6404K23102
37726B37255J51005j80526j65777L51316P35881M79166j42822n92727p26773o37010
$$ plain form
37796 -1083728 -601335 18513 575867 882848 895540 888700 1119681 1335670 1036087 268312
37786 268312 -302758 -281845 -63832 -212104 -703025 -1120931 -1279976 -1259739 -1075493 -742525
37776 -742525 -486070 -449329 -345832 117629 597846 477317 -132271 -379910 165571 932534
37766 932534 1201970 1009748 810577 715216 566819 439408 508084 613027 460088 123026
37756 123026 -134939 -409032 -974613 -1611066 -1706824 -1146807 -539432 -342445 -257849 181498
37746 181498 823773 1114960 880658 489637 309489 315544 260470 21328 -300294 -563313
37736 -563313 -818423 -1256999 -1834956 -2096529 -1651615 -769905 -140354 -12251 14153 237255
37726 237255 388260 207734 41957 393273 1129154 1608320 1465498 872771 145998 -491012
37716d91012l40240J8685Q3150k04451l60926j7022M92529N78935J76347l05728
37706c69733n69198n85944l66336M7643M70220P36699Q51720P82399L66636l12616
37696A051490p67541o67869l00883j18772j06989K409J72679J81345P1542K6292
37686d56297q72r9394j13058l627j53096p06063r87063l61052O21213Q80461M37567
37675i41281K98250P09256P67232Q2157m21994m0780M58584N5938q58163j104481
37665i95282m81424J68020L59341L72059L43415K728n22444n51743J18293P31027
37655d56010N92981O6629j7225L75907M56889j47211p32878m62143L85068O84828
37645G46835l592q15792q12038k41855N0518K1376K85884P63417O07698k95178
$$ plain form
37716 -491012 -831252 -812567 -729417 -933868 -1294794 -1311816 -819287 -240352 -64005 -369733
37706 -369733 -938931 -1524875 -1891211 -1843568 -1373348 -636649 215071 997470 1364106 1051490
37696 1051490 283949 -383920 -684803 -803575 -910564 -908155 -735476 -554131 -482589 -456297
37686 -456297 -457169 -556563 -669621 -673248 -826344 -1532407 -2519470 -2880522 -2259309 -1378848 -941281
37675 -941281 -643031 66225 833457 915614 493620 452840 911424 967362 109199 -995282
37665 -995282 -1476706 -1308686 -949345 -577286 -233871 -231143 -753587 -1305330 -1187037 -456010
37655 -456010 136971 203600 186375 562282 1019171 871960 139082 -323061 62007 746835
37645 746835 743243 -72549 -884587 -1126442 -1075924 -1054548 -768664 -5247 602451 307273
37635C07273q78199m66699J92103J86370j63280o3235L45593L99188J80717K51131
37625B90962M79994K92169j53574j93739O5279q9253n44627l78349M81669Q89989
37615A140520K40904n56378n08894K0917P5652m35478q21967o57474q1421N57449
37605a026170Q63011N92770O8390q9453Q9169q4518o82919p78102O0237Q16780
37595a70805M90156l02754l14554L46701N19090o5007n04722l53458j74349k74465
37585h04167j45143M04115O77336K75130r7135K46491P89011N99427k10840o92217
37575A042008m34986O1237K76887K13122M6984j25028j25356J77803M80955L01079
37565A914705k36910m09942M6440M26841M1213p24292r41679m92522j72014m30940
$$ plain form
37635 307273 -570926 -1037625 -845522 -659152 -822432 -885667 -540074 -140886 39831 290962
37625 290962 770956 1063125 909551 715812 781091 691838 147211 -231138 250531 1140520
37615 1140520 1381424 825046 316152 337069 412721 -22757 -844724 -1502198 -1583619 -1026170
37605 -1026170 -163159 429611 498001 408548 497717 413199 -269720 -1047822 -987585 -170805
37595 -170805 319351 16597 -297957 48744 567834 502827 -1895 -355353 -529702 -804167
37585 -804167 -949310 -545195 132141 407271 310136 556627 1345638 1945065 1734225 1042008
37575 1042008 607022 668259 945146 1158268 1205252 1080224 954868 1132671 1613626 1914705
37565 1914705 1677795 1267853 1314293 1741134 1782347 1058055 116376 -376146 -548160 -979100
37555i79100p13742l20201O01588J287526J224232M79282m80737r95737o32802
37546e29691K14674N40096l8074o98040n94718o4668J19890J40400O42675J208260
37536I40804P51447n01726r58654m5608Q13787L95837m99985n38934m847n2319
37526B99802o36028p65191l57319k40088m79091k81359L54286M42874j79168l34132
37516b175414N51578J297504P19538m87683p75256j2203M84877k6354p81499p50874
37506a955786M0894Q02348J025160P97810L67597j21093m61569l77041Q9262M23584
37496F31166K25022j81097j43084L23470M90822J7747n19200n32056k46959j22918
37486e7087m9358J95706K44918k23507n90301q0124Q12838Q26224j85697j015045
$$ plain form
37555 -979100 -1692842 -2013043 -1411455 -123929 1100303 1579585 1098848 103111 -529691
37546 -529691 -315017 225079 187005 -511035 -1105753 -1170421 -1050531 -910131 -267456 940804
37536 940804 1692251 1190525 231871 186263 1000050 1395887 895902 356968 352121 299802
37526 299802 -336226 -1101417 -1458736 -1698824 -2177915 -2459274 -2104988 -1662114 -1841282 -2175414
37516 -2175414 -1623836 -326332 393206 -94477 -869733 -881936 -397059 -423413 -1204912 -1955786
37506 -1955786 -1914892 -1112544 -87384 710426 1078023 956930 495361 118320 207582 631166
37496 631166 856188 675091 532007 855477 1346299 1364046 844846 312790 65831 -57087
37486 -57087 -106445 89261 334179 110672 -479629 -559753 253085 1079309 893612 -121433
37476a21433q69113k50706J68521M14471N47363K46258l57959m39924K32691O72955
37466B43124J18322p27049p91641k63305q3388l30220k32972M11167Q81793O59851
37456a14318J01664j79268m5339K02631K31191l9969l63618m36058l23959l49100
37446a316143m64450k35568L38746O05047K60978m8997K82883Q27302Q03104K82765
37436A335667n9863l6785M573o6317j20756k30768m38981l45643K95535Q51482
37426A188144N55166k36548m70915L3911M24494J96393k38855m48879m71229k50057
37416B81625M43443J250975J315392N07114k72210m03675l30297n46417o60822
37407A585128j71270M84064M72917j91339o94191n54086j33217m1540m17724q32170
$$ plain form
37476 -121433 -990546 -1241252 -1072731 -658260 -110897 135361 -222598 -662522 -429831 243124
37466 243124 361446 -365603 -1157244 -1420549 -1503937 -1834157 -2067129 -1655962 -774169 -114318
37456 -114318 -12654 -191922 -237261 -34630 196561 156592 -207026 -643084 -967043 -1316143
37446 -1316143 -1780593 -2016161 -1677415 -1072368 -811390 -860387 -577504 249798 1052902 1335667
37436 1335667 1275804 1239019 1243592 1177275 1056519 825751 386770 41127 336662 1188144
37426 1188144 1743310 1506762 1035847 1069758 1494252 1690645 1451790 1002911 531682 281625
37416 281625 725068 1976043 3291435 3798549 3526339 3122664 2792367 2245950 1585128
37407 1585128 1413858 1897922 2370839 2179500 1485309 931223 798006 756466 338742 -493428
37397d93428p53101j54293L80126L71524J14969J81750M13923J50662n24402o90043
37387a002313n8203M05555o0364p58562n66203L84583J003584Q50866M94233M13138
37377A106314M41408L38835J69243r201k30921l10918n305M19654L29929l94401
37367A854637j087035j098774n02743J44993L96250J47892l40190n24873l6858
37358a046701P77319J094183N49707l68777r70957j012133n58147K67383J043228
37349b24895J055976J35294q06915p33100J39739O02689J20495n25283n23443
37340g59443k04334l30859p80329p73892j97022K08096O2474p5846K83318O90641
37330a877196M84568p8017j38304M84543J003644P21618j34868p95179p85571
$$ plain form
37397 -493428 -1246529 -1400822 -1020696 -649172 -534203 -352453 61470 212132 -312270 -1002313
37387 -1002313 -1060516 -654961 -715325 -1473887 -2040090 -1655507 -651923 198943 693176 1106314
37377 1106314 1547722 1886557 2055800 2046599 1815678 1504760 1499455 1919109 2249038 1854637
37367 1854637 767602 -331172 -833915 -688922 -292672 -144780 -484970 -1009843 -1046701
37358 -1046701 -269382 824801 1374508 1005731 34774 -977359 -1535506 -1268123 -224895
37349 -224895 831081 966375 159460 -573640 -433901 168788 289283 -236000 -759443
37340 -759443 -963777 -1294636 -2074965 -2848857 -3045879 -2837783 -2775309 -2851155 -2567837 -1877196
37330 -1877196 -1392628 -1470645 -1608949 -1124406 -120762 600856 465988 -329191 -1114762
37321a114762k17325M67313Q17546O19342M1157m84408o21990m00107j36313j14041
37311a143588k88690l10311P0424O30573Q71931N93637N6304m12945o65618n83662
37301a181945j52002K13404j5717n80342n06581M77687J276440Q47721l08371
37292G0294r24354p12255l31483l0645M48443P89817K98284o73086q28514J25440
37282a768059Q85219N08198k02898j18234M27745L61257k92571m89221J82263
37273e06301R50558R64841K09671p13672j176925r00160j71922L26911K27431
37264g89568j09575j34294J45656K63306m6115n53820p76605m00003L11790N66809
37254a522419m2658p43606m21554O95485J164517M31783l24019q6447M20435P7651
$$ plain form
37321 -1114762 -1332087 -864774 -47228 572114 613271 128863 -493127 -893234 -1029547 -1143588
37311 -1143588 -1432278 -1742589 -1672165 -1041592 -169661 423976 480280 67335 -598283 -1181945
37301 -1181945 -1333947 -1120543 -1136260 -1716602 -2223183 -1745496 -469056 378665 70294
37292 70294 -854060 -1566315 -1897798 -1928443 -1480000 -690183 -391899 -1064985 -1893499 -1768059
37282 -1768059 -882840 -374642 -577540 -695774 -268029 93228 -199343 -688564 -506301
37273 -506301 444257 1409098 1618769 905097 -271828 -1171988 -1343910 -1016999 -789568
37264 -789568 -899143 -1033437 -887781 -624475 -670590 -1224410 -2001015 -2401018 -2089228 -1522419
37254 -1522419 -1565077 -2308683 -2730237 -2034752 -870235 -438452 -762471 -848918 -428483 -350832
37244c50832o89289o65554R9703M61052R8922j55571J14614L45991J60634o1629
37234f41959m9358p5312k26475j35681K35791L52444k1330l96943l14638Q7532
37224a185929M72754O68730M80476j98219r06633r09820j76825N33532P02766
37215e19168N40114L50724J35226m3038k5781l8212m35514q52007m88437N44534
37205h31559J122255O69642j14939m68358m96525m48402j39208K80817Q9978o65427
37195a001726p07824N40978J609808R19723p33179j231176k09952O28521K21007
37186C6180n28190n03878N687J72828R214J8350J88343J56569m6841j05985j273
37175e98996O0436R2229K44644M39310M78799L79635K47293j0720m43478o67391
$$ plain form
37244 -350832 -1040121 -1705675 -1605972 -1144920 -1045998 -1201569 -1086955 -740964 -580330 -641959
37234 -641959 -691317 -766629 -993104 -1128785 -892994 -540550 -561880 -958823 -1273461 -1185929
37224 -1185929 -713175 -44445 436031 237812 -668821 -1578641 -1755466 -1221934 -519168
37215 -519168 20946 371670 506896 463858 438077 399865 -35649 -887656 -1376093 -831559
37205 -831559 290696 960338 845399 377041 -119484 -567886 -707094 -426277 -336299 -1001726
37195 -1001726 -1709550 -1168572 441236 1360959 627780 -603396 -813348 -184827 36180
37186 36180 -492010 -995888 -990201 -817373 -808159 -789809 -601466 -444897 -491738 -597723 -598996
37175 -598996 -538560 -446331 -201687 237623 716422 1096057 1343350 1332630 889152 221761
37165B21761k38365N43927P42911k7908r48903r69194j64875M54833M01336K39425
37155B54948M58654N75310k7978q92889r55877m6760Q83517J030106N00716k25826
37145A553921q32326r96762m85846K75077M32712j53238o85536o69243n58106
37136b119347o90211m99656M20758J268898J078424K70668M3676N23832O78209
37127I75251Q663p57963q47930m08254r434J36219J74499L08645O56122J032976
37117A268794R37484K04810n01554m70154k6119o7725o52270r57797o52110k92535
37107a209176j97164L5067N24271O45308R4449m74507m78582k45424j97873n4035
37097a557666L91168N33982j4158m20480J66495R81402N99218p51826j341744
$$ plain form
37165 221761 -16604 527323 1270234 1242326 293423 -675771 -840646 -385813 15523 254948
37155 254948 713602 1288912 1260934 368045 -587832 -634592 248925 1279031 1779747 1553921
37145 1553921 721595 -275167 -761013 -485936 -53224 -206462 -891998 -1561241 -2119347
37136 -2119347 -2809558 -3309214 -2888456 -1619558 -541134 -270466 -226790 297042 975251
37127 975251 983914 225951 -621979 -1030233 -1039667 -903448 -728949 -420304 235818 1268794
37117 1268794 2206278 2411088 1909534 1439380 1413261 1345536 693266 -264531 -916641 -1209176
37107 -1209176 -1406340 -1371273 -847002 -201694 -107245 -581752 -1060334 -1305758 -1503631 -1557666
37097 -1557666 -1166498 -632516 -646674 -1067154 -900659 80743 679961 -71865 -1413609
37088a413609m89452N29000N61824J74498L48991P53301M60754l41127o28270
37079d4090k15885L8124k94409o06110l60572J02859K75581K54968L18216L27788
37069b03530J32105N4276L25029M42314j20334q38412o86830K74759Q35753L63367
37059E78497l53699m32957j60127k07874l69741o7864L76407J39272n98818p25099
37049a822003O8833P26485M28898k13921k39643J69627J39234m05113o37765j32893
37039a918261N48610P33437N08014M23417O60156Q00168L88352m18439q83443
37030H42011n19233J78236J97666o51132j331915q90228K49005Q79732O33396
37021d12462K45963K57057K81259j46273p08442p92251l75215R8554M23492O98314
$$ plain form
37088 -1413609 -1903061 -1374061 -812237 -637739 -288748 464553 925307 584180 -44090
37079 -44090 -259975 -221851 -516260 -1122370 -1482942 -1380083 -1104502 -849534 -531318 -203530
37069 -203530 -71425 -17149 307880 750194 629860 -208552 -895382 -620623 215130 578497
37059 578497 224798 -208159 -368286 -576160 -945901 -1013765 -637358 -498086 -1096904 -1822003
37049 -1822003 -1753170 -1026685 -597787 -811708 -1051351 -881724 -742490 -1147603 -1785368 -1918261
37039 -1918261 -1369651 -636214 -128200 295217 955373 1755541 2143893 1725454 842011
37030 842011 322778 501014 698680 47548 -1284367 -2174595 -1925590 -1045858 -412462
37021 -412462 -166499 90558 371817 225544 -482898 -1275149 -1650364 -1551810 -1128318 -430004
37011d30004Q82970P99896N01566K01033j12762n71542r77830r19966l95638J08413
37001i13864K72350K81210L67667M27706L18561J77414J55587J14976j26941m74278
36991F00388p11286p48774n20625L4460O38464P24384J90448k95628j96652J17582
36981a67239O6626j30373N3431L20356m6567p70661p38519K54283J039132P48240
36971F28709q5915o20402q63192j036785p56240J86203R51190O42522l06744p41381
36961b002035l99164N0836K39055L41235L42599R3509o1299K72001O14523K25640
36951b83100m80060l61429N52746R24688J65200o76965o18173j24199n2689k54383
36941a208364j25371K42607L78228L09394L03882K31158o7911k51173l5058J90498
$$ plain form
37011 -430004 452966 1252862 1754428 1955461 1842699 1271157 293327 -626639 -1022277 -913864
37001 -913864 -641514 -360304 7363 435069 753630 931044 1086631 1201607 1074666 600388
36991 600388 -110898 -859672 -1380297 -1345837 -707373 17011 207459 -88169 -284821 -167239
36981 -167239 -100613 -230986 -177555 142801 96234 -674427 -1412946 -1158663 -119531 628709
36971 628709 542794 -77608 -940800 -1977585 -2733825 -2547622 -1596432 -953910 -1260654 -2002035
36961 -2002035 -2401199 -2350363 -2111308 -1770073 -1427474 -1333965 -1395264 -1123263 -508740 -283100
36951 -283100 -763160 -1124589 -571843 352845 518045 -158920 -777093 -901292 -953981 -1208364
36941 -1208364 -1333735 -1091128 -712900 -403506 -99624 131534 63623 -187550 -222608 -32110
36931c2110K8215j41288J68963N73460M07105p8954q4813M07927O44389L17935
36921B210829j59786n54902r96320j203063n64210O95229J353743P19005l79228
36912A121297o95518j49508L20273J53962k44204k89502m4226j9719l89578p16669
36902i53392n33149L0905M48426N00404L93320K07972k06613o35528m69371L13785
36892i03241P91778L40562l65618l89654j7118j71699p33990p06039K7181M36335
36882a691503P8976j93468K48611P65806O23809J99270J59902K88904Q2019j76657
36872C85669K2162L08247O970n35193l76330M08757P29334J81871l89241l43717
36862C98529j90777n24985r14771o41840M2509K68314j20770l90926m2503N65967
$$ plain form
36931 -32110 -3895 -145183 23780 597240 1004345 925391 840578 1248505 1892894 2210829
36921 2210829 2051043 1496141 499821 -703242 -1267452 -572223 781520 1500525 1121297
36912 1121297 425779 276271 596544 750506 506302 216800 172574 152855 -236723 -953392
36902 -953392 -1486541 -1455636 -1007210 -506806 -113486 94486 -112127 -747655 -1217026 -903241
36892 -903241 -111463 229099 -136519 -526173 -543291 -714990 -1448980 -2155019 -2127838 -1691503
36882 -1691503 -1612527 -1805995 -1557384 -791578 -167769 31501 191403 480307 562326 385669
36872 385669 407831 716078 723048 187855 -188475 220282 949616 1131487 742246 398529
36862 398529 207752 -317233 -1232004 -1873844 -1831335 -1563021 -1683791 -2074717 -2117220 -1551253
36852a551253Q54206P52905N50704L71055J15894k34417n36310o67757o25870
36843i70843m39795j21029K54878N07605M86579K52430O8438J57536M54702O26613
36833A277114L72736k73525r40350j215557r60675l65361K51836O63452P93708
36824c96622O48962K56419l06488q33856j014790o72561m2005L42333K20039l1190
36814a829759J19832N49002N60826p5237o19793k82431O71180J249609J008786
36805A352015M15380j9990l01749m70563k49541L80624P58453K94891o17321j034867
$$ plain form
36852 -1551253 -697047 55858 606562 977617 1093511 859094 322784 -344973 -970843
36843 -970843 -1410638 -1531667 -1276789 -769184 -282605 -30175 38263 195799 650501 1277114
36833 1277114 1649850 1376325 435975 -779582 -1740257 -2105618 -1853782 -1190330 -396622
36824 -396622 252340 508759 202271 -631585 -1646375 -2318936 -2360941 -2018608 -1798569 -1829759
36814 -1829759 -1709927 -1160925 -600099 -675336 -1295129 -1577560 -906380 343229 1352015
36805 1352015 1767395 1747405 1445656 975093 725552 1106176 1864629 2159520 1542199 507332
$$ [...]
##END NTUPLES=NMR SPECTRUM
##END=
