##TITLE=31Pdec_LR-629-H2
 D2O, 124 sc
 17.10.2019
##JCAMPDX= 6.0         $$ Bruker NMR JCAMP-DX V2.0
##DATA TYPE= NMR SPECTRUM
##DATA CLASS= NTUPLES
##ORIGIN= UXNMR, Bruker Analytische Messtechnik GmbH
##OWNER= root
$$ XWIN-NMR		Version 3.5
$$ Thu Oct 17 13:57:28 2019 Russian Standard Time (UT+4h)  she@DPX200
##.OBSERVE FREQUENCY= 81.013821
##.OBSERVE NUCLEUS= ^31P
##.ACQUISITION MODE= SIMULTANEOUS
##.ACQUISITION SCHEME= undefined
##.AVERAGES= 124
##.DIGITISER RES= 17
##SPECTROMETER/DATA SYSTEM= spect
##.PULSE SEQUENCE= zgpg30
##.SOLVENT NAME= DMSO
##.SHIFT REFERENCE= (INTERNAL, DMSO, 0, 182.463)
##AUDIT TRAIL= $$ (NUMBER, WHEN, WHO, WHERE, WHAT)
$$ ##TITLE= Audit trail, XWIN-NMR		Version 3.5
$$ ##JCAMPDX= 5.01
$$ ##ORIGIN= Bruker BioSpin GmbH
$$ ##OWNER= she
$$ F:/spectra/data/she/nmr/P31/1/pdata/1/auditp.txt
$$ ##AUDIT TRAIL=  $$ (NUMBER, WHEN, WHO, WHERE, WHAT)
(   1,<2019-10-17 13:56:24.25 +0400>,<she>,<DPX200>,
      <continue with go, POWCHK disabled, PULCHK disabled
       configuration hash MD5:
       00 E9 B6 7A A2 85 ED C7 34 08 36 98 17 FE 4E 26
       data hash MD5: 32K
       00 4E 59 A1 92 9F EF A8 3F F2 1C 03 87 3E E8 49>)
(   2,<2019-10-17 13:56:25.92 +0400>,<she>,<DPX200>,
      <Start of raw data processing
       efp BC_mod = 2 LB = 1 FT_mod = 6 PKNL = 1 PHC0 = -267.7513 PHC1 = -227.5996 SI = 64K 
       data hash MD5: 64K
       EB 23 F7 EC 8C F9 B1 1D 7A 76 64 23 EE C3 1A 63>)
(   3,<2019-10-17 13:57:02.23 +0400>,<she>,<DPX200>,
      <pk PHC0 = -522.4872 PHC1 = 373.0002 
       data hash MD5: 64K
       EE 9D CA D5 BD 39 9B E8 A3 D7 7A 94 82 D3 02 70>)
(   4,<2019-10-17 13:57:05.10 +0400>,<she>,<DPX200>,
      <abs ABSG = 5 
       data hash MD5: 64K
       E0 34 34 DC 7A 4E AC BD F6 E5 5C CB C0 F6 AB F7>)
$$ ##END=
$$ 
$$ hash MD5
$$ 3B E4 46 69 08 E3 47 D1 A1 15 5B D0 EF 1A E4 A7
##$RELAX= 
##$RELAX= 
##$RELAX= 
##$RELAX= 
##$RELAX= 
##$RELAX= 
##$RELAX= 
##$RELAX= 
$$ Bruker specific parameters
$$ --------------------------
##$DU= <F:/spectra>
##$EXPNO= 1
##$NAME= <P31>
##$PROCNO= 1
##$TYPE= <nmr>
##$USER= <she>
##$AMP= (0..31)
100 100 100 100 100 100 100 100 100 100 100 100 100 100 100 100 100 100 
100 100 100 100 100 100 100 100 100 100 100 100 100 100 
##$AQSEQ= 0
##$AQ_mod= 1
##$AUNM= <au_zg>
##$AUTOPOS= <>
##$BF1= 81.014009
##$BF2= 200.13
##$BF3= 200.13
##$BF4= 200.13
##$BF5= 200.13
##$BF6= 200.13
##$BF7= 200.13
##$BF8= 200.13
##$BYTORDA= 1
##$CFDGTYP= 0
##$CFRGTYP= 5
##$CHEMSTR= <none>
##$CNST= (0..31)
1 1 145 1 1 1 1 1 1 1 1 1 1 1 1 1 1 1 1 1 1 1 1 1 1 1 1 1 1 1 1 1 
##$CPDPRG= <waltz16>
##$CPDPRG1= <>
##$CPDPRG2= <waltz16>
##$CPDPRG3= <>
##$CPDPRG4= <mlev>
##$CPDPRG5= <mlev>
##$CPDPRG6= <mlev>
##$CPDPRG7= <mlev>
##$CPDPRG8= <mlev>
##$CPDPRGB= <>
##$CPDPRGT= <>
##$D= (0..31)
0 1 0 0 0 0 0 0 0 0 0 0.03 2e-05 3e-06 0 0 0 0 0 0 0 0 0 0 0 0 0 0 0 0 
0 0 
##$DATE= 1571305978
##$DBL= (0..7)
120 120 120 11 120 120 24 19 
##$DBP= (0..7)
150 150 150 150 150 150 150 150 
##$DBP07= 0
##$DBPNAM0= <>
##$DBPNAM1= <>
$$ [...]
##$SUBNAM3= <"">
##$SUBNAM4= <"">
##$SUBNAM5= <"">
##$SUBNAM6= <"">
##$SUBNAM7= <"">
##$SUBNAM8= <"">
##$SUBNAM9= <"">
##$SW= 369.568048894756
##$SWIBOX= (0..15)
0 1 3 0 0 0 0 0 0 0 0 0 0 0 0 0 
##$SW_h= 29940.119760479
##$TD= 32768
##$TD0= 1
##$TE= 0
##$TE2= 300
##$TE3= 300
##$TEG= 300
##$TL= (0..7)
0 120 53 12 22 120 120 120 
##$TP= (0..7)
150 150 150 150 150 150 150 150 
##$TP07= 0
##$TPNAME0= <>
##$TPNAME1= <>
##$TPNAME2= <>
##$TPNAME3= <>
##$TPNAME4= <>
##$TPNAME5= <>
##$TPNAME6= <>
##$TPNAME7= <>
##$TPOAL= (0..7)
0.5 0.5 0.5 0.5 0.5 0.5 0.5 0.5 
##$TPOFFS= (0..7)
0 0 0 0 0 0 0 0 
##$TUNHIN= 0
##$TUNHOUT= 0
##$TUNXOUT= 0
##$USERA1= <user>
##$USERA2= <user>
##$USERA3= <user>
##$USERA4= <user>
##$USERA5= <user>
##$V9= 5
##$VALIST= <valist>
##$VCLIST= <CCCCCCCCCCCCCCC>
##$VD= 0
##$VDLIST= <DDDDDDDDDDDDDDD>
##$VPLIST= <PPPPPPPPPPPPPPP>
##$VTLIST= <TTTTTTTTTTTTTTT>
##$WBST= 1024
##$WBSW= 4
##$XGAIN= (0..3)
0 0 0 0 
##$XL= 0
##$YL= 0
##$YMAX_a= 8995
##$YMIN_a= -19160
##$ZGOPTNS= <>
##$ZL1= 120
##$ZL2= 120
##$ZL3= 120
##$ZL4= 120
##$ABSF1= 182.463
##$ABSF2= -187.1042
##$ABSG= 5
##$ABSL= 3
##$ALPHA= 0
##$AQORDER= 0
##$ASSFAC= 0
##$ASSFACI= 0
##$ASSFACX= 0
##$ASSWID= 0
##$AUNMP= <proc_1d>
##$AZFE= 0.1
##$AZFW= 0.5
##$BCFW= 0
##$BC_mod= 2
##$BYTORDP= 0
##$COROFFS= 0
##$CY= -3
##$DATMOD= 1
##$DC= 0
##$DFILT= <>
##$DTYPP= 0
##$F1P= 0
##$F2P= 0
##$FCOR= 1
##$FTSIZE= 65536
##$FT_mod= 6
##$GAMMA= 0
##$GB= 0
##$INTBC= 1
##$INTSCL= 5.30512e-09
##$ISEN= 30
##$LB= 1
##$LEV0= 0
##$LPBIN= 0
##$MAXI= 10000
##$MC2= 0
##$MEAN= 0
##$ME_mod= 0
##$MI= 50
##$NCOEF= 0
##$NC_proc= -8
##$NLEV= 6
##$NOISF1= 182.463
##$NOISF2= 159.3651
##$NSP= 0
##$NTH_PI= 0
##$NZP= 0
##$OFFSET= 182.463
##$PC= 4
##$PHC0= -790.2385
##$PHC1= 145.4006
##$PH_mod= 1
##$PKNL= yes
##$PPARMOD= 0
##$PSCAL= 0
##$PSIGN= 0
##$REVERSE= no
##$SF= 81.0140089999434
##$SI= 65536
##$SIGF1= 159.3651
##$SIGF2= -187.1042
##$SINO= 113.3802
##$SIOLD= 16384
##$SREGLST= <1H.CDCl3>
##$SSB= 0
##$STSI= 65536
##$STSR= 0
##$SW_p= 29940.119760479
##$SYMM= 0
##$S_DEV= 0
##$TDeff= 32768
##$TDoff= 0
##$TI= <>
##$TILT= no
##$TM1= 0
##$TM2= 0
##$TOPLEV= 0
##$USERP1= <user>
##$USERP2= <user>
##$USERP3= <user>
##$USERP4= <user>
##$USERP5= <user>
##$WDW= 1
##$XDIM= 65536
##$YMAX_p= 431249303
##$YMIN_p= -99255933
$$ End of Bruker specific parameters
$$ ---------------------------------
##NTUPLES= NMR SPECTRUM
##VAR_NAME=  FREQUENCY,     SPECTRUM/REAL,   SPECTRUM/IMAG
##SYMBOL=    X,             R,               I
##VAR_TYPE=  INDEPENDENT,   DEPENDENT,       DEPENDENT
##VAR_FORM=  AFFN,          ASDF,            ASDF
##VAR_DIM=   65536,         65536,           65536
##UNITS=     HZ,            ARBITRARY UNITS, ARBITRARY UNITS
##FACTOR=    0.456856943014862, 1,           1
##FIRST=     14782.0589164792, 0,            0
##LAST=      -15158.0608439998, 0,           0
##MIN=       -15158.0608439998, -99255933,   0
##MAX=       14782.0589164792, 431249303,    0
$$ Real data points
##PAGE= N=1
##DATA TABLE= (X++(R..R)), XYDATA
$$ [...]
$$ plain form
4092 -14852477 -16365491 1003679 18004099 14670180 356117 -4259325 -2815915 -13445238
4084 -13445238 -32128783 -36811073 -24856578 -15404293 -13853299 -5261868 12271262 18716800
4076 18716800 6248126 -5905220 -3491474 1058319 -6044978 -15196788 -11280902 1458622
4068 1458622 9618791 11542441 12125437 8773157 -2295286 -14976030 -21060797 -20832013
4060 -20832013 -16716713 -7109577 4102231 4265420 -10164565 -23633046 -21390559 -9083733
4052 -9083733 -580626 3019953 8432991 13517759 11016048 3407749 17758 2507161
4044 2507161 4661671 3755722 2539873 2861063 5046807 9686122 13576241 9804698 -1332571
4035 -1332571 -8700802 -5467272 -306990 -4598595 -15761545 -22932916 -22398910 -17713912
$$ packed form
4092a4852477j513014J7369170J7000420l333919j4314063m615442J443410j0629323
4084a3445238j8683545m682290J1954495R452285J550994Q591431J7533130O445538
4076A8716800j2468674j2153346K413746M549793p103297r151810L915886J2739524
4068A458622Q160169J923650N82996l352280j1068443j2680744o084767K28784
4060b0832013M115300R607136J1211808J63189j4429985j3468481K242487J2306826
4052i083733Q503107L600579N413038N084768k501711p608299l389991K489403
4044B507161K154510r05949j215849L21190K185744M639315L890119l771543j1137269
4035a332571p368231L233530N160282m291605j1162950p171371N34006M684998
$$ plain form
4027 -17713912 -11559876 -7843208 -14476314 -31860753 -44601906 -37752474 -17210120 -1516824
4019 -1516824 2880442 5144634 11658138 18331429 21609922 24241857 27377120 27137439
4011 27137439 22296305 17544405 16287786 16143104 13368910 7026376 -1629541 -9335103
4003 -9335103 -10992175 -4598837 4531815 9038185 8194798 6999299 7493747 5369663 -4419396
3994 -4419396 -20632815 -33952246 -33080656 -16634496 1769792 7106019 2012325 3471744
3986 3471744 18976585 37530070 48624750 56479401 66132158 68181423 51855551 25768635
3978 25768635 10678344 14333353 25300038 29505811 22338797 6170809 -13929318 -31537393
3970 -31537393 -42248430 -45261080 -39717895 -25895851 -13117273 -15285454 -30594512 -37344506
$$ packed form
4027a7713912O154036L716668o633106j7384439j2741153O849432K0542354J5693296
4019a516824M397266K264192O513504O673291L278493K631935L135263k39681
4011B7137439m841134m751900j256619j44682k774194o342534q655917p705562
4003i335103j657072O393338R130652M506370q43387j195499M94448k124084r789059
3994d419396j6213419j3319431Q71590J6446160J8404288N336227n093694J459419
3986C471744J5504841J8553485J1094680P854651R652757K049265j6325872k6086916
3978B5768635j5090291L655009J0966685M205773p167014j6167988k0100127j7608075
3970c1537393j0711037l012650N543185J3822044J2778578k168181j5309058o749994
$$ plain form
3962 -37344506 -21744006 611456 5411119 -7095765 -16055281 -10968630 -1025854 3629409
3954 3629409 3408538 2511063 4141679 11343614 21274829 22933784 13020787 7104255 18628530
3945 18628530 33588745 26779170 -263940 -20144963 -18502867 -9225299 -7689568 -11446816
3937 -11446816 -14086181 -17243741 -19669726 -12979761 1345204 7110281 -3675703 -17357696
3929 -17357696 -18479371 -9957203 -3435768 -1902024 -1933707 -1962632 1005882 11951599 26677356
3920 26677356 31689290 23547704 15668337 16644783 15755072 2124813 -14736971 -18342588
3912 -18342588 -9294372 -1122343 302397 -969404 -2824675 -5078857 -2353912 9377266
3904 9377266 21757851 21422806 7083804 -9711434 -18478796 -16932179 -8498890 -956617
$$ packed form
3962c7344506J5600500K2355462M799663j2506884q959516N086651R942776M655263
3954C629409k20871q97475J630616P201935R931215J658955r912997n916532J1524275
3945A8628530J4960215o809575k7043110j9881023J642096R277568J535731l757248
3937a1446816k639365l157560k425985O689965J4324965N765077j0785984j3681993
3929a7357696j121675Q522168O521435J533744l1683k8925K968514J0945717J4725757
3920B6677356N011934q141586p879367R76446q89711j3630259j6861784l605617
3912a8342588R048216Q172029J424740j271801j855271k254182K724945J1731178
3904I377266J2380585l35045j4339002j6795238q767362J546617Q433289P542273
$$ plain form
3896 -956617 -3259640 -15392006 -25272245 -22995078 -13133538 -5888617 -3046296 -1709329
3888 -1709329 -4429092 -13665756 -21464268 -17597567 -5382163 2725634 4016584 8159666
3880 8159666 20055703 30646230 28584436 14659751 852609 -2620124 2482087 5971140
3872 5971140 4097642 6632835 21633076 37060319 32008554 7498662 -11024051 -7999435
3864 -7999435 3426716 6896907 7908531 17279834 26954946 23905047 15564994 17700419
3856 17700419 25436211 20859107 4329438 -6359207 -5508811 -3869187 -4542521 72252
3848 72252 5932602 -1222608 -16715879 -16027621 6956065 25750448 19085531 904473
3840 904473 -3573616 7525561 20184660 29821101 38408635 38723257 23546490 3888976
$$ packed form
3896i56617k303023j2132366r880239K277167R861540P244921K842321J336967
3888a709329k719763r236664p798512L866701J2215404Q107797J290950M143082
3880H159666J1896037J0590527k061794j3924685j3807142l472733N102211L489053
3872E971140j873498K535193J5000241J5427243n051765k4509892j8522713L024616
3864g999435J1426151L470191J011624R371303R675112l049899q340053K135425
3856A7700419P735792m577104j6529669j0688645Q50396J639624o73334M614773
3848G2252N860350p155210j5493271O88258K2983686J8794383o664917j8181058
3840I04473m478089J1099177J2659099R636441Q587534L14622j5176767j9657514
$$ plain form
3832 3888976 -1732350 7463951 16765927 19502449 20936071 20641103 9412888 -12931555
3824 -12931555 -31289252 -32513107 -19617128 -5167078 1693896 -745330 -8062084 -12023903
3816 -12023903 -7268810 2434153 8909385 10119732 10670666 13247599 16671979 21584092
3808 21584092 29530903 35769495 32125716 19641062 9675696 8413142 8841101 4142343
3800 4142343 629411 7308564 17410215 12939559 -10821535 -35584862 -39966264 -22538942
3792 -22538942 642298 15944741 21467764 19477747 10451122 -1990754 -8568964 -3901080
3784 -3901080 4993659 6191208 -2557054 -12238025 -14858246 -11740878 -8828990 -8611727
3776 -8611727 -8802918 -5990962 1090533 9790320 14078677 9014415 -4143408 -18342309
$$ packed form
3832C888976n621326R196301R301976K736522J433622k94968j1228215k2344443
3824a2931555j8357697j223855J2895979J4450050O860974k439226p316754l961819
3816a2023903M755093R702963O475232J210347N50934K576933L424380M912113
3808B1584092P946811O238592l643779j2484654r965366j262554M27959m698758
3800D142343l512932O679153J0101651m470656k3761094k4763327m381402J7427322
3792b2538942K3181240J5302443N523023j990017r026625j2441876o578210M667884
3784c901080Q894739J197549q748262r680971k620221L117368K911888K17263
3776h611727j91191K811956P081495Q699787M288357n064262j3157823j4198901
$$ plain form
3768 -18342309 -26450639 -26120190 -20691160 -16993723 -19992382 -26724711 -27678666 -17622733
3760 -17622733 -2768135 6920599 9736892 10922503 11896887 8632494 791318 -5165044
3752 -5165044 -3896976 3636056 13945514 23473944 26114153 16273326 -1786763 -14450686
3744 -14450686 -13606332 -5894931 -2275081 -3221668 -526175 9065506 18662130 19921823
3736 19921823 12763128 5178180 4872550 11468650 16866390 13904464 4142505 -4083004
3728 -4083004 -4057486 4595795 17349265 27830169 31479986 29415726 26246144 21642817
3720 21642817 9906923 -7124439 -15275882 -6441209 5992813 4964894 -3149384 788443
3712 788443 13321373 9426088 -14901934 -28219316 -8500079 19837610 17913329 -12584151
$$ packed form
3768a8342309q108330L30449N429030L697437k998659o732329r53955J0055933
3760a7622733J4854598R688734K816293J185611R74384l264393p841176n956362
3752e165044J268068P533032J0309458R528430K640209r840827j8060089j2663923
3744a4450686Q44354P711401L619850r46587K695493R591681R596624J259693
3736A9921823p158695p584948l05630O596100N397740k961926r761959q225509
3728d083004K5518Q653281J2753470J0480904L649817k064260l169582m603327
3720B1642817j1735894j7031362q151443Q834673J2434022j027919q114278L937827
3712G88443J2532930l895285k4328022j3317382J9719237K8337689j924281l0497480
$$ plain form
3704 -12584151 -33085980 -20949887 7417597 26800442 32621759 33411395 32877739 30397940
3696 30397940 28072051 28003135 28835549 29609612 30658135 28661851 19419134 8032352 6311671
3687 6311671 15181635 18939675 4206136 -21640030 -37940043 -33017235 -13827175 3560970
3679 3560970 8656419 3503627 -2057236 -2341270 -1834037 -6362383 -11511970 -7545950 5007497
3670 5007497 14637150 16131144 18212555 27937749 36672881 31523964 15947914 8060109
3662 8060109 17933447 34774341 39944603 28044452 10921437 2309231 3038910 4093167
3654 4093167 1422836 638472 4299690 2306477 -15788039 -42004085 -54975187 -45747353
3646 -45747353 -28225092 -19101297 -17012915 -10288214 1291274 4562727 -7074493 -21767920
$$ packed form
3704a2584151k0501829J2136093K8367484J9382845N821317P89636n33656k479799
3696C0397940k325889o8916Q32414P74063J048523j996284r242717j1386782j720681
3687F311671Q869964L758040j4733539k5846166j6300013M922808J9190060J7388145
3679C560970N095449n152792n560863k84034N07233m528346n149587L966020J2553447
3670E007497R629653J493994K081411R725194Q735132n148917j5576050p887805
3662H060109R873338J6840894N170262j1900151j7123015q612206P29679J054257
3654D093167k670331p84364L661218j993213j8094516k6216046j2971102R227834
3646d5747353J7522261R123795K088382O724701J1579488L271453j1637220j4693427
$$ plain form
3638 -21767920 -22523340 -8121112 5126797 3156003 -8394994 -10897011 3570059 21529900
3630 21529900 25394330 15825458 8116632 8821959 8030524 -1976885 -12143222 -9493931
3622 -9493931 2903836 9989366 6195838 2085576 7669427 17629867 18441308 6116541
3614 6116541 -8885318 -14449903 -10318758 -5900631 -6163085 -4620598 7026527 26185154
3606 26185154 41616996 46628136 43826451 37137435 26464387 12389147 -521004 -8602364
3598 -8602364 -12083952 -10842011 -4054107 2463003 -2671630 -20858870 -36762425 -36896710
3590 -36896710 -28883567 -29740079 -38590258 -36660908 -16491484 4580003 8358316 909755
3582 909755 1246688 12390859 18999526 12803250 5095552 8103782 15819138 14045444
$$ packed form
3638b1767920p55420J4402228J3247909j970794j1550997k502017J4467070J7959841
3630B1529900L864430r568872p708826P05327p91435j0007409j0166337K649291
3622i493931J2397767P085530l793528m110262N583851R960440Q11441j2324767
3614F116541j5001859n564585M131145M418127k62454J542487J1647125J9158627
3606B6185154J5431842N011140k801685o689016j0673048j4075240j2910151q081360
3598h602364l481588J241941O787904O517110n134633j8187240j5903555j34285
3590c6896710Q013143q56512q850179J929350K0169424K1071487L778313p448561
3582I09755L36933J1144171O608667o196276p707698L008230P715356j773694
$$ plain form
3574 14045444 3089185 -2257317 5410488 16384861 19608337 17565718 18116298 19624315
3566 19624315 14577813 3599478 -5438652 -10868303 -18168340 -26219890 -24654679 -10013277
3558 -10013277 5634984 9662841 4639052 747006 -1008111 -7695053 -20100623 -30212131
3550 -30212131 -32720440 -29730014 -22953971 -10234742 6516573 17103705 12745418 -2926724
3542 -2926724 -16997394 -20161698 -13711295 -5084271 94681 1095970 79873 -333416
3534 -333416 2156465 8177535 14245367 14034096 5476641 -4762248 -8019808 -3950882
3526 -3950882 911523 4185572 9961497 18516422 21932385 14968173 4042230 -588939
3518 -588939 2982640 9420139 14738506 17577793 15951887 9583861 2903754 -50303
$$ packed form
3574A4045444j0956259n346502P667805J0974373L223476k042619N50580J508017
3566A9624315n046502j0978335r038130n429651p300037q051550J565211J4641402
3558a0013277J5648261M027857n023789l892046j755117o686942j2405570j0111508
3550c0212131k508309K990426O776043J2719229J6751315J0587132m358287j5672142
3542b926724j4070670l164304O450403Q627024N178952J001289j016097m13289
3534c33416K489881O021070O067832k11271q557455j0238889l257560M068926
3526c950882M862405L274049N775925Q554925L415963o964212j0925943m631169
3518e88939L571579O437499N318367K839287j625906o368026o680107k954057
$$ plain form
3510 -50303 -1121557 -3798752 -7652230 -11863582 -18247221 -24122210 -19656443 -2446577
3502 -2446577 11727657 5618919 -15951298 -32754738 -36444660 -36092634 -37618216 -34871220
3494 -34871220 -24202210 -11767670 -1081480 11697415 23873284 23240098 8149941
3487 8149941 -3977278 -118368 8621643 4339782 -10469749 -18124244 -11714774 -921076
3479 -921076 5041763 7296426 11222508 20290507 33952327 43678235 35779008 7792402
3471 7792402 -22982879 -37994278 -38943657 -38624625 -37166816 -24989943 -6361052 845913
3463 845913 -7455522 -13532267 -5023118 6524703 5332306 -4394507 -8235184 -5881867
3455 -5881867 -9122156 -18836026 -19799266 -1728303 25290620 42524930 44150061 40380062
$$ packed form
3510e0303j071254k677195l853478m211352o383639n874989M465767J7209866
3502b446577J4174234o108738k1570217j6803440l689922L52026j525582K746996
3494c4871220J0669010J2434540J0686190J2778895J2175869o33186j5090157
3487H149941j2127219L858910Q740011m281861j4809531p654495O409470J0793698
3479i21076N962839K254663L926082R067999J3661820R725908p899227k7986606
3471G792402l0775281j5011399r49379L19032J457809J2176873J8628891P206965
3463H45913q301435o076745Q509149J1547821j192397r726813l840677K353317
3455e881867l240289r713870r63240J8070963K7018923J7234310J625131l769999
$$ plain form
3447 40380062 40122754 37453771 21043859 -5323066 -21486024 -15514343 -1409093 -1627525
3439 -1627525 -16516344 -24871875 -14765182 1340503 7256095 4981186 6540731 14091338
3431 14091338 19655604 19210329 16905032 17926847 24093330 33029241 36196045 23643723
3423 23643723 -1861004 -21424471 -19887296 -4367613 6344063 5756819 1785940 -393131
3415 -393131 -2859675 -3211542 5702710 20291571 24799073 13037882 39091 1941747
3407 1941747 12583438 12177972 -4481857 -20755579 -20474609 -7981193 -813094 -7588515
3399 -7588515 -19566614 -23503376 -17087879 -8289079 -2875059 1135900 6113607 8466206
3391 8466206 3670810 -6667758 -17187645 -24531341 -26506738 -20489977 -9100334 -2649717
$$ packed form
3447D0380062k57308k668983j6409912k6366925j6162958N971681J4105250k18432
3439a627525j4888819q355531J0106693J6105685N915592k274909J559545P550607
3431A4091338N564266m45275k305297J021815O166483Q935911L166804j2552322
3423B3643723k5504727j9563467J537175J5519683J0711676n87244l970879k179071
3415c93131k466544l51867Q914252J4588861M507502j1761191j2998791J902656
3407A941747J0641691m05466j6659829j6273722K80970J2493416P168099o775421
3399g588515j1978099l936762O415497Q798800N414020M010959M977707K352599
3391H466206m795396j0338568j0519887p343696j975397O016761J1389643O450617
$$ plain form
3383 -2649717 -7166362 -13510335 -8895160 2797821 4482909 -9887615 -27566373 -36521471
3375 -36521471 -39260136 -41036054 -37458153 -24371620 -10493078 -8003457 -15998919 -23967156
3367 -23967156 -27302370 -28974331 -29626674 -27433400 -26012609 -30928492 -37687676 -33929362
3359 -33929362 -16555845 1917604 8237951 3269746 -2482721 -3713594 -5404507 -13832151
3351 -13832151 -26087874 -31233173 -22790295 -7315741 3890944 9410617 15661038 20485477
3343 20485477 11931324 -10613503 -27761380 -24405312 -11254035 -6833963 -7833689 2712302
3335 2712302 23619507 35193071 30217416 21531731 15074770 373521 -22821432 -32996331
3327 -32996331 -18016757 2196226 3440731 -8003408 -9199045 3437329 14625242
$$ packed form
3383b649717m516645o343973M615175J1692981J685088j4370524j7678758q955098
3375c6521471k738665j775918L577901J3086533J3878542K489621p995462p968237
3367b3967156l335214j671961o52343K193274J420791m915883o759184L758314
3359c3929362J7373517J8473449O320347m968205n752467j230873j690913q427644
3351a3832151j2255723n145299Q442878J5474554J1206685N519673O250421M824439
3343B0485477q554153k2544827j7147877L356068J3151277M420072r99726J0545991
3335B712302K0907205J1573564m975655q685685o456961j4701249k3194953j0174899
3327c2996331J4979574K0212983J244505j1444139j195637J2636374J1187913
$$ plain form
3320 14625242 17926665 19208808 17208697 4737994 -11053144 -12398882 1827440 12597816
3312 12597816 8948664 1081886 -240816 985390 -595585 469001 8839544 17459325
3304 17459325 18011553 12059785 4599193 -2537656 -4876082 3786472 17152468 17269695
3296 17269695 -1022781 -20439517 -25906849 -23144127 -20532046 -10987480 9353291 21569875
3288 21569875 8745993 -11230210 -7104785 16591132 23290087 -312202 -23823871
3281 -23823871 -18596061 3366148 12600760 3778821 -5669491 -5230018 47633 3956204
3273 3956204 5888137 5665129 2672265 -2040015 -9205189 -21097052 -32044523 -28809751
3265 -28809751 -9644218 6828311 3970336 -9779556 -13910330 -5054118 2723691 2679172
$$ packed form
3320A4625242L301423J282143k000111j2470703j5791138j345738J4226322J0770376
3312A2597816l649152p866778j322702J226206j580975J064586Q370543Q619781
3304A7459325N52228n951768p460592p136849k338426Q662554J3365996J17227
3296A7269695j8292476j9416736n467332K762722K612081R544566K0340771J2216584
3288B1569875j2823882j9976203M125425K3695917O698955k3602289k3511669
3281b3823871N227810K1962209R234612q821939r448312M39473N277651L908571
3273C956204J931933k23008k992864m712280p165174j1891863j0947471L234772
3265b8809751J9165533J6472529k857975j3749892m130774Q856212P777809m4519
$$ plain form
3257 2679172 2879168 8451279 12243305 6870274 -6224724 -22784246 -39331002 -48103475
3249 -48103475 -40720729 -21430309 -5444624 926231 7195628 19859316 28946870 23069963
3241 23069963 7759659 -3383671 -8932854 -17732854 -30321622 -36055083 -29676490 -19115159
3233 -19115159 -13331865 -11618799 -9685809 -8637697 -11004125 -12515307 -5723625 8990087
3225 8990087 22569850 28686521 30529304 33268621 34454127 27462228 12335126 -3347083
3217 -3347083 -14388494 -21565569 -23308089 -12393797 12381296 37350580 45765734 35805154
3209 35805154 19144054 5047843 -3976014 -3157392 13523404 39126369 52643513 40290769
3201 40290769 11186764 -14163923 -24469725 -21451934 -11358636 -1265926 1998449
$$ packed form
3257B679172J99996N572111L792026n373031j3094998j6559522j6546756q772473
3249d8103475P382746J9290420J5985685O370855O269397J2663688R087554n876907
3241B3069963j5310304j1143330n549183q800000j2588768n733461O378593J0561331
3233a9115159N783294J713066J932990J048112k366428j511182O791682J4713712
3225H990087J3579763O116671J842783K739317J185506o991899j5127102j5682209
3217c347083j1041411p177075j742520J0914292K4775093K4969284Q415154r960580
3209C5805154j6661100j4096211r023857Q18622J6680796K5602965J3517144j2352744
3201D0290769k9104005k5350687j0305802L017791J0093298J0092710L264375
$$ plain form
3194 1998449 -1422357 -2068985 6597910 17132049 17588365 8909969 3300599 6533998
3186 6533998 11524698 10247186 3259422 -4987378 -12902588 -19990389 -23012766 -17688796
3178 -17688796 -3156747 15289178 26930420 22845118 6830486 -4848644 -1618310
3171 -1618310 6651410 2313974 -13984354 -21447151 -6570732 17562685 26074199 10630752
3163 10630752 -13230673 -24333148 -16992214 -4898227 -5426872 -19373685 -28669777 -18211757
3155 -18211757 3741178 15201886 8584661 -1825046 -1830570 5349004 8802624 6125137
3147 6125137 2302020 898426 4250530 14922667 28728366 33515452 24200779 12569673
3139 12569673 12053569 18945280 20515090 16444497 17608092 25408029 27781446 18299196
$$ packed form
3194A998449l420806o46628Q666895J0534139M56316q678396n609370L233399
3186F533998M990700j277512o987764q246800p915210p087801l022377N323970
3178a7688796J4532049J8445925J1641242m085302j6014632j1679130L230334
3171a618310Q269720m337436j6298328p462797J4876419K4133417Q511514j5443447
3163A0630752k3861425j1102475P340934J2093987n28645j3946813r296092J0458020
3155a8211757K1952935J1460708o617225j0409707n524P179574L453620k677487
3147F125137l823117j403594L352104J0672137J3805699M787086r314673j1631106
3139A2569673n16104O891711J569810m070593J163595P799937K373417r482250
$$ plain form
3131 18299196 5887899 779832 1718272 2550618 2151039 1905711 1337721 1994156 8192204
3122 8192204 17902987 20373474 10129959 -3159773 -7135630 -3729202 -4271784 -11298016
3114 -11298016 -16088204 -14159565 -12805999 -19554496 -30291743 -34093818 -26609137 -14556630
3106 -14556630 -7836942 -9308678 -12453185 -9124497 331078 6759683 3944381 -1979440
3098 -1979440 619968 13339193 24325966 22024965 8321895 -4601010 -7752026 -2677386
3090 -2677386 3199759 5374834 5562636 7282935 9431517 5974465 -6673564 -23532289
3082 -23532289 -35380453 -38986771 -39366370 -40814212 -39983663 -31506767 -17815073 -8121567
3074 -8121567 -7160761 -9179442 -5558032 3931153 10658370 7726865 -1632247 -7630132
$$ packed form
3131A8299196j2411297n108067R38440Q32346l99579k45328n67990O56435O198048
3122H192204R710783K470487j0243515j3289732l975857L406428n42582p026232
3114a1298016m790188J928639J353566o748497j0737247l802075P484681J2052507
3106a4556630O719688j471736l144507L328688R455575O428605k815302n923821
3098a979440K599408J2719225J0986773k301001j3703070j2922905l151016N074640
3090b677386N877145K175075J87802J720299K148582l457052j2648029j6858725
3082b3532289j1848164l606318l79599j447842Q30549Q476896J3691694R693506
3074h121567R60806k018681L621410R489185O727217k931505r359112n997885
$$ plain form
3066 -7630132 -4432707 4911922 13556527 18249455 20813478 24781059 32334370 42018289
3058 42018289 46741327 37199340 12674667 -13233476 -24710335 -21855165 -18755504 -21894168
3050 -21894168 -21338507 -9793216 1148265 -3080655 -15409298 -15712499 -1901218 6755619
3042 6755619 892740 -4350242 3904401 13454100 8068340 -2439235 4533411 27661590
3034 27661590 42032935 36186306 25438943 22615815 18168362 2083610 -13146884 -9860900
3026 -9860900 5948356 12800568 5589384 723847 9809573 24726534 32400673 31036306
3018 31036306 26004292 19744773 12445506 6111475 2104206 -1211665 -4778008 -6956612
3010 -6956612 -7733016 -9717015 -12238126 -10032579 -1591561 6300973 6810968 1419217 -4500064
$$ packed form
3066g630132L197425R344629Q644605M692928K564023L967581P553311R683919
3058D2018289M723038r541987k4524673k5908143j1476859K855170L099661l138664
3050b1894168N55661J1545291J0941481m228920j2328643l03201J3811281Q656837
3042F755619n862879n242982Q254643R549699n385760j0507575O972646K3128179
3034B7661590J4371345n846629j0747363k823128m447453j6084752j5230494L285984
3026i860900J5809256O852212p211184m865537R085726J4916961P674139j364367
3018C1036306n032014o259519p299267o334031m007269l315871l566343k178604
3010f956612p76404j983999k521111K205547Q441018P892534N09995n391751n919281
$$ plain form
3001 -4500064 -9867215 -15721633 -18580509 -13648787 -3873652 1246004 -2786474 -10386119
2993 -10386119 -14033994 -12822852 -10319212 -7848568 -3932620 1296986 5226728 6902679
2985 6902679 9230780 14953923 21207591 20460604 8379813 -10018918 -23894842 -26505119
2977 -26505119 -20282351 -12316314 -7563247 -7401642 -10969716 -14244214 -10696744 1216614
2969 1216614 11809847 8506782 -7076981 -17312894 -9564826 6225829 9320816 -4956297
2961 -4956297 -20214211 -21862514 -14394074 -10719938 -13552913 -16146766 -15255478 -12633510
2953 -12633510 -6606778 6347994 20817083 23370260 7661822 -18191141 -41146722
2946 -41146722 -53221087 -51439586 -38030026 -24412667 -24619107 -37748139 -45156353 -32796990
$$ packed form
3001d500064n367151n854418k858876M931722R775135N119656m032478p599645
2993a0386119l647875J211142K503640K470644L915948N229606L929742J675951
2985F902679K328101N723143O253668p46987j2080791j8398731j3875924k610277
2977b6505119O222768P966037M753067J61605l568074l274498L547470J1913358
2969A216614J0593233l303065j5583763j0235913P748068J5790655L094987j4277113
2961d956297j5257914j648303P468440L674136k832975k593853Q91288K621968
2953a2633510O026732J2954772J4469089K553177j5708438k5852963k2955581
2946d1146722j2074365J781501J3409560J3617359k06440j3129032p408214J2359363
$$ plain form
2938 -32796990 -9223177 6728816 8997428 5233500 1137790 -3762108 -7768967 -6881344
2930 -6881344 -3168382 -3379656 -8553890 -12735115 -11127435 -2346789 13853127 31471949
2922 31471949 35592443 18601726 -3411190 -6603060 8122159 16214266 5797731 -6910700
2914 -6910700 -5843582 1567016 2297049 860173 6786753 13209066 8705446 483330
2906 483330 2952023 9009706 -2323170 -29332440 -43579461 -29565841 -6901050 -895900
2898 -895900 -8347586 -8652485 2388184 8266566 -1901933 -18313235 -24497611 -16708115
2890 -16708115 -5209181 -1271039 -6405312 -13034693 -14115751 -10911936 -9358244 -9913652
2882 -9913652 -6561105 2065656 6884727 -312619 -13394336 -17449621 -7934581 2583695
$$ packed form
2938c2796990K3573813J5951993K268612l763928m095710m899898m006859Q87623
2930f881344L712962k11274n174234m181225J607680Q780646J6199916J7618822
2922C1471949M120494j6990717k2012916l191870J4725219Q092107j0416535j2708431
2914f910700J067118P410598P30033j436876N926580O422313m503620q222116
2906D83330K468693O057683j1332876k7009270j4247021J4013620K2664791O005150
2898h95900p451686l04899J1040669N878382j0168499j6411302o184376P789496
2890a6708115J1498934L938142n134273o629381j081058L203815J553692n55408
2882i913652L352547Q626761M819071p197346j3081717m055285R515040J0518276
$$ plain form
2874 2583695 -112775 -14212109 -24409497 -20669686 -9435634 -4310993 -9273233 -15665286
2866 -15665286 -15000991 -9116374 -5031675 -4416915 -3300273 160561 3682219 6528485
2858 6528485 11549868 20053871 29111013 35731697 39494391 38878043 29770636 11979496
2850 11979496 -5986273 -14357305 -13941249 -15417204 -25108015 -35410303 -33173209 -16259493
2842 -16259493 2552148 9657230 5454888 2041406 7974664 19499851 26579358 23022164
2834 23022164 9610154 -8154205 -23089156 -30965778 -34187757 -36921583 -35789599 -22913869
2826 -22913869 -1720507 9889483 709050 -17121913 -23783564 -17872583 -12840670 -11720994
2818 -11720994 -3765297 12031507 19046407 6713594 -13426111 -25815163 -31390148 -37122601
$$ packed form
2874B583695k696470j4099334j0197388L739811J1234052N124641m962240o392053
2866a5665286O64295N884617M084699O14760J116642L460834L521658K846266
2858F528485N021383Q504003R057142O620684L762694o16348r107407j7791140
2850A1979496j7965769q371032M16056j475955r690811j0302288K237094J6913716
2842a6259493J8811641P105082m202342l413482N933258J1525187P079507l557194
2834B3022164j3412010j7764359j4934951p876622l221979k733826J131984J2875730
2826b2913869K1193362J1609990r180433j7830963o661651N910981N031913J119676
2818a1720994P955697J5796804P014900j2332813k0139705j2389052n574985n732453
$$ plain form
2810 -37122601 -37421167 -23489136 -4048988 2453143 -5218354 -9985896 -4390689 -2175701
2802 -2175701 -14989278 -32256784 -35708408 -24621616 -13778082 -10539044 -6850460 4400558
2794 4400558 15299533 11828632 -6797198 -24541262 -26052843 -13695544 -2734648 -1259694
2786 -1259694 -1910207 3873638 11097705 9006470 -173507 -1294147 12826994 29482896
2778 29482896 30362784 12638766 -9362443 -20438678 -17748837 -9290456 -3310063 -204945
2770 -204945 5762657 17078720 27559787 29158923 22074304 13163421 5960900 -568511
2762 -568511 -3815567 1934892 13288992 16037515 2745610 -15865796 -25683464 -28385132
2754 -28385132 -34913473 -44643498 -44624879 -29729961 -11348518 -2670650 -4502753 -9267591
$$ packed form
2810c7122601k98566J3932031J9440148O502131p671497m767542N595207K214988
2802b175701j2813577j7267506l451624J1086792J0843534L239038L688584J1251018
2794D400558J0898975l470901j8625830j7744064j511581J2357299J0960896J474954
2786a259694o50513N783845P224067k091235r179977j120640J4121141J6655902
2778B9482896Q79888j7724018k2001209j1076235K689841Q458381N980393L105118
2770b04945N967602J1316063J0481067J599136p084619q910883p202521o529411
2762e68511l247056N750459J1354100K748523j3291905j8611406r817668k701668
2754b8385132o528341r730025J8619J4894918J8381443Q677868j832103m764838
$$ plain form
2746 -9267591 -11251735 -9101617 -4658754 -2456225 -4600925 -4950412 3750292 15687356
2738 15687356 15693481 1106379 -11944275 -11108465 -4485132 -4194405 -5200169 3768325 16483584
2729 16483584 15881669 2151023 -5432840 2488445 12425431 10360460 1045131 -4161368
2721 -4161368 -5243657 -7890964 -10334137 -8470160 -7002224 -12854474 -21827626 -23525160
2713 -23525160 -17142273 -11867822 -12933801 -16704949 -18893257 -19008106 -16872625 -12355035
2705 -12355035 -8219853 -6490068 -3475478 4243932 11173102 9272865 1298102 -2607922
2697 -2607922 -949241 -1481710 -4522436 479743 15929493 26431900 18351459 452599
2689 452599 -6686385 2404501 13034617 11634826 2262515 -1329349 5950824 15167376
$$ packed form
2746i267591j984144K150118M442863K202529k144700l49487Q700704J1937064
2738A5687356O125j4587102j3050654Q35810O623333K90727j005764Q968494J2715259
2729A6483584o01915j3730646p583863P921285R936986k064971r315329n206499
2721d161368j082289k647307k443173J863977J467936n852250q973152j697534
2713b3525160O382887N274451j065979l771148k188308j14849K135481M517590
2705a2355035M135182J729785L014590P719410O929170j900237p974763l906024
2697b607922J658681n32469l040726N002179J5449750J0502407q080441j7898860
2689D52599p138984R090886J0630116j399791r372311l591864P280173R216552
$$ plain form
2681 15167376 15534821 8351850 5176830 11352244 16463846 7342064 -12205772 -23915095
2673 -23915095 -18353410 -6020739 -1129881 -3575576 -4144997 -284271 2507864 728733
2665 728733 -4514907 -12257843 -20534287 -22085786 -10129123 10595055 25656737 25988538
2657 25988538 16541569 8900136 9375510 15075873 17906329 11575061 -2677414 -17234570
2649 -17234570 -26521861 -31839617 -35143206 -32712895 -21547196 -8608492 -4327285 -7024675
2641 -7024675 -3576321 11436281 26003954 25616155 11380143 -3555904 -11455263 -16248540
2633 -16248540 -23395123 -30291078 -29063807 -16110689 2565310 14757592 11752649 -3264461
2625 -3264461 -16981009 -18247073 -8529726 1306264 3531555 208560 -2050332 -195038
$$ packed form
2681A5167376L67445p182971l175020O175414N111602r121782j9547836j1709323
2673b3915095N561685J2332671M890858k445695n69421L860726K792135j779131
2665G28733n243640p742936q276444j551499J1956663K0724178J5061682L31801
2657B5988538r446969p641433M75374N700363K830456o331268j4252475j4557156
2649a7234570r287291n317756l303589K430311J1165699J2938704M281207k697390
2641g024675L448354J5012602J4567673l87799j4236012j4936047p899359m793277
2633a6248540p146583o895955J227271J2953118J8675999J2192282l004943j5017110
2625c264461j3716548j266064R717347R835990K225291l322995k258892J855294
$$ plain form
2617 -195038 3512135 4507262 -1176812 -13545447 -25247208 -25536767 -12985751 -913270
2609 -913270 -2011537 -9158535 -3038998 18538783 32599886 21438092 -980678 -8186149
2601 -8186149 1075072 3876382 -9510577 -20568889 -11320054 10030620 23348390 22598350
2593 22598350 14921463 4852035 -5897421 -10172505 -1763220 13125494 22606460 24211319
2585 24211319 22737780 17480251 4114800 -13326071 -24915624 -28118511 -27324058 -22191825
2577 -22191825 -9308900 5494464 10505516 5179574 590402 827165 -2108907 -10843909
2569 -10843909 -14441892 -5440650 6524469 7791515 -567821 -6563242 -4935927 -2212504
2561 -2212504 -5467658 -12037927 -12070869 -1002557 11340224 9251925 -7633926 -19249404
$$ packed form
2617a95038L707173R95127n684074j2368635j1701761k89559J2551016J2072481
2609i13270j098267p146998O119537K1577781J4061103j1161794k2418770p205471
2601h186149R261221K801310j3386959j1058312R248835K1350674J3317770p50040
2593B2598350p676887j0069428j0749456m275084Q409285J4888714R480966J604859
2585B4211319j473539n257529j3365451j7440871j1589553l202887P94453N132233
2577b2191825J2882925J4803364N011052n325942m589172K36763k936072q735002
2569a0843909l597983R001242J1965119J267046q359336n995421J627315K723423
2561b212504l255154o570269l2942J1068312J2342781k088299j6885851j1615478
$$ plain form
2553 -19249404 -9974083 9119703 16419726 11419121 11220024 18329727 15446109 -3148749
2545 -3148749 -17990012 -12727883 3089698 12079891 13475073 15863199 19480935 19702767
2537 19702767 16757956 10144650 -4621146 -22979218 -29377503 -20109114 -12045246 -15325903
2529 -15325903 -15984649 -2842849 8259970 -711596 -19669463 -30428795 -38559690 -55412573
2521 -55412573 -67195780 -59267687 -54334306 -78650386 -99255933 -53250502 52011343
2514 52011343 126225341 108718272 44594213 14648500 31302147 47513421 37938260
2507 37938260 20183620 9077784 -2385168 -16413022 -21906911 -17097712 -12893523 -10703444
2499 -10703444 -885290 15060893 23377851 20878156 17815794 16594603 8401628 -6964571
$$ packed form
2553a9249404R275321J9093786P300023n000605j99097P109703k883618j8594858
2545c148749j4841263N262129J5817581Q990193J395182K388126L617736K21832
2537A9702767k944811o613306j4765796j8358072o398285R268389Q063868l280657
2529a5325903o58746J3141800J1102819q971566j8957867j0759332q130895j6852883
2521e5412573j1783207P928093M933381k4316080k0605547M6005431J05261845
2514E2011343P4213998j7507069o4124059k9945713J6653647J6211274r575161
2507C7938260j7754640j1105836j1462952j4027854n493889M809199M204189K190079
2499a0703444R818154J5946183Q316958k499695l062362j221191q192975j5366199
$$ plain form
2491 -6964571 -18223014 -22229119 -26975751 -32369424 -28001076 -14058686 -4734871 -5461560
2483 -5461560 -5579370 612054 4576616 2249966 2897874 10270994 12807150 2937000 -10115026
2474 -10115026 -16729604 -19237538 -17156582 1055728 35741766 61895010 56646981 29715774
2466 29715774 7778089 -2097410 -13356865 -30506616 -40256024 -32782588 -15001434 593478
2458 593478 8590192 10008004 8253287 7385353 8312509 7610264 4518205 4134434 7563217
2449 7563217 6068481 -6053167 -19821781 -23272660 -18149818 -13718378 -11326014 -8483412
2441 -8483412 -10901205 -23889120 -36812177 -34083645 -18968759 -8376297 -5834505 685319
2433 685319 14087259 22742162 22980669 25356136 32253615 30803303 17423592 8189764
$$ packed form
2491f964571j1258443m006105m746632n393673M368348J3942390R323815p26689
2483e461560j17810O191424L964562k326650O47908P373120K536156r870150j3052026
2474a0115026o614578k507934K080956J8212310L4686038K6153244n248029k6931207
2466B9715774k1937685r875499j1259455j7149751r749408P473436J7781154J5594912
2458E93478P996714J417812j754717q67934R27156p02245l092059l83771L428783
2449G563217j494736j2121648j3768614l450879N122842M431440K392364K842602
2441h483412k417793j2987915j2923057K728532J5114886J0592462K541792O519824
2433F85319J3401940Q654903K38507K375467O897479j450312j3379711r233828
$$ plain form
2425 8189764 11607417 10842579 -9486420 -34863882 -39439685 -22284605 -5274006 -1837856
2417 -1837856 -6540363 -11196530 -13374421 -10618494 -2106647 4168541 -779771 -12526821
2409 -12526821 -18625993 -16706923 -14890380 -16235734 -16305381 -14989644 -16221063 -15612358 -3705023
2400 -3705023 15601183 24697283 15845976 2428671 51206 7281418 12331408 9402284
2392 9402284 351690 -12369829 -25741074 -33365647 -29721656 -15705580 2812628 18878837
2384 18878837 26111718 22291248 13192727 6909868 2744697 -7445254 -25204167 -40918893
2376 -40918893 -45928389 -40529139 -26814333 -4169689 21817699 36147865 29699237 11225991
2368 11225991 -4312563 -12837224 -17533657 -15505349 -1459738 17712397 25590477 16100303
$$ packed form
2425H189764L417653p64838k0328999k5377462m575803J7155080J7010599L436150
2417a837856m702507m656167k177891K755927Q511847O275188m948312j1747050
2409a2526821o099172J919070J816543j345354o9647J315737j231419O08705J1907335
2400c705023J9306206R096100q851307j3417305k377465P230212N049990k929124
2392I402284r050594j2721519j3371245p624573L643991J4016076J8518208J6066209
2384A8878837P232881l820470r098521o282859m165171j0189951j7758913j5714726
2376d0918893n009496N399250J3714806K2644644K5987388J4330166o448628j8473246
2368A1225991j5538554q524661m696433K028308J4045611J9172135P878080r490174
$$ plain form
2360 16100303 1116562 -5374045 -3398553 -2931973 -8679655 -14183059 -10479248 2105783
2352 2105783 12761185 12463734 6301415 8300355 21804753 31280816 19950107 -8046209
2344 -8046209 -30575889 -31810033 -17156855 -3606723 -1140475 -5941640 -8332593 -4637201
2336 -4637201 -1341001 -6967807 -19554619 -25535469 -14366139 8030780 24571069 24885909
2328 24885909 14555872 7348381 11467266 23123922 31201114 28366587 18547516 12148556
2320 12148556 13913613 19142017 22610346 25512939 30338781 34454085 33828499 28877190
2312 28877190 21527925 10717404 -3328506 -13841340 -12781006 443318 19091612
2305 19091612 33887328 34813500 16559097 -10396981 -22424747 -7492870 18570029
$$ packed form
2360A6100303j4983741o490607J975492M66580n747682n503404L703811J2585031
2352B105783J0655402k97451o162319J998940J3504398R476063j1330709k7996316
2344h046209k2529680j234144J4653178J3550132K466248m801165k390953L695392
2336d637201L296200n626806j2586812n980850J1169330K2396919J6540289L14840
2328B4885909j0330037p207491M118885J1656656Q077192k834527r819071o398960
2320A2148556J765057N228404L468329K902593M825842M115304o25586m951309
2312B8877190p349265j0810521j4045910j0512834J060334J3224324J8648294
2305A9091612J4795716R26172j8254403k6956078j2027766J4931877K6062899
$$ plain form
2298 18570029 31964354 30698315 30141609 34600850 32811385 21543983 12884375 12192520
2290 12192520 7672572 -8146947 -22390480 -19970019 -5763590 4577727 6809604 7774442
2282 7774442 10024831 10536026 10655558 14698580 20552743 22072695 18993709 15329592 10581713
2273 10581713 2143130 -6146144 -8264602 -7136208 -10687223 -17441301 -17248339 -7147624
2265 -7147624 4766521 13493474 23542645 36515611 43121531 35565368 20624251 11900010
2257 11900010 13372985 18235261 20906328 22081995 22422995 18958219 10689687 3155542
2249 3155542 3079161 9408192 13245031 8442633 426410 992642 13697182 28057592
2241 28057592 30938916 20927322 8008072 1641590 3736794 11103109 18414226 18998480
$$ packed form
2298A8570029J3394325j266039n56706M459241j789465j1267402q659608o91855
2290A2192520m519948j5819519j4243533K420461J4206429J0341317K231877R64838
2282G774442K250389N11195J19532M043022N854163J519952l078986l664117m747879
2273A0581713q438583q289274k118458J128394l551015o754078J92962J0100715
2265g147624J1914145Q726953J0049171J2972966O605920p556163j4941117q724241
2257A1900010J472975M862276K671067J175667L41000l464776q268532p534145
2249C155542p6381O329031L836839m802398q016223N66232J2704540J4360410
2241B8057592K881324j0011594j2919250o366482K095204P366315P311117N84254
$$ plain form
2233 18998480 9270327 -6112137 -18696584 -26462280 -33171605 -36593063 -26759053 -1620736
2225 -1620736 23395177 30483074 20259210 8804975 6192106 7278947 3951383 -3170501
2217 -3170501 -8856509 -11602987 -12458190 -10403287 -4854094 -441580 -3816961 -15488617
2209 -15488617 -27840890 -31621067 -23470047 -8383230 4177340 8570773 8468604 11290302
2201 11290302 16227103 13086097 -3007279 -21005297 -25064380 -13514615 819928 7531990
2193 7531990 7166326 3262126 -3441370 -9537173 -7932712 978791 5002041 -4693765
2185 -4693765 -19479535 -22853862 -10490195 7325406 20011496 24706433 22302705 15229591
2177 15229591 9319790 9353926 11871267 9768086 4061263 2808107 7910997 12193720
$$ packed form
2233A8998480r728153j5382464j2584447p765696o709325l421458R834010K5138317
2225a620736K5015913P087897j0223864j1454235k612869J086841l327564p121884
2217c170501n686008k746478q55203K054903N549193M412514l375381j1671656
2209a5488617j2352273l780177Q151020J5086817J2560570M393433j02169K821698
2201A1290302M936801l141006j6093376j7998018m059083J1549765J4334543O712062
2193G531990l65664l904200o703496o095803J604461Q911503M023250r695806
2185d693765j4785770l374327J2363667J7815601J2686090M694937k403728p073114
2177A5229591n909801L4136K517341k103181n706823j253156N102890M282723
$$ plain form
2169 12193720 11037681 7089109 897050 -12029212 -29519098 -38668498 -31411147 -15916638
2161 -15916638 -4307366 3053940 11385257 16947032 11226941 -3785875 -16452378 -20365748
2153 -20365748 -17890338 -10481428 2180093 12600069 8360519 -10124746 -25212356 -22244963
2145 -22244963 -6321284 7673835 13918664 15850476 14118954 6279010 -3419135 -5964148
2137 -5964148 -1514872 -900509 -8215832 -11366142 1232171 21088799 28666707 19776790
2129 19776790 9646685 8403472 6940608 -4276917 -15302461 -10847862 3039857 5136048
2121 5136048 -8853974 -19257371 -12235209 1251906 5739275 4478577 8237172 13312262
2113 13312262 8353419 -3920836 -9710579 -5702387 -799916 2379375 10447920 22392886
$$ packed form
2169A2193720j156039l948572o192059j2926262j7489886r149400P257351J5494509
2161a5916638J1609272P361306Q331317N561775n720091j5012816j2666503l913370
2153b0365748K475410P408910J2661521J0419976m239550j8485265j5087610K967393
2145b2244963J5923679J3995119O244829J931812j731522p839944r698145k545013
2137e964148M449276O14363p315323l150310J2598313J9856628P577908q889917
2129A9776790j0130105j243213j462864j1217525j1025544M454599J3887719K096191
2121E136048j3990022j0403397P022162J3487115M487369j260698L758595N075090
2113A3312262m958843j2274255n789743M008192M902471L179291Q068545J1944966
$$ plain form
2105 22392886 27148859 22378531 19231523 21717363 17474307 -740000 -18592258 -18450303
2097 -18450303 -3428171 10789457 19385356 28168964 36332083 37123048 33863644 37836670
2089 37836670 48192836 50275059 39105299 29292964 32692840 39249414 32838215 17342269
2081 17342269 11602359 21274460 30609051 24682100 7629035 -6948151 -14398693 -19498158
2073 -19498158 -23998042 -23469621 -16324372 -8504403 -6810313 -11832572 -19391592 -25395378
2065 -25395378 -26999312 -21927171 -9909995 5887221 20475708 29533373 30435891 23719463
2057 23719463 14959110 11979313 17073419 23957937 25532756 22610619 20792418 20139148
2049 20139148 13863211 -1189356 -17842141 -26234206 -25499001 -23229932 -23514069 -20204471
$$ packed form
2105B2392886M755973m770328l147008K485840m243056j8214307j7852258J41955
2097a8450303J5022132J4217628Q595899Q783608Q163119P90965l259404L973026
2089C7836670J0356166K082223j1169760r812335L399876O556574o411199j5495946
2081A7342269n739910R672101R334591n926951j7053065j4577186p450542n099465
2073a9498158m499884N28421P145249P819969J694090n022259p559020o003786
2065b5395378j603934N072141J2017176J5797216J4588487R057665R02518o716428
2057B3719463q760353k979797N094106O884518J574819k922137j818201o53270
2049B0139148o275937j5052567j6652785q392065P35205K269069k84137L309598
$$ plain form
2041 -20204471 -5564991 16118808 28716984 20966840 316653 -14441202 -13930237 -6873278
2033 -6873278 -7196694 -17789449 -30074501 -35080705 -30426504 -19621108 -9381246 -5286565
2025 -5286565 -5321315 -164291 14743177 30042640 32449793 22692971 15430513 20410563
2017 20410563 31420764 36074703 28989477 11932764 -11064269 -32342121 -40461210 -30325939
2009 -30325939 -12188815 -3587337 -11351058 -25729333 -32607522 -27673164 -17666212 -11067334
2001 -11067334 -9986307 -10496371 -9269336 -8344405 -12139387 -20489651 -27224271 -26548574 -18988547
1992 -18988547 -10181800 -5592924 -7069873 -12343621 -16654762 -16498147 -12595293 -8076630
1984 -8076630 -4791266 -4190443 -9699974 -21821116 -31059537 -24747836 -4899926 9498017
$$ packed form
2041b0204471J4639480K1683799J2598176p750144k0650187j4757855N10965P056959
2033f873278l23416j0592755j2285052n006204M654201J0805396J0239862M094681
2025e286565l4750N157024J4907468J5299463K407153r756822p262458M980050
2017B0410563J1010201M653939p085226j7056713k2997033k1277852q119089J0135271
2009c0325939J8137124Q601478p763721j4378275o878189M934358J0006952O598878
2001a1067334J081027n10064J227035R24931l794982q350264o734620O75697P560027
1992a8988547Q806747M588876j476949n273748m311141J56615L902854M518663
1984h076630L285364O00823n509531j2121142r238421O311701J9847910J4397943
$$ plain form
1976 9498017 5439796 -6413984 -7655197 -75787 -2719486 -21085093 -35760338 -28860493
1968 -28860493 -8229994 6407873 11630313 19361402 32453735 38687942 31438891 20772322
1960 20772322 16845611 14644823 5105740 -8160599 -15309864 -16900257 -20574770 -24486088
1952 -24486088 -18703405 -3883472 5502299 837375 -9598361 -14893340 -15947511 -18048191
1944 -18048191 -18262048 -9894680 6157057 23020820 36508780 45090175 45976017 38598758
1936 38598758 27902221 17828006 6798981 -3907753 -5043020 7320924 19977763
1929 19977763 16512597 -824095 -15230404 -17935150 -13919645 -8224997 -1384609 2520202
1921 2520202 -711726 -2272302 12850187 40718838 55090564 37504628 -152111 -30307673
$$ packed form
1976I498017m058221j1853780j241213P579410k643699j8365607j4675245O899845
1968b8860493K0630499J4637867N222440P731089J3092333O234207p249051j0666569
1960B0772322l926711k200788r539083j3266339p149265j590393l674513l911318
1952b4486088N782683J4819933R385771m664924j0435736n294979j054171k100680
1944a8048191k13857Q367368J6051737J6863763J3487960Q581395Q85842p377259
1936C8598758j0696537j0074215j1029025j0706734j135267J2363944J2656839
1929A9977763l465166j7336692j4406309k704746M015505N694648O840388L904811
1921B520202l231928j560576J5122489K7868651J4371726j7585936l7656739l0155562
$$ plain form
1913 -30307673 -37229173 -23850083 -2047169 14998249 18473956 10674474 2224372 -1051618
1905 -1051618 -2622462 -5391679 -7090765 -8059985 -12089773 -15567759 -8800885 5875193
1897 5875193 11099103 -1948289 -20029784 -27347671 -25109007 -20587147 -11217207 5153365
1889 5153365 16721971 12831627 3977747 8202830 23811797 34161308 34749382 35788545
1881 35788545 39643871 35572465 19223014 711157 -10103687 -12685758 -8288901 2714350
1873 2714350 13423113 13655687 4117708 -3829908 -4446601 -2473029 -1247398 1081364
1865 1081364 2388338 -2331055 -8482902 -5005759 6834023 12930997 9083501 8104706
1857 8104706 17134081 24033033 17262504 5807135 6220847 19269811 31807308 34920072
$$ packed form
1913c0307673o921500J3379090K1802914J7045418L475707p799482q450102l275990
1905a051618j570844k769217j699086r69220m029788l477986O766874J4676078
1897E875193N223910j3047392j8081495p317887K238664M521860R369940J6370572
1889E153365J1568606l890344q853880M225083J5608967J0349511N88074J039163
1881C5788545L855326m071406j6349451j8511857j0814844k582071M396857J1003251
1873B714350J0708763K32574r537979p947616o16693J973572J225631K328762
1865A081364J306974m719393o151847L477143J1839782O096974l847496r78795
1857H104706R029375O898952o770529j1455369M13712J3048964J2537497L112764
$$ plain form
1849 34920072 29387323 19226647 9912780 7750050 12000907 12973942 6365665 3072124
1841 3072124 14500626 33398059 40964697 30772312 15044295 7774067 10961878 18286755
1833 18286755 24162938 26265902 23928887 17216645 7252788 -2221264 -4906310 1838737
1825 1838737 10599832 10499459 2088930 -2685106 865518 1701435 -9359019 -23630131
1817 -23630131 -27587026 -24091784 -25859544 -31642384 -25847958 -4125437 15895600 16543225
1809 16543225 1908084 -11021013 -15376704 -18132564 -24169727 -27832413 -23304217 -15749643
1801 -15749643 -15318400 -22193131 -24756661 -15156357 -1054043 4142041 -259293 -1941558
1793 -1941558 5662081 13682176 11986711 5357522 6619194 16906446 22360688 12020803
$$ packed form
1849C4920072n532749j0160676r313867k162730M250857R73035o608277l293541
1841C072124J1428502J8897433P566638j0192385j5728017p270228L187811P324877
1833A8286755N876183K102964k337015o712242r963857r474052k685046O745047
1825A838737Q761095j00373q410529m774036L550624Q35917j1060454j4271112
1817b3630131l956895L495242j767760n782840N794426K1722521K0021037O47625
1809A6543225j4635141j2929097m355691k755860o037163l662686M528196P554574
1801a5749643M31243o874731k563530R600304J4102314N196084m401334j682265
1793a941558P603639Q020095j695465o629189J261672J0287252N454242j0339885
$$ plain form
1785 12020803 -7563474 -18931713 -11981673 6618314 20897015 21078612 11740204 4768074
1777 4768074 5583209 9117132 9008864 5528689 1675538 -3437736 -11754482 -19891881 -22250024
1768 -22250024 -19848357 -19654815 -24034226 -26897614 -23324747 -17867247 -17992713 -21999716
1760 -21999716 -20279971 -9723965 -644380 -4386217 -17188023 -23101136 -13554307 2175167
1752 2175167 9170697 4714840 -943941 1321192 10479668 20006584 26534603 31754930
1744 31754930 37290547 39254499 30142343 9478914 -8732329 -6546309 16861561 41365142
1736 41365142 47757593 36926356 22046422 10517059 3190625 3588690 13715128 23655095
1728 23655095 19428722 1860748 -13862527 -17980908 -14530360 -9938786 -5785225 -4980759
$$ packed form
1785A2020803j9584277j1368239O950040J8599987J4278701J81597r338408o972130
1777D768074Q15135L533923j08268l480175l853151n113274q316746q137399k358143
1768b2250024K401667J93542m379411k863388L572867N457500j25466m007003
1760b1999716J719745J0556006R079585l741837j2801806n913113R546829J5729474
1752B175167O995530m455857n658781K265133R158476R526916O528019N220327
1744C1754930N535617J963952r112156k0663429j8211243K186020K3407870K4503581
1736D1365142O392451j0831237j4879934j1529363p326434L98065J0126438R939967
1728B3655095m226373j7567974j5723275m118381L450548M591574M153561Q04466
$$ plain form
1720 -4980759 -12715706 -26654612 -36023246 -35007845 -29484273 -27837259 -32370330 -40542185
1712 -40542185 -46507494 -41929192 -25066897 -8322923 -5718082 -13746231 -16970267 -11597704
1704 -11597704 -9204303 -16579686 -26261192 -28363807 -19203200 37021 19545233 21697157
1696 21697157 3844246 -7989418 7897570 32610662 35740892 29315280 47297854
1689 47297854 78998560 86222953 93425098 179287373 338536847 431249303 344582899
1682 344582899 152170480 25841489 21006502 44169886 20057634 -15424190 -10683590
1675 -10683590 9275086 -1555232 -27972268 -25914584 3268645 23328572 21419380
1668 21419380 11413628 -1071405 -17544458 -25623157 -13806367 4465796 10658951
$$ packed form
1720d980759p734947j3938906r368634J015401N523572J647014m533071q171855
1712d0542185n965309M578302J6862295J6743974K604841q028149l224036N372563
1704a1597704K393401p375383r681506k102615R160607J9240221J9508212K151924
1696B1697157j7852911j1833664J5886988K4713092L130230o425612J7982574
1689D7297854L1700706P224393P202145Q5862275J59249474R2712456q6666404
1682C44582899j92412419j26328991m834987K3163384k4112252l5481824M740600
1675a0683590J9958676j0830318k6417036K057684K9183229K0059927j909192
1668B1419380j0005752j2485033j6473053q078699J1816790J8272163O193155
$$ plain form
1661 10658951 12165204 25261305 40243034 34017934 8659326 -11782848 -17454069 -19018356
1653 -19018356 -21960447 -20294031 -14735550 -14109451 -17795517 -16009168 -8038517 -3417565
1645 -3417565 -5361734 -8261042 -10039219 -12324656 -11011245 -1970115 6232516 856425
1637 856425 -15317183 -27093580 -28237069 -24713870 -19153224 -8499220 2705658 3280028
1629 3280028 -6911814 -14102773 -10062703 -3059774 -4255390 -11982397 -15275424 -8172518
1621 -8172518 3516669 8221532 1019054 -9800864 -11988315 -5397664 -1781754 -6800614
1613 -6800614 -12099417 -9772710 -3881019 -1028774 -488331 -1142506 -6297190 -13162532 -11185759
1604 -11185759 -1198867 -792051 -16981956 -29820119 -21148563 -4346942 -3522083 -16043601
$$ packed form
1661A0658951J506253J3096101J4981729o225100k5358608k0442174n671221j564287
1653a9018356k942091J666416N558481O26099l686066J786349P970651M620952
1645c417565j944169k899308j778177k285437J313411R041130Q202631n376091
1637H56425j6173608j1776397j143489L523199N560646J0654004J1204878N74370
1629C280028j0191842p190959M040070P002929j195616p727007l293027P102906
1621h172518J1689187M704863p202478j0819918k187451O590651L615910n018860
1613f800614n298803K326707N891691K852245N40443o54175n154684o865342J976773
1604a1185759R986892M06816j6189905j2838163Q671556J6801621Q24859j2521518
$$ plain form
1596 -16043601 -20751202 -13445055 -6945381 -2440590 10219658 26094056 28268821 18942863
1588 18942863 19078163 32247564 36150516 18505787 -3575217 -10982534 -7488235 -5077565
1580 -5077565 -3575126 1458482 5296324 1352965 -8135569 -16756009 -20006989 -14059109
1572 -14059109 -1227108 2676898 -16073921 -44083892 -51503973 -31675829 -8176887
1565 -8176887 2858341 11641058 26151616 32545672 21416787 9137939 11421674 15678873
1557 15678873 2962550 -19214577 -30133702 -28115100 -24821981 -18832731 -983466 21448451
1549 21448451 31491781 29246607 28373035 29238757 19568372 1041902 -8694406 -3607742
1541 -3607742 2281296 -1201007 -6550314 -4299675 3288045 9639293 11269281 4089349
$$ packed form
1596a6043601m707601P306147O499674M504791J2660248J5874398K174765r325958
1588A8942863J35300J3169401L902952j7644729k2081004p407317L494299K410670
1580e077565J502439N033608L837842l943359r488534q620440l250980N947880
1572a4059109J2832001L904006j8750819k8009971p420081J9828144K3498942
1565h176887J1035228Q782717J4510558O394056j1128885j2278848K283735M257199
1557A5678873j2716323k2177127j0919125K018602L293119N989250J7849265K2431917
1549B1448451J0043330k245174q73572Q65722r670385j8526470r736308N086664
1541c607742N889038l482303n349307K250639P587720O351248J629988p179932
$$ plain form
1533 4089349 -13392449 -29261355 -25584326 -2725537 17014720 16878216 5000720 -559668
1525 -559668 5011222 13157519 15860020 11261745 1964563 -5158665 -2660287 8246636
1517 8246636 16795874 15512968 9127406 6432518 8001740 6862431 -1380887 -12680095
1509 -12680095 -17572050 -9453068 8063874 22945227 26652971 21794171 14432651 4399201
1501 4399201 -9055936 -17810810 -13800655 -5426538 -10708636 -31903144 -50201943 -49990981
1493 -49990981 -36101423 -21334851 -9203070 2078364 8380764 3804353 -8652648
1486 -8652648 -19577297 -24008361 -24106932 -23852265 -25594161 -28976406 -30320880 -26762804 -22376975
1477 -22376975 -24218583 -30795609 -32674746 -27441865 -24369767 -29073536 -33634093 -29669057
$$ packed form
1533D089349j7481798j5868906L677029K2858789J9740257j36504j1877496n560388
1525e59668N570890Q146297K702501m598275r297182p123228K498378J0906923
1517H246636Q549238j282906o385562k694888J569222j139309q243318j1299208
1509a2680095m891955Q118982J7516942J4881353L707744m858800p361520j0033450
1501D399201j3455137q754874M010155Q374117n282098k1194508j8298799K10962
1493d9990981J3889558J4766572J2131781J1281434O302400m576411j2457001
1486h652648j0924649m431064r8571K54667j741896l382245j344474L558076M385829
1477b2376975j841608o577026j879137N232881L072098m703769m560557L965036
$$ plain form
1469 -29669057 -22032212 -19906295 -21790699 -19867714 -13512793 -8118845 -5608943 -6455395
1461 -6455395 -15719775 -35072206 -52961804 -55841066 -46727090 -39305571 -35561890 -24817436
1453 -24817436 -5927394 6459295 3536541 -4638285 -6455973 -6489178 -14523714 -26219799
1445 -26219799 -28329192 -19092648 -10792038 -11920236 -16682305 -14633396 -4199670 6391009
1437 6391009 8201819 -301048 -12399945 -19443169 -18294207 -11676171 -1889719 11385920
1429 11385920 25114122 30300415 21521599 6835427 1317688 9505399 19418834 17178220
1421 17178220 4677023 -1844741 8214344 24947193 27991879 11583728 -7081153
1414 -7081153 -9415516 669237 4220678 -4277900 -9630522 -497688 12507884 12747824
$$ packed form
1469b9669057P636845K125917j884404J922985O354921N393948K509902q46452
1461f455395r264380j9352431j7889598k879262R113976P421519L743681J0744454
1453b4817436J8890042J2386689k922754q174826j817688l3205q034536j1696085
1445b6219799k109393R236544Q300610j128198m762069K048909J0433726J0590679
1437F391009J810810q502867j2098897p043224J148962O618036R786452J3275639
1429A1385920J3728202N186293q778816j4686172n517739Q187711R913435k240614
1421A7178220j2501197o521764J0059085J6732849L044686j6408151j8664881
1414g081153k334363J0084753L551441q498578n352622R132834J3005572K39940
$$ plain form
1406 12747824 1587754 -5731856 -2269679 5296429 10349144 12563690 11234563 4758726
1398 4758726 -1891703 -660956 5993135 5864104 -4704889 -13539328 -9161567 4140532
1390 4140532 13799138 13822632 5924718 -6772620 -19536293 -25191960 -21474552 -15817522
1382 -15817522 -16596268 -22974235 -28659729 -31294323 -32074685 -30339585 -25345192 -20238756
1374 -20238756 -17857431 -15201609 -7763903 3217220 12508586 16559047 13819019 5088379
1366 5088379 -2127678 2182631 14987400 18126888 1984505 -17824620 -20711071 -9775263
1358 -9775263 -3571602 -5897342 -4661640 1453455 -1277543 -15414842 -24354198 -18749068
1350 -18749068 -10579025 -10376624 -10447878 -4950299 -7440712 -28620661 -51227075 -50078222
$$ packed form
1406A2747824j1160070p319610L462177P566108N052715K214546j329127o475837
1398D758726o650429J230747O654091j29031j0568993q834439M377761J3302099
1390D140532R658606K3494p897914j2697338j2763673n655667L717408N657030
1382a5817522p78746o377967n685494k634594p80362J735100M994393N106436
1374b0238756K381325K655822P437706J0981123R291366M050461k740028q730640
1366E088379p216057M310309J2804769L139488j6142383j9809125k886451J0935808
1358i775263O203661k325740J235702O115095k730998j4137299q939356N605130
1350a8749068Q170043K02401p1254N497579k490413k1179949k2606414J148853
$$ plain form
1342 -50078222 -28428311 -11647619 -9914872 -10207038 -3660754 2717808 4735095 9354944
1334 9354944 17423449 17477986 6101241 -2908025 -954819 -273812 -13104549 -29221463
1326 -29221463 -31847342 -25810813 -29275390 -42023886 -43737044 -25927453 -5690283 -151724
1318 -151724 -3645859 -1671525 4932693 4345813 -4670803 -10958543 -9416816 -7715516 -12068482
1309 -12068482 -17261622 -15749402 -8792505 -3076766 -1814417 -4193620 -9149447 -14892554
1301 -14892554 -18304257 -18838787 -19368041 -19873398 -15567333 -5726432 1941966 2421250 2633129
1292 2633129 10509664 20049621 18731402 6849678 -3268914 -6505302 -9634924 -15245433
1284 -15245433 -15816184 -9195625 -5960028 -12643347 -19604590 -16543047 -10237450 -13701748
$$ packed form
1342e0078222K1649911J6780692J732747k92166O546284O378562K017287M619849
1334I354944Q068505N4537j1376745r009266J953206O81007j2830737j6116914
1326b9221463k625879O036529l464577j2748496j713158J7809591K0237170N538559
1318a51724l494135J974334O604218n86880r016616o287740J541727J701300m352966
1309a2068482n193140J512220O956897N715739J262349k379203m955827n743107
1301a4892554l411703n34530n29254n05357M306065R840901P668398M79284K11879
1292B633129P876535R539957j318219j1881724j0118592l236388l129622n610509
1284a5245433n70751O620559L235597o683319o961243L061543O305597l464298
$$ plain form
1276 -13701748 -24410224 -27762352 -19496270 -10643518 -9181729 -9114886 -2388614 6990649
1268 6990649 7277377 -5781194 -22593816 -28833117 -19857963 -5088584 3299465 4097842
1260 4097842 4677140 6329607 1219323 -13183525 -26607442 -29560609 -25980412 -24306821
1252 -24306821 -23822101 -19407172 -12607704 -7084642 -45116 9189156 9223720 -8275994
1244 -8275994 -27876446 -24439248 1171241 19708521 11833342 -9089321 -20382111 -19347442
1236 -19347442 -17037150 -16145196 -10463640 673332 11055542 17317934 19748567 16795799
1228 16795799 8073706 -319001 -2376573 -1158783 -2331340 -1651741 10648897 33314923
1220 33314923 51966187 55889867 49184772 42188420 38287127 33480148 24914317 15172961
$$ packed form
1276a3701748j0708476l352128Q266082Q852752J461789O6843O726272R379263
1268F990649K86728j3058571j6812622o239301Q975154J4769379Q388049P98377
1260D097842N79298J652467n110284j4402848j3423917k953167L580197J673591
1252b4306821M84720M414929O799468N523062P039526R234272L4564j7499714
1244h275994j9600452L437198K5610489J8537280p875179k0922663j1292790J034669
1236a9347442K310292Q91954N681556J1136972J0382210O262392K430633k952768
1228A6795799q722093q392707k057572J217790j172557O79599J2300638K2666026
1220C3314923J8651264L923680o705095o996352l901293m806979q565831r741356
$$ plain form
1212 15172961 8825253 7113040 6715736 4121983 887265 1905750 7206639 9679356
1204 9679356 5215112 1385500 8635680 23565762 29600253 17726933 -285784 -5292098
1196 -5292098 6753579 22303730 27804127 22096547 11318344 206375 -7526495 -7592924
1188 -7592924 -1153680 2068667 -5049712 -15428696 -16665837 -10277027 -10365393 -20655041
1180 -20655041 -25590427 -11946121 11054792 23792884 20947748 12230799 4019042 -5468981
1172 -5468981 -14260740 -14592755 -5801298 2355157 3250233 477513 -2376982 -8851829 -20803841
1163 -20803841 -31561215 -35168343 -35477812 -38556344 -41876880 -39079669 -30917010 -22748950
1155 -22748950 -14013664 191154 16631372 21929148 7528019 -17671681 -34236703
$$ packed form
1212A5172961o347708j712213l97304k593753l234718J018485N300889K472717
1204I679356m464244l829612P250180J4930082O034491j1873320j8012717n006314
1196e292098J2045677J5550151N500397n707580j0778203j1111969p732870o6429
1188g592924O439244L222347p118379j0378984j237141O388810q8366j0289648
1180b0655041m935386J3644306K3000913J2738092k845136q716949q211757r488023
1172e468981q791759l32015Q791457Q156455Q95076k772720k854495o474847j1952012
1163b0803841j0757374l607128l09469l078532l320536K797211Q162659Q168060
1155b2748950Q735286J4204818J6440218N297776j4401129k5199700j6565022
$$ plain form
1148 -34236703 -30960211 -14319650 119524 2949278 -3161467 -9439691 -9016255 -322360
1140 -322360 12163434 19870020 18464807 15450341 21856593 33383128 30126911 3010829
1132 3010829 -29102059 -40448364 -28956732 -11828040 2515524 19128945 35636678
1125 35636678 38709017 26489522 15084345 14081164 12850819 2332973 -5299266 6276348
1117 6276348 31727887 50762503 53955244 48491395 43143608 39727878 36147271 27982850
1109 27982850 10661015 -11598682 -24328605 -19361876 -7114196 -2730806 -6309115 -8003806
1101 -8003806 -6416529 -8142805 -12971024 -14192374 -12550968 -16055229 -25191822 -30971137
1093 -30971137 -29328455 -25635017 -22613434 -15604606 -3861053 4620029 5905031 8784351
$$ packed form
1148c4236703L276492J6640561J4439174K829754o110745o278224M23436Q693895
1140c22360J2485794P706586j405213l014466O406252J1526535l256217k7116082
1132C010829l2112888j1346305J1491632J7128692J4343564J6613421J6507733
1125C5636678L072339j2219495j1405177j003181j230345j0517846p632239J1575614
1117F276348K5451539J9034616L192741n463849n347787l415730l580607q164421
1109B7982850j7321835k2259697j2729923M966729J2247680M383390l578309j694691
1101h003806J587277j726276m828219j221350J641406l504261r136593n779315
1093c0971137J642682L693438L021583P008828J1743553Q481082J285002K879320
$$ plain form
1085 8784351 22338701 40079020 45137868 30749437 9616676 699311 9000506 21185274
1077 21185274 21394485 7985098 -8441532 -19791229 -26039549 -27854840 -23940148 -17732599
1069 -17732599 -16391732 -19086779 -16558323 -7167749 -1876352 -6707395 -12890924 -13196207
1061 -13196207 -14345470 -21487813 -24804038 -17373975 -12592333 -23497494 -35918642 -26093683
1053 -26093683 2135712 23148075 28237702 30830296 33461206 20122175 -10822551 -34070979
1045 -34070979 -31185366 -14667869 -4167252 1120458 10068905 17541060 14157457 5956029
1037 5956029 5389254 10486303 9721474 2280378 -1460123 3448239 11554144 16405094 15843082
1028 15843082 11068083 7568470 12042922 21624241 22748807 8398705 -10743148 -20850896
$$ packed form
1085H784351J3554350J7740319N058848j4388431k1132761q917365Q301195J2184768
1077B1185274K09211j3409387j6426630j1349697o248320j815291L914692O207549
1069a7732599J340867k695047K528456R390574N291397m831043o183529l05283
1061a3196207j149263p142343l316225P430063M781642j0905161j2421148R824959
1053b6093683K8229395K1012363N089627K592594K630910j3339031l0944726k3248428
1045c4070979K885613J6517497J0500617N287710Q948447P472155l383603q201428
1037E956029n66775N097049p64829p441096l740501M908362Q105905M850950n62012
1028A5843082m774999l499613M474452R581319J124566j4350102j9141853j0107748
$$ plain form
1020 -20850896 -22771281 -24760561 -24720757 -13294037 8167772 25537382 28933847 22867731
1012 22867731 17341856 14410933 6080492 -15025073 -42503763 -57076373 -47444710 -27591636
1004 -27591636 -21518691 -30923442 -33822820 -19103171 -3508717 -3994364 -11610389 -9198838
996 -9198838 -35423 1469417 -2738461 1541369 13953672 18083194 6435027 -10589311
988 -10589311 -21026138 -21551839 -12355093 2362493 9169964 -2795470 -23463363 -31030863
980 -31030863 -21480650 -13078177 -18568114 -29575405 -34253444 -34336357 -35662227 -34817879 -26220983
971 -26220983 -14289198 -8822278 -12405400 -18044811 -16170836 -2799336 14037943 17684305
963 17684305 1885283 -15488908 -11033420 11681105 24436253 12829139 -5733746
$$ packed form
1020b0850896j920385j989280L9804J1426720K1461809J7369610L396465o066116
1012B2867731n525875k930923q330441k1105565k7478690j4572610R631663J9853074
1004b7591636O072945r404751k899378J4719649J5594454m85647p616025K411551
996i198838R163415J504840m207878M279830J2412303M129522j1648167j7024338
988a0589311j0436827n25701R196746J4717586O807471j1965434k0667893p567500
980c1030863R550213Q402473n489937j1007291m678039q2913j325870Q44348Q596896
971b6220983J1931785N466920l583122n639411J873975J3371500J6837279L646362
963A7684305j5799022j7374191M455488K2714525J2755148j1607114j8562885
$$ plain form
956 -5733746 -10835407 -7241350 -9473503 -13372909 -3640498 17191021 27657597 15448163
948 15448163 -8774284 -27657612 -35159039 -35794181 -36140457 -40417471 -46945691 -46741858
940 -46741858 -32503390 -10591691 3165731 1840308 -5598431 -8661098 -9164681 -15122399
932 -15122399 -26909900 -37713800 -45313954 -54483099 -65958299 -70900605 -62039213 -45696989
924 -45696989 -35009660 -32426439 -27636300 -15122907 -4683643 -7508900 -18260256 -20864216
916 -20864216 -9514782 6203947 16787141 22667819 26030534 23397561 13083791 2718998
908 2718998 1000220 5304063 4733338 -5584231 -18723581 -24315812 -18658320 -6353561
900 -6353561 4910696 10105819 8955317 4169783 -713103 -1817728 2878389 8750195
$$ packed form
956e733746n101661L594057k232153l899406R732411K0831519J0466576j2209434
948A5448163k4222447j8883328p501427o35142l46276m277014o528220K03833
940d6741858J4238468K1911699J3757422j325423p438739l062667n03583n957718
932a5122399j1787501j0803900p600154r169145j1475200m942306Q861392J6342224
924d5696989J0687329K583221M790139J2513393J0439264k825257j0751356k603960
916b0864216J1349434J5718729J0583194N880678L362715k632973j0313770j0364793
908B718998j718778M303843n70725j0317569j3139350n592231N657492J2304759
900f353561J1264257N195123j150502m785534m882886j104625M696117N871806
$$ plain form
892 8750195 5919874 -8599831 -23078224 -23406598 -11799587 -3542502 -5119188 -7514952
884 -7514952 -4403039 -3504884 -11491254 -19124834 -13833583 193750 7732148 4374991
876 4374991 -324665 122015 1954222 1910811 2842386 4991333 2194800 -7824361 -17635147
867 -17635147 -20509344 -20010333 -22738396 -26735710 -24502372 -14898684 -5127723 -1265010
859 -1265010 -2080975 -2802235 -1180548 1040929 288771 -5378540 -12864918 -14715246 -6459594
850 -6459594 6297145 11700384 4646628 -6615349 -9797689 -2868361 4563292 3535156
842 3535156 -5075160 -14699478 -21329947 -23924945 -20916382 -12807674 -6566586 -9704613
834 -9704613 -18508069 -19535487 -7036939 7207158 7959136 -3373747 -10789138 -5222941
$$ packed form
892H750195k830321j4519705j4478393l28374J1607011Q257085j576686k395764
884g514952L111913Q98155p986370p633580N291251J4027333P538398l357157
876D374991m699656M46680J832207m3411R31575K148947k796533j0019161r810786
867a7635147k874197M99011k728063l997314K233338R603688R770961L862713
859a265010q15965p21260J621687K221477p52158n667311p486378j850328Q255652
850f459594J2756739N403239p053756j1261977l182340O929328P431653j028136
842C535156q610316r624318o630469k594998L008563Q108708O241088l138027
834i704613q803456j027418J2498548J4244097P51978j1332883p415391N566197
$$ plain form
826 -5222941 4408447 4999347 -2660901 -6597984 -2098956 862343 -7803164 -21701211
818 -21701211 -23309019 -6010549 16126237 24431819 16451199 4841061 -814574 -2477568
810 -2477568 -4248488 -4071066 1029564 8488255 14471605 19485632 24245068 24798606 18409581
801 18409581 10305799 6720919 3922235 -6679814 -22950711 -31195815 -23395291 -7232831
793 -7232831 4683023 8492380 7619057 4712448 1685063 2622736 8882388 14248798 12703936
784 12703936 9162017 13890463 26076741 31961684 22430693 4848957 -7341693 -10503092
776 -10503092 -10370660 -11022246 -11915974 -13019972 -14899386 -14606174 -9056786 -2560159 -3207759
767 -3207759 -10574891 -15277923 -13730005 -14798752 -26050255 -40475294 -44731596 -36225057
$$ packed form
826e222941R631388N90900p660248l937083M499028K961299q665507j3898047
818b1701211j607808J7298470K2136786Q305582p980620j1610138n655635j662994
810b477568j770920J77422N100630P458691N983350N014027M759436N53538o389025
801A8409581q103782l584880k798684j0602049j6270897q245104P800524J6162460
793g232831J1915854L809357q73323k906609l027385R37673O259652N366410j544862
784A2703936l541919M728446J2186278N884943r530991j7581736j2190650l161399
776a0503092J32432o51586q93728j103998j879414K93212N549388O496627o47600
767c207759p367132m703032J547918j068747j1251503j4425039m256302Q506539
$$ plain form
759 -36225057 -24281468 -17289492 -16153054 -18145085 -19239514 -13860041 -679246 11239826
751 11239826 10493255 -895329 -7739823 -900250 10456836 9913229 -7576831 -31375862
743 -31375862 -45404557 -40420805 -20874906 -2399312 1689843 -6443416 -13964587 -16163624
735 -16163624 -22292911 -38256386 -52316299 -47774675 -25790542 -5156774 678043 -2464248
727 -2464248 -1002868 8018552 15084208 11472935 -802660 -12717978 -18679677 -20731587
719 -20731587 -22836162 -24161924 -20799504 -12959363 -6835011 -8148977 -15535526 -20981686
711 -20981686 -16509584 -2193166 11124522 10646400 -3268790 -14778326 -10924386 1829378
703 1829378 7271070 1425253 -6190582 -10023590 -11944116 -7124695 14422289 45031022
$$ packed form
759c6225057J1943589O991976J136438j992031j094429N379473J3180795J1919072
751A1239826p46571j1388584o844494O839573J1357086n43607j7490060k3799031
743c1375862j4028695M983752J9545899J8475594M089155q133259p521171k199037
735a6163624o129287j5963475j4059913M541624K1984133K0633768N834817l142291
727b464248J461380R021420P065656l611273j2275595j1915318n961699k051910
719b0731587k104575j325762L362420P840141O124352j313966p386549n446160
711b0981686M472102J4316418J3317688m78122j3915190j1509536L853940J2753764
703A829378N441692n845817p615835l833008j920526M819421K1546984L0608733
$$ plain form
695 45031022 56603449 34280240 -974176 -18722715 -16197698 -11903324 -13070970 -11940143
687 -11940143 -9146759 -15992810 -31283568 -38213158 -30593306 -22664735 -24275568 -24380945
679 -24380945 -11049869 7428307 15838620 14991320 16174140 20900754 21916969 19494245
671 19494245 21042380 25762588 23909581 12916469 2408605 71673 1981753 468022
663 468022 -6018598 -13960437 -18889488 -15812295 -2631036 13369102 19268385 11154274
655 11154274 -1130634 -8321998 -13281746 -20879401 -23943182 -12138359 7467759 13452066
647 13452066 -2026397 -20560135 -21026757 -6657093 2227150 -3453393 -13435311 -16684851
639 -16684851 -14707141 -13401126 -13140890 -13045238 -16621213 -25819343 -34935675 -37159611 -33534282
$$ packed form
695D5031022J1572427k2323209l5254416j7748539K525017M294374j167646J130827
687a1940143K793384o846051j5290758o929590P619852P928571j610833j05377
679b4380945J3331076J8478176Q410313q47300J182820M726614J016215k422724
671A9494245J548135M720208j853007j0993112j0507864k336932J910080j513731
663D68022o486620p941839m929051L077193J3181259J6000138N899283q114111
655A1154274j2284908p191364m959748p597655l063781J1804823J9606118N984307
647A3452066j5478463j8533738m66622J4369664Q884243n680543r981918l249540
639a6684851J977710J306015K60236R5652l575975r198130r116332k223936L625329
$$ plain form
630 -33534282 -30068200 -29365357 -29650555 -28442909 -23278709 -13293226 -3833990 -3529155 -12151647
621 -12151647 -18677483 -17442180 -17158726 -24272739 -26572388 -8165922 24097029 45474114
613 45474114 44065678 31635676 22348937 15737078 5431313 -7987533 -19219418 -24117226
605 -24117226 -19174343 -4264947 11269053 15721052 11100021 10434829 16062903 15153419
597 15153419 2701533 -7049401 -2278464 8107321 10797728 9271531 12826431 15879259
589 15879259 7211105 -7625919 -13200292 -9521042 -10237101 -16630730 -14363661 548271
581 548271 12299986 9137903 -62160 -2260321 934293 1636812 1045200 4217203 7999334
572 7999334 6374307 2171170 2230941 5069710 4054600 -35495 -249481 3815935 4501562
$$ packed form
630c3534282L466082P02843k85198J207646N164200R985483R459236L04835q622492
621a2151647o525836J235303K83454p114013k299649J8406466L2262951K1377085
613D5474114j408436j2430002r286739o611859j0305765j3418846j1231885m897808
605b4117226M942883J4909396J5534000M451999m621031o65192N628074r09484
597A5153419j2451886r750934M770937J0385785K690407j526197L554900L052828
589A5879259q668154j4837024n574373L679250p16059o393629K267069J4911932
581E48271J1751715l162083r200063k198161L194614P02519n91612L172003L782131
572G999334j625027m203137N9771K838769j015110m090095k13986M065416O85627
$$ plain form
563 4501562 -1814815 -9317522 -11196844 -7139706 -1084020 2812405 978247 -7079901
555 -7079901 -15753126 -18005476 -14033771 -9720441 -5979037 2568914 15523478 22029971
547 22029971 14765166 2084406 -2170344 3340519 8898969 10215492 12215226 16120604
539 16120604 15116594 7745935 4612813 12790707 21202176 12976302 -10600357 -29534781
531 -29534781 -29110947 -15342766 -4368181 -4289029 -11194069 -16893007 -15471754 -5641198
523 -5641198 8683221 20806895 26107306 23798556 14763119 1341046 -10452529 -13337479
515 -13337479 -6070712 4171620 8343379 2878362 -8781878 -18612544 -19005443 -10255442
507 -10255442 -2321328 -3139325 -6026257 2931164 24052816 40566954 39725469 27877289
$$ packed form
563D501562o316377p502707j879322M057138O055686L896425j834158q058148
555g079901q673225k252350L971705M313330L741404Q547951J2954564O506493
547B2029971p264805j2680760m254750N510863N558450J316523J999734L905378
539A6120604j004010p370659l133122Q177894Q411469q225874k3576659j8934424
531b9534781M23834J3768181J0974585P9152o905040n698938J421253R830556
523e641198J4324419J2123674N300411k308750r035437j3422073j1793575k884950
515a3337479P266767J0242332M171759n465017j1660240r830666l92899Q750001
507a0255442P934114q17997k886932Q957421K1121652J6514138q41485j1848180
$$ plain form
499 27877289 18800548 16316199 16599056 19786716 28811574 41029857 50235962 54074420
491 54074420 52336519 42589547 25709156 10663276 4005976 -870793 -13004741 -26462857
483 -26462857 -26927505 -14140077 -3763323 -5442246 -12047713 -13826890 -10998964 -7594600
475 -7594600 -3721039 179832 364497 -3271566 -4902228 -1924133 1219619 1921996 3189190
466 3189190 4630324 160086 -9405682 -12219570 -2056115 10428523 12217242 4932314
458 4932314 -2384054 -8220264 -14101496 -13375156 286041 17830226 23872888 18795412
450 18795412 16487270 20459922 18718450 5728083 -6468461 -6653933 -1406364 -4008061
442 -4008061 -14780940 -21918381 -17091241 -3235726 9274095 9458095 -5884343 -25497942
$$ packed form
499B7877289r076741k484349K82857L187660R024858J2218283R206105L838458
491E4074420j737901r746972j6880391j5045880o657300m876769j2133948j3458116
483b6462857m64648J2787428J0376754j678923o605467j779177K827926L404364
475g594600L873561L900871J84665l636063j630662K978095L143752P02377J267194
466C189190J441134m470238r565768k813888J0163455J2484638J788719p284928
458D932314p316368n836210n881232P26340J3661197J7544185O042662n077476
450A8795412k308142L972652j741472j2990367j2196544j85472N247569k601697
442d008061j0772879p137441M827140J3855515J2509821J84000j5342438j9613599
$$ plain form
434 -25497942 -31246014 -18386650 -2609023 -82174 -6524717 -5477480 6695749 15543925
426 15543925 8612649 -9125537 -23236378 -26246450 -21739534 -16109161 -10731735 -2190917
418 -2190917 10960344 22626848 23304082 11721308 -1229430 -4241403 1735289 7260675
410 7260675 7159112 2722636 -5394640 -16672438 -23838007 -17595193 -975874 11069990
402 11069990 10671972 6018810 5874523 5373588 -3917841 -18361412 -27958710 -31823433 -35670390
393 -35670390 -37603299 -30060384 -15643350 -7592708 -11350486 -16937177 -14290315 -6482565
385 -6482565 -1896360 -1287445 613388 6138490 13195802 18560282 18361241 9912894 -2940722
376 -2940722 -11283936 -11986894 -11869271 -16929954 -23490161 -25226076 -22799437 -20126198 -16915252
$$ packed form
434b5497942n748072J2859364J5777627K526849o442543J047237J2173229Q848176
426A5543925o931276j7738186j4110841l010072M506916N630373N377426Q540818
418b190917J3151261J1666504O77234j1582774j2950738l011973N976692N525386
410G260675j01563m436476q117276j1277798p165569O242814J6619319J2045864
402A1069990l98018m653162j44287n00935r291429j4443571r597298l864723l846957
393c5670390j932909P542915J4417034Q050642l757778n586691K646862P807750
385f482565M586205O08915J900833N525102P057312N364480j99041q448347j2853616
376b940722q343214p02958J17623n060683o560207j735915K426639K673239L210946
$$ plain form
367 -16915252 -12302728 -10687050 -15732536 -22829551 -25717484 -26206919 -28305492 -27427453 -16881757
358 -16881757 -2157970 3921939 -407352 -4934893 -5234046 -7544522 -13319871 -13548833
350 -13548833 -4864701 1920777 -1437799 -6277874 -346094 13085950 21529947 22636126
342 22636126 24203214 27930472 26565733 18069801 10803626 10616388 11585483 5331362 -5668856
333 -5668856 -10019829 -1439983 12744940 18110090 7909839 -9288524 -18617907 -15532181
325 -15532181 -9396445 -8867087 -9913996 -4444904 3875031 2021694 -14183188 -33035136
317 -33035136 -41134007 -38193869 -33882085 -34837577 -39425479 -42354801 -39931830 -31838280
309 -31838280 -21172042 -12748123 -9534368 -10872422 -14791138 -20635418 -27963975 -33893642
$$ packed form
367a6915252M612524J615678n045486p097015k887933m89435k098573Q78039J0545696
358a6881757J4723787O079909m329291m527541k99153k310476n775349k28962
350a3548833Q684132O785478l358576m840075N931780J3432044Q443997J106179
342B2636126J567088L727258j364739q495932p266175j87238R69095o254121j1000218
333e668856m350973Q579846J4184923N365150j0200251j7198363r329383L085726
325a5532181O135736N29358j046909N469092Q319935j853337j6204882j8851948
317c3035136q098871K940138M311784r55492m587902k929322K422971Q093550
309c1838280J0666238Q423919L213755j338054l918716n844280p328557n929667
$$ plain form
301 -33893642 -33629202 -24745511 -11357119 -3424506 -9189516 -25866095 -39630824 -38719387
293 -38719387 -26217854 -16003486 -16138792 -21359778 -23219772 -21535842 -21538482 -24230260 -25423516
284 -25423516 -22371281 -16411412 -10497902 -8467062 -14313313 -26162563 -32953121 -25278893
276 -25278893 -9721797 -3227056 -10640756 -17738217 -12414838 -2951663 -4758125 -15921447
268 -15921447 -20093553 -12195919 -6554751 -15319883 -30839095 -37157385 -30902457 -22004938
260 -22004938 -18344772 -18249243 -16915054 -13679034 -11893374 -14138916 -17456251 -13910366 -30358
251 -30358 14449831 14906921 1674432 -7394429 -296823 11992476 10965716 -4249052
243 -4249052 -18703932 -23061429 -19795429 -11424615 1947575 13017851 11002306 -752761
$$ packed form
301c3893642K64440Q883691J3388392P932613n765010j6676579j3764729R11437
293c8719387J2501533J0214368j35306n220986j859994J683930k640k691778j193256
284b5423516L052235N959869N913510K030840n846251j1849250o790558P674228
276b5278893J5557096O494741p413700p097461N323379R463175j806462j1163322
268a5921447m172106P897634N641168q765132j5519212o318290O254928Q897519
260b2004938L660166R5529J334189L236020J785660k245542l317335L545885J3880008
251c0358J4480189M57090j3232489r068861P097606J2289299j026760j5214768
243d249052j4454880m357497L266000Q370814J3372190J1070276k015545j1755067
$$ plain form
235 -752761 -4874243 5840764 16707314 11872005 -4046788 -15172814 -16803951 -16957723
227 -16957723 -20171074 -21001820 -12960310 3810593 23583255 38801317 44170421 40922397
219 40922397 34935689 28360993 18145677 6279812 3936272 17555419 35967857 40805412
211 40805412 27911049 10566254 2552451 5026255 9441779 6793620 -6147949 -24154003
203 -24154003 -36502116 -36450510 -27333370 -16750641 -7764919 302420 6590045 10294146
195 10294146 14258625 20284388 23558740 18896781 10263807 6228098 7197280 5351015
187 5351015 -2617870 -10430108 -11371883 -6575152 -2684050 -5237637 -13951391 -20852184 -15693822
178 -15693822 1399007 15864236 14120794 -108473 -12780238 -18948297 -24394497 -30296868
$$ packed form
235g52761m121482J0715007J0866550m835309j5918793j1126026j631137j53772
227a6957723l213351q30746Q041510J6770903J9772662J5218062N369104l248024
219D0922397n986708o574696j0215316j1865865k343540J3619147J8412438M837555
211D0805412j2894363j7344795q013803K473804M415524k648159j2941569j8006054
203b4154003j2348113N1606R117140J0582729Q985722Q067339O287625L704101
195A0294146L964479O025763L274352m661959q632974m035709R69182j846265
187E351015p968885p812238r41775M796731L891102k553587q713754o900793N158362
178a5693822J7092829J4465229j743442j4229267j2671765o168059n446200n902371
$$ plain form
170 -30296868 -29815027 -21718669 -14721178 -13800418 -12869598 -6393823 778246 850584 -6906454
161 -6906454 -17912892 -26857980 -27303714 -15445793 1523358 9747350 6037427 1440527
153 1440527 2664428 1600618 -8669970 -19447962 -20133388 -16879609 -22614967 -33923615
145 -33923615 -33664433 -15777273 6252480 17276102 15679593 8649488 2193145 -888979
137 -888979 -783503 -1492501 -6290198 -11348530 -9968394 -3320208 351821 -2018660 -4679618
128 -4679618 -2932211 1818676 8830142 19817673 29351679 23984315 208378 -23923962
120 -23923962 -26737592 -9851509 3989177 501340 -9387223 -6621886 10741811 27065299
112 27065299 29700469 21754007 14388696 13240296 15207875 14547215 8798057 626421
$$ packed form
170c0296868M81841Q096358O997491R20760R30820O475775P172069P2338p757038
161f906454j1006438q945088m45734J1857921J6969151Q223992l709923m596900
153A440527J223901j063810j0270588j0777992o85426L253779n735358j1308648
145c3923615K59182J7887160K2029753J1023622j596509p030105o456343l082124
137h88979J05476p08998m797697n058332J380136O648186L672029k370481k660958
128d679618J747407M750887P011466J0987531R534006n367364k3775937k4132340
120b3923962k813630J6886083J3840686l487837r888563K765337J7363697J6323488
112B7065299K635170p946462p365311j148400J967579o60660n749158q171636
$$ plain form
104 626421 -4031959 -1444878 4971702 8251605 8278628 13633966 28108711 40111266 34432037
95 34432037 13604350 -2159436 1097289 15626125 24560968 21921984 13664694 5577274
87 5577274 -826386 -3644944 -1064370 3358443 2786562 -4416812 -13061401 -18297853 -20106675
78 -20106675 -20669177 -21474089 -22981808 -23328733 -18156474 -6226436 5799491 9854704 7491604
69 7491604 7845798 13530571 15938422 8354160 -2533423 -4268914 5614833 17557490
61 17557490 22324669 19617937 13807244 6419435 -3611558 -14409161 -20039469 -16409631
53 -16409631 -6633818 1502991 3258592 398106 -2889722 -4595066 -4003818 423857 8444203
44 8444203 14921558 13980277 6452954 -1146429 -6092089 -13021503 -24909164 -34768096 -32446881
$$ packed form
104F26421m658380K587081O416580L279903K7023N355338J4474745J2002555n679229
95C4432037k0827687j5763786L256725J4528836Q934843k638984q257290q087420
87E577274o403660k818558K580574M422813n71881p203374q644589n236452j808822
78b0106675n62502q04912j507719l46925N172259J1930038J2025927M055213k363100
69G491604L54194N684773K407851p584262j0887583j735491R883747J1942657
61A7557490M767179k706732n810693p387809j0030993j0797603n630308L629838
53a6409631R775813Q136809J755601k860486l287828j705344N91248M427675Q020346
44H444203O477355r41281p527323p599383m945660o929414j1887661r858932K321215
$$ plain form
35 -32446881 -18836853 -6792350 -5321487 -8161848 -3541979 7774628 12357129 3412041
27 3412041 -8009293 -7243128 3906319 9923791 2470544 -10782509 -19081815 -20798715
19 -20798715 -18771865 -12435916 -2200723 4275158 -507436 -12380225 -19780970 -19250818
11 -19250818 -18899487 -24879746 -31508051 -29068568 -17329602 -6460170 -5487855 -13389383
3 -13389383 -22244473 -26506771 -26362329
0 -26362329
$$ packed form
35c2446881J3610028J2044503J470863k840361M619869J1316607M582501q945088
27C412041j1421334P66165J1149447O017472p453247j3253053q299306j716900
19b0798715K026850O335949J0235193O475881m782594j1872789p400745N30152
11a9250818L51331n980259o628305K439483J1738966J0869432R72315p901528
3a3389383q855090m262298J44442
0b6362329
$$ Imaginary data points
##PAGE= N=2
##DATA TABLE= (X++(I..I)), XYDATA
$$ plain form
65535 19881344 26439988 25308648 13550918 -1964418 -11270335 -13609514 -15798541 -19132075
65527 -19132075 -17577943 -10687748 -7263439 -11115129 -13835859 -9336943 -5317531 -9761005
65519 -9761005 -15005300 -8890344 4243145 9006634 2741511 -1933414 1113246 2852621
65511 2852621 -3648774 -11150919 -10408727 -3699853 1623029 4929308 9700367 15003788
65503 15003788 17167780 16447263 15986118 16336620 15198226 10867086 3611359 -4315771
65495 -4315771 -9260572 -9690914 -8731858 -9247617 -8159141 -1710707 5785857 7037081 4240183
65486 4240183 6065502 12604432 15697299 15089116 19244918 26418505 22094929 3572665
65478 3572665 -10013278 -4768237 6691309 7183252 3407047 11009459 22253268 15266406
$$ packed form
65535A9881344O558644j131340j1757730j5515336r305917k339179k189027l333534
65527a9132075J554132O890195L424309l851690k720730M498916M019412m443474
65519i761005n244295O114956J3133489M763489o265123m674925L046660J739375
65511B852621o501395p502145P42192O708874N322882L306279M771059N303421
65503A5003788K163992p20517m61145L50502j138394m331140p255727p927130
65495d315771m944801m30342R59056n15759J088476O448434P496564J251224k796898
65486D240183J825319O538930L092867o08183M155802P173587m323576j8522264
65478C572665j3585943N245041J1459546M91943l776205P602412J1243809o986862
$$ plain form
65470 15266406 -7730274 -19065821 -6846056 7747837 4539850 -6292144 -4466963
65463 -4466963 7514190 11039120 1663213 -6628395 -4913684 -583917 -3017349 -10345489
65455 -10345489 -14826370 -13311128 -8134721 -3059518 -1999594 -7671804 -17656117 -24206469
65447 -24206469 -21760389 -13956332 -9886639 -12708273 -15141316 -9063987 2583532 8569511
65439 8569511 4430844 -1346930 420420 7016560 9566481 6810637 4856040 5649962
65431 5649962 5221346 3161409 3740910 5590237 658703 -11694448 -18955083 -11287023
65423 -11287023 3684061 10385178 5326263 -743695 1588664 10684713 19600158 24895879
65415 24895879 27884232 30674536 32552059 29780243 20401700 9483425 5444376 9159726
$$ packed form
65470A5266406k2996680j1335547J2219765J4593893l207987j0831994J825181
65463d466963J1981153L524930r375907q291608J714711M329767k433432p328140
65455a0345489m480881J515242N176407N075203J059924n672210r984313o550352
65447b4206469K446080P804057M069693k821634k433043O077329J1647519N985979
65439H569511m138667n777774J767350O596140K549921k755844j954597P93922
65431E649962m28616k059937N79501J849327m931534j2353151p260635P668060
65423a1287023J4971084O701117n058915o069958K332359R096049Q915445N295721
65415B4895879K988353K790304J877523k771816r378543j0918275m039049L715350
$$ plain form
65407 9159726 11858833 7562983 2011502 3436863 9557249 11571856 7769819 4476474
65399 4476474 4904957 5658879 4265663 2136465 -519724 -4845708 -7520035 -3225461
65391 -3225461 5031803 6698885 -1715363 -11062271 -13274679 -12569697 -16426096 -22560833
65383 -22560833 -23402112 -18504030 -13167953 -7677221 2315502 15319250 23302640 22920365
65375 22920365 19437228 17277021 14382280 9388675 6778644 9193036 10755562 5468149
65367 5468149 -1879938 -1773916 5020457 8173553 4446861 3301365 10794129 17117412
65359 17117412 9808005 -6034505 -12874255 -5481433 1968183 -2473916 -11356312 -10917264
65351 -10917264 -2861303 -1008863 -9736526 -18265936 -17222571 -9831172 -3233276 1822933
$$ packed form
65407I159726K699107m295850n551481J425361O120386K014607l802037l293345
65399D476474M28483P53922j393216k129198k656189m325984k674327M294574
65391c225461Q257264J667082q414248r346908k212408P04982l856399o134737
65383b2560833q41279M898082N336077N490732R992723J3003748P983390l82275
65375B2920365l483137k160207k894741m993605k610031K414392J562526n287413
65367E468149p348087J06022O794373L153096l726692j145496P492764O323283
65359A7117412p309407j5842510o839750P392822P449616m442099q882396M39048
65351a0917264Q055961J852440q727663q529410J043365P391399O597896N056209
$$ plain form
65343 1822933 7142019 10277003 8066468 2170148 -4426149 -11917599 -19202074 -19749891
65335 -19749891 -9273578 5349272 12258895 8611073 2106159 -371770 820466 2526572
65327 2526572 3006023 1040112 -3222546 -5413616 -404491 9869515 16811561 14868048
65319 14868048 6825091 -933521 -3562784 1876673 14445290 25803566 25495536 13507009
65311 13507009 1988666 356416 3872668 1994809 -6549173 -13394964 -12847615 -8401261
65303 -8401261 -6962646 -10396251 -13188471 -7263971 9206211 26933071 33050506 25343791
65295 25343791 14231620 7676786 551557 -14481515 -30763986 -32370439 -14799025
65288 -14799025 7762723 18466741 15083506 8193473 6785593 10110938 12505411 12497458
$$ packed form
65343A822933N319086L134984k210535n896320o596297p491450p284475n47817
65335a9749891J0476313J4622850O909623l647822o504914k477929J192236J706106
65327B526572M79451j965911m262658k191070N009125J0274006O942046j943513
65319A4868048q042957p758612k629263N439457J2568617J1358276l08030j1988527
65311A3507009j1518343j632250L516252j877859q543982o845791N47349M446354
65303h401261J438615l433605k792220N924500J6470182J7726860O117435p706715
65295B5343791j1112171o554834p125229j5033072j6282471j606453J7571414
65288a4799025K2561748J0704018l383235o890033j407880L325345K394473p953
$$ plain form
65280 12497458 14653448 21943909 29150981 28628557 22204093 20122376 25161415 25999425
65272 25999425 13498932 -3377948 -8432823 -947091 4620933 581046 -5423330 -6282388
65264 -6282388 -7178463 -15094556 -26319988 -32433735 -32073029 -28985007 -23394041 -13136247
65256 -13136247 -324098 10025335 16127182 18634433 15844883 5602414 -8811144
65249 -8811144 -19637485 -21698645 -15785895 -6272521 1935232 5814068 6478848 7568530
65241 7568530 9636071 9115127 5051759 2573878 5610742 9882077 8264245 720653
65233 720653 -6028942 -7054374 -3259456 1185290 1466333 -5552938 -17364405 -26158336
65225 -26158336 -26912577 -22705583 -18798977 -15768460 -12978180 -13235744 -16932237 -16687421
$$ packed form
65280A2497458K155990P290461P207072n22424o424464k081717N039039Q38010
65272B5999425j2500493j6876880n054875P485732N568024m039887o004376q59058
65264f282388q96075p916093j1225432o113747L60706L088022N590966J0257794
65256a3136247J2812149J0349433O101847K507251k789550j0242469j4413558
65249h811144j0826341k061160N912750R513374Q207753L878836O64780J089682
65241G568530K067541n20944m063368k477881L036864M271335j617832p543592
65233G20653o749595j025432L794918M444746K81043p019271j1811467q793931
65225b6158336p54241M206994L906606L030517K790280k57564l696493K44816
$$ plain form
65217 -16687421 -6894956 5283915 8659994 4751704 4240261 8711716 9610659 5872451
65209 5872451 7373372 16517192 21165329 13531147 3014316 591872 2241480 -536059
65201 -536059 -4383734 -2438519 -480060 -8118019 -18926996 -17282108 -3677910 4958093
65193 4958093 2357058 1995981 12650716 21900146 15122116 -2301912 -14958992 -19490672
65185 -19490672 -21995450 -20647753 -8038877 10960126 19921553 12085462 -1902522 -10420711
65177 -10420711 -12733309 -10586980 -1472234 12013240 18303557 13451729 11799577 26451864
65169 26451864 46155248 47910352 29725074 13254857 12233571 16175799 12145023 5794157
65161 5794157 8259662 14985617 13860573 6929792 6391128 11487047 7254441 -10746205
$$ packed form
65217a6687421R792465J2178871L376079l908290n11443M471455Q98943l738208
65209E872451J500921R143820M648137p634182j0516831k422444J649608k777539
65201e36059l847675J945215J958459p637959j0808977J644888J3604198Q636003
65193D958093k601035l61077J0654735R249430o778030j7424028j2657080m531680
65185a9490672k504778J347697J2608876J8999003Q961427p836091j3987984q518189
65177a0420711k312598K146329R114746J3485474O290317m851828j652152J4652287
65169B6451864J9703384J755104j8185278j6470217j021286L942228m030776o350866
65161E794157K465505O725955j125044o930781n38664N095919m232606j8000646
$$ plain form
65153 -10746205 -26152060 -23336159 -7481144 5321205 9158593 10301811 14464974 21505890
65145 21505890 29129765 33582110 29465979 16752320 5686763 6547612 15792244 20541048
65137 20541048 16020072 9294892 4920485 -2411725 -16123378 -27800752 -27152391 -16803208
65129 -16803208 -8818388 -8746059 -10806987 -8677793 -4036454 -2386703 -5172521 -8648291
65121 -8648291 -8127294 -2067640 6013400 9306865 3772742 -7329992 -17115659 -22315069
65113 -22315069 -23642686 -21117145 -15598322 -14388460 -25584920 -43036795 -47063327 -28946404
65105 -28946404 -7076138 -6572457 -26748772 -42405167 -36785507 -18480930 -2524621
65098 -2524621 9541789 21812476 29394450 25143238 13638300 5372088 1559815 -3138947
$$ packed form
65153a0746205j5405855K815901J5855015J2802349L837388J143218M163163P040916
65145B1505890P623875M452345m116131j2713659j1065557Q60849R244632M748804
65137B0541048m520976o725180m374407p332210j3711653j1677374O48361J0349183
65129a6803208P984820P2329k060928K129194M641339J649751k785818l475770
65121h648291N20997O059654Q081040L293465n534123j1102734r785667n199410
65113b2315069j327617K525541N518823J209862j1196460j7451875m026532J8116923
65105b8946404K1870266N03681k0176315j5656395N619660J8304577J5956309
65098b524621J2066410J2270687P581974m251212j1504938q266212l812273m698762
$$ plain form
65090 -3138947 -7044082 -4502000 -427948 -6650800 -22393395 -32831528 -30469444 -23886041
65082 -23886041 -20265961 -14201058 -2477328 4346921 -1744212 -9107049 -1080774 18832893
65074 18832893 32004775 31025963 25087681 20312169 11674121 -2023721 -10434350 -6422978
65066 -6422978 2593620 6224992 5581660 7882267 13119775 14864729 10565652 3448143
65058 3448143 -3549184 -9587643 -13745552 -16484541 -21275431 -29413162 -35055158 -31232112
65050 -31232112 -20113846 -11778392 -12170881 -16563602 -16023300 -7387646 4118322 10476707
65042 10476707 8857993 4528872 4268946 6797557 4270996 -4241631 -6849667 6857009
65034 6857009 29311957 41433698 34924458 19744046 8507152 2541595 -2580811 -5788126
$$ packed form
65090c138947l905135K542082M074052o222852j5742595j0438133K362084O583403
65082b3886041L620080O064903J1723730O824249o091133p362837Q026275J9913667
65074A8832893J3171882r78812n938282m775512q638048j3697842q410629M011372
65066f422978R016598L631372o43332K300607N237508J744954m299077p117509
65058C448143o997327o038459m157909k738989m790890q137731n641996L823046
65050c1232112J1118266Q335454l92489m392721N40302Q635654J1505968O358385
65042A0476707j618714m329121k59926K528611k526561q512627k608036J3706676
65034F857009K2454948J2121741o509240j5180412j1236894n965557n122406l207315
$$ plain form
65026 -5788126 -2323505 6763146 13784459 12682166 4284573 -5871039 -11989560 -11433013
65018 -11433013 -6587349 -2807542 -2970696 -5459130 -8299904 -11768941 -14615679 -12207794
65010 -12207794 -3401337 3862202 363034 -11582933 -19170121 -13908200 -377622 11105132
65002 11105132 15604802 14884293 12020763 8930138 7416862 8841423 12357636 15110654
64994 15110654 14521907 10178879 4011325 -1472825 -5910412 -11182824 -16936836 -17229303
64986 -17229303 -5756781 14439413 30462004 32022638 22537103 14612721 15449411 20178028
64978 20178028 20074310 13830050 7879855 7162035 9636879 11155509 11858457 13711753
64970 13711753 13990454 7400102 -4858695 -14866022 -19536371 -25329606 -35951553 -42059413
$$ packed form
65026e788126L464621R086651P021313j102293q397593j0155612o118521N56547
65018a1433013M845664L779807j63154k488434k840774l469037k846738K407885
65010a2207794Q806457P263539l499168j1945967p587188N261921J3530578J1482754
65002A1105132M499670p20509k863530l090625j513276J424561L516213K753018
64994A5110654n88747m343028o167554n484150m437587n272412n754012k92467
64986a7229303J1472522K0196194J6022591J560634r485535p924382Q36690M728617
64978B0178028j03718o244260n950195p17820K474844J518630P02948J853296
64970A3711753K78701o590352j2258797j0007327m670349n793235j0621947o107860
$$ plain form
64962 -42059413 -32356978 -11458362 3409081 2929212 -6183590 -13402146 -14866142 -10649784
64954 -10649784 -2416374 2849294 -2808621 -15441520 -20776634 -14379473 -9223670 -14884699
64946 -14884699 -20604738 -11846827 4848636 9390419 -3191837 -17240643 -19471925 -12900067
64938 -12900067 -5283533 2785664 12329355 18465978 15347118 3058691 -14117041 -30728733
64930 -30728733 -39471788 -35071103 -22379029 -13579980 -13388592 -13657567 -6693041 3134934
64922 3134934 6294020 302693 -10636890 -22351763 -30604769 -29591627 -18376023 -5858974
64914 -5858974 -2287971 -7849070 -15670420 -22956598 -30914943 -35040683 -25644994 -1860455
64906 -1860455 21700427 28071397 15364103 -2658754 -11681133 -8825197 -381706 7769056
$$ packed form
64962d2059413R702435K0898616J4867443m79869r112802p218556j463996M216358
64954a0649784Q233410N265668n657915j2632899n335114O397161N155803n661029
64946a4884699n720039Q757911J6695463M541783j2582256j4048806k231282O571858
64938a2900067P616534Q069197R543691O136623l118860j2288427j7175732j6611692
64930c0728733q743055M400685J2692074Q799049J91388k68975O964526R827975
64922C134934L159086n991327j0939583j1714873q253006J013142J1215604J2517049
64914e858974L571003n561099p821350p286178p958345m125740R395689K3784539
64906a860455K3560882O370970j2707294j8022857r022379K855936Q443491Q150762
$$ plain form
64898 7769056 14632701 20869984 25040223 24852037 20836341 16929040 16756899 19019782
64890 19019782 16762064 3685306 -16546573 -30456753 -29752311 -23788169 -27846786 -38948120
64882 -38948120 -36604451 -13622663 8205819 6398667 -9455203 -11918938 3018583
64875 3018583 10751248 -4262879 -26590242 -33390398 -23039046 -9756480 -2782562 -2522655
64867 -2522655 -8030343 -17193588 -25373832 -31364107 -38096735 -42259618 -33475391 -11280923
64859 -11280923 8266185 12979222 11073850 15727798 23408287 22228031 14129025 12137778
64851 12137778 18988089 23676519 18346805 6021977 -7494252 -18219763 -22240671 -20310944
64843 -20310944 -21844735 -32895793 -42901113 -36361005 -16273227 -2295270 -4954949
$$ packed form
64898G769056O863645O237283M170239j88186m015696l907301j72141K262883
64890A9019782k257718j3076758k0231879j3910180P04442N964142m058617j1101334
64882c8948120K343669K2981788K1828482j807152j5853870k463735J4937521
64875C018583P732665j5014127k2327363o800156J0351352J3282566O973918K59907
64867b522655n507688r163245q180244n990275o732628m162883Q784227K2194468
64859a1280923J9547108M713037j905372M653948P680489j180256q099006j991247
64851A2137778O850311M688430n329714j2324828j3516229j0725511m020908J929727
64843b0310944j533791j1051058j0005320O540108K0087778J3977957k659679
$$ plain form
64836 -4954949 -14327313 -16031015 -7181042 5460573 13209726 9913985 -2501449 -12876454
64828 -12876454 -13278922 -9980565 -12399014 -15931052 -9178792 5772268 16261795 19604977
$$ packed form
64836d954949r372364j703702Q849973J2641615P749153l295741j2415434j0375005
64828a2876454m02468L298357k418449l532038O752260J4951060J0489527L343182
$$ [...]
##END NTUPLES=NMR SPECTRUM
##END=
