##TITLE=31Pdec_LR-628-CR6
 CDCl3, 124 sc
 5.7.2019
##JCAMPDX= 6.0         $$ Bruker NMR JCAMP-DX V2.0
##DATA TYPE= NMR SPECTRUM
##DATA CLASS= NTUPLES
##ORIGIN= UXNMR, Bruker Analytische Messtechnik GmbH
##OWNER= root
$$ XWIN-NMR		Version 3.5
$$ Fri Jul  5 14:40:56 2019 Russian Standard Time (UT+4h)  she@DPX200
##.OBSERVE FREQUENCY= 81.013821
##.OBSERVE NUCLEUS= ^31P
##.ACQUISITION MODE= SIMULTANEOUS
##.ACQUISITION SCHEME= undefined
##.AVERAGES= 124
##.DIGITISER RES= 17
##SPECTROMETER/DATA SYSTEM= spect
##.PULSE SEQUENCE= zgpg30
##.SOLVENT NAME= CDCl3
##.SHIFT REFERENCE= (INTERNAL, CDCl3, 0, 182.463)
##AUDIT TRAIL= $$ (NUMBER, WHEN, WHO, WHERE, WHAT)
$$ ##TITLE= Audit trail, XWIN-NMR		Version 3.5
$$ ##JCAMPDX= 5.01
$$ ##ORIGIN= Bruker BioSpin GmbH
$$ ##OWNER= she
$$ F:/spectra/data/she/nmr/P31/1/pdata/1/auditp.txt
$$ ##AUDIT TRAIL=  $$ (NUMBER, WHEN, WHO, WHERE, WHAT)
(   1,<2019-07-05 14:40:22.70 +0400>,<she>,<DPX200>,
      <continue with go, POWCHK disabled, PULCHK disabled
       configuration hash MD5:
       00 E9 B6 7A A2 85 ED C7 34 08 36 98 17 FE 4E 26
       data hash MD5: 32K
       C6 34 F5 FF D8 41 DF 07 57 65 6E 07 62 E5 94 4C>)
(   2,<2019-07-05 14:40:24.21 +0400>,<she>,<DPX200>,
      <Start of raw data processing
       efp BC_mod = 2 LB = 1 FT_mod = 6 PKNL = 1 PHC0 = -2661.508 PHC1 = 348.5988 SI = 64K 
       data hash MD5: 64K
       DD 29 0A 11 FC 9F E2 03 E8 51 99 17 1F 9D 2E E3>)
$$ ##END=
$$ 
$$ hash MD5
$$ DE 02 E3 14 34 92 11 F9 8B 5B 7B 4A 24 29 44 99
##$RELAX= 
##$RELAX= 
##$RELAX= 
##$RELAX= 
##$RELAX= 
##$RELAX= 
##$RELAX= 
##$RELAX= 
$$ Bruker specific parameters
$$ --------------------------
##$DU= <F:/spectra>
##$EXPNO= 1
##$NAME= <P31>
##$PROCNO= 1
##$TYPE= <nmr>
##$USER= <she>
##$AMP= (0..31)
100 100 100 100 100 100 100 100 100 100 100 100 100 100 100 100 100 100 
100 100 100 100 100 100 100 100 100 100 100 100 100 100 
##$AQSEQ= 0
##$AQ_mod= 1
##$AUNM= <au_zg>
##$AUTOPOS= <>
##$BF1= 81.014009
##$BF2= 200.13
##$BF3= 200.13
##$BF4= 200.13
##$BF5= 200.13
##$BF6= 200.13
##$BF7= 200.13
##$BF8= 200.13
##$BYTORDA= 1
##$CFDGTYP= 0
##$CFRGTYP= 5
##$CHEMSTR= <none>
##$CNST= (0..31)
1 1 145 1 1 1 1 1 1 1 1 1 1 1 1 1 1 1 1 1 1 1 1 1 1 1 1 1 1 1 1 1 
##$CPDPRG= <waltz16>
##$CPDPRG1= <>
##$CPDPRG2= <waltz16>
##$CPDPRG3= <>
##$CPDPRG4= <mlev>
##$CPDPRG5= <mlev>
##$CPDPRG6= <mlev>
##$CPDPRG7= <mlev>
##$CPDPRG8= <mlev>
##$CPDPRGB= <>
##$CPDPRGT= <>
##$D= (0..31)
0 1 0 0 0 0 0 0 0 0 0 0.03 2e-05 3e-06 0 0 0 0 0 0 0 0 0 0 0 0 0 0 0 0 
0 0 
##$DATE= 1562323007
##$DBL= (0..7)
120 120 120 11 120 120 24 19 
##$DBP= (0..7)
150 150 150 150 150 150 150 150 
##$DBP07= 0
##$DBPNAM0= <>
##$DBPNAM1= <>
##$DBPNAM2= <>
##$DBPNAM3= <>
##$DBPNAM4= <>
##$DBPNAM5= <>
##$DBPNAM6= <>
##$DBPNAM7= <>
##$DBPOAL= (0..7)
0.5 0.5 0.5 0.5 0.5 0.5 0.5 0.5 
##$DBPOFFS= (0..7)
0 0 0 0 0 0 0 0 
##$DE= 6
##$DECBNUC= <off>
##$DECIM= 4
##$DECNUC= <off>
##$DECSTAT= 4
##$DIGMOD= 1
##$DIGTYP= 9
##$DL= (0..7)
0 0 52 120 120 21 21 25 
##$DP= (0..7)
$$ [...]
##$SUBNAM2= <"">
##$SUBNAM3= <"">
##$SUBNAM4= <"">
##$SUBNAM5= <"">
##$SUBNAM6= <"">
##$SUBNAM7= <"">
##$SUBNAM8= <"">
##$SUBNAM9= <"">
##$SW= 369.568048894756
##$SWIBOX= (0..15)
0 1 3 0 0 0 0 0 0 0 0 0 0 0 0 0 
##$SW_h= 29940.119760479
##$TD= 32768
##$TD0= 1
##$TE= 0
##$TE2= 300
##$TE3= 300
##$TEG= 300
##$TL= (0..7)
0 120 53 12 22 120 120 120 
##$TP= (0..7)
150 150 150 150 150 150 150 150 
##$TP07= 0
##$TPNAME0= <>
##$TPNAME1= <>
##$TPNAME2= <>
##$TPNAME3= <>
##$TPNAME4= <>
##$TPNAME5= <>
##$TPNAME6= <>
##$TPNAME7= <>
##$TPOAL= (0..7)
0.5 0.5 0.5 0.5 0.5 0.5 0.5 0.5 
##$TPOFFS= (0..7)
0 0 0 0 0 0 0 0 
##$TUNHIN= 0
##$TUNHOUT= 0
##$TUNXOUT= 0
##$USERA1= <user>
##$USERA2= <user>
##$USERA3= <user>
##$USERA4= <user>
##$USERA5= <user>
##$V9= 5
##$VALIST= <valist>
##$VCLIST= <CCCCCCCCCCCCCCC>
##$VD= 0
##$VDLIST= <DDDDDDDDDDDDDDD>
##$VPLIST= <PPPPPPPPPPPPPPP>
##$VTLIST= <TTTTTTTTTTTTTTT>
##$WBST= 1024
##$WBSW= 4
##$XGAIN= (0..3)
0 0 0 0 
##$XL= 0
##$YL= 0
##$YMAX_a= 9472
##$YMIN_a= -11618
##$ZGOPTNS= <>
##$ZL1= 120
##$ZL2= 120
##$ZL3= 120
##$ZL4= 120
##$ABSF1= 0
##$ABSF2= 0
##$ABSG= 0
##$ABSL= 0
##$ALPHA= 0
##$AQORDER= 0
##$ASSFAC= 0
##$ASSFACI= 0
##$ASSFACX= 0
##$ASSWID= 0
##$AUNMP= <proc_1d>
##$AZFE= 0.1
##$AZFW= 0.5
##$BCFW= 0
##$BC_mod= 2
##$BYTORDP= 0
##$COROFFS= 0
##$CY= -3
##$DATMOD= 1
##$DC= 0
##$DFILT= <>
##$DTYPP= 0
##$F1P= 0
##$F2P= 0
##$FCOR= 1
##$FTSIZE= 65536
##$FT_mod= 6
##$GAMMA= 0
##$GB= 0
##$INTBC= 1
##$INTSCL= 5.30512e-09
##$ISEN= 30
##$LB= 1
##$LEV0= 0
##$LPBIN= 0
##$MAXI= 10000
##$MC2= 0
##$MEAN= 0
##$ME_mod= 0
##$MI= 50
##$NCOEF= 0
##$NC_proc= -8
##$NLEV= 6
##$NOISF1= 182.463
##$NOISF2= 159.3651
##$NSP= 0
##$NTH_PI= 0
##$NZP= 0
##$OFFSET= 182.463
##$PC= 4
##$PHC0= -2661.508
##$PHC1= 348.5988
##$PH_mod= 1
##$PKNL= yes
##$PPARMOD= 0
##$PSCAL= 0
##$PSIGN= 0
##$REVERSE= no
##$SF= 81.0140089999434
##$SI= 65536
##$SIGF1= 159.3651
##$SIGF2= -187.1042
##$SINO= 113.3802
##$SIOLD= 16384
##$SREGLST= <1H.CDCl3>
##$SSB= 0
##$STSI= 65536
##$STSR= 0
##$SW_p= 29940.119760479
##$SYMM= 0
##$S_DEV= 0
##$TDeff= 32768
##$TDoff= 0
##$TI= <>
##$TILT= no
##$TM1= 0
##$TM2= 0
##$TOPLEV= 0
##$USERP1= <user>
##$USERP2= <user>
##$USERP3= <user>
##$USERP4= <user>
##$USERP5= <user>
##$WDW= 1
##$XDIM= 65536
##$YMAX_p= 359647197
##$YMIN_p= -96462075
$$ End of Bruker specific parameters
$$ ---------------------------------
##NTUPLES= NMR SPECTRUM
##VAR_NAME=  FREQUENCY,     SPECTRUM/REAL,   SPECTRUM/IMAG
##SYMBOL=    X,             R,               I
##VAR_TYPE=  INDEPENDENT,   DEPENDENT,       DEPENDENT
##VAR_FORM=  AFFN,          ASDF,            ASDF
##VAR_DIM=   65536,         65536,           65536
##UNITS=     HZ,            ARBITRARY UNITS, ARBITRARY UNITS
##FACTOR=    0.456856943014862, 1,           1
##FIRST=     14782.0589164792, 0,            0
##LAST=      -15158.0608439998, 0,           0
##MIN=       -15158.0608439998, -96462075,   0
##MAX=       14782.0589164792, 359647197,    0
$$ Real data points
##PAGE= N=1
##DATA TABLE= (X++(R..R)), XYDATA
$$ [...]
4083i484727N035540k537226j0981178m766133R595759J3743765M492310m787494
4075C10616o365970n464851n246679r01480P168057Q946115M60845q061118p184436
4066a6338901j352483L59800k573363n350267n576708j304307R098049J8502668
4058d535512J3797246m301321j6175987q776982N906509J0353996O454963M921594
4050G644506K856268o883660j3885064k798712J7279191K2023454R018503q34476
4042C4420010J1498l371136j5081033j6457476l54986J0903877N23445j3935236
4034c341037r101380O674283R578370p34336n187288J203153O017983M615416
4026I725164M279902N341807O40779o401806m153674N612542Q047934p60795q593676
$$ plain form
4083 -9484727 -4449187 -6986413 -17967591 -22733724 -13137965 605800 5098110 310616
4075 310616 -6055354 -11520205 -16766884 -17668364 -10500307 -1554192 -1093347 -9154465 -16338901
4066 -16338901 -17691384 -17331584 -19904947 -25255214 -30831922 -32136229 -23038180 -4535512
4058 -4535512 9261734 4960413 -11215574 -19992556 -14086047 -3732051 2722912 7644506
4050 7644506 10500774 3617114 -10267950 -13066662 4212529 26235983 35254486 34420010
4042 34420010 34431508 31060372 15979339 -478137 -833123 10070754 10594199 -3341037
4034 -3341037 -12442417 -5768134 3810236 3075900 -2111388 -908235 5109748 9725164
4026 9725164 14005066 19346873 19987652 13585846 9432172 15044714 23092648 22331853 13738177
4017A3738177q230684n257033j872902P139589J6623893R903446j3919741k9443004
4009a1318259j6312440J1567714K3470784J0518636p548022j0322784J261191
4002A316820J1060172P405174n429561j2719041o354607M473168M261441p743677
3994c730111j5525619p634554P926484J5040435Q835992k121434p957203n849521
3986a1015531R34397P455921J0711602J0007768M082623q064131k0085554j9023122
3978b4996027k260262J2555693Q350299m959586l212476J3585745J8600967N78713
3970A8243066j5251442m463549J8295901K0764533K80994j5510160j0469142J874995
3962A3765196M192542j670321n060315m134970l139042j977116J801469N628108
$$ plain form
4017 13738177 5507493 250460 -1622442 5517147 22141040 32044486 18124745 -11318259
4009 -11318259 -27630699 -16062985 7407799 17926435 10378413 55629 1316820
4002 1316820 12376992 19782166 14352605 1633564 -4721043 -247875 4013566 -3730111
3994 -3730111 -19255730 -26890284 -18963800 -3923365 4912627 2791193 -5166010 -11015531
3986 -11015531 -10081134 -2625213 8086389 18094157 22176780 14112649 -5972905 -24996027
3978 -24996027 -27256289 -14700596 -6350297 -11309883 -14522359 -936614 17664353 18243066
3970 18243066 2991624 -1471925 16823976 37588509 37869503 22359343 11890201 13765196
3962 13765196 17957738 16287417 11227102 7092132 3953090 1975974 3777443 9405551
3954I405551L939171m231190j3488487j6639819j0083183K735611J2835375J3688403
3946a838568P807449K444467k12814m018190j0300601j3837217r688719n13927
3938c0158120O013517O095578L908586N838482J1279476J2050753L444033p222447
3930A1249858q956886k628017R8886n427426r743712m583367M060004N907306
3922a0023354J879614k7510J064975k55962l414826j534108O158119J1034311
3914D881259O637276l027088r139342p565202j392961K708936N15951m766939
3906a1148110n000668K487806R837010Q303125Q8728n028933k955829P98788J5476
3897b602607m428627o286454r27388R013152J4389383Q961768j584570n581489
$$ plain form
3954 9405551 13344722 9113532 -4374955 -21014774 -31097957 -28362346 -15526971 -1838568
3946 -1838568 5968881 8413348 8200534 4182344 -6118257 -19955474 -29644193 -30158120
3938 -30158120 -24144603 -18049025 -14140439 -8301957 2977519 15028272 18472305 11249858
3930 11249858 2292972 -335045 -236159 -5663585 -15407297 -19990664 -15930660 -10023354
3922 -10023354 -8143740 -8171250 -7106275 -7362237 -10777063 -12311171 -6153052 4881259
3914 4881259 11518535 8491447 -647895 -8213097 -9606058 -6897122 -6381171 -11148110
3906 -11148110 -16148778 -13660972 -3823962 4479163 4567891 -461042 -3416871 -2618083 -2602607
3897 -2602607 -7031234 -13317688 -14245076 -5231924 9157459 18119227 16534657 10953168
3889A0953168j370222Q04529m105915p199506n40730R033890J0247680L331286
3881B1154180m070324r006806j0895476n577188O174673J2438750O063259j379664
3873A4901404L073118J1124006O765200n090815o658906J19859m451329k1634152
3865a851615k7509428j0642218Q536762R210116L09311L109197J9033642L0914151
3857C1109918K6136585O109231j7999946k9465200j7175990P759547J8552572
3850B5026717N620697j0388241r240518P99119P15577q087714j0323142m452388
3842a0329893k122321m985130l105882M123885M575056n768985j3765610o828185
3834c8207065R884254J9346135J1479218n831403j3560527k220567J4562458J5533300
$$ plain form
3889 10953168 9582946 10387475 6281560 -917946 -1458676 7575214 17822894 21154180
3881 21154180 17083856 8077050 -2818426 -8395614 -2220941 10217809 16281068 14901404
3873 14901404 17974522 29098528 35863728 30772913 24114007 24233866 19782537 -1851615
3865 -1851615 -29361043 -40003261 -31466499 -22256383 -21947072 -18837875 195767 31109918
3857 31109918 57246503 63355734 45355788 15890588 -1285402 6474145 25026717
3850 25026717 30647414 20259173 11018655 11817774 12533351 4445637 -5877505 -10329893
3842 -10329893 -12452214 -17437344 -20543226 -16419341 -11844285 -17613270 -31378880 -38207065
3834 -38207065 -28322811 -8976676 2502542 -3328861 -16889388 -19109955 -4547497 10985803
3826A0985803J620770m155038P950937J7487326N160809j6563341k3247857j4323938
3818a5084529o384889k324554O310440J3645693N731692r048452n859659J5903713
3810B889455K6231497Q258947j6703250k0950174o363975O203509P116347K313573
3802H995929j040453m49039K507044J169021q835496j7753418j0687982Q010959
3794a8083435J6676148Q439092J222312O289545R182757k711089j4993315r814119
3786c792104K556908M37627j2588729j3519509L245204J8850416J8321407N984938
3778A9496158o858874j2602669p053737N739077J0896662K28696j2226425r088999
3770a1470111K218315J506001q946093p355980R066466J6734715L636528j1823716
$$ plain form
3826 10985803 12606573 8451535 16402472 33889798 39050607 22487266 -760591 -15084529
3818 -15084529 -21469418 -23793972 -17483532 -3837839 1893853 -7154599 -13014258 2889455
3810 2889455 29120952 37379899 20676649 -273525 -6637500 -433991 6682356 8995929
3802 8995929 7955476 7506437 10013481 11182502 2347006 -15406412 -26094394 -18083435
3794 -18083435 -1407287 7031805 8254117 14543662 23726419 21015330 6022015 -3792104
3786 -3792104 -1235196 -797569 -13386298 -26905807 -23660603 -4810187 13511220 19496158
3778 19496158 12637284 34615 -7019122 -1280045 9616617 9845313 -2381112 -11470111
3770 -11470111 -9251796 -7745795 -16691888 -24047868 -14981402 1753313 5389841 -6433875
3762f433875j1594466l822438k601597k565291P214936J9274029J8018623M710877
3754B2200798n510672n416454m6238M735579N070824l297562j7584042k3992806
3746b3840573j3490626M021134J2699969J1127550P618672L400907m373308r688762
3738a2525037n023490K743956J433025m544746k20578J3270166J8342922R195263
3730B2671481n0140l76927q37579q063185j1891091l906522N232653J599135j0047256
3721e669431j4161018o186328N693638J3368639J2720766K636078r195089q167770
3713h960515P624993J8681235Q981931r010435j1147832L062221J1319393K166454
3705B2717445j2165455j7820721j5345437r548940p00321P885624Q781230M047838
$$ plain form
3762 -6433875 -18028341 -21850779 -24452376 -27017667 -19802731 -528702 17489921 22200798
3754 22200798 16690126 11273672 11227434 15963013 21033837 17736275 152233 -23840573
3746 -23840573 -37331199 -33310065 -20610096 -9482546 -1863874 1537033 -2836275 -12525037
3738 -12525037 -17548527 -14804571 -13371546 -17916292 -18136870 -4866704 13476218 22671481
3730 22671481 22621341 22244414 21406835 13343650 1452559 -2453963 2778690 4377825 -5669431
3721 -5669431 -19830449 -26016777 -20323139 -6954500 5766266 8402344 -792745 -8960515
3713 -8960515 -1335522 17345713 26327644 17317209 6169377 9231598 20550991 22717445
3705 22717445 10551990 -7268731 -22614168 -32163108 -32863429 -24977805 -16196575 -12148737
3697a2148737N923709J6578253K1173643J0019967n729454j1035068p308479m031426
3689A3442408j664516L161636N146662j336909q358790m701937N069719P696150
3681A8454423L312514L227362P517247L635036j0210641j8145023r384833O608713
3673E014798J4871810J2369217L645788q461771j8744301j7463253l432418R012174
3665c187956P327725j534766k162059O076986R821394L351043l974616l678772
3657A2038979j53404j549845o328240n757335K707325J0149791O225245p014371
3649A0318145j4965762p472767O636416R293925k309671j0942644l523748J0519345
3641b446761J4208136P288685K584609L937541L165795k636210o400727n429664
$$ plain form
3697 -12148737 -6225028 10353225 31526868 41546835 35817381 24782313 17473834 13442408
3689 13442408 11777892 14939528 20086190 18749281 10390491 5688554 10758273 18454423
3681 18454423 21766937 24994299 32511546 36146582 25935941 7790918 -1593915 5014798
3673 5014798 19886608 32255825 35901613 27439842 8695541 -8767712 -12200130 -3187956
3665 -3187956 4139769 2605003 442944 6519930 16341324 19692367 15717751 12038979
3657 12038979 11885575 10335730 4007490 -1749845 957480 11107271 17332516 10318145
3649 10318145 -4647617 -12120384 -5483968 3809957 1500286 -9442358 -12966106 -2446761
3641 -2446761 11761375 19050060 21634669 25572210 28738005 26101795 19701068 14271404
3633A4271404n702142q015382m214699O533953J1465771L038929q010082q854450
3625E13302l200159j880589m205612k358712K823247M897137M898960O384022
3617G871596K928133j1549497k3636108j3374683J1964341K0312085p81306k3896831
3609c0162270j9722133L486898J7047156J3746987R321048J0212046N914706n687762
3601D156676r470385J987544J3159329P709351o818699j0496909J22599R153860
3593I503366N786351j616263o8929Q258929R119242l081035j6002653j4947477
3585c048469k398979N920738K928265k378601k219106k702520j0172004j5374975
3577b9445651o192233R196166R506645q493651k2738829j5109770O040401K0019482
$$ plain form
3633 14271404 8569262 553880 -3660819 2873134 14338905 17377834 9367752 513302
3625 513302 -2686857 -4567446 -8773058 -11131770 -8308523 -3411386 1487574 7871596
3617 7871596 10799729 -749768 -24385876 -37760559 -25796218 -5484133 -6265439 -30162270
3609 -30162270 -49884403 -46397505 -29350349 -15603362 -6282314 3929732 9844438 4156676
3601 4156676 -5313709 -3326165 9833164 17542515 10723816 226907 349506 9503366
3593 9503366 15289717 13673454 13604525 21863454 30982696 27901661 11899008 -3048469
3585 -3048469 -5447448 473290 3401555 1022954 -1196152 -3898672 -14070676 -29445651
3577 -29445651 -35637884 -26441718 -16935073 -25428724 -48167553 -63277323 -57236922 -37217440
3569c7217440J8717153Q739431j487265o854610m879762R32501K270617k357249
3561b2136624l557862M268496J2053270R302389R19913q24784M268517N972658
3553A0265973J924988O60767N590666Q054105K13681j3246492j9991729j1983694
3545a8511735P922031K6436261K8208925J0362874j1872238k0277682j3218116
3538I050320l557612L56064J746930L658057J757264o197873j2102650o180442
3530a1469942R016413J8968154J2448002n201617j5945454q464313P634367J2664728
3522A9650338J987241q914768p574188n84958J563301K549084R047328J2783162
3514C0506540L142477r369024n100031J1185888J3231725o243089k2210323j4497743
$$ plain form
3569 -37217440 -18500287 -9760856 -11248121 -18102731 -22982493 -22049992 -19779375 -22136624
3561 -22136624 -25694486 -21425990 -9372720 -70331 849582 24798 4293315 10265973
3553 10265973 12190961 12851728 18442394 26496499 26710180 13463688 -6528041 -18511735
3545 -18511735 -10589704 15846557 44055482 54418356 42546118 22268436 9050320
3538 9050320 5492708 5848772 7595702 11253759 13011023 6813150 -5289500 -11469942
3530 -11469942 -2453529 16514625 28962627 23761010 7815556 -648757 6985610 19650338
3522 19650338 21637579 12722811 5148623 4563665 6126966 8676050 17723378 30506540
3514 30506540 33649017 24279993 19179962 30365850 43597575 37354486 15144163 646420
3506F46420L117379N867728o500850j4670034r479873L76158M681507J501371
3498a4460194o034665j1577537p162895P550438K0398735J9236074O830589l407369
3490A1373176l650203K120327M933719q08662j2326847j8758302j1420095M095203
3482b4441684J3015272J0424004N768435N595085L906513m284126j1933580j1059933
3474a3010014m566337J404312O805175J1160576Q748296n07928o491386m571367
3466a028673l470365p520364n965595O778098J5940643Q762525k589898q86598
3458A0019773O621324K244740r383426r480427Q24195L093934m456052m632693
3450e148632N565443P966968m639335j5404951j1136954k32778O325478J0591503
$$ plain form
3506 646420 3763799 9631527 3130677 -11539357 -21019230 -20643072 -15961565 -14460194
3498 -14460194 -20494859 -32072396 -39235291 -31684853 -11286118 7949956 14780545 11373176
3490 11373176 7722973 9843300 14777019 13968357 1641510 -17116792 -28536887 -24441684
3482 -24441684 -11426412 -1002408 4766027 10361112 14267625 9983499 -1950081 -13010014
3474 -13010014 -17576351 -16172039 -9366864 1793712 10542008 10034080 3542694 -1028673
3466 -1028673 -4499038 -12019402 -17984997 -11206899 4733744 13496269 10906371 10019773
3458 10019773 16641097 18885837 9502411 21984 846179 3940113 -515939 -5148632
3450 -5148632 416811 8383779 3744444 -11660507 -22797461 -23030239 -16704761 -6113258
3442f113258J4405881J0875797J44102n052053p51779m25802j0508710j6015461
3434a3441283n162550Q812265P760712k998089m685419N799068J3817785Q706961
3426A8609450n749938j8200509j7740750j513714J7621348J9546497J452724j5715621
3418a690513j4310702k339607K230856j707450j382891P884233J7575370J8397790
3410B4657086P741173j0031201k3110318j9951253m970980L375235k135947p007024
3402c1433229O00011J0654463J0513352P584030J3932112K1619637J5428234N23969
3394D9422579n518209j568920j037173o274619q064462p010288j1494728j6251416
3386g797236p940144P581788R450266l505922q535593L827287J4233378O943325
$$ plain form
3442 -6113258 8292623 19168420 19312522 14260469 13508690 13082888 2574178 -13441283
3434 -13441283 -18603833 -9791568 -2030856 -5028945 -9714364 -3915296 9902489 18609450
3426 18609450 12859512 -5340997 -23081747 -24595461 -6974113 12572384 14025108 -1690513
3418 -1690513 -16001215 -18340822 -16109966 -17817416 -19200307 -11316074 6259296 24657086
3410 24657086 32398259 22367058 -743260 -20694513 -25665493 -22290258 -24426205 -31433229
3402 -31433229 -30833218 -20178755 -9665403 -2081373 11850739 33470376 48898610 49422579
3394 49422579 43904370 42335450 41298277 35023658 26959196 19948908 8454180 -7797236
3386 -7797236 -15737380 -8155592 1294674 -2211248 -10746841 -6919554 7313824 14257149
3378A4257149o253056q739085m563130m588788n052275J487048P566192K143393
3370c742552r065738j1715771l994172N166970J1516276J4587125R364039m845870
3362G270307j3753243m195952J3037800J5107489N22771q904537k014737N758079
3354A2827977j268916j4024552j3780978q61865P817821M925082P01750M188329
3346E24648R985639Q609634R115r867109j8134870k2472944j6272791K282956
3338d5335722J9621115J8867196L606873m467460L578472J0235827j035733j8166491
3330a3095923j6731898M023582K0521156J8319260P343601Q86023k440290p784633
3322A1040878j0107721l111537P193156R761393M184902j033976k428640m285345
$$ plain form
3378 14257149 8004093 -734992 -5298122 -9886910 -14939185 -13452137 -5885945 -3742552
3370 -3742552 -12808290 -24524061 -28518233 -23351263 -11834987 2752138 12116177 7270307
3362 7270307 -6482936 -10678888 2358912 17466401 17989172 9084635 7069898 12827977
3354 12827977 11559061 -2465491 -16246469 -17108334 -9290513 -4365431 -3663681 524648
3346 524648 10510287 19119921 19129036 9261927 -8872943 -31345887 -47618678 -45335722
3338 -45335722 -25714607 -6847411 -3240538 -7707998 -4129526 6106301 5070568 -13095923
3330 -13095923 -29827821 -25804239 -5283083 13036177 20379778 21265801 18825511 11040878
3322 11040878 933157 -2178380 5014776 14776169 18961071 17927095 15498455 11213110
3314A1213110q696476j1296295q007556k96226P690030J2988893J3320408O661884
3306B3577772m973473j2909690q575365M206941R037389l254366j7824157j1450612
3298b2165561J3465003K6620887J0206706j4751974j8222170l194218M529494
3291c511833j215137l168770L002063K38784j5013885j9916199k334941J5390681
3283b6529237J0175626n734279o326171P191449J3607851Q607983O294462R392795
3275A6680479O052378l633358m578764N120688P325243n975922j6932779q868515
3267d810550P933700J2410558K567362o601854p529942o456294p475713m438162
3259a4400895P479784K0622813K1046461M100715j8785414k9627241k0765859
$$ plain form
3314 11213110 2516634 -8779661 -16787217 -17083443 -9393413 3595480 16915888 23577772
3306 23577772 18604299 5694609 -2880756 1326185 10363574 7109208 -10714949 -22165561
3298 -22165561 -8700558 17920329 28127035 13375061 -4847109 -8041327 -3511833
3291 -3511833 -4726970 -7895740 -4893677 -4654893 -19668778 -39584977 -41919918 -26529237
3283 -26529237 -16353611 -22087890 -28414061 -21222612 -7614761 993222 7287684 16680479
3275 16680479 22732857 19099499 14520735 19641423 26966666 20990744 4057965 -4810550
3267 -4810550 3123150 15533708 18101070 11499216 3969274 -2487020 -9962733 -14400895
3259 -14400895 -6921111 13701702 34748163 38848878 20063464 -9563777 -30329636
3252c0329636j890523J0957960J1924255P863230O184423O412505N143458K920109
3244A9185781J696624l37879n808105j1873296j2465088o935799j444414o8313
3236a8050489P59123N382440J0598556J0324284O366386O159437R202005N932916
3228C6674658n460512j1989637m525226O273989N379315l427152n984611l001654
3220A3939170o324543j2723779o001482J1639053J6712455K010842r562804l169426
3212F519486L075016p146453j4869766K373078K5955474K1037543o069146j6672669
3204A4202563k219746N204925r392138j9039892m236945J1804014L359885j3461883
3196a3779217q513150J2066392J7735994L308172p010651j139196O218742K919480
$$ plain form
3252 -30329636 -32220159 -21262199 -9337944 -1474714 4709709 11122214 16265672 19185781
3244 19185781 20882405 20544526 14736421 2863125 -9601963 -16537762 -17982176 -18050489
3236 -18050489 -17291366 -11908926 -1310370 9013914 15380300 21539737 30741742 36674658
3228 36674658 31214146 19224509 14699283 20973272 26352587 22925435 16940824 13939170
3220 13939170 7614627 -5109152 -11110634 528419 17240874 19251716 9688912 6519486
3212 6519486 9594502 2448049 -12421717 -10048639 15906835 36944378 30875232 14202563
3204 14202563 11982817 17187742 7795604 -11244288 -15481233 -3677219 -317334 -13779217
3196 -13779217 -22292367 -10225975 7510019 10818191 3807540 2668344 8887086 11806566
3188A1806566k824829j085793L667204L806701Q01806j752596n200432q667658
3180E50969n505416N385649J3327844R227918q43806l573626L372856Q649856
3172C0592244K870259q566717j1656084j748491Q931166N978688p008625j1301841
3164H090599J255876J5109930J1638532m835916j3639983o247016N440243Q933464
3156B5745729N407250R51661l391177o567394l682167M246558N788011n344479
3148B3153992j6910182j2130413O375986J8777466J3873963J243877m800539k639294
3140B6944856O31352J749126J845643j50407n997881j2106152j2487062p297907
3132f868432k382768p66049o38461j332918m186341o797133m314950J366569K147861
$$ plain form
3188 11806566 8981737 7895944 11563148 15369849 16171655 14419059 9218627 550969
3180 550969 -4954447 431202 13759046 22986964 22143158 18569532 21942388 30592244
3172 30592244 33462503 24895786 13239702 11491211 20422377 26401065 19392440 8090599
3164 8090599 9346475 24456405 36094937 31259021 17619038 11372022 16812265 25745729
3156 25745729 31152979 32104640 28713463 22146069 18463902 22710460 28498471 23153992
3148 23153992 6243810 -5886603 489383 19266849 33140812 34384689 29584150 26944856
3140 26944856 27576208 29325334 31170977 31020570 25022689 12916537 429475 -6868432
3132 -6868432 -9251200 -10017249 -10655710 -11988628 -16174969 -22972102 -27287052 -25920483 -23772622
3123b3772622k639236k453312P413819J3917838K962278j7314971k4028610j0059215
3115e5974031O620781Q262890K70449Q05815J4808999K7785791K3813149L541660
3107B9935503j6112774j7914296j084989J6656245J6249861k423882k0672177
3100D633491k2493361j1245026j948575j813814m257873o93665P801738J2848324
3092a7168761R855511L264897J59072J402976K332004R49586J62225J022962K80992
3083B261464k298696j505256L308735M152419j757675l497690N931677J2646054
3075A9241032O23281j8510526j7605292M101186J7102432O479351o182921k81388
3067D967155R855878J639097j5121832j3849720M038862J2051731K797724l094418
$$ plain form
3123 -23772622 -26411858 -28865170 -21451351 -7533513 -4571235 -21886206 -45914816 -55974031
3115 -55974031 -49353250 -41090360 -40819911 -40014096 -25205097 2580694 26393843 29935503
3107 29935503 13822729 -4091567 -5176556 11479689 27729550 25305668 4633491
3100 4633491 -17859870 -29104896 -31053471 -32867285 -37125158 -37818823 -30017085 -17168761
3092 -17168761 -7313250 -4048353 -3889281 -2486305 -154301 795285 957510 1980472 2261464
3083 2261464 -37232 -1542488 1766247 5918666 4160991 663301 6594978 19241032
3075 19241032 19864313 1353787 -16251505 -12150319 4952113 11431464 5248543 4967155
3067 4967155 14823033 16462130 1340298 -12509422 -8470560 3581171 6378895 3284477
3059C284477L663818M174196j3401899k8713315j9283652L616977J2475030N005393
3051b9178975L260618J5509562K3725413J3662016l048208p731726j477337J030511
3043A5751874l439899l872414L506447O513169l585070j5437744j2010919M023654
3035h550902J2825389N201841n696267n499594Q23010k96472q075784q891758
3027a8160537J308809R412354L612691r907066j4982359n412522Q983143J5010601
3019a0134886J0475217M454929M847687Q747287P585485k31805p106818p065047
3011A1572049k714453O86250J600902m53712o179292j0072297j875178J6892212
3003I456481K6705121J3260363r213475j3903227J428303J1117642j230589j9721586
$$ plain form
3059 3284477 6948295 11122491 -2279408 -30992723 -50276375 -46659398 -34184368 -29178975
3051 -29178975 -25918357 -10408795 13316618 26978634 23930426 16198700 14721363 15751874
3043 15751874 12311975 8439561 11946008 18459177 14874107 -563637 -12574556 -8550902
3035 -8550902 4274487 9476328 3780061 -1719533 -896523 -1192995 -9268779 -18160537
3027 -18160537 -16851728 -7439374 -3826683 -13733749 -28716108 -34128630 -25145487 -10134886
3019 -10134886 340331 4795260 9642947 18390234 25975719 25743914 18637096 11572049
3011 11572049 8857596 9543846 11144748 10691036 4511744 -5560553 -7435731 9456481
3003 9456481 36161602 49421965 40208490 26305263 27733566 38851208 37620619 17899033
2995A7899033j9797658j677138J2957316J0669655m62946n847731k220337K110346
2987A3630540m57723p541218r786160l196923L955710J340694p331505o647921
2979a6034506Q941129K4158294K0631010L74133j6810359j7169519o134712K426993
2971C82463K570988q80839p28480N301178J3409048J6880581J1382837o29480
2963D7688296j1037348j3071610p302710k65880J693157l686453j4060426k2021949
2955b2064923j7353601K774720K4399429K6619509O895817j1895967r322881N449030
2947E501133Q512569k600824p565057J906221R255241L128286k726014M898708
2939B0310263J2787146K535681j6392717j9371861m317809P954674P195902L239185
$$ plain form
2995 17899033 -1898625 -3575763 9381553 20051208 19588262 13740531 11520194 13630540
2987 13630540 13172817 5631599 -4154561 -7351484 -3395774 -2055080 -9386585 -16034506
2979 -16034506 -7093377 17064917 37695927 38070060 21259701 4090182 -2044530 382463
2971 382463 2953451 2072612 1344132 6645310 20054358 36934939 48317776 47688296
2963 47688296 36650948 23579338 16276628 16010748 17703905 14017452 -42974 -22064923
2955 -22064923 -39418524 -36643804 -12244375 14375134 21270951 9374984 52103 5501133
2947 5501133 14013702 11412878 3847821 5754042 15009283 18137569 15411555 20310263
2939 20310263 33097409 35633090 19240373 -131488 -4449297 3505377 10701279 13940464
2931A3940464K632273k77305n923747n445173Q80403J448857m941428n243286
2923b928942L798813Q534721L205551L63218O005981O171562p296981j8241666
2915c87743j1602117M26004j524313j2038681j1742531M0281O711126K925659
2907b7192315j36024M019226R861244J3286867J5692337J4638806N800827n141421
2899C0829547o459962K517248R908616P330114k570050j3197082j8669148j4286422
2891d597139k954825K766839l492499r220371K06720J7427957K2085253R981109
2883C2203044m643627j3294647j9751750k2890313j4884520j97144M964075j331995
2875c9826877j600705J1639711K1476419J3610595n82983l111260L520090M933105
$$ plain form
2931 13940464 16572737 16295432 10371685 4926512 5806915 7255772 2314344 -2928942
2923 -2928942 869871 9404592 12610143 12973361 18979342 25150904 17853923 -387743
2915 -387743 -11989860 -11563856 -13088169 -25126850 -36869381 -36829100 -30117974 -27192315
2907 -27192315 -27328339 -23309113 -13447869 -161002 15531335 30170141 35970968 30829547
2899 30829547 24369585 26886833 36795449 44125563 41555513 28358431 9689283 -4597139
2891 -4597139 -7551964 -4785125 -8277624 -17497995 -17291275 136682 22221935 32203044
2883 32203044 27559417 14264770 -5486980 -28377293 -43261813 -43458957 -38494882 -39826877
2875 -39826877 -41427582 -29787871 -8311452 5299143 4716160 1604900 5124990 10058095
2867A0058095p83960m355626l046885j415396p8625K346842J310150o508825j3065116
2858a5539346q943246J139837N638610M017670L457197K826181l623559r795608
2850b0822264l867735Q729541Q544938o679820j3957391J299819K0968816J9058157
2842A3274061j507732j5170719r968352J722523P293827R523152J3063912J1945246
2834C0175918J391571q811588o049111N048303P165005n603103j9586529k0171227
2826a6440761r279649O24843K822812K27504k248068k185307J132521N609350
2818a9736755N687716j044953p304243l110553R620050J6604159Q541078p304857
2810A951642j7594112j9150135j7460281j3402437k389079J2723777J9390187
$$ plain form
2867 10058095 9274135 4918509 1871624 456228 377603 2724445 4034595 -2474230 -15539346
2858 -15539346 -24482592 -23342755 -17704145 -13686475 -10229278 -7403097 -11026656 -20822264
2850 -20822264 -24689999 -15960458 -7415520 -14095340 -28052731 -26752912 -5784096 13274061
2842 13274061 11766329 -3404390 -13372742 -11650219 -4356392 5166760 18230672 30175918
2834 30175918 31567489 22755901 16706790 21755093 28920098 23316995 3730466 -16440761
2826 -16440761 -25720410 -25095567 -22272755 -22045251 -24293319 -26478626 -25346105 -19736755
2818 -19736755 -14049039 -15093992 -22398235 -25508788 -15888738 715421 9256499 1951642
2810 1951642 -15642470 -34792605 -52252886 -65655323 -68044402 -55320625 -35930438
2803c5930438J1925074J366103K04165M520708L026062j538528L552125J5863948
2795B989219J6170831r43534j3985482o117308O986308J508840j4765551j3867941
2787b2024618O296988J7424726O138277n873258J012877J3677772J1267655n73052
2779B7347367l299738K145838J112361o572597q809198n992466r391245j6477719
2771a9937397j1250324Q189663K2997331J9880485P162079j030623j925908J47739
2763B4233045K025009n773q769315j8069222j6482129l586766P620133Q212463
2755d822555L297321J189598K746658N032890N990119K290728q034205j8219594
2747a0529040j7670515o637926L408030N400137K696602n62348l258505j491709
$$ plain form
2803 -35930438 -24005364 -22639261 -22435096 -17914388 -14888326 -16426854 -12874729 2989219
2795 2989219 19160050 18216516 4231034 -1886274 5100034 6608874 -8156677 -22024618
2787 -22024618 -15727630 1697096 7835373 1962115 2974992 16652764 27920419 27347367
2779 27347367 24047629 26193467 27305828 20733231 11924033 5931567 -3459678 -19937397
2771 -19937397 -31187721 -22998058 -727 19879758 27041837 26011214 24085306 24233045
2763 24233045 26258054 26252281 17482966 -586256 -17068385 -20655151 -13035018 -4822555
2755 -4822555 -1525234 -335636 2411022 7443912 13434031 15724759 7690554 -10529040
2747 -10529040 -28199555 -34837481 -31429451 -26029314 -23332712 -23895060 -27153565 -28645274
2739b8645274P362767J4433492Q639770k912106j798753J1801909J6585043L582006
2731B9048854r630427q365350k788234n882193r583182j911361Q485881O727416
2723F101404j048449K551655J6145915K1176535J0823752k235640p285348q066175
2715C8163649j1132966j4554041j2163452j771886J2135154J9875198J3966680
2708D4518336n63572r072858n675487r88191n223789j3037118j3832296p804706
2700a1679681j763529K337414M726033K601489k536521k146962M921330O984592
2692C444165n91001m304779M643985J1979836L189410r926507p712679M795764
2684E518194Q641131M193363O441847J4019692J1660348K75285m015069K9180
$$ plain form
2739 -28645274 -21282507 -6849015 1790755 -1121351 -2920104 8881805 25466848 29048854
2731 29048854 19418427 11053077 8264843 2382650 -7200532 -9111893 -626012 6101404
2723 6101404 5052955 7604610 23750525 44927060 55750812 53515172 46229824 38163649
2715 38163649 27030683 12476642 313190 -1458696 10676458 30551656 44518336
2708 44518336 43954764 34881906 29206419 28218228 22994439 9957321 -3874975 -11679681
2700 -11679681 -13443210 -11105796 -6379763 -3778274 -6314795 -8461757 -3540427 3444165
2692 3444165 2853164 -1451615 3192370 15172206 18361616 8435109 722430 5518194
2684 5518194 14159325 18352688 24794535 38814227 50474575 50749860 46734791 46763971
2676D6763971j938314r893206q011238L969950P759989M6592j498302O528080
2668D3727522M028205j4106710k2263121n336343J3150954P198409j1561607j5550746
2660g13437l852779L669231P41575l102645m870974q233788q253136J604324J2511775
2651a0499854J1106462K658858L147944J1816114J2422953R71862q005783n305271
2643A8313285N38612l50959m521991l344590L489927Q168132L975310p178402
2635A9089324j4078738o633436R370296J4973074J916060j4736499j6855534o745006
2627a3700459J533129M698020Q250054R562817K004009p804364o518199K905162
2619I30169M304272m303961o841132K980466J0723866O676581K381197Q498194
$$ plain form
2676 46763971 44825657 34932451 26921213 30891163 38651152 38697744 37199442 43727522
2668 43727522 47755727 33649017 11385896 6049553 19200507 26398916 14837309 -713437
2660 -713437 -4566216 -896985 -155410 -3258055 -8129029 -16362817 -24615953 -23011629 -10499854
2651 -10499854 606608 3265466 6413410 18229524 30652477 31624339 23618556 18313285
2643 18313285 18851897 18500938 13978947 10634357 14124284 22292416 26267726 19089324
2635 19089324 5010586 -1622850 7747446 22720520 24636580 9900081 -6955453 -13700459
2627 -13700459 -12167330 -7469310 780744 10343561 12347570 4543206 -1974993 930169
2619 930169 5234441 930480 -5910652 -2930186 7793680 14470261 16851458 25349652
2611B5349652J3223746P42740k0186324k6129976j2656236Q65886N02448n195909
2603b3483973k499986O627186J0053276M173480k661489l005554J308507M535288
2595d953265N155004N507230N866573K873706n076091j3018515j2776734j982953
2587a8405045J1813021J7841718J2557396J773300p063777j1493356j1868380
2580d845123p073384K565116J0215889P359558m848471j4892821j4374280o955475
2572c2848991m10606M511113J1381380J8296350J8105351P902362o562700j5990286
2564D383973j5025327o791338j221786m626045j0064688n517180O646103R858584
2556b2357704j405312j0387241k923849R977555J0300085K234573L120848J2833233
$$ plain form
2611 25349652 38573398 39316138 19129814 -7000162 -19656398 -18790512 -18288064 -23483973
2603 -23483973 -25983959 -19356773 -9303497 -5130017 -7791506 -10797060 -9488553 -4953265
2595 -4953265 201739 5708969 11575542 14449248 9373157 -3645358 -16422092 -18405045
2587 -18405045 -6592024 11249694 23807090 25580390 18516613 7023257 -4845123
2580 -4845123 -11918507 -9353391 862498 8222056 3373585 -11519236 -25893516 -32848991
2572 -32848991 -33259597 -28748484 -17367104 929246 19034597 26936959 20374259 4383973
2564 4383973 -10641354 -17432692 -18654478 -23280523 -33345211 -38862391 -32216288 -22357704
2556 -22357704 -23763016 -34150257 -37074106 -27096551 -16796466 -14561893 -11441045 1392188
2548A392188J4634714L757624o308475n966107Q95562Q362333J1445765J511053
2540B9724657k0478909l1777104j4076300J3703224J8665214M537469K430442
2533B728693J4095611R721479j3088650j9301860L58788R532745p807632j6852585
2525b0613411J195796R876717j2443516k3844932K739393J4978631k5534228m2816525
2517i6462075N0418362J80880572J77687121J7084070j25051741j10069743j0287510
2510H4199056K5599415j7761611m6231415k3180839J83713n049749q628475M172466
2502A3302561N647526j2167484j6327454O798535K5585244J7627880K773752J305420
2494D4545980J804983o937147j0219506J551461R228053j474700j1453943j052941
$$ plain form
2548 1392188 16026902 19784526 13476051 7509944 8405506 16767839 28213604 29724657
2540 29724657 9245748 -22531356 -36607656 -22904432 -4239218 298251 2728693
2533 2728693 16824304 26545783 13457133 -5844727 -5485939 4046806 -3760826 -20613411
2525 -20613411 -19417615 -9540898 -21984414 -45829346 -43089953 -28111322 -53645550 -96462075
2517 -96462075 -46043713 134836859 312523980 329608050 204556309 94486566 84199056
2510 84199056 109798471 92036860 45805445 22624606 22808319 17758570 9130095 13302561
2502 13302561 18950087 6782603 -9544851 -2746316 22838928 40466808 43240560 44545980
2494 44545980 46350963 39413816 29194310 30745771 39973824 38499124 27045181 25992240
2486B5992240J3458701O857412j0903762j0707885P137086J3610118k743166k0292761
2478B2407983j9073303o482372J42004j916240m184453k407838J942397P584997
2470a986825J1768087Q182007m801686j6811053j4851112j22697J1584652Q766746
2462A728119k024310n855405P50951O668351L094868l929129k958132N574303
2454C049616R163720K25757j3470747j8358240j0786755P83898O951446O092343
2446a6348962K022941k302233n736150o162812j377021O691424J2182475J1548465
2438E18127P285640L920608K689714J855427k21151l851228o924914m386029N866260
2429F752454J5067061R967741p836275j8403689q580729P831582Q125318p282696
$$ plain form
2486 25992240 39450941 46308353 35404591 24696706 31833792 45443910 42700744 22407983
2478 22407983 3334680 -3147692 -3005688 -4921928 -9106381 -11514219 -9571822 -1986825
2470 -1986825 9781262 17963269 13161583 -3649470 -18500582 -18623279 -7038627 1728119
2462 1728119 -296191 -6151596 -5400645 1267706 4362574 433445 -2524687 3049616
2454 3049616 12213336 12439093 -1031654 -19389894 -30176649 -29392751 -22441305 -16348962
2446 -16348962 -14326021 -16628254 -22364404 -28527216 -29904237 -23212813 -11030338 518127
2438 518127 7803767 11724375 14414089 16269516 16048365 12197137 5272223 886194 6752454
2429 6752454 21819515 31787256 23950981 5547292 -3033437 4798145 12923463 5640767
2421E640767j7072389j0655072M52653M589371N019025O771696M865673m211045
2413d599321j1657049q122707K090419Q011451O337406J054710m452009p546779
2405a8883879m832126K640715P749107N814952m20646o674503j0515995p694694
2397c2817069M279097J6763927J6880828O888082K179273O218423N354342m853715
2389B0893188r106901J10625N878080n164552j7812736j2821833M26509J000112
2381a6597508o967066l030781J1920662J6055667L036824q908101o940160N35458
2373a0895005K214022j411453n727543p953281l680604O962982J0830453k944994
2365a2605423k1175255k0464851j700611J1757738J0469674Q224135J1797915
$$ plain form
2421 5640767 -11431622 -22086694 -21634041 -17044670 -12025645 -5253949 -388276 -4599321
2413 -4599321 -16256370 -24379077 -22288658 -14277207 -7939801 -6885091 -11337100 -18883879
2405 -18883879 -23716005 -21075290 -13326183 -7511231 -7931877 -14606380 -25122375 -32817069
2397 -32817069 -28537972 -11774045 5106783 11994865 14174138 20392561 25746903 20893188
2389 20893188 11786287 11896912 17774992 12610440 -5202296 -18024129 -17597620 -16597508
2381 -16597508 -23564574 -26595355 -14674693 1380974 4417798 -4490303 -11430463 -10895005
2373 -10895005 -8680983 -10092436 -15819979 -23773260 -27453864 -20490882 -9660429 -12605423
2365 -12605423 -33780678 -54245529 -55946140 -44188402 -33718728 -25494593 -13696678
2358a3696678R073370l721587r409013J635339J3101435Q851883k014024l191253
2350F29472K464281K543250k387018l591339j274345r87102j528407j73237j282251
2341e586696p021233q879934j250514O267039L625430k227336Q20595R575298
2333d677351J2163414P459878K447563k649481j0199023j2440881j007190J4444301
2325E541230J5307031Q11959j1266935j0955106o158607m143239j2827R994400
2317h82094J7692654J4119040K363823p955792j1954546r668253k333399N111161
2309F492594M211640o436577j4710767p549400J0551240J9529519P344345j3940635
2301E491959k1408468q371874R071277J3816695P799141M267221P139370Q820620
$$ plain form
2358 -13696678 -4623308 -8344895 -17753908 -16118569 -3017134 5834749 3820725 629472
2350 629472 3093753 5637003 3249985 -341354 -1615699 -2602801 -4131208 -4304445 -5586696
2341 -5586696 -12607929 -21487863 -22738377 -16471338 -12845908 -15073244 -14252649 -4677351
2333 -4677351 7486063 14945941 17393504 14744023 4545000 -7895881 -8903071 5541230
2325 5541230 20848261 21660220 10393285 -561821 -6720428 -10863667 -10876494 -882094
2317 -882094 16810560 30929600 33293423 25337631 13383085 3714832 1381433 6492594
2309 6492594 10704234 4267657 -10443110 -17992510 -7441270 12088249 19432594 5491959
2301 5491959 -15916509 -24288383 -15217106 -1400411 6398730 10665951 17805321 26625941
2293B6625941N762160L675534N381842M670571l135461j3251399j8889429j9223290
2285h383531j5673786p769317K623591R778799J1080536R224141N045982l482851
2277B443564j2533898j3075826m472545L211358M894844O227156Q555454L572353
2269a177540p966868q861904Q523038K3256996J1892114j6161533k9679058j6778230
2261c6952985M613644J4980433J2746114N033641l242231p263705l500482K816506
2253a0769065K501486l061352l241283M165821Q299578J839189p959418r527948
2245a7752992j182307Q394136R240947o79266j1339330q996642N640128J3890105
2237b785221L050253j3551079j4201058p4834R218515P787886R075090J7321749
$$ plain form
2293 26625941 32388101 36063635 41445477 46116048 42980587 29729188 10839759 -8383531
2285 -8383531 -24057317 -31826634 -29203043 -19424244 -8343708 880433 5926415 2443564
2277 2443564 -10090334 -23166160 -27638705 -24427347 -19532503 -13305347 -4749893 -1177540
2269 -1177540 -9144408 -18006312 -9483274 13773722 25665836 9504303 -20174755 -36952985
2261 -36952985 -32339341 -17358908 -4612794 420847 -2821384 -10085089 -13585571 -10769065
2253 -10769065 -8267579 -11328931 -14570214 -10404393 -2104815 -265626 -8225044 -17752992
2245 -17752992 -18935299 -10541163 -1300216 -1979482 -13318812 -22315454 -16675326 -2785221
2237 -2785221 265032 -13286047 -27487105 -27561939 -18343424 -10555538 -1480448 15841301
2229A5841301J7182705J259306j3046877r099140K722466J968144j0125438j5183807
2221h481340p659191k25003J39976K342968J2090165J8567281J0828354l001447
2213B4601763o349279Q30988K631886o228632j0136821K333490J6229325R289558
2205C3202278j3422656k3834206j0336630P527388J0245915L894100K068295R98024
2197A0342508q257690j6443986q040596J0229732J5731127L112976r534755q613853
2189a1474537p0381O059993Q436768P554504J911532m168653k767013L648713
2181I130926L905442l189483o324855j394035J758936k365560n155341L53255
2173c280715P655605Q629145N107718J062025n312396j3924951j7517596j1661990
$$ plain form
2229 15841301 33024006 34283312 21236435 12137295 14859761 16827905 6702467 -8481340
2221 -8481340 -16140531 -16365534 -16225558 -13882590 -1792425 16774856 27603210 24601763
2213 24601763 18252484 19083472 21715358 15486726 5349905 7683395 23912720 33202278
2205 33202278 19779622 -4054584 -14391214 -6863826 3382089 7276189 9344484 10342508
2197 10342508 2084818 -14359168 -22399764 -12170032 3561095 6674071 -2860684 -11474537
2189 -11474537 -11544918 -5484925 2951843 10506347 12417879 8249226 5482213 9130926
2181 9130926 13036368 9846885 3522030 2127995 3886931 1521371 -3633970 -3280715
2173 -3280715 4374890 13004035 18111753 19173778 13861382 -63569 -17581165 -29243155
2165b9243155j681050N636886Q780275P132203L64342n352653k340126N418853
2157a1284425P075002L414467M412508P928649J514368j1538936j2080213J952097
2149h606483Q388738k169210r426434L93885R084500m77615j1637020k731952
2141a7181591J3047800R521014o834810q826508L870088O116603p095461j2781904
2133b0164769p64477J0714687P701247O7035j350001j919424o473574p246894
2125a9436170j99966N116416K760156Q14469M905452P400771K789260j522446
2117B627942L04365J750773k580712o809773o832231q791392j3343275o771231
2109d0445534J7021182L7978303L1458341J993476k1086026j9397739k970121
$$ plain form
2165 -29243155 -30924205 -25287319 -16507044 -9374841 -9010499 -14363152 -16703278 -11284425
2157 -11284425 -4209423 -794956 3617552 11546201 13060569 1521633 -10558580 -8606483
2149 -8606483 -217745 -2386955 -11813389 -11419504 -2335004 -2812619 -14449639 -17181591
2141 -17181591 -4133791 5387223 -1447587 -10274095 -6404007 -287404 -7382865 -20164769
2133 -20164769 -20929246 -10214559 -2513312 -2446277 -3796278 -5715702 -12189276 -19436170
2125 -19436170 -19636136 -14519720 -11759564 -10945095 -6039643 1361128 4150388 2627942
2117 2627942 2932307 4683080 2102368 -4707405 -11539636 -20331028 -33674303 -40445534
2109 -40445534 -23424352 14553951 46012292 48005768 26919742 7522003 4551882
2102D551882P709897M785762m863399j1910026j3125880r861141k834616P479146
2094a8068375J5191834J0745063n630484j8361695j4287113j233858L535548o47155
2086b8756235L19475Q845724J0747927N54687q212219n887296q42526l13950L996095
2077a9548318J6497379K1492444O078914j3666003j1771157R459365K2461671
2070C1004295J3342562k690448o772179J91643M767529o23018j1831676j8187124
2062I201584j1884135K192612Q667344J038723o723004P06660J5214765J5888633
2054C4303182J627419o740697L67420O683618k365370j5911444j5716009m254393
2046b006274K334771M37583m84786O56842n607331j7781400j8077385K469843
$$ plain form
2102 4551882 12261779 17047541 12184142 274116 -12851764 -22712905 -25547521 -18068375
2094 -18068375 -2876541 7868522 2238038 -16123657 -30410770 -31644628 -28109080 -28756235
2086 -28756235 -28436760 -19591036 -8843109 -8288422 -16500641 -22387937 -23230463 -23544413 -19548318
2077 -19548318 -3050939 18441505 24520419 10854416 -916741 8542624 31004295
2070 31004295 44346857 41656409 34884230 35075873 39843402 39220384 27388708 9201584
2062 9201584 -2682551 -489939 8177405 9216128 2493124 3199784 18414549 34303182
2054 34303182 35930601 29189904 29557324 36240942 33875572 17964128 2248119 -2006274
2046 -2006274 328497 766080 281294 938136 -4669195 -22450595 -40527980 -38058137
2038c8058137K6565010L0059488J1236230j0589299k0350624j8463729r450130
2031b9051191N394804K0047928K1849213O737247j1649670j7326683j0632696
2024a4631048k715742K385774Q123096J1717344M928873r763465j7175614q952123
2016b6082905N113487J1286078Q978471P033003R427664J1364191N935364q915297
2008B4140056k6032269l0959585j5823812P478232J8044698J2246716O613772
2001d292192J0283099J1019242j149789j3173222q877181L176792K720771r151626
1993i444106j2664292k034550P647076P503944O221123R052335P058888l369453
1985I970965r489158l059320M214291M78887n207357J317377J3208670J1822230
$$ plain form
2038 -38058137 -11493127 18566361 29802591 19213292 -1137332 -19601061 -29051191
2031 -29051191 -23656387 -3608459 18240754 24978001 13328331 -3998352 -14631048
2024 -14631048 -17346790 -14961016 -6837920 4879424 9808297 44832 -17130782 -26082905
2016 -26082905 -20969418 -9683340 -704869 6328134 15755798 27119989 33055353 24140056
2008 24140056 -1892213 -32851798 -48675610 -41197378 -23152680 -10905964 -4292192
2001 -4292192 5990907 17010149 15860360 2687138 -6190043 -3013251 -292480 -9444106
1993 -9444106 -22108398 -24142948 -16495872 -8991928 -2770805 6281530 13340418 9970965
1985 9970965 481807 -2577513 1636778 2115665 -3091692 -1774315 11434355 23256585
1977B3256585l246121j2602679n515460O692835Q988054R54646q270849j3003850
1969b746839j2678186p241657K978326J5109705K3808837K2625017Q222726j1994125
1961C8083804k0573879p644640J3479351J9143665M866602r759754r177721j725169
1953B6692259l079349j1611265j3545465n777632J518499L053035M504183Q428749
1945A0183014P481060k400744j2285674j1637088k823862L445379K802925n088
1937e240078l77584J016749J732852J040360j65584j34888J725649J714085n375393
1928d063832j6533001j8533057k768254K0560697L1189014K1598549L997311n963292
1920B9484135n215047j203688p05218m554097r098289r310689k953817O401051
$$ plain form
1977 23256585 20010464 7407785 1892325 8585160 17573214 18527860 10257011 -2746839
1969 -2746839 -15425025 -22666682 -19688356 -4578651 19230186 41855203 50077929 38083804
1961 38083804 17509925 9865285 23344636 42488301 47354903 37595149 28417428 26692259
1953 26692259 23612910 12001645 -1543820 -7321452 -5802953 -2749918 1754265 10183014
1945 10183014 17664074 15263330 2977656 -8659432 -11483294 -8037915 -5234990 -5240078
1937 -5240078 -5617662 -4600913 -2868061 -1827701 -1993285 -2128173 -402524 1311561 -4063832
1928 -4063832 -20596833 -39129890 -41898144 -21337447 9851567 31450116 35447427 29484135
1920 29484135 24269088 23065400 22360182 17806085 8707796 -602893 -3556710 2844341
1912B844341J2579457J3248230J0353300N284544j518153o890352p263234n114100
1904B3524033o259048r680211q082162j174867O99725p919430j6182074r627100
1896c4701134R724794K4582699K2893435J0276313P36136l12196m46487q046397
1888B4707163j8630045j8392725l303542J2177882J2787981L066496j102761K655204
1880A3965653K582464l781206n078296L37559k246953j6030137j9461985R77574
1872b8735327K2877303J6996818q100508j8264252m574508P606569J434586q732137
1864a9491456n985497L084160M878531J889277L269175O143891K365634m998284
1856h844569o031857O87217P891325J0182317O900684q3258n060224j876656N499827
$$ plain form
1912 2844341 15423798 28672028 39025328 44309872 42791719 35901367 28638133 23524033
1904 23524033 17264985 7584774 -497388 -1672255 -972530 -8891960 -25074034 -34701134
1896 -34701134 -24976340 -393641 22499794 32776107 33512243 33200047 32753560 24707163
1888 24707163 6077118 -12315607 -15619149 -3441267 9346714 12413210 11310449 13965653
1880 13965653 16548117 12766911 7688615 8026174 5779221 -10250916 -29712901 -28735327
1872 -28735327 -5858024 11138794 3038286 -15225966 -19800474 -12193905 -10759319 -19491456
1864 -19491456 -25476953 -22392793 -17514262 -15624985 -12355810 -6211919 -3846285 -8844569
1856 -8844569 -14876426 -14189209 -6297884 3884433 10785117 10701859 5641635 3764979 9264806
1847I264806M608819o750326j4206037q167788M81440j269306n927466J448214
1839b0517644J5436728J6270420J774052p669964n9183J0945765Q187809m319933
1831B0048050j0379231n217056K402379O270075Q828409J2046064J1928866M601634
1823E0529190p503655j7581915j9692343j2086180Q51775R622682P226898k191804
1815I174648o595080j148065M584013L61417q058471o124544O289738J2168828
1807A0652484L052378o446565j556399P226524P4337j7557067j9597168J6400
1799b4135076J5633236Q141695p123093o760184M365143M946740n919584q612665
1791a9463788L392386J3640612J0012638J377959j038364j901462r495824j7305249
$$ plain form
1847 9264806 13873625 7123299 -7082738 -15250526 -14769086 -16038392 -21965858 -20517644
1839 -20517644 -5080916 11189504 12963556 5293592 5234409 16180174 24367983 20048050
1831 20048050 9668819 4451763 6854142 13124217 21952626 33998690 45927556 50529190
1823 50529190 43025535 25443620 5751277 -6334903 -5483128 4139554 11366452 9174648
1815 9174648 2579568 1431503 6015516 6376933 -1681538 -7806082 -1516344 10652484
1807 10652484 13704862 7258297 5701898 12928422 13002759 -4554308 -24151476 -24135076
1799 -24135076 -8501840 -360145 -7483238 -14243422 -9878279 -4931539 -10851123 -19463788
1791 -19463788 -16071402 -2430790 7581848 8959807 7921443 6019981 -3475843 -20781092
1783b0781092j2355791L305090J2916801P161701m084736n933267K081314P091965
1775a0598015J648364n871246l323187P941514J5548344J3891480R397283O289891
1767C4924428j189401j5401739k4495455j6348469K592178J4105284J0741072
1760D927898J027828n239769n973438k484624K785159M170558j685282q140233
1752a0611903n943934K014623L734347l695626r727218o032924L363353J0042163
1744a6857119J0668990O660124J885607R10294K455936k229795j4921495k0257205
1736c1684663n247509J5920050J7063793j067688j0851563k29144J1160533P601428
1728B665237J969322Q268671J4096540L302276j3010623j3808858k639241J331751
$$ plain form
1783 -20781092 -33136883 -29831793 -16914992 -9753291 -13838027 -19771294 -17689980 -10598015
1775 -10598015 -8949651 -14820897 -18144084 -10202570 5345774 19237254 28634537 34924428
1767 34924428 33735027 18333288 -6162167 -22510636 -19918458 -5813174 4927898
1760 4927898 5955726 715957 -5257481 -7742105 -4956946 -786388 -2471670 -10611903
1752 -10611903 -16555837 -14541214 -10806867 -14502493 -24229711 -30262635 -26899282 -16857119
1744 -16857119 -6188129 471995 2357602 3267896 5723832 3494037 -11427458 -31684663
1736 -31684663 -36932172 -21012122 -3948329 -5016017 -15867580 -16096724 -4936191 2665237
1728 2665237 4634559 12903230 26999770 30302046 17291423 3482565 843324 2175075
1720B175075l418173l184116K058264o68675j0449173j2145328l122193L605761
1712b5148558L918143O757324J1956809Q372909j592369m84837J3576246J8740499
1704C6096166K923586j6132685j7674166o242963J164329K84830k966469p107385
1696i654757j2441858j3495319o152205N272598J5000199J9829389J3521239o132859
1688E746427k1460311j0160304J5794082J6978335j1138344j7074700L5040754
1681A3725939J03040630J18044104P6992125L4364035J3480364j5407629o3193972
1674B81045596q8086457o0519776j5603639m101046k2622235l0766382j5857968
1667D3488093r80531j2630k436413r08909j980208o411050n071809J015233o77052
$$ plain form
1720 2175075 -1243098 -4427214 -2368950 -3037625 -13486798 -25632126 -28754319 -25148558
1712 -25148558 -21230415 -14473091 -2516282 5856627 4264258 3779421 17355667 36096166
1704 36096166 39019752 22887067 5212901 -1030062 134267 419097 -2547372 -9654757
1696 -9654757 -22096615 -35591934 -41744139 -36471541 -21471342 -1641953 11879286 5746427
1688 5746427 -15713884 -25874188 -10080106 6898229 -4240115 -21314815 13725939
1681 13725939 116766569 234810673 311802798 346166833 359647197 344239568 281045596
1674 281045596 192959139 132439363 116835724 112734678 90112443 59346061 43488093
1667 43488093 42507562 42494932 40058519 39149610 37169402 30758352 25686543 26701776 26024724
1658B6024724j0166431j0912086K563754J2457885L936088j2177175j5771134
1651d044375n052285N527047P534440N719684N941018O937147M957503k120m189470
1642B3328589m104938j188500k544550j2656345k3385550j9495825J214054K0502169
1634a8330896K0501267O677635o42756N103996J0219842N129950K09772P250882
1626C6119692J6704847R731248j1263704k2226156j0720945O707970Q756288k509264
1618C1299976r673500n955292J241886O206196Q881011O387781l747130j2966300
1610B1674628r822247R53796L579652l305439m469349M555290Q121853k440401
1602A8847783j2077990o389637M406815L588983l861784j761748Q118772R473499
$$ plain form
1658 26024724 15858293 4946207 7509961 19967846 23903934 11726759 -4044375
1651 -4044375 -9096660 -3569613 3964827 9684511 15625529 22562676 27520179 27518059 23328589
1642 23328589 19223651 18035151 15490601 2834256 -20551294 -40047119 -38833065 -18330896
1634 -18330896 2170371 8848006 8205250 13309246 23529088 28659038 28868810 36119692
1626 36119692 52824539 62555787 51292083 29065927 18344982 25052952 33809240 31299976
1618 31299976 21626476 15671184 16913070 23119266 32000277 38388058 34640928 21674628
1610 21674628 11852381 12806177 16385829 13080390 8611041 13166331 21288184 18847783
1602 18847783 6769793 380156 4786971 8375954 4514170 2752422 10871194 20344693
1594B0344693m60621p379470l944100J402218J260212j386913l195948n706241
1586I33830q063332o826628m401586n875973p601582j980323O774211O517527
1578b0523856k284581n691431J254174P005170L124744l429469l595826J415582
1570b2725493O845205J1250987J1716990M622893m501451n248804l58560l925068
1562b323301j6405813j9263714l567111J3415670J2595351o49984q026948l924630
1554b8150480L712588P625241M644072m866158j1194670j686746J6990524J9205376
1546F279747l317109k3055981j3147596J3894530K6455854J8913079J0045277
1539C6067801O596076j441177j2641084j1531510K539605J0316714K791401o370080
$$ plain form
1594 20344693 19884072 12504602 8560502 9962720 11222932 9836019 6640071 933830
1586 933830 -7129502 -13956130 -18357716 -24233689 -31835271 -33815594 -27041383 -20523856
1578 -20523856 -22808437 -28499868 -27245694 -20240524 -17115780 -20545249 -24141075 -22725493
1570 -22725493 -15880288 -4629301 7087689 11710582 7209131 1960327 1601767 -2323301
1562 -2323301 -18729114 -37992828 -41559939 -28144269 -15548918 -16198902 -24225850 -28150480
1554 -28150480 -24437892 -16812651 -12168579 -17034737 -28229407 -29916153 -12925629 6279747
1546 6279747 2962638 -20093343 -33240939 -19346409 7109445 26022524 36067801
1539 36067801 42663877 41222700 28581616 17050106 19589711 29906425 32697826 26327746
1531B6327746n920542l477626p573700j1816843p953248N6115N445981R776890
1523D864773J5092925J5627851O523914p156094j6796679j8551034j1896978R44026
1515a1347296J1186424R838041J570153R31421J0488804J5031638L853418j2775041
1507B8777562j7697378q649631K116328L843774l210395r651036n258477R649847
1499g9406K1088829J6709146K571862n397966m519152o174948j3988845j7613234
1491g403714j1350401k727812K458516P855733J3418909J0743219o70186p802828
1483D521436l665869J714111j256522p208769p731581m053871R08391Q744037
1475h028637J5164912R496260n734859j2106063l297306L361841l305024q474070
$$ plain form
1531 26327746 20407204 16929578 9355878 -2460965 -10414213 -10358098 -4912117 4864773
1523 4864773 19957698 35585549 42109463 34953369 18156690 -394344 -12291322 -11347296
1515 -11347296 -160872 9677169 11247322 12178743 22667547 37699185 41552603 28777562
1507 28777562 11080184 2430553 4546881 8390655 5180260 -4470776 -9729253 -79406
1499 -79406 21009423 37718569 40290431 34892465 30373313 24198365 10209520 -7403714
1491 -7403714 -18754115 -21481927 -19023411 -11167678 2251231 12994450 12324264 4521436
1483 4521436 855567 2569678 1313156 -5895613 -13627194 -17681065 -16772674 -8028637
1475 -8028637 7136275 16632535 10897676 -1208387 -4505693 -1143852 -4448876 -12922946
1467a2922946M98245Q052410k656517j5761854n913470J7555433K2775439N242240
1459A6868980p716823k067901N354343J01892p712665n425890O14192j364950
1451a348822r145881j2279501o646952M431938J4860583J7043141P139636p915711
1443F138431j5944838j2506691k141159R162844J4452133O418713j0354362j6687856
1435b1462785l752771R508518L507023q823400k494079J4923732J2917781r818864
1427e494845k0292892m453870J1881969Q591507J605886P614099J1749209k301202
1419H899861j7420180j0190303P450951P561348o474886o892757J0321280J8133973
1411A1389287J491614k0693655k3750024o654460J3839475K2614224J4194946
$$ plain form
1467 -12922946 -12424701 -4372291 -7028808 -22790662 -28704132 -11148699 11626740 16868980
1459 16868980 9152157 7084256 12438599 12540491 4827826 -598064 16128 -1348822
1451 -1348822 -10494703 -22774204 -29421156 -24989218 -10128635 6914506 14054142 6138431
1443 6138431 -9806407 -22313098 -24454257 -15291413 -839280 5579433 -4774929 -21462785
1435 -21462785 -25215556 -15707038 -12200015 -21023415 -23517494 -8593762 4324019 -5494845
1427 -5494845 -25787737 -30241607 -18359638 -9768131 -8162245 -548146 11201063 8899861
1419 8899861 -8520319 -18710622 -11259671 -3698323 -10173209 -17065966 -6744686 11389287
1411 11389287 12880901 -7812754 -31562778 -38217238 -24377763 -1763539 12431407
1404A2431407n261379j9151126j4447523K207373J1707840O677489j825765k623144
1396a0284828J927143L841349J600519m19368J085974N299968Q237110O305075
1388A7592942J115094j511126R2943M86841l724102p516482n399639K22802M235957
1379E595230N657543L482094n673043j7926580j9772820o110796Q112362O814657
1371a9821353m385260q047672o65922O964519R704142J1499870J2001670O977901
1363A4227895J044895L062104Q411869K837989j3618465k2930162j4052424K737245
1355a8279054J2005941J1048851N585141j270955q510368j3093469j2003291m850313
1347b9367517N751464J2243032N693369j0045528j5074575J711479K1565365J8780180
$$ plain form
1404 12431407 7170028 -11981098 -26428621 -24221248 -12513408 -5835919 -7661684 -10284828
1396 -10284828 -8357685 -4516336 -2915817 -3335185 -2249211 3050757 11287867 17592942
1388 17592942 18708036 17196910 17289853 17776694 14052592 6536110 1136471 1359273 5595230
1379 5595230 11252773 14734867 9061824 -8864756 -28637576 -34748372 -26636010 -19821353
1371 -19821353 -24206613 -32254285 -32920207 -25955688 -16251546 -4751676 7249994 14227895
1363 14227895 15272790 18334894 26746763 29584752 15966287 -6963875 -21016299 -18279054
1355 -18279054 -6273113 4775738 10360879 9089924 579556 -12513913 -24517204 -29367517
1347 -29367517 -23616053 -11373021 -5679652 -15725180 -30799755 -29088276 -7522911 11257269
1339A1257269m77329o744119N968599J1309123m035116j6574652m869238J4136699
1331I971236J2362796m537881q084268P170936J7087184N708321j4600801k4312289
1323G65234j9389139p853413J613263K328269p321986j7865978j4918749L105776
1315e9536723K0066033J9959906N385339o380488l776973O500493Q871155p64822
1307i676080r096351l604143Q995579J1983691K875958n159450n791699o378585
1299a5851080q304601j57676J8915173K7913263J2301059j1581640j8866014r856429
1291e487945j318131L300827J0719640J4803652M783534q554957m434282J1195545
1283B5007883J1224031p533715j7214077m827798P856793M216183m48480P201784
$$ plain form
1339 11257269 10779940 4035821 10004420 21313543 17278427 703775 -4165463 9971236
1331 9971236 22334032 17796151 9711883 16882819 33970003 39678324 25077523 765234
1323 765234 -18623905 -26477318 -24864055 -22535786 -29857772 -47723750 -62642499 -59536723
1315 -59536723 -39470690 -19510784 -14125445 -20505933 -24282906 -17782413 -8911258 -9676080
1307 -9676080 -18772431 -22376574 -13380995 -1397304 1478654 -3680796 -9472495 -15851080
1299 -15851080 -24155681 -24313357 -5398184 22515079 34816138 23234498 4368484 -5487945
1291 -5487945 -6806076 -3505249 7214391 22018043 26801577 18246620 13812338 25007883
1283 25007883 36231914 28698199 11484122 6656324 14513117 18729300 18280820 25482604
1275B5482604R128887j0815481l0143222j9466288P177911J2244393n648395j2473765
1267b4513356L308151J4857745N750709m144788K956913J1894424L896190r600291
1259D405697p967275K829996K200740r566070j3652525l931557P467538J2247943
1251e965513J2467757P244637o026095j7059531j0417165Q431909J4632003j367719
1243A940283j8301626j3423510P053559J9161938J2652503j448111q859177o306563
1235g530704M5319K658972j67900k207209K323647P902983L350954r559191j4616074
1226a7799203m462269O738175M229427m670688l007005Q587418J3873310O731313
1218A0220478k099421m267040l728170m318553k193455L618242N777734R65762
$$ plain form
1275 25482604 34611491 23796010 -6347212 -25813500 -18635589 -6391196 -12039591 -24513356
1267 -24513356 -21205205 -6347460 -596751 -4741539 -1784626 10109798 14005988 4405697
1259 4405697 -3561578 -731582 1469158 -8096912 -21749437 -25680994 -18213456 -5965513
1251 -5965513 6502244 13746881 7720786 -9338745 -19755910 -11324001 3308002 1940283
1243 1940283 -16361343 -29784853 -22731294 -3569356 9083147 7635036 -1224141 -7530704
1235 -7530704 -7485385 -4826413 -4994313 -7201522 -4877875 3025108 6376062 -3183129 -17799203
1226 -17799203 -22261472 -15523297 -11293870 -15964558 -18971563 -10384145 3489165 10220478
1218 10220478 8121057 3854017 125847 -4192706 -6386161 -2767919 3009815 3975577
1210C975577k863482O82242N520878L607041j521147j464500K724881L621392
1202A4282882J279911K860146Q860274J0283450K265476q122029j2596359j3368347
1194E745404j6589887j8111112o719207J5865883K9063806J7533825m892471j0061099
1186A1835142N671628J4921587o06268k1115006j6969161O696713J7841022N853397
1178B4129054n205119K699664J3673397N762670j3260249j9031404q090981m371
1170F72661n519901j2702665p725422N517372J2521372O075089p671588j5977932
1162b4811014j0328826N495793J7897632J7449035Q789043K811278K642702L364527
1154B3310170K001074k59439l638473q821394j1182374n006450N513597Q233000
$$ plain form
1210 3975577 1112095 1794337 7315215 10922256 9401109 7936609 10661490 14282882
1202 14282882 15562793 18422939 27283213 37566663 39832139 31710110 19113751 5745404
1194 5745404 -10844483 -28955595 -35674802 -19808919 9254887 26788712 21896241 11835142
1186 11835142 17506770 32428357 31822089 10707083 -6262078 434635 18275657 24129054
1178 24129054 18923935 21623599 35296996 41059666 27799417 8768013 677032 672661
1170 672661 -4847240 -17549905 -25275327 -19757955 -7236583 -1161494 -8833082 -24811014
1162 -24811014 -35139840 -29644047 -11746415 5702620 14491663 17302941 19945643 23310170
1154 23310170 25311244 25051805 21413332 12591938 1409564 -3596886 1916711 10149711
1146A0149711r64075j1231690r927893K275115J3497187J4423112O120228l931272
1138B0410423r890709j1258136j0548226r277653p176457m056466k66110L847166
1130b8216168O333638L441276m309397q036955n3178J3156425J6862179Q042990
1122G220810j057099j559227K014406M367645Q050766J2334592Q245095m920827
1114C4696161j2608703p229032k381179r027904j3297293M08687J8007889J4669001
1106B3237627l752680q860933L883661R450663k896633j2733054n543343L462291
1098F247599j751698j1039122q846476p57866J198105K078595J0691168J6493376
1090A4313681L804636j8523227k4560519o923138J3536517J5589407J996646p389823
$$ plain form
1146 10149711 9185636 -2046054 -11973947 -9698832 3798355 18221467 24341695 20410423
1138 20410423 10519714 -738422 -11286648 -20564301 -27740758 -31797224 -32063334 -28216168
1130 -28216168 -21882530 -18441254 -22750651 -30787606 -30840784 -17684359 -822180 7220810
1122 7220810 6163711 4604484 6618890 10986535 19037301 31371893 39616988 34696161
1114 34696161 22087458 14858426 12477247 3449343 -9847950 -9439263 8568626 23237627
1106 23237627 19484947 10624014 14507675 23958338 21061705 8328651 2785308 6247599
1098 6247599 4495901 -6543221 -15389697 -16147563 -14949458 -12870863 -2179695 14313681
1090 14313681 18118317 -404910 -24965429 -31888567 -18352050 -2762643 -765997 -8155820
1082h155820K00710J5730795J7640126j219875j9856831j3699007R881864J9400412
1074A9922374M683264r212967k498370J0344157Q565593j497739l565975j912046
1066B4828291q393561j4953668p698853L692257M56368j0493896p286595P756249
1058a2093408J2137366L392995J542728J0193509R547110n686772j4728175p462715
1050c157362j482003q698065j4214525n642811L230511j423243o647728M920331
1042c3114895K3706431K7738565J5647916L431879j838493n109252p832724p421791
1034A5207636o463494p596720n457168L212641R213692L835110o146796r735139
1026c930238r032616j1000259j0924004k45557J5899271K4476241K2305703J4586568
$$ plain form
1082 -8155820 -7955110 7775685 25415811 24195936 4339105 -9359902 521962 19922374
1074 19922374 24605638 15392671 12894301 23238458 31804051 30306312 26740337 24828291
1066 24828291 16434730 1481062 -6217791 -2525534 -2069166 -12563062 -19849657 -12093408
1058 -12093408 43958 3436953 4979681 15173190 24720300 19033528 4305353 -3157362
1050 -3157362 -4639365 -13337430 -27551955 -33194766 -29964255 -31387498 -38035226 -33114895
1042 -33114895 -9408464 18330101 33978017 37409896 35571403 30462151 22629427 15207636
1034 15207636 8744142 1147422 -4309746 -1097105 8116587 11951697 5804901 -3930238
1026 -3930238 -12962854 -23963113 -34887117 -35132674 -19233403 5242838 27548541 42135109
1018D2135109L216791r114972j1988994j258252P794502m93722j6678053j9028130
1010e415721o033222M648853N510850N333675P792309O510079K296359L453316
1002B4096498O723248k68839j4131652j5706537p58247J1425714Q029066l58255
994A9050996k652103n217368j3356077j5275027k137452J2155126J0352280j194742
986A725633l875272M289308R759852O763258J526620k411884o513822p714931
978C548762j964268M612284K461795m940679n474451J639394M658941j149626
970C392152p084192o780753m895905n280101k595003P182847J6844757J6244552
962A7028354N279587o996711j2218151q061182J530072P823995L641794p618684
$$ plain form
1018 42135109 45351900 36236928 24247934 22989682 30784184 30290462 13612409 -5415721
1010 -5415721 -11448943 -6800090 -1289240 4044435 11836744 18346823 20643182 24096498
1002 24096498 30819746 30550907 16419255 712718 -45529 11380185 19409251 19050996
994 19050996 16398893 11181525 -2174552 -17449579 -19587031 -7431905 2920375 1725633
986 1725633 -2149639 2139669 11899521 18662779 20189399 17777515 11263693 3548762
978 3548762 1584494 6196778 8658573 3717894 -1756557 -117163 4541778 3392152
970 3392152 -3692040 -10472793 -15368698 -20648799 -23243802 -16060955 783802 17028354
962 17028354 22307941 15311230 3093079 -4968103 -3438031 4385964 8027758 409074
954D09074j2976890m044036J2338508K1123789J4748998j004682j4678755j9120675
946c204669j4558459n391429L822845R639714R602643L924687k774309n167705
938d106682m110190n695456j0908110j1381312o04701J4914591K2485168J8461886
930A9055194R539971J259777o326634j2531071j4604369j2954452r604644j964912
922b8131140J1665232K0865725J1826852q935295j5961247O43454J7810841J1496898
914B1281320p591734j1106437L019499R886772m0030o323798M773197J5165064
906B9063853M369152j5953216k0335309r517583n612953j2986498j2308067L642048
898c9638573J5532716R660191J341771Q991988K2180814J7217254n087421k0044694
$$ plain form
954 409074 -12567816 -16611852 -4273344 16850445 31599443 30594761 15916006 -3204669
946 -3204669 -17763128 -23154557 -19331712 -9691998 -89355 3835332 1061023 -4106682
938 -4106682 -8216872 -13912328 -24820438 -36201750 -36806451 -21891860 593308 19055194
930 19055194 28595165 29854942 23528308 10997237 -3607132 -16561584 -26166228 -28131140
922 -28131140 -16465908 4399817 16226669 7291374 -8669873 -8026419 9784422 21281320
914 21281320 13689586 2583149 5602648 15489420 15449390 9125592 13898789 29063853
906 29063853 33433005 17479789 -2855520 -12373103 -17986056 -30972554 -43280621 -39638573
898 -39638573 -24105857 -14445666 -13103895 -4111907 18068907 35286161 30198740 10154046
890A0154046j5247880n099419n439145j1272913q499159L941158J3929165J2646410
882d887737L361668m000556k596391N446254J0864297O899158k840160r218057
874C028476q959914o021874k873559K190672Q526533J1772182J0958909R675052
866B8296477Q097277J840630q335050j4156473j1509293o503958n032617m298283
858a1601290k64829M731310Q128392J2118186J5129688Q387247q725119j9808550
850H095035j1820984L784901O883124n23044L89827J1264671J1715900n912684
842B3876746k0082708j1647093O532732R529530k945568j0395482m990608P66620
834i355831r45384j794614L967253P755362L278107r6587O573361J3909474Q041131
$$ plain form
890 10154046 -5093834 -10193253 -15632398 -26905311 -35404470 -31463312 -17534147 -4887737
882 -4887737 -1526069 -5526625 -8123016 -2676762 8187535 15086693 12246533 3028476
874 3028476 -5931438 -11953312 -14826871 -12636199 -4109666 7662516 18621425 28296477
866 28296477 36393754 38234384 29899334 15742861 4233568 -2270390 -7303007 -11601290
858 -11601290 -11866119 -7134809 993583 13111769 28241457 36628704 27903585 8095035
850 8095035 -3725949 58952 6942076 6419032 6808859 18073530 29789430 23876746
842 23876746 3794038 -7853055 -1320323 8209207 5263639 -5131843 -10122451 -9355831
834 -9355831 -10301215 -12095829 -8128576 -373214 2904893 2808306 9381667 23291141 31332272
825C1332272n227404q026475N39655K341632r734356j8773398j0089651N703588
817a1934137R646862K107841l150545l761035q090653j3827658q339104P735462
809b9612967J6922323J0735438J677860J791240N694112M929900L518211O272393
801B1928510N343479o109605j7456701j4219878n31018P708304N708324N87310
793B958725m346372r804593j0432647j689660P357720N404826j145693J764908
785i932786J0156341Q116403k755805m716278M096861N538006n113999q982415
777c593672K546133J0409747J5571j3273412j0439267K67905J526308j250073
769a3790760P604416K1391306J8247951l619680k1863866k0460485n132236J0605152
$$ plain form
825 31332272 26104868 18078393 18618048 20959680 11225324 -7548074 -17637725 -11934137
817 -11934137 -2287275 -179434 -3329979 -7091014 -15181667 -29009325 -37348429 -29612967
809 -29612967 -12690644 -1955206 -277346 1513894 7208006 12137906 15656117 21928510
801 21928510 27271989 21162384 3705683 -10514195 -11045213 -3336909 2371415 2958725
793 2958725 -1387647 -11192240 -21624887 -23314547 -15956827 -10552001 -11697694 -9932786
785 -9932786 223555 8339958 5584153 867875 4964736 10502742 5388743 -3593672
777 -3593672 -1047539 9362208 9377779 -3895633 -14334900 -14066995 -12540687 -13790760
769 -13790760 -6186344 15204962 33452913 29833233 7969367 -12491118 -17623354 -7018202
761g018202J7682404J1329969m874751j5953023j1125271K73821K742399j205906
753h148560J369209P619242K573165j2278798j7370887n117182R779822J4646330
745f927659J3051099R409243M25316j0379533j0167940J207040O069510l060571
737c73495r825945j973345O692074L23784j0087095l996311J4370617K2293859
729A7424143J2477619j362200r118561j3158462j3559963n442746O255070Q097018
721A611918q84248o075609p03005M036619K07758j777391P936018J7709143R583139
712C1644342j1196339k0160856p344161R460612J0564453l25504o685787m855426
704A101334m543678p597509l160043J1729537K1314416J1413439q769619j7818437
$$ plain form
761 -7018202 10664202 21994171 17119420 1166397 -9958874 -9685053 -6942654 -8148560
753 -8148560 -6779351 839891 3413056 -8865742 -26236629 -31353811 -21573989 -6927659
745 -6927659 6123440 15532683 15957999 5578466 -4589474 -3382434 2687076 -373495
737 -373495 -10199440 -12172785 -5480711 -5156927 -15244022 -19240333 -4869716 17424143
729 17424143 29901762 28539562 19421001 6262539 -7297424 -12740170 -6485100 1611918
721 1611918 727670 -5347939 -6050944 -2014325 -1806567 -3583958 4352060 22061203 31644342
712 31644342 20448003 287147 -7057014 2403598 12968051 12642547 5956760 1101334
704 1101334 -3442344 -11039853 -14199896 -2470359 18844057 30257496 21487877 3669440
696C669440j0099883N49050L055208J192000J921848M641146O400607O960258
688A8289674L763151p521132k1316883k1740851k963551J8305690K1027236N155153
680A2998487j0855153j3610498n990037K675754P472710Q000547N051741J17023
672E860574m444733n740922j352451O824245J0098942J048911j3820373j7355997
664a8881804k361433J8086814K6024180J7294986n8716j7167802k6730037k3006711
656b6800523r390333P96550N99979l68775Q236564J9860790K1753038J5398324
648C0085614J0910127P195456m310327j9051417k1786988j0705045p85101L44451
640h103230J899396R198395J1304611K60954j1700558q297250O215351J2716851
$$ plain form
696 3669440 -6430443 -5881393 -2826185 -1634185 287663 4928809 11329416 18289674
688 18289674 22052825 14531693 -6785190 -28526041 -31489592 -13183902 7843334 12998487
680 12998487 2143334 -11467164 -17457201 -14781447 -7308737 691810 5743551 5860574
672 5860574 1415841 -4325081 -5677532 1146713 11245655 12294566 -1525807 -18881804
664 -18881804 -21243237 -3156423 22867757 40162743 40104027 22936225 -3793812 -26800523
656 -26800523 -36190856 -35394306 -34794327 -35163102 -26926538 -7065748 14687290 30085614
648 30085614 40995741 48191197 43880870 24829453 3042465 -7662580 -8447681 -8103230
640 -8103230 -6203834 2994561 14299172 14560126 2859568 -5437682 777669 13494520
632A3494520L717036q087998q056270K551628J0096681N626593n380854j0803797
624C157539p069236k203083k943419n407582l175458K064154N271473P137269
616c168343R229900O561191l272490r663058k440696Q858810O440263p489085
608E056492j3212316m384139M551799M945449N460512R761393N598053j1182507
600F594736k2044545j1557913Q314834J6731476J3062099R773560Q178798Q61010
592B9914055r523797j2696242p799620k629450J2392J861150M99248n766458j0321117
583a6449839q184818n877792p996929m318598J2207467K5151332J5258033n518206
575D270650p287378J1864038K1443928N290950j4434640j2342535L552626P803559
$$ plain form
632 13494520 17211556 9123558 1067288 3618916 13715597 19342190 13961336 3157539
624 3157539 -3911697 -6114780 -9058199 -14465781 -17641239 -15577085 -10305612 -3168343
616 -3168343 6061557 12622748 9350258 -312800 -2753496 6105314 12545577 5056492
608 5056492 -8155824 -12539963 -7988164 -3042715 2417797 12179190 17777243 6594736
600 6594736 -15449809 -27007722 -18692888 -1961412 11100687 20874247 29053045 29914055
592 29914055 20390258 7694016 -105604 -2735054 -2722662 -861512 -362264 -6128722 -16449839
583 -16449839 -24634657 -30512449 -38509378 -42827976 -30620509 -5469177 9788856 4270650
575 4270650 -3016728 8847310 30291238 35582188 21147548 8805013 12357639 20161198
567B0161198m684213j5598396j1322538J589048Q590501N129554M3442L324548
559G233144J1742855J0975795l921714j7460102j3476454O91646N403253k05293
551I83130J172184J2655399J5023694q14925j5226285q388045R536034J4128744
543B9069930Q38412j4018423j8242067j3043765k820027Q277160J2189392L905817
535F156429p871583r034050J052284R446180Q056539J802555k185685l504261
527C918408m309861m400437l638394l557847m041670k663238J051570M249153
519a3392316M681467L201701J903571J965012L087177L413111J138735k412099
511C586359l507486j392306J09212j453698l222457k085190m0349n84786k665090
$$ plain form
567 20161198 15476985 -121411 -11443949 -9854901 -1264400 3865154 3908596 7233144
559 7233144 18975999 29951794 26030080 8569978 -4906476 -4214830 1188423 983130
551 983130 2155314 14810713 29834407 29019482 13793197 5405152 14941186 29069930
543 29069930 29908342 15889919 -2352148 -15395913 -18215940 -9938780 2250612 6156429
535 6156429 -1715154 -10749204 -9696920 -250740 7805799 9608354 7422669 3918408
527 3918408 -391453 -4791890 -8430284 -11988131 -16029801 -18693039 -17641469 -13392316
519 -13392316 -8710849 -5509148 -3605577 -1640565 1446612 4859723 5998458 3586359
511 3586359 78873 -1313433 -1204221 -2657919 -5880376 -7965566 -8005915 -8590701 -11255791
502a1255791k428980R70795M920836O986101O069362J940546l427284n819257
494b043672k974328K074065L637759j084071q983813j2491181o086593N829442
486b2122392J0905895L702955n537284m734214J945119J598842m791906l148065
478b2181050Q980235J6071918R216710J15275N63339L482479k164116j0401317
470C683473q026942L541562J1703670J1581157P387755R04005p362114j0976671
462A2435895n771132k81386l732178q916768l015032R040683J0235364j106447
454H888999q244106j868907Q482264J2250643J0689591O856893j930766j4395314
446B0729297k0407386j3597957k02728R774044J2196948P090712k704104q469967
$$ plain form
502 -11255791 -13684771 -12713976 -7793140 -807039 5262323 7202869 3775585 -2043672
494 -2043672 -5018000 -2943935 693824 -390247 -9374060 -21865241 -27951834 -22122392
486 -22122392 -11216497 -7513542 -13050826 -17785040 -15839921 -14241079 -19032985 -22181050
478 -22181050 -13200815 2871103 12087813 12203088 12766427 16248906 14084790 3683473
470 3683473 -4343469 -801907 10901763 22482920 29870675 30774680 23412566 12435895
462 12435895 6664763 6383377 2651199 -6265569 -9280601 -239918 9995446 8888999
454 8888999 644893 -1224014 7258250 19508893 30198484 37055377 35124611 20729297
446 20729297 321911 -13276046 -13478774 -3704730 8492218 15582930 12878826 4408859
438D408859k300947R483630J0862760j659702j2923867j0485513k88589N967879
430C064510P636292R869070J0749328M784305n553973j1232776p983893o61050
422A0671813K341103l169475j2107675j2799472j50708J4613159J5344384J984392
414A6727521r529132r019441k267128K680417O268715R329540O905844j933682
406A9162654q356557n988503l87113P70334j577819l790351p177031j2080956
398a9425342j2664984n570904L377254P789248Q492825P261885K346171l510294
390a1904141j651437P868236J1576512K034279r243894r148274k067350P56193
382a1779876M1911K200390L817782j577698q625662q054354l280461l165398m303904
$$ plain form
438 4408859 2107912 11591542 22454302 20794600 7870733 -2614780 -2903369 3064510
430 3064510 10700802 20569872 31319200 36103505 30549532 19316756 11332863 10671813
422 10671813 13012916 9843441 -2264234 -15063706 -15214414 -601255 14743129 16727521
414 16727521 7198389 -1821052 -4088180 -1407763 4860952 14190492 21096336 19162654
406 19162654 10806097 4817594 4430481 5200815 3622996 -167355 -7344386 -19425342
398 -19425342 -32090326 -37661230 -34283976 -26494728 -18001903 -10740018 -8393847 -11904141
390 -11904141 -13555578 -5687342 5889170 7923449 -1320445 -10468719 -12536069 -11779876
382 -11779876 -11737965 -9537575 -5719793 -7297491 -15923153 -23977507 -27257968 -30423366 -34727270
373c4727270K234390J1637124J1609882M730455M782709J1547487R792453l895833
365A7711397j3087765o543882N711492R176503L617279k903718o427179n564486
357A689641J445506R969635Q941577l914725j4853859j0584087M232627J3768129
349A0694444J0478487O39508o070513o135209k889202j739915m002339m754442
341c779181M26185P058178N618520m869573j3032012q404640N277724J3616076
333A911277P060109q778987j8178203j1381619M336149J2703502P931345L51503
325d044924M77445N655823Q035597P096558N609408R48219q558491j4647085q546646
316g974096M700390J2569453J1502399O142897j955468j1781688j5046378o368334
$$ plain form
373 -34727270 -32492880 -20855756 -9245874 -4515419 267290 11814777 21607230 17711397
365 17711397 4623632 -1920250 3791242 12967745 16585024 13681306 7254127 1689641
357 1689641 3135147 13104782 22046359 18131634 3277775 -7306312 -3073685 10694444
349 10694444 21172931 21812439 15741926 9606717 6717515 4977600 975261 -3779181
341 -3779181 -3352996 3705182 9323702 4454129 -8577883 -16982523 -11704799 1911277
333 1911277 8971386 192399 -17985804 -29367423 -25031274 -12327772 -4396427 -4044924
325 -4044924 -3567479 2088344 10123941 17220499 22829907 23778126 15219635 572550 -7974096
316 -7974096 -3273706 9295747 20798146 26941043 24985575 13203887 -1842491 -8210825
308h210825L546587J536501n820074k477908Q524250R144597j671435m698995
300a27302O518280J3418237K173153j5167064k0097660j0857528L606868J6473056
292d059960K0720612J0603007n113210p791537M082069R975811j099030j3514724
284A3803038j1782247m395232n031622q200923k382941P334842Q790652L133150
276A268717j381211m510874p256026k840545R127321J3185372N61226j2727948
268d573968r659421J96293j332554r313745p075401K337012L502305j059875L392688
259b3586666J2948864R165659p081835j3887747k643307J0940774J3298132P987527
251G141401J517472m662218o111028L45790M190339n795509j7749723j0324935
$$ plain form
308 -8210825 -4664238 -3127737 -8947811 -11425719 -2901469 6243128 4571693 -127302
300 -127302 6390978 19809215 21982368 6815304 -13282356 -24139884 -20533016 -4059960
292 -4059960 16660652 27263659 22150449 14358912 18440981 28416792 27317762 13803038
284 13803038 2020791 -2374441 -7406063 -15606986 -17989927 -10655085 -1864433 1268717
276 1268717 -112494 -4623368 -11879394 -14719939 -5592618 7592754 8153980 -4573968
268 -4573968 -14233389 -14037096 -15369650 -24683395 -31758796 -29421784 -25919479 -26979354 -23586666
259 -23586666 -10637802 -1472143 -8553978 -22441725 -25085032 -14144258 -846126 7141401
251 7141401 8658873 3996655 -2114373 -1768583 2421756 -3373753 -21123476 -31448411
243c1448411J0941461J8566077O064721m005763q6487J911688p557237j2285631
235a7899582m11884J2979957J1247753J438681l128890m357102o332866j594211
227h058144J1210858J5468763J791671j2813213j0524684k89166M81925m864397
219g596387l419833J600498m28301n313654l256468N35028l330260p505014n81693
210b9296084R317855P512358J98494L447381J2263078Q049761p265610j2699886
202h472653l332658L209509k013304p069187l278841J755205J916530K678033
194a4607366O430089O354278J510738N75091M811763M842421l72467p9311O634108
185A6099344N852521n916180j1889018k299915P616488J993597r939934j0041391
$$ plain form
243 -31448411 -20506950 -1940873 4123848 118085 31598 1943286 -5613951 -17899582
235 -17899582 -18311466 -5331509 5916244 7354925 4226035 -131067 -6463933 -8058144
227 -8058144 3152714 18621477 20413148 7599935 -2924749 -3213915 -2731990 -7596387
219 -7596387 -11016220 -9415722 -9844023 -15157677 -18414145 -17879117 -21209377 -28714391 -29296084
210 -29296084 -19978229 -12465871 -12267377 -8819996 3443082 11492843 4227233 -8472653
202 -8472653 -11805311 -8595802 -10609106 -17678293 -20957134 -19201929 -17285399 -14607366
194 -14607366 -8177277 -1822999 -312261 262830 5074593 9917014 9544547 9465236 16099344
185 16099344 21951865 16035685 4146667 1846752 9463240 11456837 1516903 -8524488
177h524488l5830M869871K098740K172802P683520R639606M220373j479728j996990
168A8647876o45203k030685n521052p848534o722548j770143L825756M288925
160B224392j672678p191401n514556O59579L387547P54709j521166J513382Q621432
151A261240J4481546J3983747N919072m960596j1465138j1431285q995823p476901
143h684138n753427l382209k848202l278433Q83650R315043J1079357j039231
135c707590j6437742j7121238p32193J6182784J8514067Q046006l283980q027588
127f567474o875964k865320K119974O065793O636608M022308J998433L706988
119H241346O745359N542215k76475l952651j487374R20284l994110j1125022q592269
$$ plain form
177 -8524488 -8560318 -3690447 -1591707 581095 8264615 17904221 22124594 20644866 18647876
168 18647876 18002673 15971988 10450936 2602402 -4120146 -5890289 -2064533 2224392
160 2224392 551714 -6639687 -12154243 -11494664 -8107117 -7352408 -8873574 -7360192 1261240
151 1261240 15742786 29726533 35645605 30685009 19219871 7788586 -1207237 -8684138
143 -8684138 -14437565 -17819774 -20667976 -23946409 -23062759 -13747716 -2668359 -3707590
135 -3707590 -20145332 -37266570 -37998763 -21815979 -3301912 4744094 1460114 -6567474
127 -6567474 -13443438 -16308758 -14188784 -8122991 -1486383 2535925 4534358 8241346
119 8241346 14986705 20528920 20252445 16299794 14812420 15732704 11738594 613572 -7978697
110g978697K949878P891482k739236j7038834j7162005j535871J5790256K2436793
102B613766J6193357J425926j3185663j6419739m470398J1233309J5018246N748308
94A8157112l759119n534790m192452m170633j163446P285749J2479736N871243
86B4973400n986355q810402j031176M110098j452702q889677o438262K875683
78f49393O582015J944310r78222L670316P995221L440963m712021n219673R94331
69A3067847J757761o883910j3273709p528388K409727J425716r999524j4617818
61c3642298k183273J4633823J5530471j98481j1601399l709883J1808013J2326071
53B963044m305038j6867501j0723862L180646P150144K540135L077288R860045
$$ plain form
110 -7978697 -5028819 2862663 123427 -16915407 -34077412 -35613283 -19823027 2613766
102 2613766 18807123 20233049 7047386 -9372353 -13842751 -2609442 12408804 18157112
94 18157112 14397993 8863203 4670751 500118 -663328 6622421 19102157 24973400
86 24973400 18987045 10176643 9145467 13255565 11802863 2913186 -3525076 -649393
78 -649393 5932622 7876932 6898710 10569026 18564247 22005210 17293189 12073516 13067847
69 13067847 14825608 7941698 -5332011 -12860399 -10450672 -9024956 -19024480 -33642298
61 -33642298 -35825571 -21191748 -5661277 -5859758 -17461157 -21171040 -9363027 2963044
53 2963044 -1341994 -18209495 -28933357 -25752711 -18602567 -16062432 -12985144 -3125099
45c125099J0150703j17254r380191r239223n417849m426580k963520J628296K797699
36b0093018l216258p201847m47260R631422R770662J001943m106432n96464M888581
27a0368671P204704P783410P025086K821738k417185l222241q78713k566031r038121
18c656024j2045917o554872K280570O987736N894098J557705k194782n26865P467890
9g90461J2866779N044932j1548523j8511458o557533J1334879J6604171P436135
1A5878921l467329
0A2411592
$$ plain form
45 -3125099 7025604 6908350 -2471841 -11711064 -17128913 -21555493 -24519013 -22890717 -20093018
36 -20093018 -23309276 -30511123 -30958383 -21326961 -11556299 -10554356 -14660788 -15257252 -10368671
27 -10368671 -3163967 4619443 11644529 14466267 12049082 8826841 7948128 5382097 -3656024
18 -3656024 -15701941 -22256813 -19976243 -12988507 -7094409 -5536704 -7731486 -8258351 -790461
9 -790461 12076318 17121250 5572727 -12938731 -19496264 -8161385 8442786 15878921
1 15878921 12411592
0 12411592
$$ Imaginary data points
##PAGE= N=2
##DATA TABLE= (X++(I..I)), XYDATA
65535A5256397k718611k024770k62391J8525m198824j1221762j2997191m693158
65527b2841785O929100J0782321N293146r71076j713472J63402q88761m749916
65519g997041o685020l926851J396542M769417L224255k354029p781299q955903
65511b8309929n218744R29793O780137J0591917J0603319N953591o46773m323025
65503c639714l796705k607744k473305K36177P036797J0862205M615926o352589
65495C881048r869052m690578j419801l558258j206020R394630J4157514K164664
65487H854147j2887945j0279337N308893J0064735j456286q150499K672520J4536146
65479H662374Q806456n848012q834924O622L701525k465054n326948K389504J0570449
$$ plain form
65535 15256397 12537786 10513016 10250625 10269150 6070326 -5151436 -18148627 -22841785
65527 -22841785 -15912685 -5130364 162782 -808294 -2521766 -2358364 -3247125 -7997041
65519 -7997041 -14682061 -18608912 -17212370 -12442953 -9218698 -11572727 -19354026 -28309929
65511 -28309929 -33528673 -32598880 -25818743 -15226826 -4623507 1330084 683311 -3639714
65503 -3639714 -7436419 -10044163 -12517468 -12281291 -5244494 5617711 10233637 3881048
65495 3881048 -5988004 -10678582 -12098383 -15656641 -16862661 -7468031 6689483 8854147
65487 8854147 -4033798 -14313135 -9004242 1060493 -395793 -8546292 -5873772 8662374
65479 8662374 17468830 11620818 2785894 2792516 6494041 4028987 -1297961 1091543 11661992
65470A1661992Q568905Q4144n075825m642117l043874l207066m430407m661621
65462d745869j912775L447555O890167M258474j664526m119393k137390j389775
65454a373532m282050n842436k164301L106727M724171L516856L365507L746647
65446D797589O27903n985920r914424n740650M084539J0965132R032080R36047
65438H802296o110243q220429o069766l42184Q103263J3357682P790652n875888
65430A1435383j3401047o385634N641586Q545879L184276J291704N747518P433911
65422B3493576J435105n763589p801465o901039p020907o857646l585046K739456
65414a0261555J0524610J5985288J1469572n745709k2331815j9477074J064920
$$ plain form
65470 11661992 20230897 20315041 15239216 10597099 7553225 4346159 -84248 -4745869
65462 -4745869 -6658644 -3211089 3679078 7937552 6273026 2153633 16243 -1373532
65454 -1373532 -5655582 -11498018 -13662319 -10555592 -5831421 -2314565 1050942 4797589
65446 4797589 5425492 -560428 -10474852 -16215502 -12130963 -1165831 7866249 8802296
65438 8802296 2692053 -5528376 -11598142 -11940326 -3837063 9520619 17311271 11435383
65430 11435383 -1965664 -8351298 -2709712 5836167 9020443 10312147 16059665 23493576
65422 23493576 24928681 19165092 11363627 4462588 -2558319 -9415965 -13001011 -10261555
65414 -10261555 263055 16248343 27717915 21972206 -359609 -19836683 -18771763
65407a8771763J4805002O140510j0552721j2576572m99069O876893J979331m131055
65399a6729444k085107L983310P211370P268427M704979k524227j1207274j1325662
65391b0703628J33952J1069134Q511523l498056r137799k119309P059714O621059
65383b063410j375710o097878l341926P93599O97407j021431O69709M589433N442975
65374a707232K229859p84824r96074k90405l35772L10616K974819O515600R237253
65365A7153840R520651M536731o333108j6149679j5333683m443000M834858M986150
65357a227240J606240K107931L627248J64110m977103m102167J698703M818299
65349C716021L947857L815868L705364j794167r899092r938135j95559O850131
$$ plain form
65407 -18771763 -3966761 2173749 -8378972 -20955544 -21454613 -14577720 -12598389 -16729444
65399 -16729444 -18814551 -14831241 -7619871 -351444 4353535 1829308 -9377966 -20703628
65391 -20703628 -20569676 -9500542 -989019 -4487075 -13624874 -15744183 -8684469 -2063410
65383 -2063410 -3439120 -9536998 -12878924 -12085325 -11387918 -12409349 -11739640 -7150207 -1707232
65374 -1707232 522627 -262197 -1258271 -1548676 -1884448 -1573832 1400987 7916587 17153840
65365 17153840 26674491 31211222 24878114 8728435 -6605248 -11048248 -6213390 -1227240
65357 -1227240 379000 2486931 6114179 6278289 1301186 -2800981 -1102278 3716021
65349 3716021 7663878 11479746 15185110 13390943 3491851 -6446284 -6641843 208288
65341B08288J996155p452507r070614k261813M150387N504967M160860K493632
65333b70645Q17788K29008J091018M06827l784092p430121n383255P36349N110478
65324h476645N996736N503455L445394j306820m744633j447301N051024M338195
65316H359405n568209j2994252p876402L811515P698283o4432q590246p074493
65308b2298831J887319O721722J888328n848478p254368k719670O62729K201965
65300b4759284Q406006J7457718J4449144o900050k6538870j9293393Q830873
65293b8347856K5229600J4870947r34794L18210R056747L580310j2361388j6036009
65285d624233k539803R481938Q294083K488048M26660k686990r880054j2674427
$$ plain form
65341 208288 2204443 -5248064 -14318678 -16580491 -12430104 -6925137 -2764277 -270645
65333 -270645 547143 776151 1867169 2273996 -1510096 -8940217 -14323472 -13587123 -8476645
65324 -8476645 -2479909 3023546 6468940 5162120 417487 -1029814 4021210 8359405
65316 8359405 2791196 -10203056 -18079458 -14267943 -6569660 -6634092 -15224338 -22298831
65308 -22298831 -20411512 -13689790 -11801462 -17649940 -24904308 -27623978 -26961249 -24759284
65300 -24759284 -16353278 1104440 15553584 8653534 -17885336 -37178729 -28347856
65293 -28347856 -3118256 11752691 10817897 11136107 20192854 23773164 11411776 -4624233
65285 -4624233 -7164036 2317902 10611985 13100033 13526693 10839703 959649 -11714778
65277a1714778n860893K603847N625520P417133J1028828R518992K52543n633236
65269A3237956o91209M426725j764357j1295776r782407k20320L615506J40245
65261b333637j655394r55102l442235n044323K745737J3142675J0255473m110564
65253H602630j0416184j678793O493604K574422l721251r17133M657711J673466
65245G268472o652744r272336m842075m60221J139617K863375N507374O311236
65237A862698K949862m351580j1058767q997956L697016J4545181J0035040l481316
65229E200178o967370K108856O079498k893843r998864m565902J606789k545254
65221a1975912n744482M461765J5654795Q948251q557427j4287636n341456J491074
$$ plain form
65277 -11714778 -17575671 -14971824 -9346304 -1929171 9099657 18618649 18871192 13237956
65269 13237956 12546747 16973472 15209115 3913339 -5869068 -6089388 -2473882 -2333637
65261 -2333637 -3989031 -4944133 -8386368 -13430691 -10684954 2457721 12713194 8602630
65253 8602630 -1813554 -3492347 3001257 5575679 1854428 937295 5595006 7268472
65245 7268472 615728 -8656608 -13498683 -13958904 -12819287 -9955912 -4448538 1862698
65237 1862698 4812560 460980 -10597787 -19595743 -15898727 -1353546 8681494 5200178
65229 5200178 -1767192 341664 6421162 3527319 -6471545 -11037447 -9430658 -11975912
65221 -11975912 -17720394 -13258629 2396166 11344417 2786990 -11500646 -16842102 -15351028
65213a5351028K23098J218371O922996O227253l219760q059290p76882Q675902
65205d139340R060517K050659m682480p134417m754647o75252k081682r828129
65197b2184771j1265629K685347J8449450J6404204K464469k28248R637828Q267869
65189B4230519j1892293k5954363j4794874N357588R191216j643010q068526l814494
65181b7388237L245557Q457683J1273972Q040105n29811l760342K995556P263695
65173I598178r22916r967560m528197Q454279J1087221L160426j295590M31872
65165A6017713r28792n810813n568563r84164p55655l225369j57550L066448n909315
65156d256060j9287862j4312686R412606K3762399J3153374k809834k012286P447518
$$ plain form
65213 -15351028 -15127930 -13909559 -6986563 -759310 -3979070 -12038360 -12815242 -4139340
65205 -4139340 4921177 6971836 2289356 -4845061 -9599708 -10274960 -12356642 -22184771
65197 -22184771 -33450400 -30765053 -12315603 4088601 6553070 6324822 15962650 24230519
65189 24230519 12338226 -13616137 -28411011 -23053423 -13862207 -15505217 -23573743 -27388237
65181 -27388237 -24142680 -15684997 -4411025 3629080 3099269 -661073 2334483 9598178
65173 9598178 8675262 -1292298 -5820495 2633784 13721005 16881431 15585841 16017713
65165 16017713 15088921 9278108 3709545 2725381 1969726 -1255643 -1413193 1653255 -4256060
65156 -4256060 -23543922 -37856608 -28444002 -4681603 8471771 5661937 3649651 11097169
65148A1097169O405765k006079j606346O148208N588488l903138n577724O260242
65140B2406585J5387764P450031r708443j7694426j0940548p27891L97518p329309
65132g58719j2587199p162232L548512P626213L154891m932L091146M627249m08083
65123A126846k197281P832542J7728623R057287j3184699k3410899j0322890Q456151
65115d914320J2480190L489356m600527o970698p137646n115981L15321L992469
65107h461836J534024p22640M901763J2423176R937960l50276m669902k59224
65099A4333045L22577q700191j5008341o929140Q633584J6929539J4830282Q999261
65091C3410616J890552q466946j8583515k0892313j4378148n386671J286094N009316
$$ plain form
65148 11097169 17502934 15496855 13890509 20038717 25627205 21724067 16146343 22406585
65140 22406585 37794349 45244380 35535937 17841511 6900963 6173072 6570590 -758719
65132 -758719 -13345918 -20508150 -16959638 -9333425 -6178534 -6183466 -3092320 1534929 1126846
65123 1126846 -1070435 6762107 24490730 33548017 20363318 -3047581 -13370471 -4914320
65115 -4914320 7565870 11055226 6454699 -515999 -7653645 -12769626 -12454305 -8461836
65107 -8461836 -6927812 -7650452 -2748689 9674487 19612447 19262171 14592269 14333045
65099 14333045 14655622 5955431 -9052910 -15982050 -7348466 9581073 24411355 33410616
65091 33410616 35301168 26834222 8250707 -12641606 -27019754 -32406425 -31120331 -26111015
65083b6111015N151783K202032J189030N720173J0289505P311403R5339j386836
65075D461414L218217M333262o80572l181902O79728K483048l440252r290905
65067a417962o793363q28177M9379j791611N97998M584388K898195j743894n10891
65058d955938N001691L997601m784609r120339k437663M914456J015158r425907
65050a5795550j1409881l06867J2256558J3209083L080719n942167m827135K173398
65042g561842M006615j549431l949592M787268J6061798J4479639j9909j0369798
65034A5884748n534880M602128M327365n740186j1410791n848438L122579O549777
65026E952302N015724K771955K2239l395707l454778J612922M995689p1629q071974
$$ plain form
65083 -26111015 -20959232 -18757200 -17568170 -11847997 -1558492 5752911 5848250 4461414
65075 4461414 7679631 12012893 11332321 8150419 8830147 11313195 7872943 -1417962
65067 -1417962 -8211325 -9039502 -8990123 -10781734 -10183736 -5599348 -2701153 -4445047 -4955938
65058 -4955938 45753 4043354 -741255 -9861594 -12299257 -7384801 -6369643 -15795550
65050 -15795550 -27205431 -27512298 -15255740 -2046657 1034062 -4908105 -9735240 -7561842
65042 -7561842 -3555227 -5104658 -9054250 -4266982 11794816 26274455 26254546 15884748
65034 15884748 10349868 14951996 19279361 13539175 2128384 -3720054 -597475 5952302
65026 5952302 10968026 13739981 13762220 10366513 6911735 8524657 13520346 13448717 5376743
65017E376743p323606J996452O783476Q40631n376662j640964N414663L240119
65009I310852n924987q402168m16795P092766N577975j086664n744729o191957
65001e785707j734593P231778J2800361N083102j0187019j2563498N493445K3707770
64993B4045639J9002473l657367j9530882j6981151o772692j387784r35990j369474
64985g587228k895476n006531k985774M483544J0282312O857362l632182j0658228
64977a1142201o180691O408101J4346850Q832768l787005r354163m960729j720446
64969g557516n219762n347748N802996J8022173J8164167J0912774Q053761N860611
64961D8691456o590070k2166780k2130999p121032K253702j130983j311901R753857
$$ plain form
65017 5376743 -1946863 49589 6833065 7673696 2297034 656070 6070733 9310852
65009 9310852 3385865 -5016303 -5433098 1659668 7237643 6150979 406250 -5785707
65001 -5785707 -7520300 -288522 12511839 17594941 7407922 -5155576 337869 24045639
64993 24045639 43048112 39390745 19859863 2878712 -3893980 -5281764 -6217754 -7587228
64985 -7587228 -10482704 -15489235 -18475009 -13991465 -3709153 3148209 -483973 -11142201
64977 -11142201 -17322892 -10914791 3432059 12264827 8477822 -876341 -5837070 -7557516
64969 -7557516 -12777278 -18125026 -12322030 5700143 23864310 34777084 42830845 48691456
64961 48691456 42101386 19934606 -2196393 -9317425 -7063723 -8194706 -9506607 247250
64953B47250J6153550N532940r147542j1243367n221159k534986J02050Q296663
64945B185399J0915055l002510j8988932j4181812O202839J4937633L854307o365091
64937d443112p73587R106914P522577j948308o363557k946457K328453N543214
64929H026137N025580r55791r028754j0832070m773733O0531k186819m850628
64921a9515547n13956O375312P580624M766658N056676P977302P528092M455482
64913B3710643N505509J0293923Q961934l620598j8206210k0756138q960179M787569
64905A716453P042323k148525j0384037q696091k233155q89507l034835J817145
64897a6810229J3463074J6247922R15485j8797622k2674197j0714278j35945R39581
$$ plain form
64953 247250 16400800 21933740 12786198 1542831 -3678328 -6213314 -6111264 2185399
64945 2185399 13100454 10097944 -8890988 -23072800 -16869961 -1932328 1921979 -4443112
64937 -4443112 -5216699 3890215 11412792 9464484 3100927 154470 2482923 8026137
64929 8026137 13051717 12095926 3067172 -7764898 -12538631 -12478100 -14664919 -19515547
64921 -19515547 -20029503 -13654191 -6073567 -1306909 3749767 11727069 19255161 23710643
64913 23710643 29216152 39510075 48472009 44851411 26645201 5889063 -3071116 1716453
64905 1716453 8758776 6610251 -3773786 -12469877 -14703032 -15592539 -18627374 -16810229
64897 -16810229 -3347155 12900767 13816252 -4981370 -27655567 -38369845 -38505790 -37566209
64889c7566209J429103P410496R997586R00124j1385100j1813993P68533J3357857
64881b6901603J6032262J1063787N972451M493081M955249L426071j632932o263007
64873A1145359n296494j017934j574028p569456q679321m02179N199218k927448
64865a1122283j4307994r964677P864306J7235720Q333454m874985r114264r057937
64857b5008660j1562291j0444973L4481J0711905J1023668N653493L538740J512996
64849a4540641n158024o914535N803055K0308845J5633376m895249j6934459j0404429
64841a7102061K91399L434881N301066J1917402J5507340R023771j205437o693607
64833B0474754p792636o231886j52270O299252K883120q880989j2547626j452326
$$ plain form
64889 -37566209 -36137106 -28726610 -18729024 -17828900 -29214000 -41027993 -40259460 -26901603
64881 -26901603 -10869341 194446 6166897 10659978 15615227 19041298 17408366 11145359
64873 11145359 5848865 4830931 3256903 -4312553 -12991874 -13394053 -8194835 -11122283
64865 -11122283 -25430277 -35394954 -27530648 -10294928 -1961474 -6836459 -15950723 -25008660
64857 -25008660 -36570951 -47015924 -46981443 -36269538 -25245870 -19592377 -16053637 -14540641
64849 -14540641 -19698665 -26613200 -20810145 -501300 15132076 10236827 -6697632 -17102061
64841 -17102061 -16810662 -13375781 -8074715 3842687 19350027 28373798 27168361 20474754
64833 20474754 12682118 6450232 6297962 12597214 15480334 6599345 -5948281 -7400607
64825g400607P999888L4113j6498353k1557705j0713767M931661J6017200J8774249
64817h413321J0695623l721070j0567614l030665P170879P106186J969170K915814
64809D125002N849377L00835q593238p334823J477802K879066m218145n706860
64801a1220984J733995M340677m370196j2055947p925610J403287N247489M791169
$$ plain form
64825 -7400607 599281 633394 -15864959 -37422664 -48136431 -43204770 -27187570 -8413321
64817 -8413321 2282302 -1438768 -12006382 -15037047 -7866168 -759982 1209188 4125002
64809 4125002 9974379 10275214 1681976 -5652847 -4175045 -1295979 -5514124 -11220984
64801 -11220984 -9486989 -5146312 -9516508 -21572455 -29498065 -28094778 -22847289 -18056120
$$ [...]
##END NTUPLES=NMR SPECTRUM
##END=
