##TITLE=31Pdec_LR-628-CR2
 DMSO-d6, 124 sc
 3.7.2019
##JCAMPDX= 6.0         $$ Bruker NMR JCAMP-DX V2.0
##DATA TYPE= NMR SPECTRUM
##DATA CLASS= NTUPLES
##ORIGIN= UXNMR, Bruker Analytische Messtechnik GmbH
##OWNER= root
$$ XWIN-NMR		Version 3.5
$$ Wed Jul  3 16:22:27 2019 Russian Standard Time (UT+4h)  she@DPX200
##.OBSERVE FREQUENCY= 81.013821
##.OBSERVE NUCLEUS= ^31P
##.ACQUISITION MODE= SIMULTANEOUS
##.ACQUISITION SCHEME= undefined
##.AVERAGES= 124
##.DIGITISER RES= 17
##SPECTROMETER/DATA SYSTEM= spect
##.PULSE SEQUENCE= zgpg30
##.SOLVENT NAME= DMSO
##.SHIFT REFERENCE= (INTERNAL, DMSO, 0, 182.463)
##AUDIT TRAIL= $$ (NUMBER, WHEN, WHO, WHERE, WHAT)
$$ ##TITLE= Audit trail, XWIN-NMR		Version 3.5
$$ ##JCAMPDX= 5.01
$$ ##ORIGIN= Bruker BioSpin GmbH
$$ ##OWNER= she
$$ F:/spectra/data/she/nmr/P31/1/pdata/1/auditp.txt
$$ ##AUDIT TRAIL=  $$ (NUMBER, WHEN, WHO, WHERE, WHAT)
(   1,<2019-07-03 16:21:17.90 +0400>,<she>,<DPX200>,
      <continue with go, POWCHK disabled, PULCHK disabled
       configuration hash MD5:
       00 E9 B6 7A A2 85 ED C7 34 08 36 98 17 FE 4E 26
       data hash MD5: 32K
       E2 1F DD 86 B8 1F 3F 55 6D 15 D8 AB 81 A1 48 80>)
(   2,<2019-07-03 16:21:26.39 +0400>,<she>,<DPX200>,
      <Start of raw data processing
       efp BC_mod = 2 LB = 1 FT_mod = 6 PKNL = 1 PHC0 = -2465.9 PHC1 = -121.0012 SI = 64K 
       data hash MD5: 64K
       73 C3 15 00 A1 00 93 52 D9 56 96 A7 48 AB 93 49>)
(   3,<2019-07-03 16:21:46.71 +0400>,<she>,<DPX200>,
      <pk PHC0 = -164.4049 PHC1 = 303.8 
       data hash MD5: 64K
       ED 03 3B F2 20 EA 89 97 C3 93 42 69 5F 6E AF D4>)
(   4,<2019-07-03 16:21:50.20 +0400>,<she>,<DPX200>,
      <abs ABSG = 5 
       data hash MD5: 64K
       17 35 B8 80 85 1B DA B2 85 97 7F 55 21 CA C5 B2>)
$$ ##END=
$$ 
$$ hash MD5
$$ 6F 22 B8 0A CD FE C2 C7 FA 7C 9C E4 BA C6 71 21
##$RELAX= 
##$RELAX= 
##$RELAX= 
##$RELAX= 
##$RELAX= 
##$RELAX= 
##$RELAX= 
##$RELAX= 
$$ Bruker specific parameters
$$ --------------------------
##$DU= <F:/spectra>
##$EXPNO= 1
##$NAME= <P31>
##$PROCNO= 1
##$TYPE= <nmr>
##$USER= <she>
##$AMP= (0..31)
100 100 100 100 100 100 100 100 100 100 100 100 100 100 100 100 100 100 
100 100 100 100 100 100 100 100 100 100 100 100 100 100 
##$AQSEQ= 0
##$AQ_mod= 1
##$AUNM= <au_zg>
##$AUTOPOS= <>
##$BF1= 81.014009
##$BF2= 200.13
##$BF3= 200.13
##$BF4= 200.13
##$BF5= 200.13
##$BF6= 200.13
##$BF7= 200.13
##$BF8= 200.13
##$BYTORDA= 1
##$CFDGTYP= 0
##$CFRGTYP= 5
##$CHEMSTR= <none>
##$CNST= (0..31)
1 1 145 1 1 1 1 1 1 1 1 1 1 1 1 1 1 1 1 1 1 1 1 1 1 1 1 1 1 1 1 1 
##$CPDPRG= <waltz16>
##$CPDPRG1= <>
##$CPDPRG2= <waltz16>
##$CPDPRG3= <>
##$CPDPRG4= <mlev>
##$CPDPRG5= <mlev>
##$CPDPRG6= <mlev>
##$CPDPRG7= <mlev>
##$CPDPRG8= <mlev>
##$CPDPRGB= <>
##$CPDPRGT= <>
##$D= (0..31)
0 1 0 0 0 0 0 0 0 0 0 0.03 2e-05 3e-06 0 0 0 0 0 0 0 0 0 0 0 0 0 0 0 0 
0 0 
##$DATE= 1562156280
##$DBL= (0..7)
120 120 120 11 120 120 24 19 
##$DBP= (0..7)
150 150 150 150 150 150 150 150 
##$DBP07= 0
##$DBPNAM0= <>
##$DBPNAM1= <>
$$ [...]
##$SUBNAM3= <"">
##$SUBNAM4= <"">
##$SUBNAM5= <"">
##$SUBNAM6= <"">
##$SUBNAM7= <"">
##$SUBNAM8= <"">
##$SUBNAM9= <"">
##$SW= 369.568048894756
##$SWIBOX= (0..15)
0 1 3 0 0 0 0 0 0 0 0 0 0 0 0 0 
##$SW_h= 29940.119760479
##$TD= 32768
##$TD0= 1
##$TE= 0
##$TE2= 300
##$TE3= 300
##$TEG= 300
##$TL= (0..7)
0 120 53 12 22 120 120 120 
##$TP= (0..7)
150 150 150 150 150 150 150 150 
##$TP07= 0
##$TPNAME0= <>
##$TPNAME1= <>
##$TPNAME2= <>
##$TPNAME3= <>
##$TPNAME4= <>
##$TPNAME5= <>
##$TPNAME6= <>
##$TPNAME7= <>
##$TPOAL= (0..7)
0.5 0.5 0.5 0.5 0.5 0.5 0.5 0.5 
##$TPOFFS= (0..7)
0 0 0 0 0 0 0 0 
##$TUNHIN= 0
##$TUNHOUT= 0
##$TUNXOUT= 0
##$USERA1= <user>
##$USERA2= <user>
##$USERA3= <user>
##$USERA4= <user>
##$USERA5= <user>
##$V9= 5
##$VALIST= <valist>
##$VCLIST= <CCCCCCCCCCCCCCC>
##$VD= 0
##$VDLIST= <DDDDDDDDDDDDDDD>
##$VPLIST= <PPPPPPPPPPPPPPP>
##$VTLIST= <TTTTTTTTTTTTTTT>
##$WBST= 1024
##$WBSW= 4
##$XGAIN= (0..3)
0 0 0 0 
##$XL= 0
##$YL= 0
##$YMAX_a= 10127
##$YMIN_a= -21307
##$ZGOPTNS= <>
##$ZL1= 120
##$ZL2= 120
##$ZL3= 120
##$ZL4= 120
##$ABSF1= 182.463
##$ABSF2= -187.1042
##$ABSG= 5
##$ABSL= 3
##$ALPHA= 0
##$AQORDER= 0
##$ASSFAC= 0
##$ASSFACI= 0
##$ASSFACX= 0
##$ASSWID= 0
##$AUNMP= <proc_1d>
##$AZFE= 0.1
##$AZFW= 0.5
##$BCFW= 0
##$BC_mod= 2
##$BYTORDP= 0
##$COROFFS= 0
##$CY= -3
##$DATMOD= 1
##$DC= 0
##$DFILT= <>
##$DTYPP= 0
##$F1P= 0
##$F2P= 0
##$FCOR= 1
##$FTSIZE= 65536
##$FT_mod= 6
##$GAMMA= 0
##$GB= 0
##$INTBC= 1
##$INTSCL= 5.30512e-09
##$ISEN= 30
##$LB= 1
##$LEV0= 0
##$LPBIN= 0
##$MAXI= 10000
##$MC2= 0
##$MEAN= 0
##$ME_mod= 0
##$MI= 50
##$NCOEF= 0
##$NC_proc= -7
##$NLEV= 6
##$NOISF1= 182.463
##$NOISF2= 159.3651
##$NSP= 0
##$NTH_PI= 0
##$NZP= 0
##$OFFSET= 182.463
##$PC= 4
##$PHC0= -2630.305
##$PHC1= 182.7988
##$PH_mod= 1
##$PKNL= yes
##$PPARMOD= 0
##$PSCAL= 0
##$PSIGN= 0
##$REVERSE= no
##$SF= 81.0140089999434
##$SI= 65536
##$SIGF1= 159.3651
##$SIGF2= -187.1042
##$SINO= 113.3802
##$SIOLD= 16384
##$SREGLST= <1H.CDCl3>
##$SSB= 0
##$STSI= 65536
##$STSR= 0
##$SW_p= 29940.119760479
##$SYMM= 0
##$S_DEV= 0
##$TDeff= 32768
##$TDoff= 0
##$TI= <>
##$TILT= no
##$TM1= 0
##$TM2= 0
##$TOPLEV= 0
##$USERP1= <user>
##$USERP2= <user>
##$USERP3= <user>
##$USERP4= <user>
##$USERP5= <user>
##$WDW= 1
##$XDIM= 65536
##$YMAX_p= 356373918
##$YMIN_p= -118386209
$$ End of Bruker specific parameters
$$ ---------------------------------
##NTUPLES= NMR SPECTRUM
##VAR_NAME=  FREQUENCY,     SPECTRUM/REAL,   SPECTRUM/IMAG
##SYMBOL=    X,             R,               I
##VAR_TYPE=  INDEPENDENT,   DEPENDENT,       DEPENDENT
##VAR_FORM=  AFFN,          ASDF,            ASDF
##VAR_DIM=   65536,         65536,           65536
##UNITS=     HZ,            ARBITRARY UNITS, ARBITRARY UNITS
##FACTOR=    0.456856943014862, 1,           1
##FIRST=     14782.0589164792, 0,            0
##LAST=      -15158.0608439998, 0,           0
##MIN=       -15158.0608439998, -118386209,  0
##MAX=       14782.0589164792, 356373918,    0
$$ Real data points
##PAGE= N=1
##DATA TABLE= (X++(R..R)), XYDATA
$$ [...]
##PAGE= N=2
##DATA TABLE= (X++(I..I)), XYDATA
5029a0644160O252532j67565n632845n123200j008702J545985K497922M952442
5021g327591P547421N600639l41503l818708j822489J054528K58592k297592k770198
5012c916901j510591m16110J549817M942684N675823Q69014l872982j118390N515883
5003G718247M579002n628285j2580233p067946L888369Q338470N592524K554141
4995G394289P41675k346931l722899J093422O843820L856621n546017q573814
4987b59834j557942M733397L043923J62335L195114O870676L278702m653889q635602
4978F176880p125804l548008J204101O014637N474346k381551r646568q857421
4970a2689388m326327l686533m102775J375699Q575926P214315r30847l309697
$$ y = [-10644160, -4391628, -4559193, -10192038, -15315238, -16323940, -14777955, -12280033, -7327591, 219830, 5820469, 5478966, 1660258, -162231, 892297, 1150889, -1146703, -3916901, -5427492, -5843602, -4293785, 648899, 6324722, 7193736, 3320754, 2202364, 7718247, 12297249, 6668964, -5911269, -12979215, -9090846, -752376, 4840148, 7394289, 8135964, 5789033, 2066134, 3159556, 10003376, 13859997, 8313980, -259834, -1817776, 2915621, 5959544, 6121879, 9316993, 16187669, 19466371, 14812482, 6176880, -948924, -4496932, -3292831, 2721806, 8196152, 5814601, -3831967, -12689388, -17015715, -20702248, -24805023, -23429324, -14853398, -7639083, -8569930, -11879627]
4962a1879627L253458P742876L362321k352597j162315L519755M701720K856688
4954A0042279J423358j029482o168392r344759n767363P93787K878739R6251j651605
4945h727187M16898L602920N444439N898580M281543n77505o600775r238565o961909
4936a2461561k699196R15537M430700Q302571R673170N298057l107921r097598
4928A253759q055752k220563K245621K476420J193445J722846L300840K899878
4920D816494j13853l251686l933393j665614J969601M287171L510159P78899j157929
4911E239849j741405k864499m795218n111569k999819r29110k26556R65786L153053
4902i309488L594898J705314J027706K337892R07307m633001p432094k862078
$$ y = [-11879627, -8626169, -883293, 2479028, 126431, -1035884, 2483871, 7185591, 10042279, 11465637, 10436155, 4267763, -5076996, -10844359, -10050572, -7171833, -7075582, -8727187, -8310289, -4707369, 737070, 6635650, 10917193, 10339688, 3738913, -5499652, -12461561, -15160757, -14245220, -9814520, -1511949, 8161221, 13459278, 10351357, 1253759, -6801993, -9022556, -6776935, -4300515, -3107070, -1384224, 1916616, 4816494, 4702641, 1450955, -2482438, -4148052, -2178451, 2108720, 5618879, 6397778, 5239849, 3498444, 633945, -4161273, -9272842, -12272661, -13201771, -13428327, -12462541, -9309488, -5714590, -4009276, -2981570, -643678, 263629, -4369372, -11801466, -14663544]
4894a4663544K776758J902736k217437k121711J010466J673236J591469M893210
4886e154817O774110R26739n715013j588667Q504536Q821724j017832m668754
4878F882026K980885P091857q07320p976135l087289M473978K098406m691268
4870F965140m343159L1214q71783l702434J08574N947808L215726m465902m186494
4861a301310M233227Q348037L909157n92991k25141O28216k61111L40734J662789
4852A6741607q24708m606328k469768L362822K972584l836017o157492q89070
4844D293630J838282l018794o396638j648240L535923J135625k891024O65645
4836b485591Q049244Q561395J050847o043157p363849m503841j29385L980527
$$ y = [-14663544, -11886786, -9984050, -12201487, -14323198, -13312732, -11639496, -10048027, -5154817, 1619293, 2546032, -3168981, -4757648, 3746888, 12568612, 11550780, 6882026, 9862911, 16954768, 16147448, 8171313, 5084024, 9558002, 11656408, 6965140, 2621981, 2653195, 1781412, -1921022, -1812448, 4135360, 7351086, 2885184, -1301310, 2931917, 11279954, 15189111, 14596120, 14370979, 14999195, 14738084, 15078818, 16741607, 15916899, 11310571, 8840803, 12203625, 15176209, 11340192, 5182700, 4293630, 6131912, 3113118, -3283520, -4931760, -1395837, -260212, -3151236, -2485591, 5563653, 14125048, 15175895, 9132738, 1768889, -2734952, -2864337, 1116190]
4828A116190N159977K585137j33933j70727m53250m252708q003382n599682K098525
4819g653853P776589O822404J473046l444401n148635l815131j760953j399654
4811g150588k551111k881255j497523K90889K133890N026649P772691P215850
4803H359492L346120M5766n38331l3362N76846K037648K424179j840573q477114
4794E900671r807668l802589K312624L112525K141358L353586L331161j297932
4786E243736n681308m005285M24197N96629k821040l580993k20422L187195M127612
4777b729679K838976p90702n205359n436230O0308M640795K613802j251457L56343
4768d903203M362544K447103m226722o869680m031685k670529m125976j421879
$$ y = [1116190, 6276167, 8861304, 8727371, 8556644, 8103394, 3850686, -4152696, -9752378, -7653853, 122736, 6945140, 8418186, 4973785, -174850, -3989981, -5750934, -7150588, -9701699, -12582954, -14080477, -13789588, -11655698, -6629049, 1143642, 8359492, 11705612, 11751378, 11213047, 11179685, 11756531, 13794179, 16218358, 14377785, 5900671, -3906997, -7709586, -5396962, -2284437, -143079, 3210507, 6541668, 5243736, -437572, -4442857, -4018660, -3422031, -6243071, -9824064, -10044486, -6857291, -2729679, 109297, -681405, -5886764, -11322994, -11262686, -6621891, -4008089, -5259546, -4903203, -540659, 1906444, -2320278, -9189958, -13221643, -15892172, -20018148, -21440027]
4760b1440027O967778J2294883Q854822K180276j028829k151799m227883m629247
4752c180026j020858K009066k96133m200100k751587L368783O865385M090034
4744D884564j185132l706887k379600O1075N23256j344311k745462j250706J613505
4735e529698K452367J113718M76562J481164K212923J794785J060208l07941k670405
4726B083683l255890J36302L117152l07468o979660p600988j398309K338757j18204
4717a1984625j176831L252608N270344l68345m463312K152926J1467973R631480
4709A3782218p06506m769370N53582L219080k965462r050474o793542q32065J216751
4700f345788M63182J440221L094918K330267O40729O49395P28258j118344k249722
$$ y = [-21440027, -14472249, -2177366, 6677456, 8857732, 7828903, 5677104, 1449221, -3180026, -4200884, -2191818, -2487951, -6688051, -9439638, -6070855, 794530, 4884564, 3699432, -7455, -2387055, -2325980, -1802724, -3147035, -5892497, -7143203, -5529698, -3077331, -1963613, -1487051, -5887, 2207036, 4001821, 5062029, 4754088, 2083683, -1172207, -1035905, 2081247, 1773779, -5205881, -12806869, -14205178, -11866421, -11984625, -13161456, -9908848, -4638504, -5006849, -9470161, -7317235, 4150738, 13782218, 13075712, 8306342, 8859924, 12079004, 9113542, 63068, -6730474, -7562539, -6345788, -5882606, -4442385, -1347467, 982800, 1623529, 2272924, 3001182, 1882838, -366884]
4691c66884J66942L433483L355014O99720j335744k773946m835072n543433l014676
4682a0214596l74829j400632l484380j333684L926816O225309M361159L000855
4674G06018L428714J149586m883383q133875m033922K391594M131764K687676
4666b555828M020978O976246M099349n549129j2156564p438577L886198R809678
4658A092351N853461p08341j336329L264387N311869O82805n597182n686476Q64636
4649C741181O099588L832718j984826k573134L259281P168281L140245m003333
4641A8680001o098931l519532l136128o181463o016771K56993N278764J525364
4633G88297o825705q624890o03436Q659336R990019L643667l562724o757371n721800
$$ y = [-366884, -199942, 3233541, 6588555, 7288275, 5952531, 3178585, -1656487, -7199920, -10214596, -10589425, -11990057, -15474437, -16808121, -12881305, -6655996, -2294837, 706018, 4134732, 5284318, 400935, -7732940, -11766862, -9375268, -5243504, -2555828, 1465150, 8441396, 12540745, 6991616, -5164948, -12603525, -8717327, 1092351, 6945812, 6237471, 4901142, 8165529, 13477398, 14160203, 8563021, 2876545, 3741181, 9840769, 13673487, 11688661, 9115527, 12374808, 19543089, 22683334, 18680001, 12581070, 9061538, 5925410, -256053, -6272824, -6015831, -737067, 788297, -6037408, -14662298, -15265734, -6606398, 3383621, 7027288, 3464564, -3292807, -9014607]
4624i014607k124214K087767M459697L534211R68662r8347P45786P68993j194706
4615A33242j929029J938555Q090858R973030M594975l600009p936365o642282
4607D622975l153160j007358q27254j550287k119430j769358m02982J077634J967358
4598c161862K922955M630291N975890N185256K178187j720198n308685p027586
4590C674248m894538K45674L487529J789074q56630Q01107M230604K701080k913190
4581H264958m455380R1056K828313p73440m263731j977075M88543l758907r720124
4572a3275787p889318J62951N015937N040556O527299R264281N221867n987932
4564D079854j2564242o745682L918725P650048L438624j096042r79209K769995
$$ y = [-9014607, -11138821, -9051054, -4591357, -1057146, -88484, -186831, 558955, 1327948, 133242, -1795787, 142768, 8233626, 18206656, 22801631, 19201622, 11265257, 4622975, 1469815, 462457, -364797, -1915084, -4034514, -5803872, -6206854, -5129220, -3161862, -238907, 4391384, 10367274, 15552530, 17730717, 16010519, 10701834, 3674248, -1220290, -974616, 2512913, 4301987, 3445357, 4246464, 8477068, 11178148, 8264958, 3809578, 3900634, 6728947, 5955507, 1691776, -285299, 203244, -3555663, -13275787, -21165105, -21002154, -15986217, -10945661, -4418362, 4845919, 10067786, 4079854, -8484388, -15230070, -11311345, -3661297, -222673, -1318715, -2297924, 472071]
4556D72071O565519O314659J96053p019450p396673j074626K022540l728534j0479702
4547a4128143q187581Q56697O582482N768151L587352L277645K766522N81189
4539A104314k223697n404366q330115o767234J914000J1191550J1085893J961811
4531D532156n099319l113746L210776O842707P451454P031510L735661l711990
4523B0879209j0214200r636149l635933O28987L39643r21537o62580j274292m293398
4514h790250n585961p10824O907015Q633070K562234k465137J059153P316939
4506H926239M448344p548907j5324859j0798665j864687J042723J39425L052544
4498a7927843P579649N766971n96443j833091K923027M226974o49049k580157
$$ y = [472071, 7037590, 13352249, 13548302, 6528852, -867821, -1942447, 80093, -3648441, -14128143, -22315724, -21459027, -14876545, -9108394, -5521042, -2243397, 523125, 1104314, -1119383, -6523749, -14853864, -21621098, -19707098, -8515548, 2570345, 4532156, -567163, -3680909, -470133, 6372574, 13824028, 20855538, 24591199, 20879209, 10665009, 1028860, -2607073, -1978086, -1638443, -2559980, -3222560, -4496852, -8790250, -14376211, -15087035, -8180020, 453050, 3015284, 550147, 1609300, 8926239, 13374583, 5825676, -9499183, -20297848, -22162535, -21119812, -20980387, -17927843, -10348194, -4581223, -5177666, -7010757, -4087730, 139244, -509805, -3089962]
4490c089962K977689P247670L118670k582094j486721J177993m215463j3810130
4482a0662348j4615927m152767O262896P958808M431727K828891M345423N861157
4474B257860N130473J875733k275065m006171j915154O47586J43010j444596l93792
4465A9884J410975n13283m390192m168178k28276L73212m104416o385194j868565
4456a9854033L685055L166371j228286k098416K465615P652051Q849284N535376
4448H173017J34057l889869m523446l604739m290747n469168l176376J296332
4440a5350939J284808l969798n311136K811055J1359128Q317877k812746o939573
4432a0611324Q73917Q546515M839943n330903r336797m066996K588573M209362
$$ y = [-3089962, -112273, 7135397, 10254067, 7671973, 6185252, 7363245, 3147782, -10662348, -25278275, -29431042, -23168146, -15209338, -10777611, -7948720, -3603297, 2257860, 7388333, 9264066, 6989001, 2982830, 1067676, 1715262, 1858272, 413676, 19884, 1430859, 917576, -3472616, -7640794, -7869070, -7495858, -11600274, -17985468, -19854033, -16168978, -13002607, -14230893, -16329309, -13863694, -6211643, 2637641, 8173017, 8307074, 4417205, -106241, -3710980, -8001727, -13470895, -16647271, -15350939, -14066131, -18035929, -23347065, -20536010, -9176882, -859005, -3671751, -10611324, -9737407, -1190892, 3649051, -1681852, -11018649, -15085645, -12497072, -8287710]
4424h287710K431950J312851J294571Q72623K07020J23518j81553j377406j300329
4415d904465K335680O635383N264372k466994q215851m454530M744786Q116555
4407G054936J745506o475407p916896l260282R67491J203258j197496l305988
4399a1184878k543645J986183P216316P876427K979947k593050n078103n906201
4391g247004o008299k050764O410813J1782157P866028J41088j767598J477974
4383A0604395J543304k793652m501326j898744j702245n857522o608730K56202
4375a0958318P248916O931272L236200L231168M874778K129552l028107l492487
4367A0172974J042704M121240K854996k8723l209681p530445j0243786p034695
$$ y = [-8287710, -5855760, -4542909, -3248338, -2375715, -2168695, -2045177, -2226730, -3604136, -4904465, -2568785, 4066598, 9330970, 6863976, -1351875, -5806405, -1061619, 7054936, 8800442, 2325035, -5591861, -8852143, -7884652, -6681394, -7878890, -11184878, -13728523, -11742340, -4526024, 3350403, 6330350, 3737300, -1340803, -7247004, -13255303, -15306067, -8895254, 2886903, 10752931, 10894019, 9126421, 10604395, 12147699, 9354047, 4852721, 2953977, 1251732, -4605790, -11214520, -10958318, -3709402, 3221870, 6458070, 9689238, 14564016, 16693568, 13665461, 10172974, 11215678, 15336918, 18191914, 18163191, 14953510, 7423065, -2820721, -9855416]
4359i855416m71499J850858q88777j267927L366850N450800N5849n110025r43863
4350g813150P453379O927618l625624j0166244l252039Q221265R229555j333962
4342E640798j0906359j1131501o590752m211470k351533L835285J1431978J2123434
4334b160120M498527l108582l481350J283388M626180L878807Q61296k048544
4326D349602l067036j004569K722879M224496J831181j588871l129201l624367
4318G14114m393570l846543r01592J724297J914687K419484N644046P515486L050147
4309A3840556m167603n433865O80812O460599O024220J520880k566166m603500
4301A1755933l613271J404371P104849O731569r47920q448561q791273l632163
$$ y = [-9855416, -10326915, -8476057, -9364834, -10632761, -7265911, -1815111, -1759262, -6869287, -7813150, -359771, 6567847, 2942223, -7224021, -10476060, -2254795, 6974760, 5640798, -5265561, -16397062, -22987814, -27199284, -29550817, -25715532, -14283554, -2160120, 2338407, -770175, -4251525, -2968137, 1658043, 5536850, 6398146, 4349602, 1282566, 277997, 3000876, 7225372, 9056553, 7467682, 4338481, 714114, -3679456, -7525999, -8427591, -6703294, -4788607, -2369123, 3274923, 10790409, 13840556, 9672953, 4239088, 4919900, 11380499, 17404719, 18925599, 16359433, 11755933, 8142662, 9547033, 16651882, 23383451, 22435531, 13986970, 5195697, 1563534]
4293A563534J030852K772620K519014M98927k991589n441989m758733k260081
4285g067445l96551K23819l57996k151235k633032J903027R236672J0716627K746984
4276A2220870o096168n822518R77634L507697j243196n385256k890011K733058
4268a997890N447109M403044J539370k754976p449547q531178l543989L683985
4260i204072O860187M686916J177524p35290k209241m420374m998176j358277
4252a0200803M110406N991136L223120N45443P80323J92589m255397p278521k173595
4243i065299O716411P643297j454883r034997o716738p35907n96596m526136m519305
4234b2290153K83509M339493N455002M918743J546880n293311r714587n774678
$$ y = [1563534, 2594386, 5367006, 7886020, 8384947, 5393358, -48631, -4807364, -7067445, -7463996, -7240177, -7598173, -9749408, -12382440, -10479413, -1242741, 9473886, 12220870, 6124702, 302184, 1279818, 4787515, 3544319, -1840937, -4730948, -1997890, 3449219, 7852263, 9391633, 6636657, -812890, -9344068, -12888057, -9204072, -2343885, 2343031, 3520555, 2785265, 576024, -3844350, -8842526, -10200803, -6090397, -99261, 3123859, 3669302, 4449625, 4642214, 386817, -6891704, -9065299, -2348888, 5294409, 3839526, -5195471, -11912209, -12648116, -13244712, -17770848, -22290153, -22006644, -17667151, -12212149, -7293406, -5746526, -11039837, -20754424, -26529102]
4226b6529102K364252N951014M740790M583380M840615L17960n874967n024314
4218a4630372J403609K957025j354538j447268L701460J954766q795965j1691668
4210b7902951K602864J7012655J2305422k851654n827592M808450R799960J209910
4202A1157064p971438p696049m228004m170004k528115M737214J0034132O042297
4194E377097j655112l403150N56119L598747L883288L528373J739526k766007
4186A0858881o095273m017392K2154n07974m131963k913330M406942Q537892K393013
4177H552950p536651q043633L787697J5430367J3047028j944860j4484446j3634319
4169d825867l721885M135292N874192M818444L011841j1098k177869j057162k47989
$$ y = [-26529102, -24164850, -18213836, -13473046, -8889666, -4049051, -3731091, -9606058, -14630372, -13226763, -10269738, -11624276, -13071544, -9370084, -7415318, -16211283, -27902951, -25300087, -8287432, 4017990, 1166336, -4661256, 147194, 9947154, 11157064, 3185626, -4510423, -8738427, -12908431, -15436546, -10699332, -665200, 5377097, 3721985, 318835, 874954, 4473701, 8356989, 11885362, 13624888, 10858881, 4763608, 746216, 768370, 260396, -3871567, -6784897, -2377955, 6159937, 8552950, 1016299, -7027334, -3239637, 12190730, 25237758, 23292898, 8808452, -4825867, -8547752, -4412460, 1461732, 6280176, 9292017, 9280919, 7103050, 6045888, 5797899]
4160E797899m773403j0251082p009601L385234P535382O41733m878267O54423
4152h897682P480113K190832q795844p683571O680878J6158270R858642k085431
4144A4906207o006476k626856p4258J87879R54093M79688l684111o880688l419443
4135f163965K406569J479534m938664n665004K907336R832474N277781m808428
4127C27633p305135k96124N883338M254199r37712l233046k857617k653903j419164
4118h237531K685760N952905L281306k852219m316418J209399O765629O059908
4110A0548739J556718n49844P97619J729036k30962m049373p657673q951592n806452
4101a2613784J034802N875127L055709n282827r874209m585107N903244J0701283
$$ y = [5797899, 1024496, -9226586, -16236187, -12850953, -5315571, -4673838, -9552105, -8897682, -1417569, 773263, -8022581, -15706152, -9025274, 7132996, 16991638, 14906207, 8899731, 6272875, 6198617, 6386496, 7340589, 7820277, 4136166, -2744522, -6163965, -3757396, -2277862, -7216526, -12881530, -9974194, -141720, 5136061, 327633, -6977502, -7273626, -1390288, 2863911, 1926199, -1306847, -4164464, -6818367, -8237531, -5551771, 401134, 3682440, 830221, -3486197, -2276798, 4488831, 10548739, 12105457, 11555613, 12353232, 14082268, 13851306, 9801933, 2144260, -6807332, -12613784, -11578982, -5703855, -2648146, -7930973, -17805182, -22390289, -16487045, -5785762]
4093e785762M700499n469497q492361j157396P826551Q421857J597945k859486
4085a217650j28416L786180J902966l706763o089848l371515Q61839M221407O647541
4076B905741O686066K898191j546157j760016J079467P86518l962533o857423
4068B29854l431102K058804K812720j287395m458598k737260K219460N787246
4060A193729M900736R13000j551723j61901J536369n77318l507407o65431O464290
4051H544344P784179q38150r717620q070889J100168O208602L066161k607370
4043E469425o147662q267858q608398m042112M208370R131565O986842K130890
4035H61062k36189o34316j175175m38815K677577M397954J033772m206106m813530
$$ y = [-5785762, -1085263, -6554760, -15047121, -16204517, -8377966, 43891, 1641836, -1217650, -1346066, 2440114, 4343080, 636317, -5453531, -8825046, -7963207, -3741800, 2905741, 9591807, 12489998, 10943841, 9183825, 10263292, 11049810, 7087277, 229854, -3201248, -1142444, 1670276, 382881, -4075717, -6812977, -4593517, 1193729, 6094465, 7007465, 5455742, 5293841, 6830210, 6252892, 2745485, 2080054, 8544344, 16328523, 15490373, 5772753, -2298136, -1197968, 5010634, 8076795, 5469425, -678237, -8946095, -17554493, -21596605, -17388235, -8256670, -1269828, 861062, 624873, -9443, -1184618, -1623433, 1054144, 5452098, 6485870, 2279764, -2533766]
4026b533766J55878N556844P261330N293152R40245m419155p773592o320492j563139
4017c402695J844937J661182m95527k652315l736441k067813K747096O658521
4009E56945N186185Q15482K95453L642149L249584l251640p390762k664952M362818
4000D801262L681477k983699n935400k805785J35671J74625P63913J792754j421755
3991a796937p050711o029509K829495P875366J930432n381752k373345N913689
3983d083272O150643j202486k748013N478134J0793706L235990r427682j3184230
3975d987210o382447J132466K763182J101054Q62228K576910L868603K782965
3967C717751q88047m895687n122316L38877P286821Q385821J592723o272031o831324
$$ y = [-2533766, -2377888, 3178956, 10440286, 15733438, 16673683, 12254528, 4480936, -1839556, -3402695, -1557758, 103424, -392103, -3044418, -6780859, -8848672, -6101576, 556945, 5743130, 6558612, 6854065, 10496214, 13745798, 10494158, 3103396, 438444, 4801262, 8482739, 5499040, -436360, -3242145, -3106474, -2931849, -2167936, -375182, -1796937, -8847648, -14877157, -12047662, -4172296, -2241864, -7623616, -9996961, -4083272, 2067371, 864885, -1883128, 3595006, 14388712, 17624702, 8197020, -4987210, -11369657, -10237191, -7474009, -6372955, -5510727, -2933817, 934786, 3717751, 2829704, -2065983, -7188299, -6849422, 437399, 8823220, 10415943, 4143912, -2687412]
3958b687412n02723L595969m34508o742577n487764K587130O350472Q15518m346814
3949f852709J157936J1947754J4089488N552366j450134O72625M658289J387494
3941C1163109o304041r878191q330967o767136n902169j868146M790918P953652
3933D857029M676917r18659l901315l830709k407649k96444J566936J022754k315508
3924a546648n228878m294040M5797M199422N192886K827522p28796k598964j494872
3915c626571Q49292J518281K47522k4095K481213N049467L730373p75952l454093
3906E995437j954497r3279j772203m002293q40548O181914P749304k77658r014996
3897A971181p312464K768875Q174000K097933p775963j0109698l443671M259871
$$ y = [-2687412, -3190135, 405834, -28674, -6771251, -12259015, -9671885, -3321413, -2505895, -6852709, -5694773, 6252981, 20342469, 25894835, 24444701, 25117326, 29775615, 31163109, 24859068, 14980877, 6649910, -117226, -6019395, -7887541, -3096623, 4857029, 9533946, 8615287, 4713972, 883263, -1524386, -1820830, -253894, 768860, -1546648, -6775526, -11069566, -11023769, -6824347, -1631461, 1196061, 467265, -2131699, -3626571, -2777279, -1258998, -1011476, -1035571, 1445642, 6495109, 10225482, 9449530, 5995437, 4040940, 3947661, 2175458, -1826835, -2667383, 3514531, 11263835, 10986177, 1971181, -5341283, -2572408, 5601592, 7699525, -76438, -10186136, -13629807, -9369936]
3889i369936N782710R59940m926829o324467k233025K666393K988767q88320l507847
3880a4852614j579884K521602M971564M735787K731561K29050r72462k12491k22975
3871b650862l499409o295839k103985P549842J2426502O677125l446080q432917
3863B24377o149371j32805O000988P914632J504767r521073j3883140p243145
3855b1284770O82019J183847L05512O662643J3604827Q660583l899990p475981
3847a561310K83558L577958m819083j0904821k728707R024568P390536m440396
3839d177697q862978r43262O197054L257791k417837j005265L833572K066283
3831b052339n453076p340394P10296Q126604M224426n776645p832813P27720Q365474
$$ y = [-9369936, -3587226, -2627286, -7554115, -13878582, -16111607, -13445214, -10456447, -11344767, -14852614, -16432498, -13910896, -8939332, -4203545, -1471984, -1242934, -2215396, -2427887, -2650862, -6150271, -12446110, -14550095, -7000253, 5426249, 12103374, 8657294, 224377, -5924994, -6057799, -56811, 7857821, 9362588, -158485, -14041625, -21284770, -20602751, -19418904, -19113392, -12450749, 1154078, 9814661, 5914671, -1561310, -1277752, 2300206, -2518877, -13423698, -16152405, -7127837, 262699, -4177697, -13040675, -13983937, -7786883, -4529092, -6946929, -7952194, -4118622, -2052339, -7505415, -14845809, -14135513, -6008909, -1784483, -7561128, -15393941, -14666221, -6300747]
3822f300747P565477M536785N617087N383158j881872q230209l161456P143482
3814A0671705P255453l159004q873127l855863N68334l090729n862568L58676
3806e987123P324768M170456m258481n890414o20189K070766k74422j435049J126818
3797c772870L560853M198653M967080M667779j46574p178146r244303m322495
3789g270023J668103L226848J138087q17008n11190J858610M299249M008379K63150
3780G864205m338696p066396p451736n423009r04057L195823K946484O28514L191491
3771g357377J0090705J1177853K497028n094554j798476N371097M101298l271830
3763A5715744n129047r73892j010649o856324q211219o56818O991416O853415
$$ y = [-6300747, 1264730, 5801515, 11418602, 16801760, 14919888, 6689679, 3528223, 10671705, 17927158, 14768154, 5895027, 2039164, 2607498, -483231, -6345799, -5987123, 1337645, 5508101, 1249620, -4640794, -5260983, -3190217, -3464639, -4899688, -3772870, -212017, 3986636, 8953716, 13621495, 13474921, 6296775, -2947528, -7270023, -5601920, -2375072, -1236985, -2053993, -2565183, -706573, 3592676, 7601055, 7864205, 3525509, -3540887, -10992623, -16415632, -17319689, -14123866, -11177382, -10548868, -7357377, 2733328, 13911181, 16408209, 11313655, 9515179, 14886276, 18987574, 15715744, 10586697, 9612805, 8602156, 1745832, -6465387, -7122205, -130789, 6722626]
3755F722626J999564j652885l311797l358998p80504J791346p39370o463396p054140
3746a2847554r30639L550255J670395o92476J606419M342229K611864m39103j89333
3737a317943J460720J018286j36458J26055L85720L11210K477673M954532Q34570
3728A0114365q860232j1638505j452902R226960O334447m594618p349755J40380
3720h079860M832107R36137j802197M593574J3157780J2594847L156990m974518
3712B4414860n209701r07420N09984l691839r109499r619022m526589J129487
3704g009739L388607L299248K722199M45326m107260o975809m267985J463257
3696a1042156M033587J637574j768431k133010P19082L721571K972908k650785
$$ y = [6722626, 8722190, 7069305, 3757508, 398510, -381994, 1409352, 669982, -5793414, -12847554, -13778193, -10227938, -8557543, -9250019, -7643600, -3301371, -689507, -1128610, -1317943, 142777, 1161063, 1024605, 1150660, 1536380, 1847590, 4325263, 9279795, 10114365, 1254133, -10384372, -11837274, -2610314, 3724133, -870485, -8220240, -8079860, -3247753, -2311616, -4113813, 479761, 13637541, 26232388, 29389378, 24414860, 19205159, 18297739, 18807723, 15115884, 6006385, -3612637, -8139226, -7009739, -3621132, -321884, 2400315, 2845641, -1261619, -8237428, -12505413, -11042156, -7008569, -5370995, -7139426, -9272436, -8553354, -4831783, -1858875, -4509660]
3688d509660q583202q366559k324265J891516K67621j507028K308374P350553
3680a3472650N854077k44660j453378M869773J0088449N899293m969643j2000319
3672e429058q346018K099119Q477955M532547m098813p201691l658493j522232
3664a5146684m008550m571265L75472L866618M70433l408583o09116L797593J843894
3655a7390188k237453N78532O996963O250559j013141l649186J212279N097431
3647d154204M297734M257120N985954K892832n094601q290362l140493J703573
3639a542447O64839l93590K484173K830936k879920n546572K337990J2629481
3631A0584890J2775548L451635n402496r309069r841966o865414q07368K459381
$$ y = [-4509660, -13092862, -21459421, -23783686, -21892170, -21624549, -23131577, -20823203, -13472650, -7618573, -7863233, -9316611, -4446838, 5641611, 11540904, 6571261, -5429058, -13775076, -11675957, -3198002, 1334545, -2764268, -9965959, -13624452, -15146684, -19155234, -23726499, -23351027, -19484409, -19013976, -22422559, -23031675, -19234082, -17390188, -19627641, -19049109, -12052146, -5801587, -6814728, -10463914, -9251635, -4154204, 143530, 4400650, 10386604, 13279436, 8184835, -105527, -3246020, -1542447, -877608, -1271198, 1212975, 4043911, 1163991, -4382581, -2044591, 10584890, 23360438, 26812073, 21409577, 12100508, 2258542, -4606872, -5414240, -2954859]
3623b954859o44607l250906K214549J0356337R705150J84419p457298p969658
3615A83127o232535n715461l246710K435647O024984L405604k049050m451901
3607i646295k777696p40131j514931l873391l156004K667366Q121953N830654
3599e088475k006227m630675J505943O477467K620626k575356P02396O810387
3591C816086L208567p909702j1681497l231116O519750R092134Q129849P281954
3583A5226025K494931o949019j1735950n570979M032978O593897K973008M73863
3575G538754K54183j078375k295393J35496L338879J152142m926089o632319j464965
3566c977687L418076J900513k967311m777737k739859o84913j90144O27459K242033
$$ y = [-2954859, -3599466, -6850372, -4635823, 5720514, 15425664, 15610083, 8152785, 183127, -6049408, -11764869, -15011579, -12575932, -6550948, -3145344, -5194394, -9646295, -12423991, -13164122, -14679053, -18552444, -21708448, -19041082, -10919129, -5088475, -7094702, -11725377, -10219434, -3741967, -1121341, -3696697, -2994301, 3816086, 7024653, -885049, -12566546, -15797662, -9277912, -185778, 7944071, 15226025, 17720956, 10771937, -964013, -6534992, -2502014, 4091883, 7064891, 7538754, 7792937, 6714562, 4419169, 4554665, 7893544, 9045686, 4119597, -2512722, -3977687, -559611, 1340902, -1626409, -6404146, -9144005, -9828918, -10019062, -9391603, -7149570]
3557g149570J932398j712708n326225m470544L29268M230083M675641M004984
3549c486673M426363M150242J239308j941630k071748l83247l43197j399371m7198
3540A42849L477203M743815J848919j947765l162213j818161L02888J478846L1264
3531E097645l605688n211152j838861K145282K22816n126983m219423M804944
3523g731420J0955328N208713o435548j1173693n944691J194669L403506J760321
3515h762815K70605R4513j9295r68239k151044j809966J145139M934167O138201
3506a128734M077102J688154R38533L97425r44834j086303Q85497J458705k574590
3497C710955q204845r153810l919312K491655M781322K945038J301555K948801
$$ y = [-7149570, -5217172, -6929880, -12256105, -16726649, -16397381, -12167298, -7491657, -3486673, 939690, 5089932, 6329240, 4387610, 2315862, 1932615, 1589418, 190047, 142849, 3620052, 8363867, 10212786, 8265021, 5102808, 3284647, 3587535, 5066381, 5097645, 1491957, -3719195, -5558056, -3412774, -3189958, -8316941, -12536364, -7731420, 3223908, 8432621, 1997073, -9176620, -15121311, -13926642, -10523136, -8762815, -8492210, -8397697, -8416992, -9385231, -11536275, -13346241, -12201102, -7266935, -1128734, 2948368, 4636522, 5575055, 5972480, 5027646, 3941343, 4826840, 6285545, 3710955, -4493890, -13647700, -17567012, -15075357, -10294035, -7348997, -6047442, -3098641]
3489c098641N540807L661639l340045q240299m613555L220201N054843p83140
3481b598190n396591l076956J272464J970524J346224K977641L750529J11983
3473C57628l803622k449105J462508J816242l39631L82874L481869L808422O98098
3464E415283k397438n062273q331507q595288k405182M888764N441228J951433
3456i094980L142685P634400N636666k659109n212327J584159N635777r43677
3448E723594q607205o740739p99821p86550k903210K424047J1058305J0022748
3440I391169o99029p061555k637826L068863J693367j685577Q1303L201511L85095
3431E737321n672798o137272j39333M081771J772115k295785k054394J559688
$$ y = [-3098641, 2442166, 6103805, 2763760, -5476539, -10090094, -6869893, -1815050, -2598190, -7994781, -11071737, -9799273, -7828749, -6482525, -3504884, 245645, 357628, -3445994, -5895099, -4432591, -2616349, -2955980, -2573106, 908763, 4717185, 5415283, 3017845, -2044428, -10375935, -18971223, -21376405, -16487641, -11046413, -9094980, -5952295, 1682105, 7318771, 4659662, -552665, 1031494, 6667271, 5723594, -2883611, -9624350, -10424171, -11210721, -14113931, -11689884, -631579, 9391169, 8692140, 1630585, -1007241, 2061622, 3754989, 2069412, 2150715, 5352226, 5737321, 64523, -6072749, -6212082, -2130311, -358196, -2653981, -4708375, -3148687]
3423c148687L575862K151663q62629l929968o399039o262702j636736M957128
3415a1555108P514880L580957k309717m290449k008016N51805R95279K78986o7328
3406g308711N71907K283066L873638K994959l03685k050106J83335K569387M21094
3397C234884l835228m045177k83916J650710M25157R12016M451714N500211Q78531
3388H888902n128384q346950r891701r827659m040150O549518J1659279M754425
3380e382720n763036p517164j404032J893849r45913k999916k43188K834947K035463
3371a7491710n99233j596845j51407L860627R723156J2919781Q828302N09377
3363A6002048l584993j027231J821315J2976l649090m881330m211695l760590
$$ y = [-3148687, 427175, 2578838, 1716209, -2213759, -8612798, -14875500, -16512236, -11555108, -4040228, -459271, -2768988, -7059437, -9067453, -8515648, -7520369, -7241383, -7308711, -6736804, -4453738, -580100, 2414859, 2111174, 61068, 244403, 2813790, 3234884, -600344, -4645521, -4929437, -3278727, -2853570, -1941554, 2510160, 8010371, 8888902, 3760518, -4586432, -14478133, -24305792, -28345942, -21796424, -10137145, -5382720, -11145756, -18662920, -20066952, -18173103, -19119016, -22118932, -22362120, -19527173, -17491710, -18090943, -19687788, -19839195, -15978568, -6255412, 6664369, 15492671, 16002048, 12417055, 11389824, 13211139, 13224115, 9575025, 4693695, 482000, -3278590]
3355c278590l149046k087146k427909m260431m010041K92723N302465O802384
3347f815591M805120J896539m67228j997550k807339m005447o058728o189309
3339b1639533j651007M147524M576889R0699j114230M496138R631546O874823
3331E412849o76981n153615n106453m370252l595732j95405M986991P471630N395296
3322D168328J202967k565322n180705n906217l934692j23955L527615N412148
3314c399833M003189j415972p595284q367513k369654L424047K097548l999292
3306a7622764p085126m608798p82445J048580J985629L659754N506940O530224
3298a1368006O299644M069237q6339l542931l501155q45979Q50959l57322l491607
$$ y = [-3278590, -6427636, -8514782, -10942691, -15203122, -19213163, -18920440, -13617975, -6815591, -2010471, -113932, -581160, -2578710, -5386049, -9391496, -15450224, -21639533, -23290540, -19143016, -14566127, -14475428, -15589658, -11093520, -1461974, 5412849, 4735868, -417747, -5524200, -9894452, -13490184, -13685589, -8698598, -1226968, 4168328, 5371295, 2805973, -2374732, -8280949, -12215641, -12339596, -8811981, -3399833, 603356, -812616, -8407900, -16775413, -19145067, -15721020, -13623472, -17622764, -24707890, -29316688, -30099133, -29050553, -27064924, -23405170, -17898230, -11368006, -5068362, -999125, -1085464, -4628395, -8129550, -8975529, -8124570, -8481892, -11973499]
3289a1973499o405087o860949l699525J027160L512256L711197N676617R756067
3281e255763R711101K479054m532422l091240L053257L722671j920314n085049
3273i18705k421921q38030m673977p604699k683067O274382R690482N057608q09580
3264A072493j228556K594465M000055k84873n259018l649942L410435O383277
3256G038336M96867o709826o299929q98435J114533j73684J920496O900773O735567
3247A0124698j99812n695612m285400M55958M200685O601435N584901k263225
3239A4523628j2142227j2908816l259252M768730L863348J520212M997434Q055150
3231I418207K695160n950700q071292m807778l837210n603812n328754l352371
$$ y = [-11973499, -18378586, -25239535, -28939060, -27911900, -24399644, -20688447, -15011830, -5255763, 4455338, 6934392, 2401970, -689270, 2363987, 6086658, 4166344, -918705, -3340626, -4178656, -8852633, -16457332, -19140399, -12866017, -3175535, 1882073, 1072493, -156063, 2438402, 6438457, 6153584, 894566, -2755376, 655059, 7038336, 7535203, 825377, -5474552, -6372987, -5258454, -5432138, -3511642, 3389131, 10124698, 9924886, 4229274, -56126, 399832, 4600517, 11201952, 16786853, 14523628, 2381401, -10527415, -13786667, -9017937, -5154589, -3634377, 1363057, 9418207, 12113367, 6162667, -1908625, -6716403, -10553613, -16157425, -21486179, -24838550]
3223b4838550k352110N61843P588708J1319720M641770m896863m354514M103219
3215h226777O696148O06290k673963K050173N411856N98326n015815k611545M171932
3206A006625N934901Q41136n555522q551289p066154k322725K398091L968173
3198i346764L240143L293565M066991L449966K433238K951009K457299j595072
3190A0950375m276654j74594M396744r21998j1206130j0119007M122933J3269318
3182F040987O118894n034515n103551J314244J529334k970626j617513N280765
3174E558019P311208J221949n758311p963522n960638j346504L699471M381602
3166A143274n38571m227760j857832K34542m567689r436038l981756P281777J0963189
$$ y = [-24838550, -27190660, -26628817, -19040109, -7720389, -3078619, -7975482, -12329996, -8226777, -1530629, -924339, -3598302, -1548129, 3863727, 4462053, -553762, -3165307, 1006625, 6941526, 7782662, 2227140, -6324149, -13390303, -15713028, -13314937, -9346764, -6106621, -2813056, 1253935, 4703901, 7137139, 10088148, 12545447, 10950375, 6673721, 6499127, 10895871, 9973873, -1232257, -11351264, -7228331, 6040987, 12159881, 7125366, 2021815, 3336059, 4865393, 1894767, 277254, 5558019, 12869227, 14091176, 8332865, 369343, -5591295, -6937799, -3238328, 1143274, 604703, -3623057, -5480889, -5246347, -9814036, -19250074, -23231830, -15950053, -4986864]
3157d986864N936006K831257M188849K062019l966963m110526K699637M496294
3149I149709l037298q118872l464953N44828n387177j1756017n670175O846034
3141b0893921J0094291L356849q5837M587846Q019285L898203j830488k340619
3133D805609J03475J46375k150547l357026k431408p98794N03221J517827K601535
3124I40267L325738J572982l997548r218368o657166L761831J1444707Q140347
3116I312790n71842m070736k119215j873145l414174p18595M125678J743086p214895
3107d801048r820688j375540N720131K227468j995621N002672J5099916J1494693
3099B1551983l755388j1733182n242815K323193m7190n665620m960770j360698
$$ y = [-4986864, 949142, 3780399, 7969248, 10031267, 6064304, 1953778, 4653415, 9149709, 6112411, -2006461, -5471414, -4926586, -10313763, -22069780, -27739955, -20893921, -10799630, -7442781, -7528618, -2940772, 5078513, 8976716, 7146228, 4805609, 4909084, 5055459, 2904912, -452114, -2883522, -3682316, -3179095, -1661268, 940267, 4266005, 5838987, 1841439, -7376929, -14034095, -10272264, 1172443, 9312790, 8740948, 4670212, 2550997, 677852, -2736322, -3454917, 670761, 2413847, -4801048, -14621736, -15997276, -10277145, -8049677, -10045298, -5042626, 10057290, 21551983, 17796595, 6063413, 820598, 3143791, 3096601, -2569019, -7529789, -8890487]
3091h890487j980132l463514N66887N618592L133855l349114k436194O047898
3083d752209R391632J251281q946655r927865k678994M159802N452508J193994
3075d856506o278306j1353187p490900L575147J0352717N821533j796976l39207
3067a2365685Q131663J0215888J243357p934009p067809n12144J176860k038830
3059i150709n8369J0546655J8108243R626362j0195854k1185599j1553925O554087
3051g309109J1958319J445474p769281l073962P342531R148100K735778j032248
3043A3445602K36409j338752q124144j1884565p139802M81727L631743L057415
3035g634367L054253L610440K694156J525088J937136J962812o81058l298183
$$ y = [-8890487, -10870619, -14334133, -13767246, -8148654, -5014799, -8363913, -10800107, -4752209, 4639423, 5890704, -3055951, -12983816, -15662810, -11503008, -6050500, -4856506, -11134812, -22487999, -29978899, -26403752, -16051035, -10229502, -12026478, -12365685, -4234022, 5981866, 7225223, -708786, -7776595, -8288739, -7111879, -9150709, -9209078, 1337577, 19445820, 29072182, 18876328, -2309271, -13863196, -7309109, 4649210, 6094684, -1674597, -4748559, 2593972, 11742072, 14477850, 13445602, 13682011, 12343259, 4219115, -7665450, -14805252, -14323525, -10691782, -7634367, -4580114, -969674, 1724482, 3249570, 5186706, 7149518, 6468460, 3170277]
3027C170277j544107L435824N875692K997033j968426m518583l742599j715454
3019A989657N5298K098928M768352N589209J149009p191702j2256241q965845
3011a2763335j329776K578593J044621q92176k69430Q09251J095527K448601M759452
3002b518672M800864J991528m70971j700959l936392n845782k782178L784788
2994f677774N709519R58535k084545J531333M667368P74495l979737j142629N172692
2985D929257N273048j97866l406723l681848n683407o557216P31535J1954049
2977C360829J3890053L823651o370935q344807o618550o045566l235491L102131
2969f438685N393137n46026o255730l081819M019178M999916O67757m87187K868339
$$ y = [3170277, 1626170, 5061994, 10937686, 13934719, 11966293, 7447710, 3705111, 1989657, 2044955, 4143883, 8912235, 14501444, 15650453, 8458751, -3797490, -12763335, -14093111, -11514518, -10469897, -11362073, -11631503, -10822252, -9726725, -7278124, -2518672, 2282192, 4273720, 3802749, 2101790, -1834602, -7680384, -10462562, -6677774, -968255, -9720, -2094265, -562932, 4104436, 4878931, 899194, -243435, 4929257, 10202305, 10004439, 6597716, 2915868, -2767539, -9324755, -8593220, 3360829, 17250882, 21074533, 14703598, 6358791, -259759, -6305325, -9540816, -6438685, -1045548, -1591574, -7847304, -10929123, -6909945, -1910029, -1242272, -1729459, 1138880]
2960A138880M112905J034760j074282O54059K036506n35212m033766l594745K98146
2951C7251K627603O41659k451607j588224K834090M317588q98718p254257o939418
2942h674033j462686Q00257k111965l570668n82649J637690O35428J832494O992198
2933d503934Q033019O13997n805681j990365N454886M881284j074615j334411
2925D274180L528968L165570k894703m456457k8268L75308m943110m339902N758795
2916D40381J1450893L577200o006709l837833K513859k007542j3035646j2753742
2908a9659139J050472J1242955P867494Q33434J080483M398266K487012j801031
2900G499946j052919K552575Q18601o517068j1310654r226330m054430K27906
$$ y = [1138880, 5251785, 6286545, 5212263, 5866322, 7902828, 7367616, 3333850, -260895, 37251, 2664854, 3306513, 854906, -733318, 2100772, 6418360, 5519642, -1734615, -8674033, -10136719, -9336462, -11448427, -15019095, -15601744, -13964054, -13328626, -11496132, -4503934, 3529085, 4143082, -1662599, -3652964, 1801922, 6683206, 5608591, 4274180, 7803148, 10968718, 8074015, 3617558, 3589290, 3964598, -978512, -5318414, 440381, 11891274, 15468474, 9461765, 5623932, 8137791, 6130249, -6905397, -19659139, -18608667, -7365712, 501782, 1335216, 2415699, 6813965, 9300977, 7499946, 6447027, 8999602, 9818203, 3301135, -8009519, -17235849, -21290279, -21062373]
2892b1062373M112059P540989O732695k29913q407918j0473171m762689L531395
2884b3018926Q161844O917139J853649l357495o003525n470594k674876J136105
2876b2456679M506601N378307K581895j578524k315282K146483P374156P389714
2868C026671J831860m095423o406311n805747l978071m30329M562571P111433
2860d183346L732152l082063o957302n032292k03971L781623N986492O346938
2852C88231L714881j724609o104682m945342J315989O743143O081919J115227
2844F584757r40366L190751O910676J394676j0652896j5117397m407335J0383998
2836b653136J2687744K359587n329347k018827L634913J617156m515577n847653
$$ y = [-21062373, -16950314, -9409325, -2676630, -2906543, -11314461, -21787632, -26550321, -23018926, -14857082, -7939943, -6086294, -9443789, -15447314, -20917908, -23592784, -22456679, -17950078, -12571771, -9989876, -11568400, -13883682, -11737199, -4363043, 3026671, 4858531, 763108, -5643203, -11448950, -15427021, -15857350, -11294779, -4183346, -451194, -3533257, -10490559, -15522851, -15726822, -11945199, -5958707, 388231, 4103112, 2378503, -3726179, -8671521, -7355532, -612389, 5469530, 6584757, 5644391, 8835142, 15745818, 17140494, 6487598, -8629799, -13037134, -2653136, 10034608, 12394195, 7064848, 5046021, 8680934, 10298090, 5782513, -65140]
2828f5140k949856k594922m647174k934819K713804N513294L069391M69316N30062
2819h96044k86316l339062l526615J703915O051859L292708k526297k761663K875053
2810E87538O001145J479674o283176r725346o387776M86533O276051Q136706N778110
2801F349459R49690l813704o198857m583708N97489N376805M719146j516081p209920
2792e329681p136373l420794j516683j758231N3728M176120N204672R75530k442687
2783a1194399P20651O247021N090567l002760q040292l742946L458995M054183
2775f408980p05689j795271K662293M309918j435879o766909l042078N172799
2767h009796O488063J86421k971917J792839N487620j52330q985464r209703n07034
$$ y = [-65140, -3014996, -5609918, -10257092, -13191911, -10478107, -4964813, -1895422, -1426106, -896044, -1182360, -4521422, -8048037, -6344122, -292263, 3000445, 474148, -2287515, 587538, 6588683, 8068357, 1785181, -7940165, -14327941, -13841408, -7565357, 571349, 6349459, 7299149, 3485445, -2713412, -7297120, -6699631, -1322826, 3396320, 1880239, -5329681, -12466054, -15886848, -17403531, -19161762, -19108034, -14931914, -9727242, -8751712, -11194399, -10473748, -4226727, 863840, -2138920, -10179212, -13922158, -10463163, -6408980, -7114669, -8909940, -6247647, -1937729, -3373608, -10140517, -13182595, -8009796, -1521733, -1335312, -4307229, -2514390, 2973230, 2820900, -6164564, -15374267, -15881301]
2758a5881301O486568N617036J358266o49093j046128k258985l140930k056686
2750a1571253q27598j520602k362687o27672K705060M741595N199436N434101
2742A170380M528940P65257l524771l478048P62050K682394j480120o019855k984640
2733g578413N620441Q850926J383562q274894q079680K333679J1798346J1727022
2725A7780989M631540k113175n596730p403599q091743o109340j292483L821197
2717d373344O338998N023184M62950n086641q355156p096226j931305L925303
2709a1092237O592330M183837p03498k122214K602400P942677O045584k300743
2701A1148136p940294o002601j951900j659988k093662K205537Q696728J0359390
$$ y = [-15881301, -9394733, -3777697, -2419431, -3068524, -4114652, -6373637, -9514567, -11571253, -12398851, -13919453, -16282140, -16909812, -14204752, -9463157, -4263721, 1170380, 5699320, 6464577, 2939806, -538242, 223808, 2906202, 1426082, -4593773, -7578413, -1957972, 6892954, 8276516, 1622, -8078058, -5744379, 6053967, 17780989, 22412529, 20299354, 14702624, 7299025, -792718, -6902058, -8194541, -4373344, 1965654, 6988838, 7451788, 2365147, -5990009, -13086235, -15017540, -11092237, -4499907, -316070, -1019568, -3141782, -539382, 7403295, 13448879, 11148136, 3207842, -2794759, -4746659, -6406647, -8500309, -6294772, 2401956, 12761346]
2693A2761346O330995J613883j550360m604866o565295m561046m2355K249265
2685E631567J107734j183928l978084o737619n201222K343072P642415K061369
2677A685304q031152q034617K671318R475633N757267J706033M423255N447307
2669A5100348k102416q666664l806298N077696M572773l018591n523991j993603
2661c60746j491091m644033l068231L641429O014222J259600k182281O63446M277075
2652D109390L477887M15446k404748n954523q417807m866542L313595P743493
2644b583809N178363J582808R74081n33543n474155q795280o092958p25584K127561
2635a4342516K183361J106402p43950j603125Q79242L738571J260538m580563
$$ y = [12761346, 19092341, 20706224, 19155864, 14550998, 7985703, 3424657, 3382302, 5631567, 6739301, 5555373, 1577289, -5160330, -10361552, -8018480, -376065, 1685304, -6345848, -14380465, -11709147, -2233514, 3523753, 5229786, 9653041, 15100348, 12997932, 4331268, 524970, 5602666, 10175439, 7156848, 1632857, -360746, -1851837, -6495870, -9564101, -5922672, 91550, 1351150, -831131, -167685, 4109390, 7587277, 8002723, 5597975, -356548, -8774355, -13640897, -10327302, -2583809, 2594554, 4177362, 5151443, 4617900, -856255, -9651535, -15744493, -16470077, -14342516, -12159155, -11052753, -11796703, -13399828, -12520586, -8782015, -7521477, -12102040]
2627a2102040n411521n83662R01571l490334m034655M396979J1915032R149120
2619G40490K143018Q96371K906336O25787l005756n87411M162146J650257o156743
2610C374495q103923k407119J086110k182008n301909k949232J023660K597358
2602a2862568M145893P617959R334524O129163M73944m051216p017328q305873
2594d535502o431630k220031P11733J190584J662272K934023K913752J779154
2586a995645K523148M370649J792677o473595j2627157q708962K564613J0059469
2578h494803O483611l943856r949617m913355N568127R174504J259171q841806
2570a3658024q964622J140373J0800468J1952851N924081k059189q327589r996102
$$ y = [-12102040, -17513561, -18097223, -17195652, -20685986, -24720641, -20323662, -8408630, 740490, 2883508, 3779879, 6686215, 7312002, 4306246, 3718835, 7880981, 9531238, 3374495, -4729428, -7136547, -6050437, -8232445, -13534354, -16483586, -15459926, -12862568, -8716675, -1098716, 8235808, 14364971, 14838915, 10787699, 3770371, -4535502, -10967132, -13187163, -12475430, -11284846, -9622574, -6688551, -3774799, -1995645, 527503, 4898152, 6690829, 217234, -12409923, -21118885, -18554272, -8494803, -2011192, -5955048, -15904665, -20818020, -15249893, -6075389, -4816218, -13658024, -22622646, -21482273, -10681805, 1271046, 7195127, 5135938, -3191651, -13187753]
2562a3187753n152295L465112R116226P859498K218998k866514m945385m165394
2554g657507j412807K156564N041482N685269L173639j109039l212148j250376
2546A415077L05644l650303r006719o395605L379274Q168563K892718k616479
2538e507830j063125J38981n346964q398251n69571P921597M547378k469036J056331
2529i690490P641858J239521r898397m257569J2598091J3531798k694257p864083
2521F06472M204088N687238q524058R93661M9886910Q2055096M0077075m3014815
2513A31971667p9374022m3393793L805254R365438q302829r599076K689097K753854
2505I915590q473513r942826L81639N382099j71774m553956j629248K305018K817044
$$ y = [-13187753, -18340048, -14874936, -5758710, 2100788, 4319786, 1453272, -3492113, -7657507, -9070314, -6913750, -1872268, 3813001, 6986640, 5877601, 2665453, 1415077, 1720721, -1929582, -10936301, -17331906, -13952632, -5784069, -2891351, -5507830, -6570955, -6431974, -11778938, -20177189, -20746760, -12825163, -8277785, -10746821, -9690490, -2048632, -809111, -10707508, -14965077, -2366986, 11164812, 8470555, 606472, 4810560, 10497798, 1973740, 2967401, 52854311, 134909407, 174986482, 131971667, 52597645, 9203852, 13009106, 22374544, 14071715, 4472639, 7161736, 9915590, 1442077, -8500749, -8119110, -2737011, -2908785, -7462741, -9091989, -6786971, -3969927]
2496c969927J929605m77139n818345q567432j845758R205645J1549726K333746
2488D340121p521799q808399l776021J118783L626196M115938K454526o6284k78183
2479d795122K473047M598694L050547n28824k323363j628726j791989n465803
2471f411539r717959q117637N91236Q529291P795282J877429J328246P745632
2463C619981J0302788J819230r514778j1019561k635441M602184M135506Q9656
2455A399565j272929P38071L148212L728964J769198k233317o280454q183995
2447g186685p429699m398540R66768P267534R911680N136126m054662r336106
2439i123584n704476L309409R948408J0024661N388136K40088k916175l762417
$$ y = [-3969927, -2040322, -2517461, -8335806, -16903238, -18748996, -9543351, 2006375, 4340121, -3181678, -11990077, -15766098, -14647315, -11021119, -6905181, -4450655, -4516939, -4795122, -2322075, 2276619, 5327166, 4798342, 2474979, 846253, -945736, -6411539, -16129498, -24247135, -23655899, -15126608, -7331326, -5453897, -4125651, 3619981, 13922769, 15741999, 6227221, -4792340, -7427781, -2825597, 1309909, 1399565, 126636, 864707, 4012919, 7741883, 9511081, 7277764, 997310, -7186685, -14616384, -19014924, -18048156, -10780622, -868942, 4267184, 212522, -9123584, -14828060, -11518651, -1570243, 8454418, 13842554, 14082642, 11166467, 7404050]
2431G404050k838489j400670j390931l054537l169053R01554N417475L672465
2423E541864l150685n091835K193154R051790N472606k908004l192587M207339
2415A2123642O592966j3046n269060k926082n47598m466294q189422m983840o73163
2406h351897k618436n249886L93683R397615R255728k33914o981560n151052q26493
2397a0366212J195335L871884Q485093R429302K971041o221093j1117395r481524
2389a1233569l106858M505373Q492991O433962K674846L131878N901699M074964
2381B0875286k224819n349142k961055j758426n012519n917153Q43925Q797230
2373G293327Q228010k26503p301500o814205j34629P667036J1080066O704375
$$ y = [7404050, 4565561, 3164891, 1773960, -1280577, -4449630, -3548076, 1869399, 5541864, 2391179, -2700656, -507502, 8544288, 14016894, 11108890, 7916303, 12123642, 18716608, 18703562, 13434502, 10508420, 9960822, 5494528, -2694894, -7678734, -8351897, -10970333, -16220219, -15826536, -6428921, 2826807, 2592893, -4388667, -9539719, -10366212, -9170877, -5298993, 3186100, 12615402, 15586443, 9365350, -1752045, -11233569, -14340427, -9835054, -1342063, 5091899, 7766745, 10898623, 16800322, 20875286, 18650467, 13301325, 10340270, 8581844, 3569325, -2347828, -1503903, 7293327, 15521337, 15294834, 7993334, 1179129, 1044500, 8711536, 19791602, 26495977]
2365B6495977k626252q829893p474431k631892K51664J643984L806662M751277
2357A5387096K543878J124535M337291P453777L025995o556984j1156909p529195
2349H629484l234048m227263o739933n136900r48985J101768J218506K888246
2341f449125N802477N905920J798084l182837n438397m507475j691720J754953
2333f008120L995439K704892j931477n467686l246565L305584P051312L738583
2325D141962j904310k082988L128901N562806N62978o393452p788042m169173
2317h941318j246160k74721K203539O298373P269896L070417k253108m472285
2309A654633l851928k257806k25504J148797J35857j491774O25285N344667M694630
$$ y = [26495977, 23869725, 15039832, 7565401, 4933509, 5185173, 6829157, 10635819, 15387096, 17930974, 19055509, 23392800, 30846577, 33872572, 27315588, 16158679, 8629484, 5395436, 1168173, -5571760, -10708660, -11657645, -10555877, -9337371, -6449125, -646648, 5259272, 7057356, 3874519, -1563878, -6071353, -7763073, -6008120, -2012681, 692211, -1239266, -6706952, -9953517, -6647933, 403379, 4141962, 2237652, 154664, 3283565, 8846371, 9409349, 3015897, -4772145, -8941318, -10187478, -10462199, -8258660, -1960287, 5309609, 8380026, 6126918, 1654633, -2197295, -4455101, -4680605, -3531808, -3395951, -4887725, -4262440, 1082227, 5776857]
2300E776857m361332j2281211q301300M100733J1329365P682073P07076j553115
2292C099146J42241J940027L543871M752225K262443m266885q104171l788013
2284d19116L916790N810873P26244m129081m025427j523809k91415N2988J330993
2275A449040L197615L820670J713415l235816q044550p227235P81726Q874575
2267A329440Q316030L58743n250775l936038j232685j805011j678993L078030
2259h21259O967950K795973n195622n615718K992516Q504006J722242j0332902
2251A017186j2961430k244534J0442855J2157146K638737o992202p819676k240948
2243f002866J389015J42068j522090m56613J91424k509295m515007N4087R099899
$$ y = [5776857, 1415525, -10865686, -19166986, -15066253, -3736888, 3945185, 4652261, 3099146, 3241387, 5181414, 8725285, 13477510, 15739953, 11473068, 3368897, -419116, 3497674, 9308547, 10034791, 5905710, 1880283, 356474, 65059, 118047, 1449040, 4646655, 8467325, 10180740, 6944924, -1099626, -8326861, -7545135, 1329440, 9645470, 10004213, 4753438, 817400, -415285, -2220296, -3899289, -821259, 6146691, 8942664, 3747042, -1868676, 1123840, 9627846, 11350088, 1017186, -11944244, -14188778, -3745923, 8411223, 11049960, 4057758, -3761918, -6002866, -4613851, -4471783, -5993873, -6450486, -6259062, -8768357, -13283364, -13229277, -4129378]
2234d129378J3688531R302032J183906k978678j971369m48596j858223m603366
2226H184859m815766j391767K526858L410396J897383J419097K166654K6492o322950
2217G101256j1057206q245044o88333L504918J818937q08251n00125J350449L112114
2208d411285N759268Q381145O656883n85387p736939r007384n047679M6369M057675
2199a887334N362430J369099o150395q474667q6958J1097022J1976528K129518
2191A5335243n442903k942294K133894J10328o002940o656780j366463J480293
2183c351622j359591l797585j575897J032029n30590l200024k093350J025683
2175a3850947J493924K86691J609081M051435K147037l207881m047858K513242
$$ y = [-4129378, 9559153, 18861185, 20045091, 17066413, 15095044, 14646448, 12788225, 8184859, 3369093, 1977326, 4504184, 7914580, 9811963, 11231060, 13397714, 13424206, 7101256, -3955950, -12200994, -12889327, -9384409, -7565472, -8373723, -8873848, -7523399, -4411285, 1347983, 9729128, 16386011, 15800624, 8063685, -943699, -5991378, -5945009, -1887334, 3475096, 4844195, -1306200, -9780867, -9867825, 1229197, 13205725, 15335243, 9892340, 6950046, 9083940, 9194268, 3191328, -3465452, -4831915, -3351622, -4711213, -8508798, -10084695, -9052666, -9583256, -12783280, -14876630, -13850947, -12357023, -12070332, -10461251, -6409816, -4262779, -7470660, -11518518, -9005276]
2167i005276Q635673O535917o81573m165276j298712K853593L436398J12438m615072
2158A808110o923681l513969L583949O469953J098370m848744j084403R243734
2150E833319J1585711L18994j1752202j0147448J419473O405139j742151j1299178
2142i378343r112822J557314O333626j71638p504995m742443M191736P128627
2134a1698938J825969j782392K017979O188159L569032j085751o4956L341259
2126B310361Q89524m816094l432502M996842Q441612J970270m558007l277982
2118B524024l78397k860458m474099K776949J1157461O621425p357819j1683679
2110c674593J95712J1108027M826194r901809j1963566J911708J3467011R193141
$$ y = [-9005276, -369603, 6166314, 5484741, 1319465, 20753, 2874346, 6310744, 6423182, 1808110, -5115571, -8629540, -5045591, 1424362, 2522732, -2326012, -3410415, 5833319, 17419030, 17738024, 5985822, -4161626, -2742153, 3662986, 1920835, -9378343, -18491165, -16933851, -10600225, -10771863, -18276858, -23019301, -18827565, -11698938, -9872969, -11655361, -9637382, -3449223, 119809, -965942, -1030898, 2310361, 3199885, -1616209, -5048711, -51869, 8389743, 10360013, 5802006, 2524024, 2145627, -714831, -5188930, -2411981, 8745480, 15366905, 8009086, -3674593, -3478881, 7629146, 12455340, 2553531, -9410035, -7498327, 5968684, 15161825]
2102A5161825k828079p558960l981392j809924l549140k322181L295780N052688
2094A460617n00710m598512m90863M548931J319765n088676l758544K745826K388030
2085a974136n100106p233719o24998K942217k158198m280023N450299J6043464
2077C064800J2874344N75811n062390j067005K071992k75193k078214l24988L34881
2068A0114038j915183k611900l28947N35917j432665k058928Q1558J153887q6153
2059C451624j74701J331258K96990l587002n128414k771894r76057r33531J850136
2050f641591P260706P789413J224507l628304p90180K509233k035797r343258
2042c655271r145450k763878q1584l004881l645201J578480O773656O976444M585948
$$ y = [15161825, 12333746, 4774786, 793394, -1016530, -4565670, -6887851, -3592071, 1460617, 959907, -3638605, -4129468, 419463, 1739228, -3349448, -7107992, -4362166, -1974136, -7074242, -14307961, -14932959, -11990742, -14148940, -18428963, -12978664, 3064800, 15939144, 16514955, 11452565, 10385560, 12457552, 12182359, 10104145, 9779157, 10114038, 8198855, 5586955, 5258008, 5793925, 4361260, 2302332, 2383890, 3537777, 3451624, 3276923, 4608181, 4905171, 1318169, -3810245, -6582139, -7558196, -8491727, -6641591, 619115, 8408528, 9633035, 6004731, 5214551, 7723784, 5687987, -3655271, -12800721, -15564599, -15646183, -18651064, -22296265, -20717785, -13944129, -6967685, -2381737]
2033b381737K862693P89043k178060k644667J252325N384762M607982n57597n074642
2024B060102n178136j265003K945766L087901j661599o389957n253087R41939
2016a0712074N331214M004705M34153o74479M21854J199731J605068K208482J144113
2007D962767k268781l553356J375171P971340O988619k584985j0812573r528542
1999g450340k351842J740676K87776k249898k816616k444085j597975J233211
1991a5649093N278254O531779L153347j343381k365240L95414L458084L841585
1983C300749J734085J9744J414561M878937N660620J040132n170581p075936m403519
1974A398792j510499K0935J890485K821302m09240m572934j790803O735472Q706525
$$ y = [-2381737, 480956, 1269999, -908061, -3552728, -2300403, 3084359, 7692341, 7134744, 2060102, -3118034, -4383037, -1437271, 1650630, -10969, -6400926, -11654013, -10712074, -5380860, -1376155, -942002, -1616481, -1194627, 5104, 1610172, 3818654, 4962767, 2693986, -859370, 515801, 8487141, 15475760, 12890775, 2078202, -7450340, -9802182, -8061506, -7773730, -10023628, -12840244, -15284329, -16882304, -15649093, -10370839, -3839060, -685713, -2029094, -4394334, -3998920, -540836, 3300749, 5034834, 5054578, 6469139, 11348076, 17008696, 18048828, 12878247, 5802311, 1398792, -111707, -90772, 1799713, 4621015, 4211775, -361159, -2151962, 4583510, 13290035]
1965A3290035r31888r271514l234032R648420J1381641K7404q620070n340937
1957F949059J205997O60515m702743p646457p177247n145330o31513M877674M708140
1948f901905k414503o134597J672907J2531607J1766633j62928q462210n425201
1940c530197Q23819J437584n04875J459565M613434J970476m567321n390116K615730
1931a071901J0909499J0813978M247313j024473k406301l213641m845938m855173
1923H553363k963584k542524m078040l181588J573997M770011K895986J086905
1915F114526M233571O673900J84787j1114137j5002921r286868l551479j746191
1907b3494812L247072J2929369J5412985M176076p376016l785659Q225435R359800
$$ y = [13290035, 12358147, 3086633, -147399, 9501021, 20882662, 20910066, 12289996, 6949059, 8155056, 8815571, 4112828, -3533629, -10710876, -15856206, -16487719, -11610045, -6901905, -9316408, -15451005, -13778098, -1246491, 10520142, 10357214, 1895004, -3530197, -2706378, -1268794, -1773669, -314104, 4299330, 6269806, 1702485, -3687631, -1071901, 9837598, 20651576, 24898889, 23874416, 21468115, 18254474, 13408536, 8553363, 5589779, 3047255, -1030785, -4212373, -2638376, 2131635, 5027621, 6114526, 10348097, 17021997, 17206784, 6092647, -8910274, -18197142, -21748621, -23494812, -20247740, -7318371, 8094614, 12270690, 4894674, 1109015, 9334450, 18694250]
1899A8694250k548675r920542l476521M433547J033879p107305o512300J338222
1891d065445M054745j080994m549201j790389K85741k798421m331187J588379
1883a2686772Q221361N948651j535452j858083O784954J2290617O647461k924337
1875B0888400n772144k284789L35723K05395L58865N80424j628936m338887l734223
1866D609828j775583l118156n643552l045282L424111N564046J882692N77052
1858B475156N668671R847962O258647r90081m306420l662550l536549m508051
1850G246785m580527m268636m081921j149984N445688R943808P017046L63228
1842A5935487k280634j04300J125439j543680n226695o496370m722075j043589
$$ y = [18694250, 16145575, 6225033, 2748512, 7182059, 8215938, 1108633, -5403667, -4065445, -10700, -1091694, -5640895, -7431284, -7145543, -9943964, -14275151, -12686772, -4465411, 1483240, -52212, -1910295, 4874659, 17165276, 23812737, 20888400, 15116256, 12831467, 13167190, 13372585, 13731450, 14311874, 12682938, 8344051, 4609828, 2834245, -283911, -5927463, -8972745, -5548634, 15412, 1898104, 2475156, 8143827, 17991789, 24250436, 23260355, 18953935, 15291385, 11754836, 7246785, 2666258, -1602378, -5684299, -6834283, -1388595, 8555213, 15572259, 15935487, 13654853, 13550553, 14675992, 13132312, 7905617, 1409247, -3312828, -4356417]
1834d356417K150993K251557L1189l49676K185485L164741K23415j871986Q77970
1825D307271L960154J456090l428538l135562J789865L722551L32881k446043
1817F558669m15490K986877K408817k653569p890102p953359j083167P311503
1809g29821Q503217J436167m319923j547926L851704K251681m439626o341173
1801a335700j286092L384133L364732J496495l64675l346904m809284L4185P884386
1792E021276Q872272J273739n009864l670922j147720m693690r611285o407748
1784a5373942M240188J1580576Q329026j400506p689706n395482J135374L365972
1776a208500j170957n711389l527987K589378M812349J869406k38478J755155
$$ y = [-4356417, -2205424, 46133, 77322, -272354, 1913131, 5077872, 5301287, 3429301, 4307271, 8267425, 9723515, 6294977, 3159415, 4949280, 8671831, 9004712, 6558669, 6143179, 9130056, 11538873, 8885304, 995202, -6958157, -8041324, -729821, 7773396, 9209563, 4889640, 3341714, 7193418, 9445099, 5005473, -1335700, -2621792, 762341, 4127073, 5623568, 5258893, 1911989, -2897295, -2863110, 5021276, 13893548, 15167287, 10157423, 6486501, 5338781, 645091, -8966194, -15373942, -11133754, 446822, 8775848, 7375342, -314364, -5709846, -4574472, -1208500, -2379457, -8090846, -11618833, -9029455, -4217106, -2347700, -2586178, -831023]
1768h31023M449273M313252J986933q71646l593586m674097k993318j042498j976926
1759e233636l944889k648567J439934M173908M574551M303421K443977j791422
1751C317277l629115J051741O198966K631315o675232r790140m086859J068468
1743i913579R36548J497462N915634Q112800M945607K766431N609093P517949
1735B7387945L307466k504059m085328l161501l432499l855915k734891j225702
1727I695516R54181N313079P772017K203450o824123p115727J708475N662875
1719A9369743j282177p247416k836849L383480O56960n860853n336357J016549
1711A863080M995512N550850O254404O090762L019815j79593j853808n339644
$$ y = [-831023, 3618250, 7931502, 9918435, 9046789, 5453203, 779106, -2214212, -3256710, -5233636, -9178525, -11827092, -10387158, -6213250, -1638699, 2664722, 5108699, 3317277, -311838, 739903, 6938869, 9570184, 2894952, -6895188, -10982047, -9913579, -8977031, -7479569, -1563935, 6548865, 11494472, 14260903, 19869996, 27387945, 30695411, 28191352, 24106024, 20944523, 17512024, 13656109, 10921218, 9695516, 10649697, 15962776, 23734793, 25938243, 19114120, 11998393, 13706868, 19369743, 18087566, 10840150, 8003301, 11386781, 12043741, 6182888, 846531, 1863080, 6858592, 12409442, 18663846, 24754608, 27774423, 27594830, 25741022, 20401378]
1703B0401378j0103548r019678j265408L735491K244725K664792Q550060J0535295
1695B7743107M036730j565438q38618j062452l547277J996332J3447782J2740113
1687E2950279j9784j85924J5958723J8344992K253774J1968945N9000270O6136971
1679B26408246l2100096j63118323j82213287o4574554N8390795P5039288K0806415
1672f1361516r318007K766881J1702812K819692J03635P527851O187762k305065
1664d1875955m28313O628889R13076r142414j690394J4476887J1080590r130919
1656b9168553j4757078J822304J4397034Q728766P86644K317212K874633l725368
1648a6724406n603566K933901R515192O860285M137300N650265J525204j0311005
$$ y = [20401378, 10297830, 1278152, 12744, 3748235, 5992960, 8657752, 17207812, 27743107, 31779837, 30214399, 29375781, 28313329, 24766052, 26762384, 40210166, 52950279, 52930495, 52744571, 68703294, 87048286, 89302060, 101271005, 160271275, 226408246, 194308150, 31189827, -151023460, -215598014, -157207219, -82167931, -61361516, -70679523, -67912642, -56209830, -53390138, -53286503, -45758652, -39570890, -41875955, -42304268, -35675379, -34762303, -43904717, -45595111, -31118224, -20037634, -29168553, -43925631, -42103327, -27706293, -18977527, -18190883, -15873671, -12999038, -16724406, -22327972, -19394071, -9878879, -3018594, 1118706, 6768971, 8294175, -2016830]
1640b016830j5521976p699888L8718j050992j029902O708437J0143021O67521
1632i761891q417342l034247P584339O626471k552703l726887M931502R393969
1624A043211K491190p204417r166788k804912N007327P496521L328121k073229
1616a882976k565246L87193M72153k360438j903174K213237K998502o73473j053342
1607d367564L944302N543975m57863n408627k560606J859373J081287m85208K000798
1598A149867K848584k616424o113403N32704R219992O949511l356449q072853
1590E41529l941742N82396J621271L180464N706090M535994l23034l924105n243324
1581B735539o398320n204626N85893M163348k647279j3874083j4916700l824468
$$ y = [-2016830, -17538806, -25238694, -25199976, -26250968, -27280870, -20572433, -10429412, -9761891, -18179233, -21213480, -13629141, -7002670, -9555373, -13282260, -8350758, 1043211, 3534401, -3670016, -12836804, -15641716, -10634389, -3137868, 190253, -1882976, -4448222, -4061029, -3588876, -5949314, -7852488, -5639251, -2640749, -3314222, -4367564, -423262, 5120713, 4662850, -745777, -3306383, -1447010, -365723, -850931, 1149867, 3998451, 1382027, -4731376, -4198672, 5021320, 11970831, 8614382, 541529, -3400213, -2817817, -1196546, 1983918, 7690008, 12226002, 11902968, 7978863, 2735539, -3662781, -8867407, -8281514, -4118166, -6765445, -20639528, -35556228, -39380696]
1573c9380696O353994P896742P159076R556620R629843K532521n953387q373968
1565a0579255n787270k395785J834370O642124P343328K389558j588507O76580
1557a464857M505385L126033j703832m182998m046377l808754j620938M166249
1549e030089P513748J857219p692879r782392l606689N21881j704793k306084
1541b0230078M251071J0704019Q511410J543433p45613J551886N39909n022192
1533A103845p368286k713529K696535K910565J003207K300488M607223J790924
1525F330972n836467j1026522q655435n68581P901090J2053034R343935J326404
1517A0868430o124965q403664p343547o968912o019228o77697O505482Q239388
$$ y = [-39380696, -33026702, -25129960, -17970884, -8414264, 1215579, 3748100, -2205287, -10579255, -16366525, -18762310, -16927940, -10285816, -2942488, -552930, -2141437, -1464857, 3040528, 6166561, 4462729, 279731, -3766646, -7575400, -9196338, -5030089, 2483659, 4340878, -3352001, -13134393, -16741082, -16219201, -17923994, -20230078, -15979007, -5274988, 3236422, 4779855, 4034242, 5586128, 6126037, 1103845, -6264441, -8977970, -6281435, -3370870, -2367663, -67175, 4540048, 6330972, 494505, -10532017, -19187452, -19756033, -11854943, 198091, 9542026, 10868430, 4743465, -3660199, -11003746, -17972658, -23991886, -24669583, -18164101, -9924713]
1509i924713L771528K87318Q40733k27729n576099p698919o23946Q792087J0195077
1500a64663M781433J373204J700239L42503k897656j973030L638215O578491L101143
1491A6479879k080473m766849o439817p607534m719062K113993O274195M407851
1483C662183J821421K970682L866623K87109l364624j279604L264015L367798
1475A4595603K52103J02343J963468r54991q343751j1303860n818009J048060
1467h459034K035378l48402N07513M830867O858999L097949l859223q627770p961663
1458a1925386l470074q6554o7773Q13367P235026J4853942J3102947q4082j2486112
1449G885301j1605729k76575P686063M934906k726178o493846m998059k656176
$$ y = [-9924713, -6153185, -5865867, -5025134, -5252863, -10828962, -18527881, -19151827, -10359740, -164663, 4616770, 5989974, 7690213, 8032716, 5135060, 3162030, 6800245, 13378736, 16479879, 14399406, 9632557, 3192740, -4414794, -9133856, -7019863, -745668, 3662183, 5483604, 8454286, 12320909, 12608018, 9243394, 7963790, 11227805, 14595603, 14847706, 14950049, 16913517, 15958526, 7614775, -3689085, -9507094, -8459034, -6423656, -6772058, -6264545, -1433678, 5425321, 8523270, 4664047, -3963723, -11925386, -15395460, -15482014, -15549787, -14736420, -7501394, 7352548, 20455495, 20371413, 7885301, -3720428, -3997003, 3689060, 8623966, 5897788, -596058, -5594117, -8250293]
1441h250293k131444j787053P93127N013863P392421N472814J359860k55096J721070
1432I329269L031573L68780l404572l678850j343029j020269l450389m934027
1424e101514m160791l960238n175160m297012M35035N270996O199615M046713
1416f742356J489374j054743l218405k369829K049082M992203J675858m907446
1408h086262p225318k936216K999114N292452L429129J94965j424579k95177J233994
1399f817898p69006n579398o619453r20809M122299O60836n894924l019437R172490
1390a5665300J5637429P618889m416486o050836J407284N765256K607584j529223
1382E374597k108888k092750l724580l844688l38681L399257L929192K731805
$$ y = [-8250293, -10381737, -12168790, -11375663, -6361800, 1030621, 6503435, 7863295, 7608199, 9329269, 12360842, 12729622, 9325050, 5646200, 4303171, 3282902, -167487, -5101514, -9262305, -13222543, -18397703, -22694715, -22259680, -16988684, -10789069, -6742356, -5252982, -6307725, -9526130, -11895959, -9846877, -4854674, -3178816, -8086262, -15311580, -18247796, -15248682, -9956230, -6527101, -6332136, -7756715, -8051892, -6817898, -7586904, -13166302, -19785755, -20706564, -16584265, -15923429, -21818353, -24837790, -15665300, -27871, 7591018, 3174532, -2876304, -1469020, 4296236, 6903820, 5374597, 3265709, 1172959, -2551621, -6396309, -6734990, -3335733, 593459, 3325264]
1374C325264K254121J063453l014987p536271p457407j839500M689783P427627
1366a087917O219030L755624J141378k577349o556690o769971j134107N460955
1358a549047N389700j841527q104054o925744j219500K313768K519828K757522
1350f659054L384497J364818l216334n907722m135292l77892K073161K928940
1342a0544878L182383K597236N08923k574044m936912m460156n26736L634236
1334a3119948L125102j533567l077656K357071P791554M874518k666303m296388
1326f545617M18017J572128l508371n169822J586468P463725M195913j322868
1318a310427J087720P387792O240714k125958p129455m931299j432404N97326
$$ y = [3325264, 5579385, 6642838, 3627851, -3908420, -11365827, -13205327, -8515544, -1087917, 5131113, 8886737, 10028115, 7450766, 894076, -5875895, -7010002, -1549047, 3840653, 1999126, -6104928, -13030672, -14250172, -11936404, -9416576, -6659054, -3274557, -1909739, -5126073, -11033795, -15169087, -15546979, -13473818, -10544878, -7362495, -4765259, -4256336, -6830380, -11767292, -16227448, -16754184, -13119948, -9994846, -11528413, -14606069, -12248998, -4457444, 417074, -2249229, -6545617, -6127600, -4555472, -8063843, -13233665, -11647197, -4183472, 12441, -1310427, -222707, 7165085, 13405799, 11279841, 4150386, -780913, -2213317, -1615991]
1310a615991M431034Q679421O298551k818680r414942q556664n360946l485257
1302a1843474Q76111Q248342J0564383M295476j364248J178166M529724j495394
1294A4989086j1671653j2459233k963736M575978L603979j71050j206192j038150
1286f340971q39207J856682N786565N155735j50414k699654L54679K687757J007390
1277F818562J777189Q702794J2909156N430154p323048j1611967n840593r01038
1269I961209k815469n901813m090819M24296K531714J009166k807730p424571
1261i114017r809512o692405M02776N732288O537986N142945K801769k432482
1253g430652r041867r764760j267600Q439320Q569008o02715q309970p049427
$$ y = [-1615991, 2815043, 11494464, 17793015, 14974335, 5559393, -2997271, -8358217, -11843474, -10967363, -2719021, 7845362, 12140838, 10776590, 11954756, 16484480, 14989086, 3317433, -9141800, -12105536, -7529558, -3925579, -4096629, -5302821, -6340971, -7180178, -5323496, 463069, 5618804, 5468390, 2768736, 3123415, 5811172, 6818562, 8595751, 17298545, 30207701, 35637855, 28314807, 16702840, 10862247, 9961209, 7145740, 1243927, -2846892, -2422596, 109118, 1118284, -1689446, -9114017, -18923529, -25615934, -25213158, -19480870, -12942884, -7799939, -4998170, -7430652, -16472519, -26237279, -27504879, -19065559, -10496551, -11099266, -19409236, -26458663]
1245b6458663l81007L874670L632175K948526M689937O296717L899621j114904
1237b612928k643910J864672O523757L982784m137844q755238n577250k47310
1229a1603267R24675l86382L97566J802189r70903o667896q447743l871610J808683
1220b7014688L769682L466333L888341L992011J865127j05575J811393O070934
1212b256442O952562K445984k908437m191766k005062m72264j674334m137276
1204h247035n303099l525598J083899N777357O539764K862374k30976J760272
1196G16958N899109N406024k61703m634661m588580m838157q767290j1297611
1188b2365911o548993K476712Q399000R499827Q415264N155025k17802k060197
$$ y = [-26458663, -26839670, -22965000, -19332825, -16384299, -11694362, -5397645, -1498024, -2612928, -5256838, -3392166, 3131591, 7114375, 2976531, -5778707, -11355957, -11603267, -10678592, -11064974, -10667408, -8865219, -9836122, -16504018, -24951761, -28823371, -27014688, -23245006, -19778673, -15890332, -11898321, -10033194, -10138769, -8327376, -2256442, 4696120, 7142104, 4233667, 41901, -1963161, -2435425, -4109759, -8247035, -13550134, -17075732, -15991833, -10214476, -3674712, -812338, -1043314, 716958, 6616067, 12022091, 11760388, 7125727, 2537147, -2301010, -11068300, -22365911, -28914904, -26438192, -18039192, -8539365, -124101, 5030924, 4813122, 2752925]
1180B752925L266037P356255j82623j3087456j4598688l468840K880861l757454
1172a8838983r076773q62310R909094P643363j873933k691486L733646L011594
1164i045788n280695o830042J842908P850986M974218K833232P232499R152225
1156A2729543J870268o156123n441460k4414J925406J159109J527482J165314
1148H755125j230700r55860K875541K190716n873557j0636308m708242K320893
1140g262392K90948l034261L478060J1532724N635965q393665r836651L721535
1132c867737J2338056N427677m015192l041456K879683L982976K030378J720340
1124A7454725J56001m608543o229987j199916L206003J061878k674318l183296
$$ y = [2752925, 6018962, 13375217, 13192594, 105138, -14493550, -17962390, -15081529, -18838983, -27915756, -28778066, -18868972, -11225609, -13099542, -15791028, -12057382, -9045788, -14326483, -21156525, -19313617, -11462631, -6488413, -3655181, 3577318, 12729543, 14599811, 8443688, 3002228, 2977814, 4903220, 6062329, 7589811, 8755125, 7524425, 6568565, 9444106, 11634822, 5761265, -4875043, -9583285, -7262392, -6971444, -10005705, -6527645, 5005079, 10641044, 2247379, -7589272, -3867737, 8470319, 13897996, 9882804, 6841348, 9721031, 13704007, 15734385, 17454725, 17610726, 13002183, 6772196, 5572280, 8778283, 9840161, 7165843, 3982547]
1116C982547m634773q740772p301788K432191Q037025J305979n517954N22834
1108i914711R356239M263842p813901o519158O650760R600447l474089j2620755
1100a0471326n267113N432211N371555J191521L822952Q023826L879869m408490
1092G575005o570435l420761k268189l311515k983980l161398n376048l813913
1084b3331234M076284Q379550J187068p823328m908895N663167R083075M016100
1076c658213J881845N569389O854807L989407L929505O114449J754338p937482
1068A8498045j0225221k192646L175423j474810o473762l371842R12458j472816
1060b625171m598459p24243M495117K047772m111737m198875O28250J787994j076083
$$ y = [3982547, -652226, -9392998, -16694786, -14262595, -6225570, -4919591, -10437545, -9914711, -558472, 3705370, -4108531, -10627689, -3976929, 5623518, 2149429, -10471326, -15738439, -10306228, -4934673, -3743152, 79800, 8103626, 11983495, 7575005, 1004570, -2416191, -4684380, -7995895, -10979875, -14141273, -19517321, -23331234, -19254950, -10875400, -9688332, -17511660, -22420555, -16757388, -7674313, -3658213, -1776368, 3793021, 10647828, 14637235, 18566740, 24681189, 26435527, 18498045, 8272824, 6080178, 9255601, 7780791, 1307029, -2064813, -1152355, -2625171, -7223630, -7947873, -3452756, -1404984, -5516721, -9715596, -9087346, -7299352, -8375435]
1051h375435n44169M910616Q653979O464451J110757k680398k006700K832940
1043A0366041O186426J312620q484324j0527387r79048O939879K172206o550690
1035D35723m876596M064483O255028L77126k319426J400098L593463J733216J554613
1026A2217728K629487k045372r788310q442924K967337J0053638N226469j563850
1018A1254203j200992Q35610k021889m525987j065526K385242m85031l767419
1010A408211j45000N037372L058739k769291l782655j314905k196985m285544
1002d990058j54496P923159R736278K763241n056261p458502n196841n35177M413575
993A444918N274693J15383n169593m459235j368222k408042m252385M33030P484792
$$ y = [-8375435, -8919604, -4008988, 4644991, 11109442, 12220199, 9539801, 7533101, 10366041, 16552467, 17865087, 9380763, -1146624, -2125672, 4814207, 6986413, 435723, -4440873, -376390, 5878638, 6255764, 3936338, 5336436, 8929899, 10663115, 12217728, 14847215, 12801843, 3013533, -5429391, -2462054, 7591584, 12818053, 11254203, 10053211, 10888821, 8866932, 4340945, 3275419, 5660661, 5175630, 1408211, 1263211, 6300583, 9359322, 6590031, 2807376, 1492471, -704514, -4990058, -5144554, 2778605, 12514883, 15278124, 10221863, 2763361, -2433480, -2968657, 1444918, 6719611, 6834994, 1665401, -2793834, -4162056, -6570098, -10822483, -10389453, -2904661]
984b904661N462579n019743j0405370m545962L712191O582869P327240Q952824
976I161967O298121k550075q239764l318102N075777N476750j481186o299622
968D123866m950614p85947L536888O820252N294733k891715j1048775j0638594
960a0539906l652610J55774j943578k584018K605389P713847O320308J431377
952d93417j4622K122801K314176j020519l388511k003520j74531j435175l251105
943g344423p95751M746763O749082K799134j148312N81093M583834L440473k628669
934A0983224n798777k701069L42252k828352q687732r258567l389229K607612
926a8730638L895844J471401j886442m741144n113820m70246P489121J1496482
$$ y = [-2904661, 2557918, -2461825, -12867195, -17413157, -13700966, -7118097, 209143, 9161967, 15460088, 12910013, 4670249, 1352147, 6427924, 11904674, 10423488, 4123866, -826748, -1612695, 1924193, 8744445, 14039178, 11147463, 98688, -10539906, -14192516, -14036742, -15980320, -18564338, -15958949, -8245102, -1924794, -493417, -508039, 1614762, 3928938, 2908419, -480092, -2483612, -2658143, -4093318, -7344423, -8140174, -3393411, 3355671, 6154805, 5006493, 5587586, 10171420, 13611893, 10983224, 5184447, 2483378, 2825630, -2722, -8690454, -17949021, -21338250, -18730638, -14834794, -13363393, -15249835, -19990979, -25104799, -25575045, -18085924, -6589442]
918f589442O254361m055177r730565o952815j377894O78984L15094J948951M689596
909a4818907L635377j120295l391500m66869K452292R11685j424770N08057L788720
900i926210K039467l520358n643147k642822M1491M31698L196104R387784J1643212
891E007219N115474l590174n268614j083887P96255j545934k028229K466583O937712
882F806405N959073R92038k755308l149468k052756j587506j857461j554440L82511
873A183088L209684M384743K255681j371210k995848j837243m68348n25914k08400
864C626233K219842M324303J829903n108029j0716848r935290m162633R42927
856a6979592K092467O36603r25450j701709j304408Q84014L706159L987172N70231
$$ y = [-6589442, -335081, -4390258, -14120823, -21073638, -22451532, -21772548, -21457454, -19508503, -14818907, -11183530, -12303825, -15695325, -16162194, -13709902, -12798217, -14222987, -13714930, -9926210, -7886743, -11407101, -17050248, -19693070, -19651579, -19219881, -16023777, -6635993, 5007219, 10122693, 6532519, 1263905, 180018, 976273, -569661, -2597890, -131307, 6806405, 12765478, 13757516, 11002208, 7852740, 5799984, 4212478, 2355017, 800577, 1183088, 4392772, 8777515, 11033196, 9661986, 6666138, 4828895, 4360547, 3834633, 3626233, 5846075, 10170378, 12000281, 6892252, -3824596, -13759886, -17922519, -16979592, -14887125, -14250522, -15175972, -16877681, -18182089, -17298075, -13591916, -9604744, -9034513]
847i034513l172022l208135J43180L296940M035553K610611k21632l199680l750989
838a2500687o37889L049287K787178j578220n664497n825457j997512L755515
830a8612282Q330646Q205589K792435l269248m716234j833693J459873L903381
822c739533O430153P325155M241473n5966j147699j287783n610617j0293493n686501
813i824811O330830J0713607J183490q313147l812369P410259Q544311j367527
805A0864643q513207o760557l613718m176977l940508j95204K354441J594470
797a2386617K156423M777901K720501m921752p279556K190467J2928839J1271904
789A1458110L33099n888409l664935j927863n055831o530489k151593K012811
$$ y = [-9034513, -12206535, -15414670, -15271490, -11974550, -7938997, -5328386, -5550018, -8749698, -12500687, -13138576, -10089289, -7302111, -8880331, -14544828, -20370285, -22367797, -18612282, -10281636, -2076047, 716388, -2552860, -7269094, -9102787, -7642914, -3739533, 2690620, 10015775, 14257248, 14201282, 13053583, 11765800, 6155183, -4138310, -9824811, -3493981, 7219626, 8403116, 89969, -3722400, 3687859, 12232170, 10864643, 2351436, -4409121, -8022839, -12199816, -16140324, -16335528, -13981087, -12386617, -10230194, -5452293, -2731792, -7653544, -14933100, -12742633, 186206, 11458110, 11791209, 5902800, 2237865, 310002, -4745829, -11276318, -13427911, -11415100]
781a1415100J96337l339588j769021L261700N055761K456292K22681P26612J398808
772c205518K15760j192400p57096R67985J898440Q54939j169372j323414K146282
763a564394O205853N080749j696494o662744l779055K734691M283829R9348l192102
754A509681k749647k190775k695376j79337N937710R254847N889931L38627k790213
745A2325448n662847j0058600j0631409l258623N629562O954912K083094q56236
737c474699j80259o49088k828144k610510l00332k72961j753664L93631N317404
728f358622O330804K381873l27820L87929j60153k926525k036390M090121Q273230
719I654447N629473K39301l372021o319918q520205n456932K538285O995221L637469
$$ y = [-11415100, -11218763, -14558351, -16327372, -13065672, -8009911, -5553619, -5330938, -4604326, -3205518, -2989758, -4182158, -4939254, -3971269, -2072829, -1217890, -2387262, -3710676, -1564394, 4641459, 9722208, 8025714, 1362970, -2416085, 318606, 4602435, 4701783, 1509681, -1239966, -3430741, -6126117, -6305454, -367744, 8887103, 14777034, 15115661, 12325448, 6662601, -3395999, -14027408, -17286031, -11656469, -4701557, -2618463, -3474699, -3654958, -4304046, -7132190, -9742700, -10043032, -10315993, -12069657, -11676026, -6358622, -27818, 2354055, 2026235, 2414164, 2254011, -672514, -2708904, 1381217, 9654447, 15283920, 15523221, 12151200, 5831282, -2688923, -8145855, -5607570, 1387651, 5025120]
710E025120o06963P70758M064931L857557K050518R52484k928321r464559r317628
701e596103J542455J1029273P033280l657772n994109N10723M134566J065518
693A0067831k068323k728086m409765n471553o10570O676699O967691O32619k766853
684F289690j295761k710248q002056p606505J755998R861153Q307447J680460
676H280178k324370l620954m666167l909031m05762K467118K677137K080925M17479
667I96553n049665j1163616r601056K62298Q584509R206924O994883O759425N246283
658A2236538q7875m318054l813913k715548m007778l237084J713463L813783j800848
649b217316q068855o468199J15840L817214M093678M580602M307206J515170K37819
$$ y = [5025120, 4418157, 5188915, 9253846, 13111403, 15161921, 16114405, 13186084, 3721525, -5596103, -4053648, 6975625, 14008905, 10351133, 4357024, 4867747, 9002313, 10067831, 7999508, 5271422, 861657, -4609896, -5220466, 1456233, 8423924, 9056543, 6289690, 4993929, 2283681, -5718375, -13324880, -11568882, -1707729, 6599718, 8280178, 5955808, 2334854, -2331313, -6240344, -6646106, -4178988, -1501851, 579074, 996553, -4053112, -15216728, -24817784, -24555486, -15970977, -6764053, 230830, 6990255, 12236538, 12148663, 7830609, 4016696, 1301148, -2706630, -5943714, -4230251, -416468, -2217316, -10286171, -16754370, -16638530, -12821316, -8727638, -4147036, 160170, 1675340, 1913159]
640A913159L467458N292371l64540q250571r051621l629125J06527L64370J005326
631i146646J456690j913471o567831o457682k436954k49010L09706M215227J0252685
622a0537286J1332452N847424l18317l178013l747821k483719P69595K250791
614f4894j194772m253742J42331P317296N743703m213764r198874l043335M756312
605d009739N348980K884681L698093M470828K99028m539752m119595k170024n016083
596c153583q441353l494062P065042J0401222K678535m669991j767781N738259
588D356288O074491j472682o882983m394863R53740K573902J117832O74173J357836
579D357734O25298j184726j997746k714322n017058n791551n79187P408572R394277
$$ y = [1913159, 5380617, 10672988, 10308448, 2057877, -6993744, -10622869, -10516342, -10151972, -9146646, -7689956, -9603427, -16171258, -22628940, -25065894, -25314904, -25005198, -20789971, -10537286, 795166, 6642590, 6324273, 3146260, -601561, -3085280, -2315685, -64894, -1259666, -5513408, -5371077, 1946219, 7689922, 3476158, -5722716, -8766051, -4009739, 1339241, 4223922, 7922015, 12392843, 12691871, 8152119, 4032524, 1862500, -3153583, -11594936, -15088998, -8023956, 2377266, 5055801, 385810, -1381971, 4356288, 10430779, 8958097, 2075114, -2319749, -1366009, 1207893, 2325725, 2999898, 4357734, 4983032, 3798306, 1800560, -913762, -5930820, -11722371, -12301558, -4892986, 4501291]
570D501291L800689j011640K20033K306297J29678k175415k389J537834l984308
561E322070j1454277j0857594l275913J273534K27768P43680N265098O847587
553e908047J847379l334216k763130N55925J768190K041698L646877L703308o15297
544I42687n301680m538998K96492K613622K23427k230323n87086L079382L676121
535a826356L11235j958869J310514O982720P289658L59256o669180p577052n083570
526f861644m489165m603263j801227J488468J186660J036365P012684J3879333
518F848211R669592m970592j4402497r386799M73006K302540j915136j644917
510a3026592M872911R513109P084984Q12087l822719m578336k465613n06211j494704
$$ y = [4501291, 8301980, 7290340, 7510373, 9816670, 9946348, 7770933, 7768544, 9306378, 5322070, -6132207, -16989801, -20265714, -18992180, -18764412, -18020732, -12755634, -5908047, -4060668, -7394884, -10158014, -9602089, -7833899, -5792201, -2145324, 1557984, 942687, -4358993, -8897991, -8601499, -5987877, -5764450, -7994773, -8581859, -5502477, -1826356, -1515121, -3473990, -2163476, 4819244, 12108902, 12468158, 5798978, -1778074, -6861644, -11350809, -15954072, -17755299, -16266831, -15080171, -14043806, -7031122, 6848211, 16517803, 11547211, -2855286, -12242085, -11769079, -9466539, -11381675, -13026592, -8153681, 1359428, 8444412, 9256499, 5433780, 855444, -1610169, -2116380, -3611084]
501c611084m163388l639996J772925P229641P592600L864260K79755j683310k759109
492D882294k331714M47903L656027M029171N88166m618076p757070m988744L486365
483b605678J0504554P805407l286246j1731960r832041j903620K863698J641668
475f544218j468663k221290J84671L618135M431476Q22915l851272m384936r31076
466a0344258J524848J166026R41719J603952M49891j547079K08825M164698K370961
457E39583n684054q988760j269003Q141660P983150J159984k393260j485372j480778
448c476850k243901P4079L092196J463938k338468j253758L976470N871823K572609
439G738138p08586j831639l542984n333964l182558J824455L537833N31761k198096
$$ y = [-3611084, -7774472, -11414468, -9641543, -2411902, 5180698, 9044958, 9324713, 7641403, 4882294, 2550580, 2998483, 6654510, 10683681, 11271847, 6653771, -1103299, -6092043, -2605678, 7898876, 15704283, 12418037, 686077, -9145964, -11049584, -8185886, -6544218, -8012881, -10234171, -10049500, -6431365, -1999889, -1176974, -5028246, -9413182, -10344258, -8819410, -7653384, -6711665, -5107713, -4657822, -6204901, -5996076, -1831378, 539583, -5144471, -14133231, -15402234, -7260574, 722576, 1882560, -510700, -1996072, -3476850, -5720751, -5646672, -2554476, -1090538, -3429006, -4682764, -706294, 5165529, 7738138, 7029552, 5197913, 1654929, -3679035, -6861593, -5037138, -1499305, -967544, -3165640]
430c165640k086423j672766j838538l90935J776593J005938j734599j525043J696429
421g934984K933901J411378J645457M339406N067616L324670L465151M793812
413A9046407J004686p318096j0331328m115618J884928p56778o688496o308348
405a3582643m12941L495283L600054L293467K598752o70866l703605j529922L692580
396c219841M169459k096975p951387o771343m26952M534249M947947K757801P84670
387c272372m41032j458407j453955O94619L014826J418750l819035o140873j369772
378a2827251M969453M886521j52397k180899j9697j68807m045064m856832r8383
369a4493356L277681J061910p77954K631334N755943K782618j419431j00408K934461
$$ y = [-3165640, -5252063, -6924829, -8763367, -9154302, -7377709, -6371771, -8106370, -9631413, -7934984, -5001083, -3589705, -1944248, 2395158, 7462774, 10787444, 14252595, 19046407, 20051093, 12732997, 2401669, -1713949, 170979, -585799, -7274295, -13582643, -13995584, -10500301, -6900247, -3606780, -1008028, -1678894, -5382499, -6912421, -3219841, 949618, -1147357, -9098744, -15870087, -16297039, -11762790, -6814843, -4057042, -3272372, -3713404, -5171811, -6625766, -5931147, -2916321, -1497571, -5316606, -11457479, -12827251, -7857798, -2971277, -3123674, -5304573, -5324270, -5493077, -9538141, -14394973, -14493356, -11215675, -10153765, -10931719, -8300385, -2544442, 238176, -1181255, -1281663, 1652798]
360A652798O04300l762744k183672K885322K345221l006864l483155K097192M029011
351A177409q94106l312253K265007P376325L557902l807643m738520j26876J820025
342C317270n58221j841068N637J622882J573121J839604K261552L81719k814102
333E788394l229646m93871J230810L33512J03562K281348L572604J336062j724890
324I197885j994852o99530j484999m409825n952503m071582n54905J289944j82653
315h863020l235414l549515J225702O973233O514091n97368n785036k552298M197567
306e672058N385457R44254j590901M1288L44896k593411k817901K310406N247139
297A599169m75917q531745p956554O91946O397993L624541j565694k097758J362242
$$ y = [1652798, 2257098, -1505646, -3689318, -803996, 1541225, -1465639, -4948794, -2851602, 1177409, 283303, -3028950, -763943, 6612382, 10170284, 6362641, 1624121, 1497245, 3317270, 2759049, 917981, 923618, 2546500, 4119621, 5959225, 8220777, 8602496, 5788394, 2558748, 2064877, 3295687, 3629199, 3732761, 6014109, 9586713, 10922775, 9197885, 7203033, 6503503, 5018504, 608679, -5343824, -9415406, -9970311, -8680367, -8863020, -12098434, -15647949, -14422247, -7449014, -934923, -1532291, -7317327, -9869625, -5672058, -286601, 657653, -933248, -891960, -547064, -3140475, -5958376, -3647970, 1599169, 1123252, -7408493, -15365047, -14673101, -8275108, -4650567, -6216261, -8314019, -6951777]
288f951777M702841O643732O978227L843511k652900p539371o283173j083927
280b342837J987408Q65572j109820j049973r0609l77463j382018j075679O73976
271c901443J971862J939362J917209K793960K819529K6433l994928n273735k675647
262d377398L62816J52974k961673n336751l612160K360736Q366713Q584375K525612
253F065244k333830K06055M793676J264453q383823j0371967q3675R034431N261880
244E452444l699131m345427N99193j016344p925210p210768K426771P385030K047264
235f286178k246009K569298P645998L156438n042992n863524l30228K981610K412109
226a003478J926681J211200j977932m067151q93877K883851J43317n643723m590841
$$ y = [-6951777, -2248936, 4394796, 11373023, 15216534, 12563634, 5024263, -1258910, -2342837, -355429, 510143, -599677, -1649650, -1740259, -2117722, -3499740, -4575419, -3901443, -1929581, 9781, 1926990, 4720950, 7540479, 7566912, 3571984, -1701751, -4377398, -4014582, -3861608, -6823281, -12160032, -15772192, -13411456, -5044743, 3539632, 6065244, 3731414, 3937469, 8731145, 9995598, 1611775, -8760192, -8843867, 190564, 5452444, 1753313, -2592114, -1992921, -3009265, -10934475, -18145243, -15718472, -8333442, -6286178, -8532187, -5962889, 1683109, 4839547, -203445, -6066969, -6397197, -3415587, -1003478, 923203, 2134403, 156471, -3910680, -4804557, -1920706, -1777389, -7421112, -12011953]
217a2011953L556679Q402535M662295r69800j042410K924206N152225L471283
209A4145060p86242n547003p776014m922778P37566K973213o80341n226200m601544
200a1684283Q83620N906111O974068N366548L917045L016298P83139l241598o146791
191E774157m969611j118330J144225N13738l06688K72517N87914j08905J36315
182A925332J469485O24904l128642n080393k019379K219777K663011O95500O13848
173a6557K229996K507507J733636K218937K867511P11682l429622n769251m859167
164a805328k014648J625530M484949L754216k95198k387632L34213K701993n50226
155E847869n236329l935901J352047K057691k741662m696716L86789O484063P035238
$$ y = [-12011953, -8455274, -52739, 4609556, 3639756, 2597346, 5521552, 10673777, 14145060, 13358818, 7811815, 35801, -4886977, -4149411, -1176198, -1856539, -7082739, -11684283, -10800663, -4894552, 2079516, 7446064, 11363109, 14379407, 15162546, 11920948, 5774157, 804546, -313784, 830441, 1344179, 1037491, 1310008, 1897922, 1789017, 1925332, 3394817, 4019721, 891079, -4189314, -6208693, -3988916, -1325905, -630405, -16557, 2213439, 4720946, 6454582, 8673519, 11541030, 12252712, 8823090, 3053839, -1805328, -3819976, -2194446, 2290503, 6044719, 5749521, 3361889, 3696102, 6398095, 5847869, 611540, -3324361, -1972314, 85377, -2656285, -7353001, -6966212, -482149, 6553089]
146F553089L076850j156795m222685n859979m753558j182536J915359K757004
138b873251K423626J811631M55734j007684r06490N21399J648107K548294L927471
129H548837M057666J158654k400796l119996k190784l035332m654646l443250
121e079647k10126J049328J13768l65555j136626m339985o808625l631396K687154
112a7721710N227520L662053K972399K647320j737253o765317l837248N031130
104a0521106P440025p9648o255315l294685K274011L150523K617504M478557L985655
95C795521j707309n022980k00517N621508L993346j248886k644509k385592n298370
86e097788p028311k070842L683692J846813l335733k536088J795849R84073k375896
$$ y = [6553089, 9629939, 8473144, 4250459, -1609520, -6363078, -7545614, -5630255, -2873251, -449625, 1362006, 1817740, 810056, -96434, 424965, 2073072, 4621366, 8548837, 12606503, 13765157, 11364361, 8244365, 6053581, 3018249, -1636397, -5079647, -5289773, -4240445, -4126677, -4492232, -5628858, -9968843, -16777468, -20408864, -17721710, -12494190, -8832137, -5859738, -3212418, -4949671, -11714988, -15552236, -10521106, -3081081, -3160729, -9416044, -12710729, -10436718, -7286195, -4668691, -190134, 3795521, 2088212, -2934768, -3135285, 2486223, 6479569, 5230683, 2586174, 200582, -5097788, -12126099, -14196941, -10513249, -8666436, -12002169, -14538257, -12742408, -11758335, -14134231]
77a4134231J170350Q951510Q847794N51052l084561K061796M864506j306469p923730
68a983o839735k651481j678819o90622M236504P572930L048302m644081o284190
59g933175j311181L412597L985637J701677j518321l711914k026699L247812O746368
50B592801M818484R10221l42476m11852k846122n561496l665975J925788M909869
41B329242K230321k595962m804977l197493L58922L077006K885733L18663j478516
32h77061l88219J882999K295787M62230j717121l010738l371378k620232o69794
23h013527J556872K799138K453740M78165k237714l267188r28284K281029J755352
14c122417k491138m865558k072935J946322K204461J57059N06056L187701L966723
$$ y = [-14134231, -12963881, -4012371, 4835423, 5386475, 2301914, 4363710, 9228216, 7921747, -1983, -6841718, -9493199, -11172018, -11862640, -7626136, -53206, 2995096, -1648985, -7933175, -9244356, -5831759, -1846122, -144445, -1662766, -5374680, -7401379, -4153567, 2592801, 7411285, 8321506, 7979030, 7567178, 4721056, -840440, -4506415, -2580627, 2329242, 4559563, 1963601, -2841376, -6038869, -5679947, -2602941, 282792, 601455, -877061, -1265280, 617719, 2913506, 3375736, 1658615, -1352123, -4723501, -7343733, -8013527, -6456655, -3657517, -1203777, -725612, -2963326, -6230514, -7158798, -4877769, -3122417, -5613555, -10479113, -12552048, -10605726, -8401265, -8244206, -7738150, -4550449, -583726]
5e83726J880947N13213J433737J499215j543905
0C199481
$$ y = [-583726, 1297221, 1810434, 3244171, 4743386, 3199481]
##END NTUPLES=NMR SPECTRUM
##END=
