##TITLE=31Pdec_LR-628-C2-M2
 CDCl3, 124 sc
 5.7.2019
##JCAMPDX= 6.0         $$ Bruker NMR JCAMP-DX V2.0
##DATA TYPE= NMR SPECTRUM
##DATA CLASS= NTUPLES
##ORIGIN= UXNMR, Bruker Analytische Messtechnik GmbH
##OWNER= root
$$ XWIN-NMR		Version 3.5
$$ Fri Jul  5 15:10:21 2019 Russian Standard Time (UT+4h)  she@DPX200
##.OBSERVE FREQUENCY= 81.013821
##.OBSERVE NUCLEUS= ^31P
##.ACQUISITION MODE= SIMULTANEOUS
##.ACQUISITION SCHEME= undefined
##.AVERAGES= 124
##.DIGITISER RES= 17
##SPECTROMETER/DATA SYSTEM= spect
##.PULSE SEQUENCE= zgpg30
##.SOLVENT NAME= CDCl3
##.SHIFT REFERENCE= (INTERNAL, CDCl3, 0, 182.463)
##AUDIT TRAIL= $$ (NUMBER, WHEN, WHO, WHERE, WHAT)
$$ ##TITLE= Audit trail, XWIN-NMR		Version 3.5
$$ ##JCAMPDX= 5.01
$$ ##ORIGIN= Bruker BioSpin GmbH
$$ ##OWNER= she
$$ F:/spectra/data/she/nmr/P31/1/pdata/1/auditp.txt
$$ ##AUDIT TRAIL=  $$ (NUMBER, WHEN, WHO, WHERE, WHAT)
(   1,<2019-07-05 15:05:53.15 +0400>,<she>,<DPX200>,
      <continue with go, POWCHK disabled, PULCHK disabled
       configuration hash MD5:
       00 E9 B6 7A A2 85 ED C7 34 08 36 98 17 FE 4E 26
       data hash MD5: 32K
       4D A5 20 81 FA B4 03 76 8E 1E 01 6E 13 4B 21 D3>)
(   2,<2019-07-05 15:09:09.14 +0400>,<she>,<DPX200>,
      <Start of raw data processing
       efp BC_mod = 2 LB = 1 FT_mod = 6 PKNL = 1 PHC0 = -2661.508 PHC1 = 348.5988 SI = 64K 
       data hash MD5: 64K
       30 6D 46 8C 43 2A A8 D6 C3 4D 07 43 60 FB 24 5C>)
(   3,<2019-07-05 15:09:54.87 +0400>,<she>,<DPX200>,
      <pk PHC0 = -443.5345 PHC1 = 332.2001 
       data hash MD5: 64K
       38 CF 5F 7F 74 1F 30 74 44 C7 B3 06 B7 54 3B 76>)
(   4,<2019-07-05 15:09:58.39 +0400>,<she>,<DPX200>,
      <abs ABSG = 5 
       data hash MD5: 64K
       60 8B 73 41 49 6E 92 1D 15 56 7A D6 E8 60 A4 97>)
$$ ##END=
$$ 
$$ hash MD5
$$ 40 F2 3F 42 1A 7E CF 21 FD DD 36 F7 6E B3 DB 1F
##$RELAX= 
##$RELAX= 
##$RELAX= 
##$RELAX= 
##$RELAX= 
##$RELAX= 
##$RELAX= 
##$RELAX= 
$$ Bruker specific parameters
$$ --------------------------
##$DU= <F:/spectra>
##$EXPNO= 1
##$NAME= <P31>
##$PROCNO= 1
##$TYPE= <nmr>
##$USER= <she>
##$AMP= (0..31)
100 100 100 100 100 100 100 100 100 100 100 100 100 100 100 100 100 100 
100 100 100 100 100 100 100 100 100 100 100 100 100 100 
##$AQSEQ= 0
##$AQ_mod= 1
##$AUNM= <au_zg>
##$AUTOPOS= <>
##$BF1= 81.014009
##$BF2= 200.13
##$BF3= 200.13
##$BF4= 200.13
##$BF5= 200.13
##$BF6= 200.13
##$BF7= 200.13
##$BF8= 200.13
##$BYTORDA= 1
##$CFDGTYP= 0
##$CFRGTYP= 5
##$CHEMSTR= <none>
##$CNST= (0..31)
1 1 145 1 1 1 1 1 1 1 1 1 1 1 1 1 1 1 1 1 1 1 1 1 1 1 1 1 1 1 1 1 
##$CPDPRG= <waltz16>
##$CPDPRG1= <>
##$CPDPRG2= <waltz16>
##$CPDPRG3= <>
##$CPDPRG4= <mlev>
##$CPDPRG5= <mlev>
##$CPDPRG6= <mlev>
##$CPDPRG7= <mlev>
##$CPDPRG8= <mlev>
##$CPDPRGB= <>
##$CPDPRGT= <>
##$D= (0..31)
0 1 0 0 0 0 0 0 0 0 0 0.03 2e-05 3e-06 0 0 0 0 0 0 0 0 0 0 0 0 0 0 0 0 
0 0 
##$DATE= 1562323901
##$DBL= (0..7)
120 120 120 11 120 120 24 19 
##$DBP= (0..7)
150 150 150 150 150 150 150 150 
##$DBP07= 0
##$DBPNAM0= <>
##$DBPNAM1= <>
$$ [...]
##$SUBNAM3= <"">
##$SUBNAM4= <"">
##$SUBNAM5= <"">
##$SUBNAM6= <"">
##$SUBNAM7= <"">
##$SUBNAM8= <"">
##$SUBNAM9= <"">
##$SW= 369.568048894756
##$SWIBOX= (0..15)
0 1 3 0 0 0 0 0 0 0 0 0 0 0 0 0 
##$SW_h= 29940.119760479
##$TD= 32768
##$TD0= 1
##$TE= 0
##$TE2= 300
##$TE3= 300
##$TEG= 300
##$TL= (0..7)
0 120 53 12 22 120 120 120 
##$TP= (0..7)
150 150 150 150 150 150 150 150 
##$TP07= 0
##$TPNAME0= <>
##$TPNAME1= <>
##$TPNAME2= <>
##$TPNAME3= <>
##$TPNAME4= <>
##$TPNAME5= <>
##$TPNAME6= <>
##$TPNAME7= <>
##$TPOAL= (0..7)
0.5 0.5 0.5 0.5 0.5 0.5 0.5 0.5 
##$TPOFFS= (0..7)
0 0 0 0 0 0 0 0 
##$TUNHIN= 0
##$TUNHOUT= 0
##$TUNXOUT= 0
##$USERA1= <user>
##$USERA2= <user>
##$USERA3= <user>
##$USERA4= <user>
##$USERA5= <user>
##$V9= 5
##$VALIST= <valist>
##$VCLIST= <CCCCCCCCCCCCCCC>
##$VD= 0
##$VDLIST= <DDDDDDDDDDDDDDD>
##$VPLIST= <PPPPPPPPPPPPPPP>
##$VTLIST= <TTTTTTTTTTTTTTT>
##$WBST= 1024
##$WBSW= 4
##$XGAIN= (0..3)
0 0 0 0 
##$XL= 0
##$YL= 0
##$YMAX_a= 38531
##$YMIN_a= -44808
##$ZGOPTNS= <>
##$ZL1= 120
##$ZL2= 120
##$ZL3= 120
##$ZL4= 120
##$ABSF1= 182.463
##$ABSF2= -187.1042
##$ABSG= 5
##$ABSL= 3
##$ALPHA= 0
##$AQORDER= 0
##$ASSFAC= 0
##$ASSFACI= 0
##$ASSFACX= 0
##$ASSWID= 0
##$AUNMP= <proc_1d>
##$AZFE= 0.1
##$AZFW= 0.5
##$BCFW= 0
##$BC_mod= 2
##$BYTORDP= 0
##$COROFFS= 0
##$CY= -3
##$DATMOD= 1
##$DC= 0
##$DFILT= <>
##$DTYPP= 0
##$F1P= 0
##$F2P= 0
##$FCOR= 1
##$FTSIZE= 65536
##$FT_mod= 6
##$GAMMA= 0
##$GB= 0
##$INTBC= 1
##$INTSCL= 5.30512e-09
##$ISEN= 30
##$LB= 1
##$LEV0= 0
##$LPBIN= 0
##$MAXI= 10000
##$MC2= 0
##$MEAN= 0
##$ME_mod= 0
##$MI= 50
##$NCOEF= 0
##$NC_proc= -7
##$NLEV= 6
##$NOISF1= 182.463
##$NOISF2= 159.3651
##$NSP= 0
##$NTH_PI= 0
##$NZP= 0
##$OFFSET= 182.463
##$PC= 4
##$PHC0= -3105.042
##$PHC1= 680.7989
##$PH_mod= 1
##$PKNL= yes
##$PPARMOD= 0
##$PSCAL= 0
##$PSIGN= 0
##$REVERSE= no
##$SF= 81.0140089999434
##$SI= 65536
##$SIGF1= 159.3651
##$SIGF2= -187.1042
##$SINO= 113.3802
##$SIOLD= 16384
##$SREGLST= <1H.CDCl3>
##$SSB= 0
##$STSI= 65536
##$STSR= 0
##$SW_p= 29940.119760479
##$SYMM= 0
##$S_DEV= 0
##$TDeff= 32768
##$TDoff= 0
##$TI= <>
##$TILT= no
##$TM1= 0
##$TM2= 0
##$TOPLEV= 0
##$USERP1= <user>
##$USERP2= <user>
##$USERP3= <user>
##$USERP4= <user>
##$USERP5= <user>
##$WDW= 1
##$XDIM= 65536
##$YMAX_p= 431751556
##$YMIN_p= -103758482
$$ End of Bruker specific parameters
$$ ---------------------------------
##NTUPLES= NMR SPECTRUM
##VAR_NAME=  FREQUENCY,     SPECTRUM/REAL,   SPECTRUM/IMAG
##SYMBOL=    X,             R,               I
##VAR_TYPE=  INDEPENDENT,   DEPENDENT,       DEPENDENT
##VAR_FORM=  AFFN,          ASDF,            ASDF
##VAR_DIM=   65536,         65536,           65536
##UNITS=     HZ,            ARBITRARY UNITS, ARBITRARY UNITS
##FACTOR=    0.456856943014862, 1,           1
##FIRST=     14782.0589164792, 0,            0
##LAST=      -15158.0608439998, 0,           0
##MIN=       -15158.0608439998, -103758482,  0
##MAX=       14782.0589164792, 431751556,    0
$$ Real data points
##PAGE= N=1
##DATA TABLE= (X++(R..R)), XYDATA
$$ [...]
##PAGE= N=2
##DATA TABLE= (X++(I..I)), XYDATA
$$ plain form
5016 -5748212 -4954630 -2812623 -2019702 -3458346 -5574397 -5835695 -2755021 1829593 3634307
5007 3634307 1561449 388746 4037595 8692876 8309887 4866184 5408808 9359321 7885530
4998 7885530 -1919419 -11181085 -11782160 -6620825 -1776397 3676119 12045062 17493307
4990 17493307 12317156 -54572 -8180915 -8105930 -6634328 -8610839 -10419552 -9071206
4982 -9071206 -8704372 -12158747 -13150193 -5077334 6264299 8026489 -1887317 -11046417
4974 -11046417 -9311237 -1997180 -629199 -5823968 -7519578 -803672 7080981 7844397
4966 7844397 3090767 -610852 -2250432 -5352426 -9337053 -9485083 -5625656 -4030683
4958 -4030683 -8414435 -14284927 -15358303 -11673818 -7909057 -6632886 -7048429 -8563148
$$ packed form
5016e748212P93582K142007P92921j438644k116051k61298L080674M584614J804714
5007C634307k072858j172703L648849M655281l82989l443703N42624L950513j473791
4998G885530r804949r261666o01075N161335M844428N452516Q368943N448245
4990A7493307n176151j2371728q126343P4985J471602j976511j808713J348346
4982i071206L66834l454375r91446Q072859J1341633J762190r913806r159100
4974a1046417J735180P314057J367981n194769j695610O715906P884653P63416
4966G844397m753630l701619j639580l101994l984627j48030L859427J594973
4958d030683m383752n870492j073376L684485L764761J276171m15543j514719
$$ plain form
4950 -8563148 -11669786 -15703464 -18751129 -19911313 -19547285 -17495402 -13227899 -7967904
4942 -7967904 -4528196 -4253588 -5618114 -6724805 -7861963 -10230777 -13087598 -14260024
4934 -14260024 -13658151 -13871009 -15747754 -15671508 -10508072 -4069068 -3836801 -10223793 -14099559
4925 -14099559 -8212286 3080545 10081206 10508170 9984865 11406915 10793954 4729976
4917 4729976 -4009461 -10530148 -12958576 -11379569 -6150569 -97673 1742184 -1713348
4909 -1713348 -4736330 -1909353 4276927 6932999 4157065 546370 -163739 403023 -605836
4900 -605836 -1842692 728567 7349795 11889771 7968337 -2186834 -7873979 -1769405
4892 -1769405 10123957 14863444 8575097 359974 -1505475 -686802 -4950245 -12358148
$$ packed form
4950h563148l106638m033678l047665j160184L64028K051883M267503N259995
4942g967904L439708K74608j364526j106691j137158k368814k856821j172426
4934a4260024O01873k12858j876745P6246N163436O439004K32267o386992l875766
4925a4099559N887273J1292831P000661M26964n23305J422050o12961o063978
4917D729976q739437o520687k428428J579007N229000O052896J839857l455532
4909a713348l022982K826977O186280K656072k775934l610695p10109N66762j008859
4900f05836j236856K571259O621228M539976l921434j0155171n687145O104574
4892a769405J1893362M739487o288347q215123j865449Q18673m263443p407903
$$ plain form
4884 -12358148 -13538746 -6499407 -620194 -3327344 -9520794 -9183434 -1371352 5293878
4876 5293878 4597295 -590354 -4318369 -5154638 -5139590 -4937480 -4132507 -4464311 -8180265
4867 -8180265 -13219730 -14173039 -9046895 -1633378 3920452 7087236 7893835 4546248 -2202249
4858 -2202249 -6085192 -1864628 6887062 11078471 6171501 -4569039 -14897195 -19336373
4850 -19336373 -14457254 -2405229 7682419 7714811 53677 -6342703 -8104117 -9022562
4842 -9022562 -10207116 -7615546 -1315738 1793504 -1233443 -3670644 419626 6742661
4834 6742661 7976067 4664487 2155713 1624481 1691396 5000712 14459534 24596300 25234347
4825 25234347 14548062 1740603 -4785474 -6491554 -9865832 -16609566 -21502849 -18791389
$$ packed form
4884a2358148j180598P039339N879213k707150o193450L37360P812082O665230
4876E293878o96583n187649l728015q36269J5048K02110Q04973l31804l715954
4867h180265n039465r53309N126144P413517N553830L166784Q06599l347587o748497
4858b202249l882943M220564Q751690M191409m906970j0740540j0328156m439178
4850a9336373M879119J2052025J0087648L2392p661134o396380j761414r18445
4842i022562j184554K591570O299808L109242l026947k437201M090270O323035
4834F742661J233406l311580k508774n31232O6915L309316R458822J0136766O38047
4825B5234347j0686285j2807459o526077j706080l374278o743734m893283K711460
$$ plain form
4817 -18791389 -9370239 -1214888 -1410388 -7911261 -12346373 -11521118 -10976981 -14515548 -16333300
4808 -16333300 -9415186 2686285 9686158 7881574 2756915 -288779 -910635 46432
4800 46432 2616267 4991734 4116248 -7330 -4690699 -8999495 -13420156 -16030538 -14495802
4791 -14495802 -11484405 -12127856 -15662423 -15391531 -7927167 2755368 11138454 14700453
4783 14700453 12288255 4251527 -4393319 -7031641 -3740693 -1166372 -2691759 -4788037
4775 -4788037 -4777052 -4998272 -6075106 -3387691 4773218 11858996 11759219 7550937 5143795
4766 5143795 2908988 -4563480 -15232817 -20537630 -17293543 -11465537 -9041261 -9298839
4758 -9298839 -9116281 -8598052 -9027086 -8787737 -5368582 -98746 2605677 1020127 -1405572
$$ packed form
4817a8791389R421150Q155351j95500o500873m435112Q25255N44137l538567j817752
4808a6333300O918114J2101471O999873j804584n124659l045694o21856R57067
4800D6432K569835K375467q75486m123578m683369m308796m420661k610382J534736
4791a4495802L011397o43451l534567K70892P464364J0682535Q383086L561999
4783A4700453k412198q036728q644846k638322L290948K574321j525387k096278
4775d788037J0985k21220j076834K687415Q160909P085778r9777m208282k407142
4766E143795k234807p472468j0669337n304813L244087N828006K424276k57578
4758i298839J82558N18229m29034K39349L419155N269836K704423j585550k425699
$$ plain form
4749 -1405572 -755235 1666286 681903 -5818847 -13868830 -18423556 -18758021 -16803562 -12945065
4740 -12945065 -7311039 -3389092 -5295143 -11370742 -14933585 -12077627 -4960913 2789733
4732 2789733 9372476 12904688 11433888 6744820 3653161 3489146 2534162 -1272445 -4875394
4723 -4875394 -5578355 -4813383 -3530247 765199 8343730 13545214 11483906 4533994 -2076084
4714 -2076084 -6815488 -9743473 -9253043 -6663271 -8520487 -16807474 -21868553 -14522418
4706 -14522418 -1587686 1772439 -6344145 -12934699 -11208207 -10172878 -17723318 -25847198
4698 -25847198 -22071200 -8045508 3710737 7509068 8700452 11473135 12231199 7270590
4690 7270590 -191941 -4389135 -4159619 -2523047 -1878387 -2361406 -3150884 -3018205 -504900
$$ packed form
4749a405572O50337K421521r84383o500750q049983m554726l34465J954459L858497
4740a2945065N634026L921947j906051o075599l562843K855958P116714P750646
4732B789733O582743L532212j470800m689068l091659j64015r54984l806607l602949
4723d875394p02961P64972J283136M295446P578531N201484k061308o949912o610078
4714b076084m739404k927985M90430K589772j857216q286987n061079P346135
4706a4522418J2934732L360125q116584o590554J726492J035329p550440q123880
4698b5847198L775998J4025692J1756245L798331J191384K772683P58064m960609
4690G270590p462531m197194K29516J636572O44660m83019p89478J32679K513305
$$ plain form
4681 -504900 4743931 11187261 16539812 18942533 16994474 10553359 2363199 -3069356
4673 -3069356 -3727289 -1801643 -57958 1283945 2108620 -358718 -7965236 -16794018 -20558762
4664 -20558762 -18546995 -15482182 -13418053 -9576425 -3665655 -685408 -2750423 -4345954
4656 -4345954 -1196598 1620612 -2478821 -9962691 -11891427 -7543553 -4084313 -3867136
4648 -3867136 -2072119 2371497 3764196 134294 -2911123 -2677845 -4410237 -10743814
4640 -10743814 -15180092 -12804998 -9388973 -11826846 -16592055 -16755290 -14487453 -16276171
4632 -16276171 -19978876 -17810041 -10363274 -6787049 -10560839 -14448922 -11261632 -2230514
4624 -2230514 6792020 11290714 9501865 3557323 -703124 -271964 172273 -3868475 -6902813
$$ packed form
4681e04900N248831O443330N352551K402721j948059o441115q190160n432555
4673c069356o57933J925646J743685J341903Q24675k467338p606518q828782l764744
4664b0558762K011767L064813K064129L841628N910770K980247k065015j595531
4656d345954L149356K817210m099433p483870j928736M347874L459240K17177
4648c867136J795017M443616J392699l629902l045417K33278j732392o333577
4640a0743814m436278K375094L416025k437873m765209j63235K267837j788718
4632a6276171l702705K168835P446767L576225l773790l888083L187290R031118
4624b230514R022534M498694j788849n944542m260447M31160M44237m040748l034338
$$ plain form
4615 -6902813 -648627 10696454 13769466 5722027 -1014221 2832330 11032689 13355492
4607 13355492 9796149 6549757 5587323 5416988 6216411 7853515 8105413 7940465 12269831
4598 12269831 20354378 23222215 17269195 12086650 16046304 22321331 20453656 14577209
4590 14577209 15988440 22194123 19780527 7754194 1249936 7894412 15610018 11618211
4582 11618211 1249152 -2239689 2305266 5254939 2440480 -517025 1744147 8320310
4574 8320310 15373202 18952422 15396605 4968111 -5572890 -9684968 -9720120 -13177600
4566 -13177600 -20857705 -25421246 -22635509 -17251267 -15068971 -15288691 -14807834 -14896039 -17858222
4557 -17858222 -20292069 -16213318 -6188711 2441398 5090571 4469560 4027042 2180372
$$ packed form
4615f902813O254186J1345081L073012q047439o736248L846551Q200359K322803
4607A3355492l559343l246392r62434j70335P99423J637104K51898j64948M329366
4598A2269831Q084547K867837n953020n182545L959654O275027j867675n876447
4590A4577209J411231O205683k413596j2026333o504258O644476P715606l991807
4582A1618211j0369059l488841M544955K949673k814459k957505K261172O576163
4574H320310P052892L579220l555817j0428494j0541001m112078l5152l457480
4566a3177600p680105m563541K785737N384242K182296k19720M80857q8205k962183
4557a7858222k433847M078751J0024607Q630109K649173o21011m42518j846670
$$ plain form
4549 2180372 -3038762 -7466045 -4705742 4328732 11276494 11018871 7906463 8455196 11438690
4540 11438690 9947745 2056343 -5831506 -7815829 -6554432 -8960815 -15820263 -19966640
4532 -19966640 -15387637 -4808130 3898053 6984357 7848034 11171087 16620535 19495909
4524 19495909 16338722 8600593 1116473 -2165273 -988897 1967715 4161974 5194221
4516 5194221 5776529 5696510 4134044 1776221 871360 2474763 4886025 5494114 2914850
4507 2914850 -3163394 -12073084 -20620561 -23854942 -20357238 -15369439 -15123573 -18569637
4499 -18569637 -18668850 -12377336 -5123277 -3478262 -7168493 -11415252 -14121690 -16475978
4491 -16475978 -18068310 -16300351 -11000664 -5534817 -2042313 1062555 5144486 8079965
$$ packed form
4549B180372n219134m427283K760303R034474O947762k57623l112408N48733K983494
4540A1438690j490945p891402p887849j984323J261397k406383o859448m146377
4532a9966640M579003J0579507Q706183L086304Q63677L323053N449448K875374
4524A9495909l157187p738129p484120l281746J176376K956612K194259J032247
4516E194221N82308q0019j562466k357823r04861J603403K411262O08089k579264
4507B914850o078244q909690q547477l234381L497704M987799K45866l446064
4499a8569637r9213O291514P254059J645015l690231m246759k706438k354288
4491a6475978j592332J767959N299687N465847L492504L104868M081931K935479
$$ plain form
4483 8079965 7521453 4931167 3161269 1852524 -940007 -3698452 -2803650 723870 1029539
4474 1029539 -3850082 -7909116 -5737428 -1193822 -1961421 -7808774 -10936076 -7776785
4466 -7776785 -3604722 -3528568 -5157110 -3946215 -1020753 -900580 -4380313 -8175373 -9815666
4457 -9815666 -9021146 -5737171 -454070 4553334 7212756 7615852 5856600 692426 -6435485
4448 -6435485 -9401564 -4286200 4150289 8099243 6655843 4441304 2588460 -1557638
4440 -1557638 -6719223 -7828860 -4650155 -2443638 -2552293 -384245 4790841 6609397
4432 6609397 2412778 -839076 2699161 8184622 8161453 4190672 2583615 3340849 1979181
4423 1979181 -891155 -832134 1172337 -437687 -5649889 -7593680 -2682072 4645599 8892189
$$ packed form
4483H079965n58512k590286j769898j308745k792531k758445Q94802L527520L05669
4474A029539m879621m059034K171688M543606p67599n847353l127302L159291
4466g776785M172063P6154j628542J210895K925462J20173l479733l795060j640293
4457i815666P94520L283975N283101N007404K659422M03096j759252n164174p127911
4448f435485k966079N115364Q436489L948954j443400k214539j852844m146098
4440a557638n161585j109637L178705K206517j08655K168048N175086J818556
4432F609397m196619l251854L538237N485461k3169l970781j607057P57234j361668
4423A979181k870336N9021K004471j610024n212202j943791M911608P327671M246590
$$ plain form
4414 8892189 9560463 8912886 8840654 10989783 15021819 16276237 10801075 3065056 1652488
4405 1652488 5822994 4600294 -6742237 -17296904 -14584084 -2301774 4538204 -516716
4397 -516716 -9114722 -11805408 -9808356 -9903999 -13391814 -15358516 -12920038 -9509899 -9988929
4388 -9988929 -13976272 -16245319 -13610557 -9263851 -8271598 -9695956 -6661630 4173978
4380 4173978 16052186 18415578 9126362 -2724102 -6833194 -2189812 3578885 3531562
4372 3531562 -1900115 -7066341 -7943480 -5681084 -3877754 -3828856 -3636006 -1757938 126014
4363 126014 -1016484 -5404010 -9573306 -9910285 -5827337 1065648 9221592 16660230 19351079
4354 19351079 13655705 1766130 -8092511 -9612889 -5051488 -1234069 -527831 228876
$$ packed form
4414H892189O68274o47577p2232K149129M032036J254418n475162p736019j412568
4405A652488M170506j222700j1342531j0554667K712820J2282310O839978n054920
4397e16716q598006k690686J997052r5643l487815j966702K438478L410139m79030
4388i988929l987343k269047K634762M346706R92253j424358L034326J0835608
4380D173978J1878208K363392r289216j1850464m109092M643382N768697m7323
4372C531562n431677n166226q77139K262396J803330M8898J92850J878068J883952
4363A26014j142498m387526m169296l36979M082948O892985Q155944P438638K690849
4354A9351079n695374j1889575r858641j520378M561401L817419P06238P56707
$$ plain form
4346 228876 2496955 3116455 461723 -1143659 3187254 11900578 19004761 21112300 18882636
4337 18882636 13049774 3467776 -7558776 -14489123 -12794220 -3187536 8385334 14606175
4329 14606175 12269656 5449918 1705349 3605034 6016236 3529024 -2411128 -6788290
4321 -6788290 -8325090 -9065344 -8981723 -6393374 -2765711 -1830723 -4162628 -7291339 -10567617
4312 -10567617 -14831103 -18120275 -17856212 -16812122 -19632618 -23099212 -18610351 -6625411
4304 -6625411 938249 -2219598 -6374405 -188684 11919520 16781358 11941298 6881547
4296 6881547 6737857 6434013 2499907 -549 2968457 6099162 2546994 -4836982 -6868741
4287 -6868741 -773035 6088952 5513675 -2226711 -9425360 -9297834 -2149954 6128672 10688912
$$ packed form
4346B28876K268079O19500k654732j605382M330913Q713324P104183K107539k229664
4337A8882636n832862r581998j1026552o930347J694903R606684J1572870O220841
4329A4606175k336519o819738l744569J899685K411202k487212n940152m377162
4321f788290j536800p40254Q3621K588349L627663R34988k331905l128711l276278
4312a0567617m263486l289172K64063J044090k820496l466594M488861J1984940
4304f625411P563660l157847m154807O185721J2108204M861838m840060n059751
4296F881547j43690l03844l934106k500456K969006L130705l552168p383976k031759
4287f868741O095706O861987n75277p740386p198649J27526P147880Q278626M560240
$$ plain form
4278 10688912 11978308 13311684 15842294 17742437 17530801 15837905 13850316 12168058
4270 12168058 11458688 12075052 12482494 10213950 5346825 1191651 319506 1331682 882839
4261 882839 -1993838 -4748120 -4168722 179495 5246604 7414509 6462569 5736816 7440306
4252 7440306 9258695 7881391 4621181 4029441 6983103 9139654 7581561 5183063
4244 5183063 5792859 8179237 8322395 5792243 3895416 4223908 5009884 5310805 7178806
4235 7178806 11984138 17093140 18342164 14504794 7652937 415495 -4937832 -5564994
4227 -5564994 499986 10539837 16973858 13811583 3414375 -5129521 -5193571 1009370
4219 1009370 5849846 4588249 -951972 -5520717 -5147856 437717 7522556 10598007
$$ packed form
4278A0688912J289396J333376K530610J900143k11636j692896j987589j682258
4270A2168058p09370O16364M07442k268544m867125m155174q72145J012176m48843
4261H82839k876677k754282N79398M348217N067109K167905r51940p25753J703490
4252G440306J818389j377304l260210n91740K953662K156551j558093k398498
4244E183063O09796K386378J43158k530152j896827L28492P85976L00921J868001
4235G178806M805332N109002J249024l837370o851857p237442n353327o27162
4227e564994O064980J0039851O434021l162275j0397208q543896o4050O202941
4219A009370M840476j261597n540221m568745L72861N585573P084839L075451
$$ plain form
4211 10598007 7421420 2291467 1594521 5416752 6916706 1710055 -5897318 -9396575
4203 -9396575 -9402699 -11236856 -15103296 -15508671 -11272174 -9167263 -13907777 -19940744 -18709970
4194 -18709970 -10719604 -4079636 -2468335 -1226164 3657380 8670568 7867823 858630
4186 858630 -7557740 -13133141 -14598439 -12484080 -8623466 -5545551 -3789601 -1148026
4178 -1148026 3001961 4677233 483049 -5445418 -4879178 3252782 9955380 7170935
4170 7170935 -2191921 -9095211 -10456958 -11146980 -14525720 -16855115 -13670748 -7467770
4162 -7467770 -4630514 -6530414 -8336262 -6633869 -3719386 -2927965 -3925550 -5396907 -8607968
4153 -8607968 -14011512 -17131316 -13447697 -6130913 -2674524 -3755509 -2447097 3569592
$$ packed form
4211A0598007l176587n129953o96946L822231J499954n206651p607373l499257
4203i396575o124j834157l866440m05375M236497K104911m740514o032967J230774
4194a8709970P990366O639968J611301J242171M883544N013188q02745p009193
4186H58630q416370n575401j465298K114359L860614L077915J755950K641575
4178a148026M149987J675272m194184n928467N66240Q131960O702598k784445
4170G170935r362856o903290j361747o90022l378740k329395L184367O202978
4162g467770K837256j899900j805848J702393K914483P91421r97585j471357l211061
4153h607968n403544l119804L683619P316784L456389j080985J308412O016689
$$ plain form
4145 3569592 6565855 268884 -9537673 -12666259 -8395262 -4144007 -3263401 -2653348 -1470456
4136 -1470456 -3152141 -7436816 -8731887 -5398636 -3191311 -5336158 -6041717 441361
4128 441361 9784382 13362610 10336571 6709719 4313557 -1650927 -13474052 -25602467
4120 -25602467 -30694817 -27170751 -19072382 -11573332 -8112781 -9068282 -11211693 -10226575
4112 -10226575 -5434184 -947188 -1077543 -5625539 -10662412 -13092302 -13247608 -13046196 -12590990
4103 -12590990 -9862497 -4401671 171773 -112559 -3618026 -4549621 -1606196 -847632 -6609028
4094 -6609028 -13764196 -14825224 -11940493 -13810876 -20665275 -21545777 -10656587 1660014
4086 1660014 1910722 -7650941 -12548971 -6713386 747445 1328617 -432529 3469647 10076317
$$ packed form
4145C569592K996263o296971r806557l128586M270997M251255Q80606O10053J182892
4136a470456j681685m284675j295071L333251K207325k144847p05559O483078
4128D41361R343021L578228l026039l626852k396162n964484j1823125j2128415
4120b5602467n092350L524066Q098369P499050L460551r55501k143411R85118
4112a0226575M792391M486996j30355m547996n036873k429890j55306K01412M55206
4103a2590990K728493N460826M573444k84332l505467r31595K943425P58564n761396
4094f609028p155168j061028K884731j870383o854399q80502J0889190J2316601
4086A660014K50708r561663m898030N835585P460831N81172j761146L902176O606670
$$ plain form
4077 10076317 9913072 2399027 -3113482 -1830092 54070 -3905059 -10946503 -14628051
4069 -14628051 -13375831 -8415942 932529 13245376 21057936 19126614 13784455 15312930
4061 15312930 22345436 23398916 14521895 5321661 4151247 6864750 6225896 4390123
4053 4390123 7588698 13524975 13541686 5816390 -1899283 -3377182 -1079397 -291871 -1218077
4044 -1218077 -84431 4463074 8974961 8969004 4019472 -1304246 -1992643 2139353 6817939
4035 6817939 8395323 6367274 1391022 -5340274 -10101026 -8710159 -2876660 -92049
4027 -92049 -4029909 -9091275 -8265636 -2521582 2190072 3746848 4100925 3105026 -1935646
4018 -1935646 -11072245 -20481692 -25948830 -24750474 -16512387 -6010997 -2034814 -8137203
$$ packed form
4077A0076317j63245p514045n512509J283390J884162l959129p041444l681548
4069a4628051J252220M959889R348471J2312847P812560j931322n342159J528475
4061A5312930P032506J053480q877021r200234j170414K713503o38854j835773
4053D390123L198575N936277J6711p725296p715673j477899K297785P87526r26206
4044a218077J133646M547505M511887n957m949532n323718o88397M131996M678586
4035F817939J577384k028049m976252o731296m760752J390867N833499K784611
4027i2049l937860n061366Q25639N744054M711654J556776L54077r95899n040672
4018a935646r136599r409447n467138J198356Q238087J0501390L976183o102389
$$ plain form
4010 -8137203 -16702513 -17542610 -10221189 -2218582 2530091 6116215 9249419 9252795 5689708
4001 5689708 1193652 -3544687 -9163538 -12408314 -9105631 -2729262 -1814934 -7261573
3993 -7261573 -10339469 -5877754 553836 2209464 454156 -10508 1313745 2963523
3985 2963523 5825622 10093089 12295917 10044942 6131012 4150548 3731707 3259554 3167332
3976 3167332 3368560 1831777 -1131330 -1776328 798068 2283298 136186 -2743309 -4664602
3967 -4664602 -8845238 -15932390 -19767510 -16476780 -11196576 -9162729 -7032770 -1323413
3959 -1323413 1361507 -6331788 -17222628 -16204246 -1690767 10779839 8329964 -4837338
3951 -4837338 -15393529 -15894666 -8829469 -1345161 992734 -1498828 -3312665 -1066054
$$ packed form
4010h137203q565310q40097P321421Q002607M748673L586124L133204L376l563087
4001E689708m496056m738339n618851l244776L302683O376369R14328n446639
3993g261573l077896M461715O431590J655628j755308m64664J324253J649778
3985B963523K862099M267467K202828k250975l913930j980464m18841m72153r2222
3976C167332K01228j536783k963107o44998K574396J485230k147112k879495j921293
3967d664602m180636p087152l835120L290730N280204K033847K129959N709357
3959a323413K684920p693295j0890840J018382J4513479J2470606k449875j3167302
3951d837338j0556191n01137P065197P484308K337895k491562j813837K246611
$$ plain form
3943 -1066054 1450411 -517284 -4073607 -2523008 3768698 7519638 5222141 687116
3935 687116 -2379936 -4458758 -6096458 -6362191 -6547546 -9225017 -12705577 -12572928 -9216357
3926 -9216357 -7143395 -6575099 -3608066 545950 -341165 -6143744 -9023728 -7023312 -8425117
3917 -8425117 -16638490 -21403880 -14235053 -3800201 -4207601 -13688657 -17765090 -11258652
3909 -11258652 -4305977 -5442671 -10348460 -11451283 -9380991 -8666677 -8229250 -3343622
3901 -3343622 5294405 10484066 6967663 -2440379 -10292592 -12522796 -11903180 -13772909
3893 -13772909 -19373661 -24541934 -24769615 -19766249 -12442479 -5539790 -772745 762088
3885 762088 -215897 -732211 1318845 4385045 5687783 5420690 5823654 6604851 4610524
$$ packed form
3943a066054K516465j967695l556323J550599O291706L750940k297497m535025
3935F87116l067052k078822j637700k65733j85355k677471l480560J32649L356571
3926i216357K072962N68296K967033M154016q87115n802579k879984K000416j401805
3917h425117q213373m765390P168827J0434852m07400r481056m076433O506438
3909a1258652O952675j136694m905789j102823K070292P14314M37427M885628
3901c343622Q638027N189661l516403r408042p852213k230204O19616j869729
3893a3772909n600752n168273k27681N003366P323770O902689M767045J534833
3885G62088r77985n16314K051056L066200J302738k67093M02964P81197j994327
$$ plain form
3876 4610524 -918259 -5336523 -3100696 5315355 12811416 12613260 4983952 -3945058
3868 -3945058 -9189015 -10431832 -8539935 -2839470 4915098 7687943 458299 -11055512
3860 -11055512 -16095241 -13670164 -13706145 -20908699 -26131011 -19643896 -5685090 4419935
3852 4419935 8430102 12846730 19320802 22041787 18969234 15780169 15945285 15147956 9493661
3843 9493661 2446270 -1089041 -2160957 -4223843 -6384940 -5400809 -1607495 1906877
3835 1906877 4103528 5746004 5921917 2951341 -1917220 -5135092 -4975448 -2745981 -676410
3826 -676410 -700489 -4198401 -10608179 -17035440 -20863993 -21527119 -18710346 -11770040 -3224822
3817 -3224822 797194 -2192629 -6065142 -3485624 3480994 5986822 883924 -5748706
$$ packed form
3876D610524n528783m418264K235827Q416051P496061j98156p629308q929010
3868c945058n243957j242817J891897N700465P754568K772845p229644j1513811
3860a1055512n039729K425077l5981p202554n222312O487115J3958806J0105025
3852D419935M010167M416628O474072K720985l072553l189065J65116p97329n654295
3843I493661p047391l535311j071916k062886k161097R84131L793314L514372
3835A906877K196651J642476J75913k970576m868561l217872J59644K229467K069571
3826f76410k4079l497912o409778o427261l828553o63126K816773O940306Q545218
3817c224822M022016k989823l872513K579518O966618K505828n102898o632630
$$ plain form
3809 -5748706 -8193334 -7731877 -7443305 -6379820 -3029550 -406590 -2968128 -10330654 -17435607
3800 -17435607 -19850705 -17167954 -13047665 -12925467 -18385507 -22404370 -14921940 3624401
3792 3624401 19014469 18347159 4810152 -7913197 -12424504 -12025881 -10939675 -8706575
3784 -8706575 -4985484 -2415885 -2170090 -1927427 -211736 1992805 5253715 11839280 19805186
3775 19805186 22481875 17025807 8949261 5046676 5937869 8390543 10473735 11147693
3767 11147693 9386582 7525384 10829812 19188938 23662826 16727046 2337137 -9776605
3759 -9776605 -16317611 -20550923 -23347918 -22039198 -17485025 -14845349 -16148995 -17636289
3751 -17636289 -15487651 -9552683 -1052044 8444838 15055157 14581871 8004294 1153473
$$ packed form
3809e748706k444628M61457K88572J063485L350270K622960k561538p362526p104953
3800a7435607k415098K682751M120289J22198n460040m018863P482430J8546341
3792C624401J5390068o67310j3537007j2723349m511307L98623J086206K233100
3784h706575L721091K569599K45795K42663J715691K204541L260910O585565P965906
3775A9805186K676689n456068q076546l902585Q91193K452674K083192O73958
3767A1147693j761111j861198L304428Q359126M473888o935780j4389909j2113742
3759i776605o541006m233312k796995J308720M554173K639676j303646j487294
3751a7636289K148638N934968Q500639R496882O610319m73286o577577o850821
$$ plain form
3743 1153473 -2109966 -2942398 -3478746 -3897917 -4305146 -5518026 -6720113 -5609920 -1873615
3734 -1873615 2214221 4885762 5885394 4996944 2797215 1813803 3109483 3189040 -976758
3725 -976758 -5464965 -3762977 3601673 10347394 14280321 18034782 20324779 15790442
3717 15790442 5363652 -2450543 -3883292 -4777605 -9326239 -12971842 -11836358 -10502100
3709 -10502100 -13592859 -17312048 -16939441 -15773547 -18247865 -20375476 -16298285 -9229685
3701 -9229685 -6079626 -5243782 -103432 7965294 10570697 5194059 -2553494 -8833498
3693 -8833498 -14112161 -16086077 -10458164 -373773 4605807 1802715 -944862 1739032
3685 1739032 4572459 1221018 -4987294 -6112828 -1034626 3703450 2341526 -4367794
$$ packed form
3743A153473l263439q32432n36348m19171m07229j212880j202087J110193L736305
3734a873615M087836K671541R99632q88450k199729r83412J295680P9557m165798
3725i76758m488207J701988P364650O745721L932927L754461K289997m534337
3717A5790442j0426790p814195j432749q94313m548634l645603J135484J334258
3709a0502100l090759l719189L72607J165894k474318k127611M077191P068600
3701i229685L150059Q35844N140350Q068726K605403n376638p747553o280004
3693h833498n278663j973916N627913J0084391M979580k803092k747577K683894
3685A739032K833427l351441o208312j125534N078202M738076j361924o709320
$$ plain form
3677 -4367794 -10386292 -9677575 -2234119 4665757 3866302 -3282487 -9267480 -9821842 -6132268
3668 -6132268 530960 9036422 13782224 8933218 -984227 -4013336 2279464 6222313
3660 6222313 -360482 -9496319 -9929537 -4412718 -3796486 -9411325 -12855981 -10841739 -8838072
3651 -8838072 -9664725 -8862000 -4023959 -118315 -1308125 -3783705 -1536178 4694721 8700455
3642 8700455 7134898 3355627 3491580 10037744 18916890 23025112 19720689 13734822
3634 13734822 10775191 9940024 5788561 -3264023 -12772880 -18112857 -18232446 -13585686
3626 -13585686 -5213865 2972652 5804123 3186784 1296623 5050092 12155905 16493423
3618 16493423 14571469 7152785 -2025425 -7199385 -4199142 3941050 8528425 5593761
$$ packed form
3677d367794o018498P08717P443456O899876p99455p148789n984993n54362L689574
3668f132268O663228Q505462M745802m849006r917445l029109O292800L942849
3660F222313o582795r135837m33218N516819O16232n614839l444656K014242K003667
3651h838072q26653Q02725M838041L905644j189810k475580K247527O230899M005734
3642H700455j565557l779271J35953O546164Q879146M108222l304423n985867
3634A3734822k959631q35167m151463r052584r508857n339977j19589M646760
3626a3585686Q371821Q186517K831471k617339j890161L753469P105813M337518
3618A6493423j921954p418684r178210n173960L000243Q140192M587375k934664
$$ plain form
3610 5593761 1062719 1647977 4617882 2530057 -4564231 -8861703 -6353146 -1697857
3602 -1697857 -209216 -1014531 -680001 1324311 3860295 6946763 10263195 11949389 11660746
3593 11660746 11772333 12727828 10479000 2292435 -7454650 -11464500 -8060833 -1948443
3585 -1948443 2144757 2865919 466483 -4241400 -9263886 -12963546 -15918716 -18526606
3577 -18526606 -18053881 -11976091 -3449809 1108501 60085 -2269086 -2960991 -4261920
3569 -4261920 -8362803 -12941865 -14615227 -13373504 -10666035 -5934849 1506060 8886132
3561 8886132 11876662 9978330 7393008 7586968 8397591 4484070 -4608308 -10854430 -5852234
3552 -5852234 7451246 16130170 12572858 2783924 -4680351 -11171119 -21265752 -29464329
$$ packed form
3610E593761m531042N85258K969905k087825p094288m297472K508557M655289
3602a697857J488641q05315L34530K004312K535984L086468L316432J686194k88643
3593A1660746J11587R55495k248828q186565r747085m009850L403667O112390
3585a948443M093200P21162k399436m707883n022486l699660k955170k607890
3577a8526606M72725O077790Q526282M558310j048416k329171o91905j300929
3569d261920m100883m579062j673362J241723K707469M731186P440909P380072
3561H886132K990530j898332k585322J93960Q10623l913521r092378o246122N002196
3552e852234J3303480Q678924l557312r788934p464275o490768j0094633q198577
$$ plain form
3544 -29464329 -25734847 -12690964 -4428234 -6776623 -10883681 -9265073 -5559856 -3572345
3536 -3572345 185101 5536553 3023553 -10467972 -21654646 -18597210 -8949704 -7009393
3528 -7009393 -11037033 -9212438 -1995125 -976852 -8102337 -13521908 -14159323 -17335752
3520 -17335752 -23592017 -22628878 -11533736 -2005430 -2270349 -4788228 -298125 6929595
3512 6929595 7194632 338710 -6349388 -9141918 -9365974 -8964181 -10365740 -15635486 -21109318
3503 -21109318 -18867308 -7976828 2384841 5447976 4972350 5989726 6114809 2862030
3495 2862030 1262242 5740496 11346666 11830084 10206456 12186107 14957197 12531168
3487 12531168 7365789 5954975 6474751 2023851 -5826624 -7932331 -1955203 4239335
$$ packed form
3544b9464329L729482J3043883Q262730k348389m107058J618608L705217J987511
3536c572345L757446N351452k513000j3491525j1186674L057436R647506J940311
3528g009393m027640J824595P217313J018273p125485n419571o37415l176429
3520a7335752o256265R63139J1095142R528306k64919k517879M490103P227720
3512F929595K65037o855922o688098k792530k24056M01793j401559n269746n473832
3503b1109318K242010J0890480J0361669L063135m75626J017376J25083l252779
3495B862030j599788M478254N606170M83418j623628J979651K771090k426029
3487A2531168n165379j410814N19776m450900p850475k105707N977128O194538
$$ plain form
3479 4239335 4562434 1177156 -2446570 -6692564 -11606470 -14343876 -13531627 -11242650 -9075147
3470 -9075147 -6833995 -5908254 -9031260 -15401977 -20160697 -19781582 -14793437 -7215872 1176309
3461 1176309 8227969 12327650 13573444 11790015 5742003 -2574182 -6544397 -2855625
3453 -2855625 2631415 3025206 1072188 4014507 10196110 10073551 755760 -9195897 -11367353
3444 -11367353 -6588623 -246365 4795829 7637546 7232412 4304446 1984069 2453669
3436 2453669 5395820 9760431 13717391 13780347 8592568 2828712 2196216 5345090 6448588
3427 6448588 4810436 4794782 6265677 3278687 -5617554 -13206740 -13274362 -8853351 -7343778
3418 -7343778 -11581532 -18327527 -22141755 -19456122 -12532435 -9666106 -16797997 -28838388
$$ packed form
3479D239335L23099l385278l623726m245994m913906k737406Q12249K288977K167503
3470i075147K241152R25741l123006o370717m758720L79115M988145P577565Q392181
3461A176309P051660M099681J245794j783429o048012q316185l970215L688772
3453b855625N487040L93791j953018K942319O181603j22559r317791r951657k171456
3444a1367353M778730O342258N042194K841717m05134k927966k320377M69600
3436B453669K942151M364611L956960O2956n187779n763856o32496L148874J103498
3427F448588j638152j5654J470895k986990q896241p589186o7622M421011J509573
3418g343778m237754o745995l814228K685633O923687K866329p131891j2040391
$$ plain form
3410 -28838388 -34652745 -30567425 -22762709 -16525520 -11001064 -5786789 -4207941 -6860585
3402 -6860585 -9255343 -9356467 -10611742 -13947578 -13731425 -6207424 3893707 9385569
3394 9385569 8179628 1887287 -6948772 -13092660 -11085308 -3562408 -270426 -4543348
3386 -4543348 -8167810 -4652196 690311 882234 -375288 4241776 11976463 13612122
3378 13612122 8021962 3679462 6190769 11752791 13426680 8673378 344221 -6576191
3370 -6576191 -9654438 -11486152 -14778444 -15292838 -6430667 7760321 13580671 6289026
3362 6289026 -2075284 -474274 5401017 4618963 -1381067 -5114331 -8992959 -19709992
3354 -19709992 -31436773 -31048419 -19223244 -11051172 -14330086 -21140599 -23187711 -21943561
$$ packed form
3410b8838388n814357M085320P804716O237189N524456N214275J578848k652644
3402f860585k394758j01124j255275l335836K16153P524001J0101131N491862
3394I385569j205941o292341q836059o143888K007352P522900L291982m272922
3386d543348l624462L515614N342507J91923j257522M617064P734687J635659
3378A3612122n590160m342500K511307N562022J673889m753302q329157o920412
3370f576191l078247j831714l292292n14394Q862171J4190988N820350p291645
3362F289026q364310J601010N875291p82054o000030l733264l878628j0717033
3354a9709992j1726781L88354J1825175Q172072l278914o810513k047112J244150
$$ plain form
3346 -21943561 -19821501 -14174722 -5653301 -1511914 -4398988 -7080169 -4073297 56830
3338 56830 -346100 -3149244 -4650303 -7046189 -13150347 -20142497 -24706631 -28374896 -32069258
3329 -32069258 -31577814 -24562749 -16159461 -11423423 -8080691 -3235651 -1051179 -5866232
3321 -5866232 -12919840 -14715918 -12925002 -15131511 -22149850 -27153678 -26259581 -22172028
3313 -22172028 -17766414 -13120174 -8957203 -6820510 -5616183 -3181040 -737050 -709891
3305 -709891 -1448245 37931 1473162 -1740574 -7702857 -9568381 -6237657 -3911566 -5643354
3296 -5643354 -6885277 -3846176 912537 4409757 7712737 10221509 6363929 -5841926
3288 -5841926 -18123973 -20889630 -15580643 -11305108 -11412055 -10707557 -5558721 350292
$$ packed form
3346b1943561K122060N646779Q521421M141387k887074k681181L006872M130127
3338E6830m02930k803144j501059k395886o104158o992150m564134l668265l694362
3329c2069258M91444P015065Q403288M736038L342732M845040K184472m815053
3321e866232p053608j796078J790916k206509p018339n003828Q94097M087553
3313b2172028M405614M646240M162971K136693J204327K435143K443990K7159
3305g09891p38354J486176J435231l213736n962283j865524L330724K326091j731788
3296e643354j241923L039101M758713L497220L302980K508772l857580j2205855
3288e841926j2282047k765657N308987M275535j06947P04498N148836N909013
$$ plain form
3280 350292 2040430 -331744 -3334740 -4650228 -3601132 -760483 839531 -2676836
3272 -2676836 -10550792 -16191123 -14630239 -9262139 -7409679 -9949837 -9536502 -422264
3264 -422264 13141233 21096176 19053097 12796234 10795163 14406374 17489673 14891323
3256 14891323 8475758 3607224 2085167 1486199 569602 1511729 5572580 9723708 10199320
3247 10199320 7617474 5826883 6716338 8948422 11121382 12832120 12331862 6736008
3239 6736008 -3508804 -12778345 -15404308 -11713460 -7096595 -5753568 -7189078 -8685874
3231 -8685874 -9290846 -10270102 -12254802 -13275624 -10693633 -5036643 -417160 184059 -928436
3222 -928436 1151580 7146863 11796519 9827482 2085904 -5674076 -9274740 -10001376 -11803884
$$ packed form
3280C50292J690138k372174l002996j315488J049096K840649J600014l516367
3272b676836p873956n640331J560884N368100J852460k540158M13335R114238
3264d22264J3563497P954943k043079o256863k001071L611211L083299k598350
3256A4891323o415565m868534j522057n98968r16597R42127M060851M151128M75612
3247A0199320k581846j790591Q89455K232084K172960J710738n00258n595854
3239F736008j0244812r269541k625963L690848M616865J343027j435510j496796
3231h685874o04972r79256j984700j020822K581991N656990M619483O01219j112495
3222i28436K080016N995283M649656j969037p741578p759980l600664p26636j802508
$$ plain form
3213 -11803884 -15231905 -15439316 -8023045 3338127 8645007 3418113 -4532588 -4614786
3205 -4614786 2699286 7613306 5431705 1485073 430523 -773222 -4715836 -5932741
3197 -5932741 1257666 12114676 16736128 13722477 11143754 14639421 21261528 25323198
3189 25323198 24400069 18830613 10630249 4016314 2418157 3977450 4081407 2559693
3181 2559693 3485481 7450825 10033577 9821146 11850469 19274065 26485165 25595326 17004241
3172 17004241 8736402 6554324 8771796 10366870 8693489 4703101 1059141 -102358
3164 -102358 1067357 2044752 452806 -3048285 -5055305 -2998859 1874277 5586292 5631513
3155 5631513 3522688 2549362 3835702 6148870 8858030 12315343 15190443 14938764 12132070
$$ packed form
3213a1803884l428021k07411P416271J1361172N306880n226894p950701q2198
3205d614786P314072M914020k181601l946632j054550j203745l942614j216905
3197e932741P190407J0857010M621452l013651k578723L495667O622107M061670
3189B5323198r23129n569456q200364o613935j598157J559293J03957j521714
3181B559693R25788L965344K582752k12431K029323P423596P211100q89839q591085
3172A7004241q267839k182078K217472J595074j673381l990388l643960j161499
3164a02358J169715R77395j591946l501091k007020K056446M873136L712015M5221
3155E631513k108825r73326J286340K313168K709160L457313K875100k51679k806694
$$ plain form
3146 12132070 10621088 11382779 10183914 4316663 -2489895 -5957327 -8019513 -12422282
3138 -12422282 -17130899 -17635025 -15315002 -15290313 -17254389 -15871609 -9961875 -3988946 -209641
3129 -209641 3244533 5790059 3786301 -1688720 -4119780 -1341385 1004035 -1160782
3121 -1160782 -4324960 -4199102 -2057985 -565778 474433 399150 -3837648 -11094364 -14207266
3112 -14207266 -9547766 -2614760 457754 624494 296608 -2632659 -8478944 -10535851
3104 -10535851 -4442658 2899206 2449844 -3882986 -8227957 -9881199 -13103166 -15745757
3096 -15745757 -11878582 -3960785 -416615 -1179073 2349526 11355559 15659404 9593136
3088 9593136 993879 -1312263 196710 -1270585 -5116805 -6471799 -5775045 -7382771
$$ packed form
3146A2132070j510982P61691j198865n867251o806558l467432k062186m402769
3138a2422282m708617n04126K320023K4689j964076J382780N909734N972929L779305
3129b09641L454174K545526k003758n475021k431060K778395K345420k164817
3121a160782l164178J25858K141117J492207J040211p5283m236798p256716l112902
3112a4207266M659500O933006L072514J66740l27886k929267n846285k056907
3104a0535851O093193P341864m49362o332830m344971j653242l221967k642591
3096a5745757L867175P917797L544170p62458L528599R006033M303845o066268
3088I593136q599257k306142J508973j467295l846220j354994O96754j607726
$$ plain form
3080 -7382771 -11542466 -14549315 -15206654 -15331349 -14811625 -11346983 -5075989 633738 3413761
3071 3413761 3875795 3030492 357897 -4600207 -10238618 -13634873 -13386181 -11572891 -12180028
3062 -12180028 -16662796 -21769759 -23180667 -20405176 -15912261 -10460726 -2990852 4519284
3054 4519284 6316703 -490735 -11013596 -17056453 -15567988 -10692653 -7997868 -8517175
3046 -8517175 -9046861 -7403825 -5757977 -7405821 -11244150 -12670592 -10665786 -9851507 -12852030
3037 -12852030 -14994298 -11622582 -7184219 -9841525 -18343955 -22377065 -17138161 -9679714
3029 -9679714 -7564793 -8497363 -6561596 -3005582 -3637483 -8398888 -10814146 -7575979 -2677075
3020 -2677075 -737365 -780887 1187131 6354980 12124746 15331999 14640640 10794883 6223871
$$ packed form
3080g382771m159695l006849o57339j24695N19724L464642O270994N709727K780023
3071C413761M62034q45303k672595m958104n638411l396255K48692J813290o07137
3062a2180028m482768n106963j410908K775491M492915N451535P469874P510136
3054D519284J797419o807438j0522861o042857J488465M875335K694785n19307
3046h517175n29686J643036J645848j647844l838329j426442K004806Q14279l000523
3037a2852030k142268L371716M438363k657306q502430m033110N238904P458447
3029i679714K114921r32570J935767L556014o31901m761405k415258L238167M898904
3020b677075J939710m3522J968018N167849N769766L207253o91359l845757m571012
$$ plain form
3011 6223871 3960304 5275883 8039573 8613366 5973226 2856073 1898630 1932725 3281
3002 3281 -3707674 -5465241 -2490715 4381036 12246155 17406597 15671261 6017360 -5352263
2993 -5352263 -9936346 -7651599 -6654298 -9915678 -9754246 -1300024 6587283 3051219 -8014068
2984 -8014068 -14146843 -13426032 -14457285 -18493464 -16137083 -4931744 3618488 1466463
2976 1466463 -2852578 2474214 14486501 20652076 16733657 9874185 6876708 7928045
2968 7928045 10571187 12802383 12715949 10438757 9522576 11870349 12915928 6740265 -5343103
2959 -5343103 -16048503 -20868289 -21085980 -19104555 -15483682 -10557024 -5230426 -29030
2951 -29030 4118045 4998346 1626486 -3423881 -6527054 -6404893 -3127429 3531484 11696781
$$ packed form
3011F223871k263567J315579K763690N73793k640140l117153r57443L4095j929444
3002C281l710955j757567K974526O871751P865119N160442j735336r653901j1369623
2993e352263m584083K284747R97301l261380J61432Q454222P887307l536064j1065287
2984h014068o132775P20811j031253m036179K356381J1205339Q550232k152025
2976A466463m319041N326792J2012287O165575l918419o859472k997477J051337
2968G928045K643142K231196q6434k277192r16181K347773J045579o175663j2083368
2959e343103j0705400m819786k17691J981425L620873M926658N326598N201396
2951b9030M147075Q80301l371860n050367l103173J22161L277464O658913Q165297
$$ plain form
2942 11696781 16081169 13114381 5837694 319254 -1240331 -908947 -689276 -1093429 -2161016
2933 -2161016 -2932737 -1890742 -122874 -829875 -3358011 -2459551 2970671 6171636 2917718
2924 2917718 -322106 3784077 10565428 9830993 1935561 -2975479 -287264 4965308
2916 4965308 9004472 13493723 17499286 16085870 10025937 6906235 8549000 7072481
2908 7072481 -1330930 -8379789 -6753223 -2671415 -6071904 -14195068 -15316577 -5953144
2900 -5953144 5351374 10722102 10856669 9348446 6595275 2141366 -2019372 -3792165
2892 -3792165 -4031043 -4923173 -6673140 -7161621 -4380308 1076845 5770323 6560198 4584940
2883 4584940 4543264 8756131 13651437 14132741 10218152 7057001 8754403 14037256 18125149
$$ packed form
2942A1696781M384388k966788p276687n518440j559585L31384K19671m04153j067587
2933b161016p71721J041995J767868p07001k528136Q98460N430222L200965l253918
2924B917718l239824M106183O781351p34435p895432m911040K688215N252572
2916D965308M039164M489251M005563j413416o059933l119702J642765j476519
2908G072481q403411p048859J626566M081808l400489q123164j121509R363433
2900e953144J1304518N370728J34567j508223k753171m453909m160738j772793
2892c792165k38878q92130j749967m88481K781313N457153M693478P89875j975258
2883D584940m1676M212867M895306M81304l914589l161151J697402N282853M087893
$$ plain form
2874 18125149 17682110 13592804 9302027 6946333 5972947 5526951 5881709 6007666 2793116
2865 2793116 -3757791 -7367413 -2964446 4573753 6090701 1724218 108164 2856475
2857 2856475 177389 -13114554 -26801907 -28508104 -20443876 -13559620 -10555539 -5484694
2849 -5484694 2942864 9098005 10945869 12188614 12890848 8066202 -1902980 -8890326
2841 -8890326 -9001766 -8643868 -13868727 -21023461 -23617465 -22209929 -21207200 -20856052 -18853367
2832 -18853367 -15916537 -13420219 -8939814 -673389 6583154 6746766 1591062 -2421514
2824 -2421514 -4608732 -9333031 -15448351 -15651962 -8348703 -1543932 -941654 -1903848 999466
2815 999466 3334554 -1843410 -10040558 -8891266 3879868 14989398 11862099 -1849478
$$ packed form
2874A8125149m43039m089306m290777k355694r73386m45996L54758J25957l214550
2865B793116o550907l609622M402967P538199J516948m366483j616054K748311
2857B856475k679086j3291943j3687353j706197Q064228O884256L004081N070845
2849e484694Q427558O155141J847864J242745P02234m824646r969182o987346
2841h890326j11440L57898n224859p154734k594004J407536J002729L51148K002685
2832a8853367K936830K496318M480405Q266425P256543J63612n155704m012576
2824b421514k187218m724299o115320k03611P303259O804771O02278r62194K903314
2815I99466K335088n177964q197148J149292J2771134J1109530l127299j3711577
$$ plain form
2807 -1849478 -12210888 -12593795 -9068902 -9281566 -12534782 -13704704 -12517053 -13484777 -17304523
2798 -17304523 -17971906 -11456540 -3484427 -3425235 -11429769 -17604031 -15531948 -10617342 -10643742
2789 -10643742 -13174474 -9886462 -1388146 1488000 -6489076 -15819920 -14500602 -4077265
2781 -4077265 3408703 1749282 -3549775 -5371258 -3648188 -1556122 978097 5328113
2773 5328113 8959638 7388805 1108430 -3296310 -420065 7263545 11456707 6719017
2765 6719017 -3521421 -10239912 -8300776 -1705549 1823140 453669 -382320 3269859
2757 3269859 7212992 4296311 -5155836 -12133619 -9439622 -658522 4223359 1435759
2749 1435759 -1856972 2553555 11886482 14829164 6416802 -4845994 -8447501 -6043658
$$ packed form
2807a849478j0361410l82907L524893k12664l253216j169922J187651r67724l819746
2798a7304523o67383O515366P972113N9192q004534o174262K072083M914606k6400
2789a0643742k530732L288012Q498316K876146p977076r330844J319318J0423337
2781d077265P485968j659421n299057j821483J723070K092066K534219M350016
2773E328113L631525j570833o280375m404740K876245P683610M193162m737690
2765F719017j0240438o718491J939136O595227L528689j369471q35989L652179
2757C269859L943133k916681r452147o977783K693997Q781100M881881k787600
2749A435759l292731M410527R332927K942682q412362j1262796l601507K403843
$$ plain form
2741 -6043658 -7245308 -13043848 -13013633 -2377170 7059797 1346879 -15111236 -23773896
2733 -23773896 -16129813 -3467035 534258 -2420538 -1799550 4136249 7335690 4679631
2725 4679631 3334296 8555750 14309321 11994692 3707065 -282203 4354865 11277212
2717 11277212 13718353 13143998 14182771 15559458 11953216 3745987 -1047975 3125506
2709 3125506 11153847 12977248 6073296 -2027787 -4505876 -4386349 -9225484 -18774413
2701 -18774413 -23690792 -18242681 -9089653 -6435740 -9440246 -7642527 2693873 11591805
2693 11591805 9304409 1193589 985741 11675122 21814768 21989808 17016448 17350724
2685 17350724 23987210 28115663 23353586 12462573 2277618 -3099944 -3169507 851416
$$ packed form
2741f043658j201650n798540L0215J0636463R436967n712918j6458115q662660
2733b3773896P644083J2662778M001293k954796O20988N935799L199441k656059
2725D679631j345335N221454N753571k314629q287627l989268M637068O922347
2717A1277212K441141n74355J038773J376687l606242q207229m793962M173481
2709C125506Q028341J823401o903952q101083k478089J19527m839135r548929
2701a8774413m916379N448111R153028K653913l004506J797719J0336400Q897932
2693A1591805k287396q110820k07848J0689381J0139646J75040m973360L34276
2685A7350724O636486M128453m762077j0891013j0184955n377562o9563M020923
$$ plain form
2677 851416 6623462 11434210 14009459 14706397 13655980 10410382 5965777 3177524 3788146
2668 3788146 6054419 6392859 2805591 -3764755 -10528802 -14692390 -15085221 -12705255 -9388516
2659 -9388516 -6093192 -3216828 -1885597 -3024438 -5233584 -5887351 -4874171 -4927337 -7401075
2650 -7401075 -10163229 -10773311 -9059809 -5337994 285520 4649749 2178496 -6858818
2642 -6858818 -12986498 -8908195 -1094028 -1416703 -8388578 -7374500 7759638 23690754
2634 23690754 24852186 13343987 3021800 -196782 -1706413 -5091910 -6840246 -4614956
2626 -4614956 -1200872 1911880 6755776 12178042 12753666 8010213 5384533 9126933
2618 9126933 12857455 9391067 2618538 2031182 8572634 13871704 12763962 9225152
$$ packed form
2677H51416N772046M810748K575249O96938j050417l245598m444605k788253O10622
2668C788146K266273L38440l587268o570346o764047m163588l92831K379966L316739
2659i388516L295324K876364J331231j138841k209146o53767J013180n3166k473738
2650g401075k762154o10082J713502L721815N623514M364229k471253r037314
2642f858818o127680M078303P814167l22675o971875J014078J5134138J5931116
2634B3690754J161432j1508199j0322187l218582j509631l385497j748336K225290
2626d614956L414084L112752M843896N422266N75624m743453k625680L742400
2618I126933L730522l466388o772529n87356O541452N299070j107742l538810
$$ plain form
2610 9225152 8475627 9113642 6306130 -410212 -5819652 -4919135 1558756 7885368 9314887
2601 9314887 6619475 3879786 2872266 2088390 816889 515513 1383464 1505764 907022
2592 907022 2244601 5239736 5045513 -342278 -5346730 -3857291 2750896 9391419 15109836
2583 15109836 21068670 24024692 19467649 10026265 3241563 929050 -2003848 -7185207
2575 -7185207 -8665405 -2181258 7332119 11412736 7444487 -810941 -8775064 -13946333
2567 -13946333 -15583613 -14513463 -12306220 -9254977 -4411254 1803291 6982220 9457156
2559 9457156 9683242 8262104 4662098 -1124906 -7261038 -11402610 -12674059 -12148267 -11698901
2550 -11698901 -11655774 -9571899 -3448968 3413966 4480678 -1188922 -6196161 -4039078
$$ packed form
2610I225152p49525O38015k807512o716342n409440R00517O477891O326612J429519
2601I314887k695412k739689j007520p83876j271501l01376Q67951J22300n98742
2592I07022J337579K995135j94223n387791n004452J489439O608187O640523N718417
2583A5109836N958834K956022m557043r441384o784702k312513k932898n181359
2575g185207j480198O484147R513377M080617l968249q255428p964123n171269
2567a3946333j637280J070150K207243L051243M843723O214545N178929K474936
2559I457156K26086j421138l600006n787004o136132m141572j271449N25792M49366
2550a1698901M3127K083875O122931O862934J066712n669600n007239K157083
$$ plain form
2542 -4039078 2746363 7364095 7696015 6218744 5106669 5955775 9685268 11895868 4678502
2533 4678502 -10355004 -18345725 -9808654 4424451 8542495 4551957 4792431 8345330
2525 8345330 4134983 -5663086 -6870596 1825268 7994960 11556799 24822585 38709330
2517 38709330 19592247 -40678181 -97274858 -101969934 -63444009 -30338716 -26597919
2510 -26597919 -34124101 -33140194 -26585708 -20793826 -10916449 3788652 11166751 4108427
2502 4108427 -7561753 -11943247 -9171361 -4218853 1250706 3300365 -4578688 -18332564
2494 -18332564 -22407210 -10807145 2021946 665435 -10924786 -18342101 -16937091 -12406857
2486 -12406857 -8473670 -5368632 -6010049 -13048222 -21938477 -25411275 -23341244 -21590946
$$ packed form
2542d039078O785441M617732L31920j477271j112075Q49106L729493K210600p217366
2533D678502j5033506p990721Q537071J4233105M118044l990538K40474L552899
2525H345330m210347r798069j207510Q695864O169692L561839J3265786J3886745
2517C8709330j9117083o0270428n6596677m695076L8525925L3105293L740797
2510b6597919p526182R83907O554486N791882R877377J4705101P378099p058324
2502D108427j1670180m381494K771886M952508N469559K049659p879053j3753876
2494a8332564m074646J1600065J2829091j356511j1590221p417315J405010M530234
2486a2406857L933187L105038o41417p038173q890255l472798K070031J750298
$$ plain form
2478 -21590946 -22917184 -24859384 -24839533 -22355178 -17945803 -13894093 -13346887 -15315084 -14155450
2469 -14155450 -7738644 -1905723 -2413706 -6761100 -9048905 -8829999 -9349404 -10420730 -9385376
2460 -9385376 -7152380 -7517284 -11374465 -15872859 -18210062 -17076021 -12408392 -6867688
2452 -6867688 -4959791 -7501219 -10023942 -9926750 -11168651 -17325469 -23864715 -23201076 -15103554
2443 -15103554 -6489940 -2383445 -2096517 -3172947 -4321298 -4949630 -5482105 -7396590 -10245048
2434 -10245048 -10586896 -6894673 -2948856 -2700031 -4374328 -3870723 -1648610 -1642916 -5009022
2425 -5009022 -9204683 -11876340 -11969249 -8760656 -3412243 481323 1230293 1324359 2053658
2416 2053658 -262371 -7917519 -15665396 -17185533 -14691642 -15175782 -19176341 -20642418
$$ packed form
2478b1590946j326238j942200J9851K484355M409375M051710N47206j968197J159634
2469a4155450O416806N832921n07983m347394k287805K18906n19405j071326J035354
2460i385376K232996l64904l857181m498394k337203J134041M667629N540704
2452f867688J907897k541428k522723R7192j241901o156818o539246O63639Q097522
2443a5103554Q613614M106495K86928j076430j148351o28332n32475j914485k848458
2434a0245048l41848L692223L945817K48825j674297N03605K222113N694l366106
2425e009022m195661k671657r2909L208593N348413L893566P48970R4066P29299
2416B053658k316029p655148p747877j520137K493891m84140m000559j466077
$$ plain form
2408 -20642418 -17003171 -12096107 -9064519 -7103169 -5835366 -6710683 -9116355 -10477487
2400 -10477487 -10721258 -11559228 -11722653 -8898679 -5958681 -8030398 -12799920 -11572753 -1932506
2391 -1932506 8403189 13281481 15793899 19803053 21364819 15414427 5761982 947760
2383 947760 2936700 6420944 7297766 5515548 882933 -7037064 -14264600 -13986147 -5500258
2374 -5500258 2643091 1604305 -8094397 -18435128 -23188586 -22061728 -16924985 -8437976
2366 -8437976 2039120 10554687 13927522 13819957 14342451 16027890 15509135 11429008 6921282
2357 6921282 4876008 4365850 3895920 4652737 7510515 9940955 9538702 8058642 8243974
2348 8243974 9323566 9862029 11990869 17030401 19353145 12093365 -1372545 -9371246
$$ packed form
2408b0642418L639247M907064L031588J961350J267803q75317k405672j361132
2400a0477487k43771q37970j63425K823974K939998k071717m769522J227167R640247
2391a932506J0335695M878292K512418M009154J561766n950392r652445m814222
2383I47760J988940L484244Q76822j782218m632615p919997p227536K78453Q485889
2374e500258Q143349j038786r698702j0340731m753458J126858N136743Q487009
2366h437976J0477096Q515567L372835j07565N22494J685439n18755m080127m507726
2357F921282k045274n10158m69930P56817K857778K430440m02253j480060J85332
2348H243974J079592N38463K128840N039532K322744p259780j3465910p998701
$$ plain form
2340 -9371246 -6933145 -1794669 -2731411 -8662365 -13561109 -16078017 -18039739 -17441750 -10532171
2331 -10532171 -299443 3701027 -3747610 -16384303 -22716169 -17932820 -7902795 -1999006
2323 -1999006 -3565944 -7976076 -8917137 -4731788 1663082 6758029 8510507 6233961
2315 6233961 1264963 -2852295 -3304697 -771524 2659547 6948911 12494515 16473081
2307 16473081 15078053 9183381 3471387 -228011 -3989765 -7570521 -6849239 -1044322
2299 -1044322 3585053 1190403 -6048275 -11587399 -12810894 -11694521 -9822761 -7242831
2291 -7242831 -4631436 -2304098 1618517 7591190 10287484 3396979 -10462257 -19805087
2283 -19805087 -16732544 -5749685 2487578 3315662 892511 1124898 5510224 11247470
$$ packed form
2340i371246K438101N138476r36742n930954m898744k516908j961722N97989O909579
2331a0532171J0232728M000470p448637j2636693o331866M783349J0030025N903789
2323a999006j566938m410132r41061M185349O394870N094947J752478k276546
2315F233961m968998m117258m52402K533173L431071M289364N545604L978566
2307A6473081j395028n894672n711994l699398l761754l580756P21282N804917
2299a044322M629375k394650p238678n539124j223495J116373J871760K579930
2291g242831K611395K327338L922615N972673K696294o890505j3859236r342830
2283a9805087L072543J0982859Q237263Q28084k423151K32387M385326N737246
$$ plain form
2275 11247470 14094291 11108131 3548684 -2575642 -1792346 4241217 8380516 7175798
2267 7175798 4650322 4798676 4797761 377370 -5352924 -5162687 932488 4465085 151882
2258 151882 -7277327 -10496663 -8650481 -5686164 -3975680 -3304215 -2860795 -1071570 3234340
2249 3234340 6892296 4021409 -5107146 -11829140 -10240989 -5585914 -5879810 -10088979
2241 -10088979 -11670191 -9556448 -7194329 -3809015 3774775 11886101 12357496 4682358
2233 4682358 -2946108 -5667717 -6370588 -6836871 -3864403 2804635 7444278 7325123 7069923
2224 7069923 9874982 11924231 10327336 9209282 12079220 14880267 13286587 11026350
2216 11026350 13561189 18286924 18968211 16534094 17404737 22910670 27854160 28909834
$$ packed form
2275A1247470K846821k986160p559447o124326P83296O033563M139299j204718
2267G175798k525476J48354r15m420391n730294J90237O095175L532597m313203
2258A51882p429209l219336J846182K964317J710484O71465M43420J789225M305910
2249C234340L657956k870887r128555o721994J588151M655075k93896m209169
2241a0088979j581212K113743K362119L385314P583790Q111326M71395p675138
2233D682358p628466k721609p02871m66283K972468O669038M639643j19155k55200
2224G069923K805059K049249j596895j118054K869938K801047j593680k260237
2216A1026350K534839M725735O81287k434117Q70643N505933M943490J055674
$$ plain form
2208 28909834 27882833 26721206 25157658 23679514 23646664 23586101 19640354 10880770 1278220
2199 1278220 -4127933 -2963029 3800619 12262389 17482944 17503938 14630451 10909577 4904221
2190 4904221 -3839247 -10269393 -9322617 -4474418 -4367865 -10254994 -13074939 -5937321 5382248
2181 5382248 9049301 1967286 -6860827 -7965507 -2431797 1028488 -2148834 -7138492
2173 -7138492 -6552313 835991 10146641 16436963 17602660 13454472 6275352 1384840
2165 1384840 2435528 6073117 5798306 1253690 -1601444 -282748 488429 -2782285 -6275786
2156 -6275786 -5163018 -1109597 977728 -100306 -2353722 -4625660 -5943455 -4035176
2148 -4035176 1338141 6304752 7695749 6846338 5493197 2376796 -1806500 -1253259 6773976
$$ packed form
2208B8909834j027001j161627j563548j478144l2850o0563l945747q759584r602550
2199A278220n406153J164904O763648Q461770N220555K0994k873487l720874o005356
2190D904221q743468o430146R46776M848199J06553n887129k819945P137618J1319569
2181E382248L667053p082015q828113j104680N533710L460285l177322m989658
2173g138492N86179P388304R310650O290322J165697m148188p179120m890512
2165A384840J050688L637589k74811m544616k855134J318696P71177l270714l493501
2156f275786J112768M053421K087325j078034k253416k271938j317795J908279
2148d035176N373317M966611J390997q49411j353141l116401m183296N53241Q027235
$$ plain form
2139 6773976 14696805 12996668 3290966 -4374030 -5344102 -3517064 -1774533 1735227
2131 1735227 6383235 6569101 237277 -6218223 -5965720 -635145 2795352 1200141 -2463219
2122 -2463219 -4658473 -5356982 -6050605 -5833057 -1706409 6329097 12297514 9846819 1160841
2113 1160841 -3948106 34657 7532941 10433905 9130989 9594129 12442914 11902558 5425490
2104 5425490 -1767288 -3436050 275035 3860045 2839810 -1462390 -2633235 4086340
2096 4086340 14721238 19104493 12680644 2280822 -2903061 -1915643 601928 2846369
2088 2846369 5270001 5380976 855392 -4321450 -4538291 -1955412 -3493435 -9624029 -14507730
2079 -14507730 -16604412 -19783266 -23411361 -21743779 -15810763 -15310879 -23274709 -28225160
$$ packed form
2139F773976P922829j700137r705702p664996r70072J827038J742531L509760
2131A735227M648008J85866o331824o455500K52503N330575L430497j595211l663360
2122b463219k195254o98509o93623K17548M126648Q035506N968417k450695q685978
2113A160841n108947L982763P498284K900964j302916M63140K848785n40356o477068
2104E425490p192778j668762L711085L585010j020235m302200j170845O719575
2096D086340J0634898M383255o423849j0399822n183883R87418K517571K244441
2088B846369K423632J10975m525584n176842k16841K582879j538023o130594m883701
2079a4507730k096682l178854l628095J667582N933016M99884p963830m950451
$$ plain form
2071 -28225160 -19481124 -3473163 4337477 172219 -4459312 705608 12223865 19070227
2063 19070227 16120726 8090961 2024627 -605509 -3028359 -6382480 -7579464 -5128081
2055 -5128081 -2991842 -4705315 -6654438 -2860628 4960217 8509040 4288140 -2362644
2047 -2362644 -5930918 -7464837 -10226056 -13765838 -15484023 -14398083 -10880303 -5928417
2039 -5928417 -2512171 -4088957 -9990046 -15668408 -18662653 -20164769 -19674729 -13827085
2031 -13827085 -3415600 3889683 2472439 -3210186 -4102543 2392066 10815720 15047410
2023 15047410 13265261 6714502 -2679749 -13125164 -23116541 -30584494 -31595808 -22274514
2015 -22274514 -4096752 14229447 22752971 18594458 7921320 184168 476418 6505437
$$ packed form
2071b8225160Q744036J6007961P810640m165258m631531N164920J1518257O846362
2063A9070227k949501q029765o066334k630136k422850l354121j196984K451383
2055e128081K136239j713473j949123L793810P820845L548823m220900o650784
2047b362644l568274j533919k761219l539782j718185J085940L517780M951886
2039e928417L416246j576786n901089n678362k994245j502116M90040N847644
2031a3827085J0411485P305283j417244n682625q92357O494609Q423654M231690
2023A5047410j782149o550759r394251j0445415r991377p467953j011314R321294
2015b2274514J8177762J8326199Q523524m158513j0673138p737152K92250O029019
$$ plain form
2007 6505437 12277665 14250213 12970578 9489717 3617079 -3087922 -6740820 -6532526
1999 -6532526 -6802866 -9769674 -10340924 -3777777 5041416 7105057 1996359 -2118759 -271830
1990 -271830 4464219 7361541 6646744 2283473 -3385508 -4727563 776978 6820317 6363560
1981 6363560 2980068 4742140 9161816 6302812 -3397027 -8020241 -3436967 -183373
1973 -183373 -6127489 -14717974 -17004140 -14157275 -10848158 -6625267 -1691887 -1336288 -6025965
1964 -6025965 -6344135 2950361 12430165 11520885 4616601 2871686 6810577 8958569 8540997
1955 8540997 10924775 15016295 13230504 4124915 -4485003 -6148754 -2728199 -151980
1947 -151980 -2097163 -7612804 -11952670 -11582715 -9712212 -11903309 -14828836 -8050938 8927111
$$ packed form
2007F505437N772228J972548j279635l480861n872638o705001l652898K08294
1999f532526k70340k966808n71250O563147Q819193K063641n108698m115118J846929
1990b71830M736049K897322p14797m363271n668981j342055N504541O043339m56757
1981F363560l383492J762072M419676k859004r699839m623214M583274L253594
1973a83373n944116q590485k286166K846865L309117M222891M933380L55599m689677
1964f025965l18170R294496R479804r09280o904284j744915L938891K147992m17572
1955H540997K383778M091520j785791r105589q609918j663751L420555K576219
1947a51980j945183n515641m339866L69955J870503k191097k925527O777898J6978049
$$ plain form
1938 8927111 21707171 20438142 14112463 15609581 21948683 21906935 15675130 12602413
1930 12602413 14147679 13460140 9410511 7561852 8488369 7618432 5751887 7678193 11029184
1921 11029184 8543444 1391827 -1344080 3209831 9045101 12422142 14348279 12446380
1913 12446380 2992435 -8284825 -10438887 -4012981 -434264 -2467283 426102 12597849
1905 12597849 22489453 20211043 12526641 10464455 11595715 5809148 -7144909 -16540501
1897 -16540501 -14960021 -5930170 2051427 4113819 2017321 1233455 4447358 7943869
1889 7943869 6903646 3038747 2095462 4540851 5108898 1990088 -398558 636900 1837024
1880 1837024 28925 -2989620 -3721996 -879423 4671395 9585132 8515663 407289
$$ packed form
1938H927111J2780060j269029o325679J497118O339102m1748o231805l072717
1930A2602413J545266o87539m049629j848659R26517q69937j866545J926306L350991
1921A1029184k485740p151617k735907M553911N835270L377041J926137j901899
1913A2446380r453945j1277260k154062O425906L578717k033019K893385J2171747
1905A2597849R891604k278410p684402k062186J131260n786567j2954057r395592
1897a6540501J580480R029851P981597K062392k096498p83866L213903L496511
1889G943869j040223l864899r43285K445389N68047l118810k388646J035458J200124
1880A837024j808099l018545p32376K842573N550818M913737j069469q108374
$$ plain form
1872 407289 -7158585 -6660383 -2026872 -3261438 -11130483 -16653144 -15193519 -10658804 -5475977
1863 -5475977 2285790 10362689 12627665 10664544 13350445 21487669 24877059 19106966
1855 19106966 12787327 12213970 11518639 5877293 2219975 6651747 11771794 8140375
1847 8140375 108944 -1759649 2275240 3607664 228540 -2397027 -2663006 -4411950
1839 -4411950 -8431781 -11375275 -12469225 -13714056 -14229187 -11260841 -6113990 -3094923
1831 -3094923 -3402344 -5181345 -7947602 -11557245 -12531627 -7274302 1776884 8218872 9390938
1822 9390938 7883885 6306269 4795893 3348378 2796870 2948463 2023976 -1442831 -6561343
1813 -6561343 -9599812 -6564138 1898424 9916509 13785564 17026675 22679352 24109741
$$ packed form
1872D07289p565874M98202M633511j234566p869045n522661J459625M534715N182827
1863e475977P761767Q076899K264976j963121K685901Q137224L389390n770093
1855A9106966o319639n73357o95331n641346l657318M431772N120047l631419
1847H140375q031431j868593M034889J332424l379124k625567k65979j748944
1839d411950m019831k943494j093950j244831n15131K968346N146851L019067
1831c094923l07421j779001k766257l609643r74382N257325R051186O441988J172066
1822I390938j507053j577616j510376j447515n51508J51593r24487l466807n118512
1813f561343l038469L035674Q462562Q018085L869055L241111N652677J430389
$$ plain form
1805 24109741 12817322 -5708053 -15282395 -10426259 -3372336 -5302614 -11371914 -11209390
1797 -11209390 -4922565 78817 1448377 2307842 3804822 4890226 6207166 8034061
1789 8034061 7504828 3071491 -1496150 -2031411 429393 2598153 3757916 4603598 5385413
1780 5385413 7551894 12497448 17084062 16325892 11822652 10302435 12436328 11778983 6770534
1771 6770534 3799939 5248652 5256381 1750126 1664387 8620859 16038063 18390977 18671010
1762 18671010 18786858 14211784 5095703 668791 4624261 8097946 5560052 4866046
1754 4866046 11685264 17024232 11953552 2705201 -1142195 -1826612 -4143085 -3178208 4607401
1745 4607401 9819031 5174789 1130710 9687014 22536317 23522966 14757079 11346153
$$ packed form
1805B4109741j1292419j8525375r574342M856136P053923j930278o069300J62524
1797a1209390O286825N001382J369560Q59465J496980J085404J316940J826895
1789H034061n29233m433337m567641n35261K460804K168760J159763Q45682P81815
1780E385413K166481M945554M586614p58170m503240j520217K133893o57345n008449
1771F770534k970595J448713P729l506255q5739O956472P417204K352914K80033
1762A8671010J15848m575074r116081m426912L955470L473685k537894o94006
1754D866046O819218N338968n070680r248351l847396o84417k316473R64877P785609
1745D607401N211630m644242m044079Q556304J2849303R86649q765887l410926
$$ plain form
1737 11346153 15858527 16857238 9952442 3558435 4764933 12350738 21503467 25434969
1729 25434969 17927136 4024087 -232443 10812448 22131005 20727613 15096689 17397042
1721 17397042 21176116 15498637 7526707 10067656 18531647 21484508 22362798 28845364
1713 28845364 32922816 24969680 15614843 19310159 28367984 28137743 24196661 27888298
1705 27888298 30342342 20331325 11362489 18576261 26743548 17436594 8098827 22249659
1697 22249659 41665628 36763725 23740108 35279147 54601999 44254658 22519782
1690 22519782 34706185 62616851 52143008 22571067 41420277 87723708 71387342
1683 71387342 17760427 78011790 273399376 379460132 206476040 -111036753 -272412499
$$ packed form
1737A1346153M512374R98711o904796o394007J206498P585805R152729L931502
1729B5434969p507833j3903049m256530J1044891J1318557j403392n630924K300353
1721A7397042L779074n677479p971930K540949Q463991K952861Q78290O482566
1713B8845364M077452p953136r354837L695316R057825k30241l941082L691637
1705B7888298K454044j0011017q968836P213772Q167287r306954r337767J4150832
1697B2249659J9415969m901903j3023617J1539039J9322852j0347341k1734876
1690B2519782J2186403K7910666j0473843k9571941J8849210M6303431j6336366
1683G1387342n3626915O0251363J95387586J06060756j72984092l17512793j61375746
$$ plain form
1676 -272412499 -195814466 -69374760 -44948677 -69889639 -52437033 -20057094 -31459589
1669 -31459589 -56688250 -41466641 -8935575 -9750490 -29766957 -25459326 -5753476 -6963078
1661 -6963078 -21349350 -16754459 -732945 -4250207 -21250032 -20294487 -2501446 2529875
1653 2529875 -11028736 -21788013 -22443464 -24302087 -26709939 -18694051 -6079315 -3710601
1645 -3710601 -6064163 2851740 16216092 12767288 -5954010 -17843209 -17035262 -18239091
1637 -18239091 -25185437 -24423403 -12989278 -5354598 -8363637 -12381253 -11554883 -11989481
1629 -11989481 -15877249 -16611773 -13248310 -12438064 -13473503 -8167782 2480054 7958082
1621 7958082 6129822 5177530 6344172 1448322 -10155111 -18423700 -19344824 -19410119 -20566663
$$ packed form
1676b72412499P6598033J26439706K4426083k4940962J7452606L2379939j1402495
1669c1459589k5228661J5221609L2531066q14915k0016467M307631J9705850j209602
1661f963078j4386272M594891J6021514l517262j6999825R55545J7793041N031321
1653B529875j3558611j0759277o55451j858623k407852Q015888J2614736K368714
1645c710601k353562Q915903J3364352l448804j8721298j1889199Q07947j203829
1637a8239091o946346P62034J1434125P634680l009039m017616Q26370m34598
1629a1989481l887768p34524L363463Q10246j035439N305721J0647836N478028
1621G958082j828260r52292J166642m895850j1603433q268589r21124o5295j156544
$$ plain form
1612 -20566663 -16157730 -5592743 1740246 1668711 799489 2821531 2614284 -1659262 -3856044
1603 -3856044 -2311467 -4343064 -12655325 -19119080 -18192612 -15411914 -16000844 -15483896 -9007757
1594 -9007757 -1091435 1473520 -600009 -2915060 -4637753 -6046495 -4573243 1198341
1586 1198341 8078545 12622380 14258899 11764720 2985065 -8849028 -15112644 -11913451
1578 -11913451 -4565577 949138 4563267 7096345 5934375 375131 -4913242 -6535324
1570 -6535324 -6971480 -8281266 -7179388 -1438221 4342960 4954698 1818048 -1394359 -5506230
1561 -5506230 -11897966 -16007334 -12184387 -2948932 3388989 3500892 1645196 2084031 4549214
1552 4549214 7585532 11143794 14286776 14348158 10603366 6364093 5500064 8180785 11219443
$$ packed form
1612b0566663M408933J0564987P332989p1535q69222K022042k07247m273546k196782
1603c856044J544577k031597q312261o463755R26468K780698n88930N16948O476139
1594i007757P916322K564955k073529k315051j722693j408742J473252N771584
1586A198341O880204M543835J636519k494179q779655j1834093o263616L199193
1578a1913451P347874N514715L614129K533078j161970n559244n288373j622082
1570f535324m36156j309786J101878N741167N781181O11738l136650l212407m111871
1561e506230o391736m109368L822947R235455O337921J11903j855696M38835K465183
1552D549214L036318L558262L142982O1382l744792m239273q64029K680721L038658
$$ plain form
1543 11219443 11539643 8420395 3410582 -774805 -1877403 -21359 1863614 796462
1535 796462 -2553990 -4346985 -2934302 -1962167 -5490169 -11436084 -14100722 -12902336 -12879498
1526 -12879498 -14790139 -11385749 1512301 15707440 19612549 13257035 6340530 3196123
1518 3196123 -884878 -7599478 -10091788 -4299029 2083007 -765465 -10765141 -16991525
1510 -16991525 -14522485 -9013448 -6671239 -6497013 -4596172 -908031 1875304 2793145
1502 2793145 2339759 -184070 -5227790 -10099038 -11596945 -11265413 -13641558 -18582303 -20281508
1493 -20281508 -16276234 -12461848 -14678838 -19066816 -16681662 -5904285 5560499 10296457
1485 10296457 7346285 -536885 -9752509 -15773479 -16308743 -15506452 -19412475 -26608927
$$ packed form
1543A1219443L20200l119248n009813m185387j102598J856044J884973j067152
1535G96462l350452j792995J412683R72135l528002n945915k664638J198386K2838
1526a2879498j910641L404390J2898050J4195139L905109o355514o916505l144407
1518C196123m081001o714600k492310N792759O382036k848472r999676o226384
1510a6991525K469040N509037K342209J74226J900841L688141K783335R17841
1502B793145m53386k523829n043720m871248j497907L31532k376145m940745j699205
1493b0281508M005274L814386k216990m387978K385154J0777377J1464784M735958
1485A0296457k950172p883170r215624o020970n35264Q02291l906023p196452
$$ plain form
1477 -26608927 -29470096 -25273276 -18826724 -12875623 -4404856 6662242 13921058 14203398
1469 14203398 12619056 12654105 9689777 1025141 -6049510 -4831983 -795976 -2903400
1461 -2903400 -8992650 -10137684 -5260148 -767404 1298333 3908809 5582193 1101164
1453 1101164 -8132210 -13898378 -12336448 -7802473 -5421230 -6638092 -11188780 -16184886
1445 -16184886 -14827527 -4208973 7209948 8856023 3210484 1651069 6198483 7111814
1437 7111814 -278350 -8310267 -9811446 -7393418 -5690425 -4094752 -2133341 -3271844
1429 -3271844 -8041682 -11090974 -10114834 -10369249 -15292344 -19868375 -18706927 -13908461 -9290128
1420 -9290128 -3433268 5087311 11205479 9064032 487726 -7913357 -12818435 -14719041
$$ packed form
1477b6608927k861169M196820O446552N951101Q470767J1067098P258816K82340
1469A4203398j584342L5049k964328q664636p074651J217527M036007k107424
1461b903400o089250j145034M877536M492744K065737K610476J673384m481029
1453A101164r233374n766168J561930M533975K381243j216862m550688m996106
1445a6184886J357359J0618554J1418921J646075n645539j559415M547414R13331
1437G111814p390164q031917j501179K418028J702993J595673J961411j138503
1429c271844m769838l049292R76140k54415m923095m576031J161448M798466M618333
1420i290128N856860Q520579O118168k141447q576306q401083m905078j900606
$$ plain form
1412 -14719041 -13972326 -10978769 -7370019 -3469167 2189371 8198815 9716622 5735330
1404 5735330 1955546 2637194 4515917 3036306 -211808 -1178577 -403098 -1270880 -4016992
1395 -4016992 -5686824 -4102211 565734 5619284 6242899 224187 -7169588 -8703747
1387 -8703747 -6100707 -7994516 -15771380 -20786617 -18600791 -15453724 -15472942 -12515482 -2543872
1378 -2543872 6144009 4964008 -1236946 -3105019 -1718973 -3170676 -5342041 -3053165
1370 -3053165 -670791 -5409907 -12104356 -9892639 -2214996 -4071891 -18034845 -28374934
1362 -28374934 -23353311 -10064613 -1340946 638850 759214 543977 -692351 -703958 2507037
1353 2507037 6370772 7502409 6131879 3553876 -507121 -5214137 -8104942 -9921737
$$ packed form
1412a4719041P46715K993557L608750L900852N658538O009444J517807l981292
1404E735330l779784O81648J878723j479611l248114r66769P75479q67782k746112
1395d016992j669832J584613M667945N053550O23615o018712p393775j534159
1387h703747K603040j893809p776864n015237K185826L147067j9218K957460R971610
1378b543872Q687881j180001o200954j868073J386046j451703k171365K288876
1370c053165K382374m739116o694449K211717P677643j856895j3962954j0340089
1362b8374934N021623J3288698Q723667J979796J20364k15237j236328j1607L210995
1353B507037L863735J131637j370530k578003m060997m707016k890805j816795
$$ plain form
1345 -9921737 -14750666 -22423284 -26181094 -21474072 -12293426 -5335735 -2485590 -2315201
1337 -2315201 -4136314 -6819943 -8009393 -8019831 -10135539 -14005298 -14246267 -9537768 -6936368
1328 -6936368 -11507300 -17478541 -17070486 -13339034 -15012067 -21021364 -20479392 -9087098
1320 -9087098 3640474 7212359 3264889 824772 3179863 5251304 2058175 -5429913
1312 -5429913 -13007368 -17910900 -19524035 -17999155 -14330809 -11075281 -11086104 -14668174 -18462883
1303 -18462883 -18092287 -12477654 -5407044 -2293745 -5122879 -10842410 -14809427 -15092897
1295 -15092897 -12745580 -8953277 -4156413 -80446 414386 -2518378 -4228489 -1357715
1287 -1357715 2784119 2741119 -419337 -353088 4293097 6850181 2280084 -5416923 -9117749
$$ packed form
1345i921737m828929p672618l757810M707022R180646O957691K850145J70389
1337b315201j821113k683629j189450j0438k115708l869759k40969M708499K601400
1328f936368m570932n971241M08055L731452j673033o009297N41972J1392294
1320i087098J2727572L571885l947470k440117K355091K071441l193129p488088
1312e429913p577455m903532j613135J524880L668346L255528j0823l582070l794709
1303a8462883L70596N614633P070610L113299k829134n719531l967017k83470
1295a5092897K347317L792303M796864M075967M94832k932764j710111K870774
1287a357715M141834m3000l160456O6249M646185K557084m570097p697007l700826
$$ plain form
1278 -9117749 -7688051 -5150155 -4430121 -6371188 -11696396 -18858780 -22333422 -18282757
1270 -18282757 -10391882 -5391014 -4475760 -4072262 -3326943 -4969637 -9316144 -13022533 -14048175
1261 -14048175 -13176810 -10721347 -6407544 -2447605 -2140575 -5459952 -10022981 -15137727
1253 -15137727 -19966016 -19822514 -11479634 -1155856 1233628 -3581119 -4614241 2416760
1245 2416760 7944495 3099980 -6918368 -10665657 -5488673 2107994 6241568 4778129
1237 4778129 -3292759 -15800378 -24780450 -23406661 -15281478 -10724525 -13638410 -17613923
1229 -17613923 -15923166 -10203874 -6915123 -8556826 -11130090 -9088830 -1132022 8741091
1221 8741091 15234170 16220188 12823806 6488707 -1280796 -6571055 -4783533 2966486
$$ packed form
1278i117749J429698K537896P20034j941067n325208p162384l474642M050665
1270a8282757P890875N000868R15254M03498P45319j642694m346507l706389j025642
1261a4048175Q71365K455463M313803L959939L07030l319377m563029n114746
1253a5137727m828289J43502Q342880J0323778K389484m814747j033122P031001
1245B416760N527735m844515j0018348l747289N176984P596667M133574j463439
1237D778129q070888j2507619q980072J373789Q125183M556953k913885l975513
1229a7613923J690757N719292L288751j641703k573264K041260P956808R873113
1221H741091O493079R86018l396382o335099p769503n290259J787522P750019
$$ plain form
1213 2966486 8370439 4237854 -7098398 -16170270 -16083797 -8128062 679357 3631636
1205 3631636 -721651 -7739675 -11534759 -11193301 -10358272 -10620249 -9090042 -3988887 1587721
1196 1587721 4345612 5384644 6493868 5531801 353334 -5350925 -5850668 -1952272 -270009
1187 -270009 -3697458 -7527477 -6407584 -1300971 2491527 1808599 -1829382 -5011374 -6290043
1178 -6290043 -6998611 -8199149 -7612223 -1771133 8197208 15788677 16084640 11084749 5723840
1169 5723840 1194077 -4267938 -9983198 -12835166 -12489728 -12637995 -16088085 -21242227 -24349596
1160 -24349596 -23511756 -19876838 -15935348 -12707044 -8253589 -201269 9519440 14613818
1152 14613818 11038834 2024485 -5458703 -7563164 -5042927 -183110 4984439 9133924
$$ packed form
1213B966486N403953m132585j1336252r071872Q6473P955735Q807419K952279
1205C631636m353287p018024l795084L41458Q35029k61977J530207N101155N576608
1196A587721K757891J039032J109224r62067n178467n704259m99743L898396J682263
1187b70009l427449l830019J119893N106613L792498o82928l637981l181992j278669
1178f290043p08568j200538N86926N841090R968341P591469K95963m999891n360909
1169E723840m529763n462015n715260k851968L45438j48267l450090n154142l107369
1160b4349596Q37840L634918L941490L228304M453455Q052320R720709N094378
1152A4613818l574984r014349p483188k104461K520237M859817N167549M149485
$$ plain form
1144 9133924 12994332 18763629 26184977 31612964 33142545 33202554 33108767 29644170 21801249
1135 21801249 15844157 16311523 16165519 5812808 -9924468 -15457980 -6536843 3041073
1127 3041073 1681725 -3770949 -229558 11365011 18499144 15579022 9320841 6573285
1119 6573285 6410319 6097511 6918813 10095762 12054467 8202060 -955651 -10536118 -16527164
1110 -16527164 -18030241 -15742668 -10862893 -5425675 -1894174 -1587668 -3750120 -6381388
1102 -6381388 -8151666 -9589938 -11974637 -14826015 -15449039 -11987422 -6242422 -2092492
1094 -2092492 -1550795 -3874780 -7864623 -12319636 -13929485 -8476846 2959080 11476144
1086 11476144 8577782 -3107874 -11667593 -9909582 -3430416 -1748891 -5194787 -5926638
$$ packed form
1144I133924L860408N769297P421348N427987J529581O0009r3787l464597p842921
1135B1801249n957092M67366j46004j0352711j5737276n533512Q921137R577916
1127C041073j359348n452674L541391J1594569P134133k920122o258181k747556
1119F573285j62966l12808Q21302L176949J958705l852407r157711r580467n991046
1110a6527164j503077K287573M879775N437218L531501L06506k162452k631268
1102f381388j770278j438272k384699k851378o23024L461617N745000M149930
1094b092492N41697k323985l989843m455013j609849N452639J1435926Q517064
1086A1476144k898362j1685656q559719J758011O479166J681525l445896p31851
$$ plain form
1078 -5926638 -336169 5982567 6831557 3331416 263903 -1031667 -1915999 -1722803 1185372
1069 1185372 4831690 4763407 -56764 -6043136 -9887275 -11452209 -11596504 -10635645 -9817720
1060 -9817720 -10873435 -12485443 -10307130 -2867923 4984876 7576102 5891281 6081381
1052 6081381 10473136 13500954 8501310 -3462855 -14374754 -18465724 -17608637 -16350002
1044 -16350002 -14676953 -9346033 -1106510 4282574 3574732 378112 -838217 -1665742
1036 -1665742 -6523702 -14574323 -19956548 -20094217 -19031339 -20825488 -23393782 -21930415
1028 -21930415 -16387695 -12057566 -12653609 -15515334 -15183213 -10313950 -4711339 -1478976
1020 -1478976 983950 5192482 9185587 8713592 4011533 -11812 -981654 -2105219 -6430629
$$ packed form
1078e926638N590469O318736Q48990l500141l067513j295570q84332J93196K908175
1069A185372L646318o8283m820171n986372l844139j564934j44295R60859Q17925
1060i817720j055715j612008K178313P439207P852799K591226j684821J90100
1052F081381M391755L027818m999644j1964165j0911899m090970Q57087J258635
1044a6350002J673049N330920Q239523N389084p07842l196620j216329q27525
1036a665742m857960q050621n382225j37669J062878j794149k568294J463367
1028b1930415N542720M330129n96043k861725L32121M869263N602611L232363
1020a478976K462926M208532L993105m71995m702059m023345r69842j123565m325410
$$ plain form
1011 -6430629 -12222143 -16267389 -17677485 -15703110 -8330345 2826398 10155665 7679117
1003 7679117 -1432524 -9302505 -12466219 -12128306 -9018171 -4071663 -1362256 -3506754
995 -3506754 -6083290 -3491156 1487130 1553445 -3208937 -5894951 -4548256 -3772427 -3882833
986 -3882833 1092849 11566020 18484047 16124351 10193412 7641364 6347664 1478058
978 1478058 -4820229 -7513081 -7326501 -8310036 -10806152 -12804078 -14147164 -14037382 -9452606
969 -9452606 -1907941 220034 -6419031 -11928960 -6245187 4440824 5395390 -5381299
961 -5381299 -15393084 -16430599 -13172727 -11575393 -10266708 -7391290 -5979425 -7140877
953 -7140877 -6137242 -1100753 1405954 -3835441 -11043247 -10902495 -3958542 838760 -872966
$$ packed form
1011f430629n791514m045246j410096J974375P372765J1156743P329267k476548
1003G679117r111641p869981l163714L37913L110135M946508K709407k144498
995c506754k576536K592134M978286O6315m762382k686014J346695P75829j10406
986c882833M975682J0473171O918027k359696n930939k552048j293700m869606
978A478058o298287k692852J86580r83535k496116j997926j343086J09782M584776
969i452606P544665K127975o639065n509929N683773J0686011R54566j0776689
961e381299j0011785j037515L257872J597334J308685K875418J411865j161452
953g140877J003635N036489K506707n241395p207806J40752O943953M797302j711726
$$ plain form
944 -872966 -4438859 -5001764 -4571461 -7578028 -12835604 -13752525 -6801935 2572242 5172732
935 5172732 -573935 -5774397 -2183085 7046420 12553537 12277661 12361924 14427466 10860359
926 10860359 -2805078 -17906232 -22024540 -14500127 -5781599 -3393326 -5235530 -6372521
918 -6372521 -6109920 -6735168 -9627485 -14476105 -19490788 -21317052 -17467472 -9886115 -3783920
909 -3783920 -2205774 -3905062 -6532033 -8475816 -6946118 1023301 12612553 18287587
901 18287587 12041223 838242 -1906501 7348859 17964774 19075755 12406219 6903810
893 6903810 5029938 1304613 -6807681 -14101739 -15661724 -13502717 -11526884 -8735292
885 -8735292 -2490732 4625956 6873905 3042344 -2805601 -7514133 -10911364 -12188342
$$ packed form
944h72966l565893n62905M30303l006567n257576r16921O950590R374177K600490
935E172732n746667n200462L591312R229505N507117k75876Q4263K065542l567107
926A0860359j3665437j5101154m118308P524413Q718528K388273j842204j136991
918f372521K62601o25248k892317m848620n014683j826264L849580P581357O102195
909c783920J578146j699288k626971j943783J529698P969419J1589252N675034
901A8287587o246364j1202981k744743R255360J0615915J110981o669536n502409
893F903810j873872l725325q112294p294058j559985K159007J975833K791592
885h735292O244560P116688K247949l831561n847945m708532l397231j276978
$$ plain form
877 -12188342 -9844072 -6146409 -5904937 -8367440 -5760148 5842207 18331990 19987528
869 19987528 10272124 401257 -1023123 2533787 2571198 -2472217 -6537138 -5301772 -1402059
860 -1402059 574139 593444 1954769 5351130 7400804 5222448 52473 -4427548 -5578240
851 -5578240 -2869754 2795365 9625298 15785232 20327301 22446098 20378013 13428159
843 13428159 4898034 -580938 -3397854 -8271042 -15241888 -16651189 -7713259 4141842
835 4141842 7131317 496377 -4904668 -1728531 4391450 2889885 -8308467 -20220472
827 -20220472 -22185180 -12784621 -1851063 -274575 -6980851 -9729330 -1534191 9222340
819 9222340 11204827 7206954 8658940 15866839 16724715 6895238 -1794684 878887 8330215
$$ packed form
877a2188342K344270L697663K41472k462503K607292J1602355J2489783J655538
869A9987528r715404r870867j424380L556910L7411n043415m064921J235366L899713
860a402059J976198J9305J361325L396361K049674k178356n169975m480021j150692
851e578240K708486N665119O829933O159934M542069K118797k068085o949854
843A3428159q530125n478972k816916m873188o970846j409301Q937930J1855101
835D141842K989475o634940n401045L176137O119981j501565j1198352j1912005
827b0220472j964708R400559J0933558J576488o706276k748479Q195139J0756531
819I222340J982487l997873J451986P207899Q57876r829477q689922K673571P451328
$$ plain form
810 8330215 8319270 1037825 -3996523 -3799775 -4256528 -8730044 -13380943 -13843072 -9965661
801 -9965661 -3866338 1615851 3044632 -461047 -4873469 -5781943 -3774265 -1821525 108052
792 108052 3475347 6814999 7736770 6941442 5698377 2276377 -4028386 -8640640 -7498928
783 -7498928 -4102813 -4462653 -8095983 -10765620 -12554092 -15253733 -15459847 -9914774 -4594627
774 -4594627 -7181453 -12573500 -8894971 2453772 7373909 1869982 -1387997 4992750
766 4992750 10040507 2906544 -8739408 -11140844 -5274892 -1902666 -3188853 -3166549 -1780569
757 -1780569 -4538442 -10214173 -11750973 -9160188 -9930580 -15664138 -18716986 -14106803 -6094863
748 -6094863 -1091453 -1475666 -7333144 -16586544 -22576952 -19612259 -12217157 -10886618 -17265719
$$ packed form
810H330215j0945p281445n034348J96748m56753m473516m650899m62129L877411
801i965661O099323N482189J428781l505679m412422r08474K007678J952740J929577
792A08052L367295L339652R21771p95328j243065l422000o304763m612254J141712
783g498928L396115l59840l633330k669637j788472k699641k06114N545073N320147
774d594627k586826n392047L678529J1348743M920137n503927l257979O380747
766D992750N047757p133963j1645952k401436N865952L372226j286187K2304J385980
757a780569k757873n675731j536800K590785p70392n733558l052848M610183Q011940
748f094863N003410l84213n857478r253400n990408K964693P395102J330539o379101
$$ plain form
739 -17265719 -21839057 -17983259 -9322032 -617263 8862340 18418671 21720750 15934809
731 15934809 7676354 3469360 996207 -3582264 -6418519 -2283604 5143114 8026883
723 8026883 5997558 4809597 5992117 5949616 3853150 2764621 3476530 3860041 3763147
714 3763147 4478601 4285384 771363 -3289383 -2738934 2110466 6805340 10662173 16000792
705 16000792 20598229 19701144 15702607 16141116 20300862 18021572 5805096 -5725789
697 -5725789 -6537634 -909974 879319 -2487055 -5055951 -4793441 -4223927 -3547795 -1582374
688 -1582374 -874181 -3795242 -6023398 -2489900 2104110 -1643273 -12493231 -18293770
680 -18293770 -12977537 -4592180 -2799737 -6501831 -8749290 -7221015 -4092418 -472529
$$ packed form
739a7265719m573338L855798Q661227Q704769R479603R556331L302079n785941
731A5934809q258455m206994k473153m578471k836255M134915P426718K883769
723H026883k029325j187961J182520m2501k096466j088529P11909L83511r6894
714C763147P15454j93217l514021m060746N50449M849400M694874L856833N338619
705A6000792M597437q97085l998537M38509M159746k279290j2216476j1530885
697e725789q11845N627660J789293l366374k568896K62510N69514O76132J965421
688a582374P08193k921061k228156L533498M594010l747383j0849958n800539
680a8293770N316233Q385357J792443l702094k247459J528275L128597L619889
$$ plain form
672 -472529 3248994 4982783 3985238 3613604 6677223 10762005 12360151 12612258 14066678
663 14066678 14545973 10319905 4058639 3163574 9469117 16075309 16402639 12352051 10966658
654 10966658 15628808 23122088 28132038 28420019 25385154 20723205 14032251 4963172
646 4963172 -3148761 -5013598 -82568 5453251 5832837 2353990 -222686 -1235095 -3514283
637 -3514283 -6773971 -7178407 -3985766 -1655512 -3658398 -8041694 -10968908 -11310343 -9809080
628 -9809080 -6931307 -4004110 -3767516 -6889509 -9750296 -8445856 -3774464 155628 1117303
619 1117303 -83056 -2932645 -8549385 -16757369 -23906934 -25504516 -20832466 -13733740
611 -13733740 -8264192 -4494310 -25462 4927838 6858458 4505007 1879327 2796921
$$ packed form
672d72529L721523J733789r97545l71634L063619M084782J598146K52107J454420
663A4066678M79295m226068o261266q95065O305543O606192L27330m050588j385393
654A0966658M662150P493280N009950K87981l034865m661949o690954r069079
646D963172q111933j864837M931030N535819L79586l478847k576676j012409k279188
637c514283l259688m04436L192641K330254k002886m383296k927214l41435J501263
628i809080K877773K927197K36594l121993k860787J304440M671392L930092R61675
619A117303j200359k849589n616740q207984p149565j597582M672050P098726
611a3733740N469548L769882M468848M953300J930620k353451k625680R17594
$$ plain form
603 2796921 4945589 3633965 -350388 -2073875 -1040978 -2003785 -6007902 -7423784 -3198460
594 -3198460 1133891 -287751 -4411417 -4523664 -1047459 147568 -1680219 -998565 4241243
585 4241243 8786928 8096149 4450381 2280231 2110124 2525356 4252966 7945681 10162197
576 10162197 6270459 -2547444 -8629099 -5725493 3722850 10600461 8582491 893191
568 893191 -3298238 983439 9684539 15480878 15677518 12247088 6764624 -432044 -6991700
559 -6991700 -9155144 -6461389 -2389528 407199 2246715 3434638 3177006 2581243 4571091
550 4571091 9014047 11936307 11676592 11565430 13746636 14852671 11736762 7367021 6108966
541 6108966 6611103 5029297 2476442 2650831 3751429 27893 -8750801 -16443415 -19866215
$$ packed form
603B796921K148668j311624l984353j723487J032897r62807m004117j415882M225324
594c198460M332351j421642m123666j12247L476205J195027j827787O81654N239808
585D241243M545685o90779l645768k170150j70107M15232J727610L692715K216516
576A0162197l891738q817903o081655K903606R448343O877611k017970p689300
568H93191m191429M281677Q701100N796339J96640l430430n482464p196668o559656
559f991700k163444K693755M071861K796727J839516J187923k57632n95763J989848
550D571091M442956K922260k59715j11162K181206J106035l115909m369741j258055
541F108966N02137j581806k552855J74389J100598l723536q778694p692614l422800
$$ plain form
532 -19866215 -21799402 -23140438 -20051618 -12649877 -8761161 -12717194 -16557684 -10577570
524 -10577570 1105649 4691537 -4468744 -16006989 -19065213 -14914187 -11696720 -13133413
516 -13133413 -17556823 -23490288 -29774492 -32073248 -25601042 -12327789 -1286050 154561
508 154561 -6761404 -14837072 -18480164 -17411718 -14525673 -12104420 -10413840 -9163008 -9173337
499 -9173337 -11400852 -14391376 -14733629 -11388756 -7747275 -7052992 -7262994 -3972726 1877835
490 1877835 3478941 -2993611 -12285743 -15438210 -9344198 1170023 8881150 9456408
482 9456408 3241031 -4889227 -8281278 -4258651 2838835 6445930 4848066 1080507
474 1080507 -2789834 -7142839 -10706814 -9893208 -4364048 342896 -1188130 -7555104 -12455834
$$ packed form
532a9866215j933187j341036L088820P401741L888716l956033l840490N980114
524a0577570J1683219L585888r160281j1538245l058224M151026L217467j436693
516a3133413m423410n933465o284204k298756O472206J3273253J1041739J440611
508A54561o915965q075668l643092J068446K886045K421253J690580J250832j0329
499i173337k227515k990524l42253L344873L641481O94283k10002L290268N850561
490A877835J601106o472552r292132l152467O094012J0514221P711127N75258
482I456408o215377q130258l392051M022627P097486L607095j597864l767559
474A080507l870341m353005l563975Q13606N529160M706944j531026o366974m900730
$$ plain form
465 -12455834 -12128355 -8644735 -6337340 -6708752 -7196076 -4761144 -692614 -348144 -6195502
456 -6195502 -12833316 -12960088 -7598207 -4824439 -7361885 -8075119 -1371150 7257997 9139535
447 9139535 5158549 3065853 4777454 4659927 86171 -4294735 -4464796 -2619526 -2440747
438 -2440747 -4064776 -5990932 -7254811 -5884279 -417379 4848687 2050371 -9038117
430 -9038117 -17393190 -13551887 -2226450 3413852 -2313041 -12607242 -17804251 -15215176
422 -15215176 -9537326 -6877543 -8542557 -9274039 -3041851 8290388 15244251 11883733
414 11883733 2898942 -3653358 -6276460 -7899463 -8163178 -4758211 38787 1521804
406 1521804 166917 100432 789891 -2106224 -7579499 -9321179 -6509485 -6165070 -11513292
$$ packed form
465a2455834L27479L483620K307395l71412m87324K434932M068530L44470n847358
456f195502o637814j26772N361881K773768k537446p13234O703969Q629147J881538
447I139535l980986k092696J711601j17527m573756m380906j70061J845270J78779
438b440747j624029j926156j263879J370532N466900N266066k798316j1088488
430i038117q355073L841303J1325437N640302n726893j0294201n197009K589075
422a5215176N677850K659783j665014p31482O232188J1332239O953863l360518
414A1883733q984791o552300k623102j623003k63715L404967M796998J483017
406A521804j354887o6485O89459k896115n473275j741680K811694L44415n348222
$$ plain form
397 -11513292 -15816292 -12502079 -4808243 52922 704254 -99701 -1801867 -4171136 -3367080
388 -3367080 2866179 8878913 7299247 20995 -3871955 -394169 5692211 9192199
380 9192199 9751034 8274324 4734820 1300993 1776643 5612845 7670651 6284871 6114090
371 6114090 9653184 11334272 5268422 -4859558 -9569726 -5609905 1120466 3977658
363 3977658 1835047 -3249964 -9466937 -14408679 -14814972 -10197849 -4475910 -1323901 353423
354 353423 3526453 7220090 7474852 3956665 1303940 2235423 3242309 544042 -2573745
345 -2573745 532196 9473876 15593640 12848734 5611246 2586994 5934657 9978016
337 9978016 9024090 2957994 -4200092 -8173543 -6973043 -2238889 1568019 1187336 -1940274
$$ packed form
397a1513292m303000L314213P693836M861165O51332q03955j702166k369269Q04056
388c367080O233259O012734j579666p278252l892950L477786O086380L499988
380I192199N58835j476710l539504l433827M75650L836202K057806j385780j70781
371F114090L539094J681088o065850j0127980m710168L959821O730371K857192
363C977658k142611n085011o216973m941742m06293M617123N721939L152009J677324
354C53423L173030L693637K54762l518187k652725R31483J006886k698267l117787
345b573745L105941Q941680O119764k744906p237488l024252L347663M043359
337I978016r53926o066096p158086l973451J200500M734154L806908l80683l127610
$$ plain form
328 -1940274 -3434672 -934778 3954958 7967866 8844253 6383575 2590246 384915 831067
319 831067 2261084 3007598 3345340 3485150 2280060 328000 1364291 6671275 10619514
310 10619514 6928690 -1966784 -7318162 -5348035 -518587 2401426 3159665 1815320
302 1815320 -3511279 -11729105 -17321681 -17445963 -15805195 -15997828 -15792888 -12121309 -7279608
293 -7279608 -5341305 -6041275 -7012739 -8571968 -11017067 -10433374 -3340629 6461009 11520478
284 11520478 9837891 5159375 163300 -4638128 -6934201 -4637381 -1388561 -2845430
276 -2845430 -7072484 -6021214 1981255 8768135 8213245 4507215 4365629 7103237 7803340
267 7803340 5720458 3742582 2566049 863351 -724228 -556859 482912 548126 421650
$$ packed form
328a940274j494398K499894M889736M012908Q76387k460678l793329k205331M46152
319H31067J430017P46514L37742J39810j205090j952060J036291N306984L948239
310A0619514l690824q895474n351378J970127M829448K920013P58239j344345
302A815320n326599q217826n592576j24282J640768j92633K04940L671579M841701
293g279608J938303o99970r71464j559229k445099N83693P092745R801638N059469
284A1520478j682587m678516m996075m801428k296073K296820L248820j456869
276b845430m227054J051270Q002469O786880n54890l706030j41586K737608P00103
267G803340k082882j977876j176533j702698j587579J67369J039771O5214j26476
$$ plain form
258 421650 1641678 2692343 1375952 -366178 1194820 4880188 5036977 -834368 -8921789
249 -8921789 -14181619 -14791125 -10942398 -3550633 3940465 6167921 1226201 -6428579 -10525881
240 -10525881 -8986743 -4194368 468228 2500728 883639 -2631565 -4130861 -1788780
232 -1788780 1555800 2307470 1255742 1771103 3759955 3483171 96689 -1688020 2137119
223 2137119 8950736 13048614 13142014 12513580 12628334 11078821 6781506 3068622 3076197
214 3076197 5004123 5253925 4367356 5871797 9760133 11473313 8815761 6321011 9574693
205 9574693 16826569 19982363 14597407 5985142 3100860 7729192 12876783 12215006 7540701
196 7540701 4318423 2883413 -865849 -6858436 -9237150 -5455046 -1239276 -2254456
$$ packed form
258D21650J220028J050665j316391j742130J560998L685368J56789n871345q087421
249h921789n259830o09506L848727P391765P491098K227456m941720p654780m097302
240a0525881J539138M792375M662596K032500j617089l515204j499296K342081
232a788780L344580P51670j051728N15361J988852k76784l386482j784709L825139
223B137119O813617M097878R3400o28434J14754j549513m297315l712884P575
214C076197J927926K49802q86569J504441L888336J713180k657552k494750L253682
205I574693P251876L155794n384956q612265k884282M628332N147591o61777m674305
196G540701l222278j435010l749262n992587k378714L782104M215770j015180
$$ plain form
188 -2254456 -5490921 -4699710 -861825 4285 -2325430 -1903195 2495477 4485157 729152
179 729152 -3260219 -2396340 -290775 -2322628 -6019596 -5667037 -2700489 -3342502 -7571142
170 -7571142 -8627659 -3809800 1747517 3725828 4243789 5943514 6535184 3624672 433780
161 433780 1374447 4527199 3985204 -1139876 -5188632 -4280182 -1871989 -3618687 -9469419
152 -9469419 -14137639 -14376280 -12319670 -11008762 -9901358 -7233676 -4538520 -4924027 -7262560
143 -7262560 -6271496 215610 7493299 9772545 7009660 3247814 488650 -2235314 -4870197
134 -4870197 -5145673 -1771431 3371946 6571706 4912780 -1370179 -7953250 -9531925 -5497763
125 -5497763 -488273 2347577 5294740 10249448 12853945 7833238 -2149284 -8950384
$$ packed form
188b254456l236465P91211L837885Q66110k329715M22235M398672J989680l756005
179G29152l989371Q63879K105565k031853l696968L52559K966548o42013m228640
170g571142j056517M817859N557317J978311N17961J699725N91670k910512l190892
161D33780R40667L152752n41995n125080m048756R08450K408193j746698n850732
152i469419m668220k38641K056610J310908J107404K667682K695156l85507k338533
143g262560R91064O487106P277689K279246k762885l761846k759164k723964k634883
134d870197k75476L374242N143377L199760j658926o282959o583071j578675M034162
125e497763N009490K835850K947163M954708K604497n020707r982522o801100
$$ plain form
117 -8950384 -9158289 -6157787 -3109112 -369591 502270 -2581188 -6716193 -6264800 -2028635
108 -2028635 -849710 -4220654 -5554053 -2080263 -622517 -5991315 -11820056 -10361508
100 -10361508 -4509369 -1428230 120748 6136757 14834968 18403956 15908855 14285722
92 14285722 16241863 16687913 12724785 8321344 6323531 3719355 -1410426 -4891508 -2772197
83 -2772197 2352050 5263152 4357537 812860 -4427197 -9523300 -11085376 -7869718 -2559807
74 -2559807 2111508 5878590 8132476 6888755 2916306 653714 2141683 3959235 3048542
65 3048542 1451470 1985826 3343134 3174453 2062347 570199 -3344025 -9410125 -12056695
56 -12056695 -8139828 -3668552 -5858093 -11476495 -11085224 -3463819 2621958 1499642 -2617790
$$ packed form
117h950384k07905L000502L048675K739521Q71861l083458m135005M51393M236165
108b028635J178925l370944j333399L473790J457746n368798n828741J458548
100a0361508N852139L081139J548978O016009Q698211L568988k495101j623133
92A4285722J956141M46050l963128m403441j997813k604176n129781l481082K119311
83b772197N124247K911102r05615l544677n240057n096103j562076L215658N309911
74b559807M671315L767082K253886j243721l972449k262592J487969J817552r10693
65C048542j597072N34356J357308j68681j112106j492148l914224o066100k646570
56a2056695L916867M471276k189541n618402L91271P621405O085777j122316m117432
$$ plain form
47 -2617790 -4011422 -3452935 -4283551 -6124080 -6776860 -6649190 -7305430 -8014047 -6986659
38 -6986659 -4530691 -2656622 -2601414 -3908749 -4784321 -3244703 256450 2085723 396583
29 396583 -242533 5828183 15503222 18858748 12936804 6870927 9157365 15794250 16937879
20 16937879 10848009 4352476 2205163 3049329 4752731 6982186 8374431 7036425 4400751
11 4400751 3406182 2713933 -1462213 -7201620 -7313501 -236148 5984785 4489067 -1224472
2 -1224472 -3904849 -3598580
0 -3598580
$$ packed form
47b617790j393632N58487q30616j840529o52780J27670o56240p08617J027388
38f986659K455968J874069N5208j307335q75572J539618L501153J829273j689140
29C96583o39116O070716R675039L355526n921944o065877K286438O636885J143629
20A6937879o089870o495533k147313Q44166J703402K229455J392245j338006k635674
11D400751r94569o92249m176146n739407j11881P077353O220933j495718n713539
2a224472k680377L06269
0c598580
##END NTUPLES=NMR SPECTRUM
##END=
