##TITLE=31Pdec_LR-621-C2
 CDCl3, 84 sc
 25.9.2019
##JCAMPDX= 6.0         $$ Bruker NMR JCAMP-DX V2.0
##DATA TYPE= NMR SPECTRUM
##DATA CLASS= NTUPLES
##ORIGIN= UXNMR, Bruker Analytische Messtechnik GmbH
##OWNER= root
$$ XWIN-NMR		Version 3.5
$$ Wed Sep 25 14:32:11 2019 Russian Standard Time (UT+4h)  she@DPX200
##.OBSERVE FREQUENCY= 81.013821
##.OBSERVE NUCLEUS= ^31P
##.ACQUISITION MODE= SIMULTANEOUS
##.ACQUISITION SCHEME= undefined
##.AVERAGES= 84
##.DIGITISER RES= 17
##SPECTROMETER/DATA SYSTEM= spect
##.PULSE SEQUENCE= zgpg30
##.SOLVENT NAME= CDCl3
##.SHIFT REFERENCE= (INTERNAL, CDCl3, 0, 182.463)
##AUDIT TRAIL= $$ (NUMBER, WHEN, WHO, WHERE, WHAT)
$$ ##TITLE= Audit trail, XWIN-NMR		Version 3.5
$$ ##JCAMPDX= 5.01
$$ ##ORIGIN= Bruker BioSpin GmbH
$$ ##OWNER= she
$$ F:/spectra/data/she/nmr/P31/1/pdata/1/auditp.txt
$$ ##AUDIT TRAIL=  $$ (NUMBER, WHEN, WHO, WHERE, WHAT)
(   1,<2019-09-25 14:30:10.21 +0400>,<she>,<DPX200>,
      <continue with go, POWCHK disabled, PULCHK disabled
       configuration hash MD5:
       00 E9 B6 7A A2 85 ED C7 34 08 36 98 17 FE 4E 26
       data hash MD5: 32K
       5F D6 AB BC D3 21 D0 BA 2A DF C3 8C 71 50 38 6A>)
(   2,<2019-09-25 14:31:01.62 +0400>,<she>,<DPX200>,
      <Start of raw data processing
       efp BC_mod = 2 LB = 1 FT_mod = 6 PKNL = 1 PHC0 = -278.3431 PHC1 = -159.5996 SI = 64K 
       data hash MD5: 64K
       D2 2F 81 95 34 9D E4 CF D0 D3 A8 CC 3F 64 AD A2>)
(   3,<2019-09-25 14:31:29.35 +0400>,<she>,<DPX200>,
      <pk PHC0 = 23.08694 PHC1 = -43.59997 
       data hash MD5: 64K
       17 86 0B B1 C6 BA 8A 8A D4 71 02 CE 82 CF 11 21>)
(   4,<2019-09-25 14:31:40.45 +0400>,<she>,<DPX200>,
      <abs ABSG = 5 
       data hash MD5: 64K
       40 9A 2C 06 14 C3 E3 AC B3 96 33 15 52 98 A0 1E>)
$$ ##END=
$$ 
$$ hash MD5
$$ EC 81 A4 98 48 7D 3F 1D D3 02 FF 89 60 8B 46 F9
##$RELAX= 
##$RELAX= 
##$RELAX= 
##$RELAX= 
##$RELAX= 
##$RELAX= 
##$RELAX= 
##$RELAX= 
$$ Bruker specific parameters
$$ --------------------------
##$DU= <F:/spectra>
##$EXPNO= 1
##$NAME= <P31>
##$PROCNO= 1
##$TYPE= <nmr>
##$USER= <she>
##$AMP= (0..31)
100 100 100 100 100 100 100 100 100 100 100 100 100 100 100 100 100 100 
100 100 100 100 100 100 100 100 100 100 100 100 100 100 
##$AQSEQ= 0
##$AQ_mod= 1
##$AUNM= <au_zg>
##$AUTOPOS= <>
##$BF1= 81.014009
##$BF2= 200.13
##$BF3= 200.13
##$BF4= 200.13
##$BF5= 200.13
##$BF6= 200.13
##$BF7= 200.13
##$BF8= 200.13
##$BYTORDA= 1
##$CFDGTYP= 0
##$CFRGTYP= 5
##$CHEMSTR= <none>
##$CNST= (0..31)
1 1 145 1 1 1 1 1 1 1 1 1 1 1 1 1 1 1 1 1 1 1 1 1 1 1 1 1 1 1 1 1 
##$CPDPRG= <waltz16>
##$CPDPRG1= <>
##$CPDPRG2= <waltz16>
##$CPDPRG3= <>
##$CPDPRG4= <mlev>
##$CPDPRG5= <mlev>
##$CPDPRG6= <mlev>
##$CPDPRG7= <mlev>
##$CPDPRG8= <mlev>
##$CPDPRGB= <>
##$CPDPRGT= <>
##$D= (0..31)
0 1 0 0 0 0 0 0 0 0 0 0.03 2e-05 3e-06 0 0 0 0 0 0 0 0 0 0 0 0 0 0 0 0 
0 0 
##$DATE= 1569407256
##$DBL= (0..7)
120 120 120 11 120 120 24 19 
##$DBP= (0..7)
150 150 150 150 150 150 150 150 
##$DBP07= 0
##$DBPNAM0= <>
##$DBPNAM1= <>
$$ [...]
##$SUBNAM3= <"">
##$SUBNAM4= <"">
##$SUBNAM5= <"">
##$SUBNAM6= <"">
##$SUBNAM7= <"">
##$SUBNAM8= <"">
##$SUBNAM9= <"">
##$SW= 369.568048894756
##$SWIBOX= (0..15)
0 1 3 0 0 0 0 0 0 0 0 0 0 0 0 0 
##$SW_h= 29940.119760479
##$TD= 32768
##$TD0= 1
##$TE= 0
##$TE2= 300
##$TE3= 300
##$TEG= 300
##$TL= (0..7)
0 120 53 12 22 120 120 120 
##$TP= (0..7)
150 150 150 150 150 150 150 150 
##$TP07= 0
##$TPNAME0= <>
##$TPNAME1= <>
##$TPNAME2= <>
##$TPNAME3= <>
##$TPNAME4= <>
##$TPNAME5= <>
##$TPNAME6= <>
##$TPNAME7= <>
##$TPOAL= (0..7)
0.5 0.5 0.5 0.5 0.5 0.5 0.5 0.5 
##$TPOFFS= (0..7)
0 0 0 0 0 0 0 0 
##$TUNHIN= 0
##$TUNHOUT= 0
##$TUNXOUT= 0
##$USERA1= <user>
##$USERA2= <user>
##$USERA3= <user>
##$USERA4= <user>
##$USERA5= <user>
##$V9= 5
##$VALIST= <valist>
##$VCLIST= <CCCCCCCCCCCCCCC>
##$VD= 0
##$VDLIST= <DDDDDDDDDDDDDDD>
##$VPLIST= <PPPPPPPPPPPPPPP>
##$VTLIST= <TTTTTTTTTTTTTTT>
##$WBST= 1024
##$WBSW= 4
##$XGAIN= (0..3)
0 0 0 0 
##$XL= 0
##$YL= 0
##$YMAX_a= 9435
##$YMIN_a= -14275
##$ZGOPTNS= <>
##$ZL1= 120
##$ZL2= 120
##$ZL3= 120
##$ZL4= 120
##$ABSF1= 182.463
##$ABSF2= -187.1042
##$ABSG= 5
##$ABSL= 3
##$ALPHA= 0
##$AQORDER= 0
##$ASSFAC= 0
##$ASSFACI= 0
##$ASSFACX= 0
##$ASSWID= 0
##$AUNMP= <proc_1d>
##$AZFE= 0.1
##$AZFW= 0.5
##$BCFW= 0
##$BC_mod= 2
##$BYTORDP= 0
##$COROFFS= 0
##$CY= -3
##$DATMOD= 1
##$DC= 0
##$DFILT= <>
##$DTYPP= 0
##$F1P= 0
##$F2P= 0
##$FCOR= 1
##$FTSIZE= 65536
##$FT_mod= 6
##$GAMMA= 0
##$GB= 0
##$INTBC= 1
##$INTSCL= 5.30512e-09
##$ISEN= 30
##$LB= 1
##$LEV0= 0
##$LPBIN= 0
##$MAXI= 10000
##$MC2= 0
##$MEAN= 0
##$ME_mod= 0
##$MI= 50
##$NCOEF= 0
##$NC_proc= -8
##$NLEV= 6
##$NOISF1= 182.463
##$NOISF2= 159.3651
##$NSP= 0
##$NTH_PI= 0
##$NZP= 0
##$OFFSET= 182.463
##$PC= 4
##$PHC0= -255.2562
##$PHC1= -203.1996
##$PH_mod= 1
##$PKNL= yes
##$PPARMOD= 0
##$PSCAL= 0
##$PSIGN= 0
##$REVERSE= no
##$SF= 81.0140089999434
##$SI= 65536
##$SIGF1= 159.3651
##$SIGF2= -187.1042
##$SINO= 113.3802
##$SIOLD= 16384
##$SREGLST= <1H.CDCl3>
##$SSB= 0
##$STSI= 65536
##$STSR= 0
##$SW_p= 29940.119760479
##$SYMM= 0
##$S_DEV= 0
##$TDeff= 32768
##$TDoff= 0
##$TI= <>
##$TILT= no
##$TM1= 0
##$TM2= 0
##$TOPLEV= 0
##$USERP1= <user>
##$USERP2= <user>
##$USERP3= <user>
##$USERP4= <user>
##$USERP5= <user>
##$WDW= 1
##$XDIM= 65536
##$YMAX_p= 421654289
##$YMIN_p= -63947656
$$ End of Bruker specific parameters
$$ ---------------------------------
##NTUPLES= NMR SPECTRUM
##VAR_NAME=  FREQUENCY,     SPECTRUM/REAL,   SPECTRUM/IMAG
##SYMBOL=    X,             R,               I
##VAR_TYPE=  INDEPENDENT,   DEPENDENT,       DEPENDENT
##VAR_FORM=  AFFN,          ASDF,            ASDF
##VAR_DIM=   65536,         65536,           65536
##UNITS=     HZ,            ARBITRARY UNITS, ARBITRARY UNITS
##FACTOR=    0.456856943014862, 1,           1
##FIRST=     14782.0589164792, 0,            0
##LAST=      -15158.0608439998, 0,           0
##MIN=       -15158.0608439998, -63947656,   0
##MAX=       14782.0589164792, 421654289,    0
$$ Real data points
##PAGE= N=1
##DATA TABLE= (X++(R..R)), XYDATA
$$ [...]
##PAGE= N=2
##DATA TABLE= (X++(I..I)), XYDATA
4877a2589284r90335J5982480J5474270J09290r805099m615398K945877n80031
4869E931770q378850n128681P932432J3920097M988745p146470q699199j147972
4861B271872M940985N425022M047965L192243J528781o18040n21247K110905M422492
4852B6800978M447224J979695l269079r738678j1970870o475666J520089L985109
4844G278802J806770K332161N504889L220655n059762q194632j124902M775322
4836A0539303j175005j1080564r931126J898156J0845183J0321343N144665j061866
4828A5500089q471038j2211808n930070M648504O308269j013899l080837M974635
4820G23845R619297J324636q623844n116430P879422J3881410O426263n974652
$$ y = [-12589284, -13579619, 2402861, 17877131, 17986421, 8181322, 3565924, 6511801, 5931770, -2447080, -7575761, 356671, 14276768, 19265513, 12119043, 3419844, 2271872, 7212857, 12637879, 16685844, 19878087, 21406868, 20788828, 20267581, 22378486, 26800978, 31248202, 33227897, 29958818, 20220140, 8249270, 1773604, 3293693, 7278802, 9085572, 11417733, 16922622, 20143277, 15083515, 6888883, 5763981, 10539303, 9364298, -1716266, -11647392, -9749236, 1095947, 11417290, 16561955, 15500089, 7029051, -5182757, -11112827, -6464323, -156054, -1169953, -4250790, 723845, 10343142, 11667778, 3043934, -2072496, 5806926, 19688336, 26114599, 20139947]
4812B0139947j2766306j0559314l370150L61454l860258p692836J321694J7865887
4804A440118J9500311j525447k1866155j7215239L682018J3524949N385800m105705
4796a179350m821144l206821k780744K760477J2476740J3890630K865029q193430
4788A1811387r080910m748791k955995k461344o12469k32741j745814L2930M781673
4779e212074M372810j795065k360739O899297J2953321N078864p493668r524756
4771B917990j150238O996023J0834597J2089324Q641745o16857p663200n492497
4763B6556887q03381l243127p798299l144412O706578O481384n038612j1167469
4755H549549k744106P731742M842158q082860j5250010r777310L36187N596426
$$ y = [20139947, 7373641, -3185673, -6555823, -6194369, -10054627, -17747463, -16425769, 1440118, 20940429, 19414982, -2451173, -19666412, -15984394, -2459445, 2926355, -1179350, -6000494, -9207315, -11988059, -9227582, 3249158, 17139788, 20004817, 11811387, 2730477, -2018314, -4974309, -7435653, -8048122, -8280863, -10026677, -9993747, -5212074, -839264, -2634329, -4995068, 1904229, 14857550, 19936414, 12442746, 2917990, 1767752, 8763775, 19598372, 31687696, 40329441, 39712584, 32049384, 26556887, 25753506, 22510379, 14712080, 11567668, 18274246, 24755630, 19717018, 8549549, 5805443, 13537185, 18379343, 10296483, -4953527, -14730837, -14394650, -8798224]
4747h798224O762020J0427132J6261878J4698125P80595j4487069j5407786l165089
4739G071582M985277K51819o815671n656933j987092m593105q578236n410192
4731b0732551N28645M96862j932939J484955O883768N761682K059500L686881
4723a763197M102964o756770j9012092j4321335K244541Q015364K54834o97106
4715b7932797J0294904J2478796l034781j4939806p311661L692361p89498j0103838
4707c7646320n344561O972468R218782N247225J0184276J8237922J0231135j1352911
4699E748016k2640931j3662761P44003O841654O897586N586190J923686j158874
4691i721431K642493Q900418N901371m333384o058150M603220J1999738N664922
$$ y = [-8798224, -2036204, 8390928, 24652806, 39350931, 40131526, 25644457, 10236671, 7071582, 12056859, 12308678, 5493007, -163926, -2151018, -6744123, -15322359, -20732551, -20203906, -19707044, -21639983, -20155028, -13271260, -7509578, -5450078, -1763197, 2339767, -4417003, -23429095, -37750430, -35505889, -27490525, -27235691, -27932797, -17637893, -5159097, -8193878, -23133684, -30445345, -26752984, -27542482, -37646320, -42990881, -36018413, -26799631, -21552406, -11368130, 6869792, 17100927, 5748016, -16892915, -30555676, -29811673, -22970019, -16072433, -10486243, -8562557, -9721431, -7078938, 1821480, 7722851, 3389467, -2668683, 1934537, 13934275, 19599197]
4683A9599197m288594n240361l31176J354772k64861j588690m181832p933112
4675b874657n778043M095083J0344542M101738n933069o052182J877990N238465
4667E019867P65835l760884n054601p588899j1104649q124021K412984J0025511
4659a7408857P170178O18183R66671O370142N737817l503413j0189094n061459
4651a5299832N513383Q143672J249149l109790L013805J1885694J0739017j436063
4643B0699035j3505699j5742155q641880J57704L594440Q49628k077589Q78286
4635a3788230P497140R685270N303429J045196J024289R40300j817461k078284
4627G811649J953634J980936n894530j0437306k084758R153397Q340703k65962
$$ y = [19599197, 15310603, 10070242, 9739066, 11093838, 10828977, 9240287, 5058455, -2874657, -8652700, -4557617, 5786925, 9888663, 3955594, -2096588, -218598, 5019867, 5785702, 2024818, -3029783, -10618682, -21723331, -29847352, -27434368, -17408857, -10238679, -9620496, -8653825, -2283683, 3454134, -49279, -10238373, -15299832, -9786449, -1642777, -393628, -3503418, -489613, 11396081, 22135098, 20699035, 7193336, -8548819, -17190699, -17032995, -13438555, -12588927, -14666516, -13788230, -6291090, 3394180, 8697609, 9742805, 10767094, 11707394, 9889933, 7811649, 9765283, 11746219, 5851689, -4585617, -6670375, 2483022, 10823725, 10557763]
4619A0557763j952444K770712K445631m14788O705128J8383462J3933813p627309
4611D4801968k1444532j4235140l072854m957888j1078270o928573K467786N214036
4603i233467L396068L598081J818776m579042m689808P524011J6862609R213899
4595B3911127k962696O1284J1815781J0318813n554743j6213029j4009687j0441392
4587c074542j1036690p053448M599528J3840785J4203877J0014517L909141o448230
4579A8954938j6883530j8072343j0818125n073104k907855J876069P545770N909289
4571a9468891L82335K781512J0369023P691886m903230q071188L864399J1112522
4563C758368J033270j0342695n356579O823018P850940j33233l379866k324284
$$ y = [10557763, 8605319, 11376031, 13821662, 13406874, 20112002, 38495464, 52429277, 44801968, 23357436, 9122296, 6049442, 1091554, -9986716, -16915289, -14447503, -9233467, -5837399, -2239318, -420542, -4999584, -9689392, -2165381, 14697228, 23911127, 20948431, 21009715, 32825496, 43144309, 37589566, 21376537, 7366850, -3074542, -14111232, -21164680, -16565152, -2724367, 11479510, 21494027, 25403168, 18954938, 2071408, -16000935, -26819060, -31892164, -34800019, -32923950, -25378180, -19468891, -19086556, -16305044, -5936021, 1755865, -3147365, -11218553, -7354154, 3758368, 4791638, -5551057, -10907636, -4084618, 3766322, 3633089, 253223, -2071061]
4555b071061o470240j2164817p730699L547423O472884r87817m613988K498286
4547b1520029J0167212Q789286K419240j291489k585259m398911m345953Q19968
4539a1945935P745591R832296O036552J912512K105249M503515L309982k577893
4531B0921869p024703n050359r75545k450493p763162p420881M44578N850251
4523c468445K238696l558205l326806n94566k412737n127967j38763R779849J2240680
4514E631736L438010o209885p039340j837012J400976J158791J085326J539182
4506h32216n62666m143477k617832O810550J6425601J5742467M888127n512996
4498C0197558q426253p496043p435226n679615R6553L942887L35186n276128n101677
$$ y = [-2071061, -8541301, -20706118, -28436817, -24889394, -18416510, -19404327, -24018315, -21520029, -11352817, -2563531, -144291, -1435780, -4021039, -8419950, -12765903, -11945935, -4200344, 5631952, 11668504, 13581016, 15686265, 20189780, 23499762, 20921869, 13897166, 8846807, 7871262, 5420769, -2342393, -9763274, -9318696, -3468445, -1229749, -4787954, -8114760, -8709326, -11122063, -16250030, -16388793, -6608944, 5631736, 9069746, 2859861, -4179479, -6016491, -4615515, -3456724, -2371398, -832216, -1394882, -5538359, -8156191, -1345641, 15079960, 30822427, 35710554, 30197558, 21771305, 14275262, 6840036, 1160421, 1256974, 5199861, 5535047, 258919, -4842758]
4489d842758k375654l829781m748873K809906J1289581O223115p605198r801646
4481a2881308L188320J1397022L484234o613459n067855J437215L672061P169030
4473E785260J5065420J3440589n692729k3302877j8173436P604N982197k900465
4465i788437q273442l011967L114020N792249R870791J2496807N614728m926940
4457A0887809m630896M812162P153361j106897o409032k802163P15308L19425
4449H939077K965795P757966L700308q300705j2945804o663286l970792r628386
4441a8145827p910245Q537230K1749942J5733248R90562m953280l853438n644514
4433F503678p042536q75241O289750N561003L549781R183827J3359404L181675
$$ y = [-4842758, -7218412, -11048193, -15797066, -12987160, -1697579, 4525536, -3079662, -12881308, -9692988, 1704034, 5188268, -1425191, -6493046, -5055831, -1383770, 5785260, 20850680, 34291269, 28598540, 5295663, -12877773, -12870169, -6887972, -9788437, -18061879, -21073846, -17959826, -12167577, -2296786, 10200021, 15814749, 10887809, 6256913, 11069075, 18222436, 17115539, 10706507, 7904344, 8619652, 8939077, 11904872, 19662838, 23363146, 15062441, 2116637, -4546649, -8517441, -18145827, -26056072, -17518842, 4231100, 19964348, 20954910, 16001630, 12148192, 6503678, -538858, -1414099, 4875651, 10436654, 13986435, 23170262, 36529666, 39711341]
4425C9711341j2026551j2178811R74014O113559l948479j3422897j0650727l183634
4417h612185m77072K45727L385764N154510K534569L67154K172328L652866J338684
4408I762345j639346l578527p908508j3078062r716213L782785J2978612N869274
4400c527640p748487q356798N695644J6318938J1608851O14266k358992K373254
4392A4619036L784006k372212r252670j0144831n872894n07815L590853M753996
4384a402531J899327j992217j498963L195410N115647R11951l354366j903507
4376I70751J310417j7092l145704j654110J616686j886673j1103182j4944885
4368b8853792q457102Q55017M997481M266772J644674k050123m210846p17700
$$ y = [39711341, 27684790, 15505979, 16479993, 22593552, 18645073, 5222176, -5428551, -8612185, -9089257, -8843530, -5457766, -303256, 2231313, 2598467, 4770795, 8423661, 9762345, 8122999, 4544472, -3364036, -16442098, -26158311, -22375526, -9396914, -3527640, -11276127, -19632925, -13937281, 2381657, 13990508, 14604774, 12245782, 14619036, 18403042, 16030830, 6778160, -3366671, -9239565, -9747380, -6156527, -1402531, 496796, -1495421, -2994384, 201026, 5316673, 6228624, 2874258, 970751, 2281168, 2264076, -881628, -2535738, -919052, -2805725, -13908907, -28853792, -37310894, -36455877, -31458396, -27191624, -25546950, -27597073, -31807919, -32525619]
4360c2525619O292798R367612P174813N728376N904112J327505p259103q685825
4352a2675331M45668P033730Q45337q622999o539493M936082J1476740P371373
4344D271107o78892n829282o144288j391623N439945P521456L532502J863048
4336H583973O863864Q869579q89045j3620238j5026118p020439j968811j272579
4328a5479814K771173P987940M803624l556306l774688K990491L05963j4452654
4320a8404271k1022488o157555J5269023K1595677J2315715J388258m812240p870004
4312g697885n503355M037315J1318480N476148p423268j0088485J678054J3106795
4304D903799J1129887q9553q255472q542788m560819j07676L426813M184486J84781
$$ y = [-32525619, -26232821, -16865209, -9690396, -3962020, 1942092, 3269597, -3989506, -12675331, -12229663, -5195933, -4350596, -12973595, -19513088, -14577006, -3100266, 4271107, 3592215, -2237067, -8381355, -9772978, -4333033, 3188423, 6720925, 8583973, 15447837, 24317416, 23428371, 9808133, -5217985, -12238424, -14207235, -15479814, -12708641, -4720701, 82923, -3473383, -7248071, -4257580, -3951617, -18404271, -39426759, -45584314, -30315291, -8719614, 3596101, 4984359, 172119, -7697885, -13201240, -9163925, 2154555, 7630703, 207435, -9881050, -8202996, 4903799, 16033686, 15944133, 7688661, -854127, -5414946, -5522622, -2095809, 2088677, 2273458]
4295B273458o982717j1847296r811717j752854O521428R614567P407883M172192
4287d05056K907956K033829j274490o001512q021075n737766k178495j45725J932461
4278a6889873O120193R093160N933682M1571J333866J0156947J1430547n284624
4270B1935469k5639099k4645345m33651K1517314K1892932R883321L772389M158671
4262C2442001M92582o590046o971863l89695K477934k334951p235120o672558
4254E218284l567691r00362K266347M824935L459897k07121j175403j39217j931902
4245G847767n298334m387807k59370J72577l037894k997370K73347n58757m527223
4236a2773064q38330J1829352J8428755Q106133r654257j8375901j4897239p444930
$$ y = [2273458, -4709259, -16556555, -26368272, -28121126, -21599698, -11985131, -4577248, -405056, 2502900, 4536729, 3262239, -2739273, -10760348, -16498114, -18676609, -18822334, -16889873, -10769680, -1676520, 4257162, 4298733, 5632599, 15789546, 27220093, 21935469, -3703630, -28348975, -28782626, -7265312, 14627620, 24510941, 28283330, 32442001, 32934583, 26344537, 19372674, 18982979, 21460913, 19125962, 11890842, 5218284, 1650593, 750231, 3016578, 7841513, 11301410, 11094289, 9918886, 9779669, 7847767, 2549433, -1838374, -2097744, -1925167, -4963061, -7960431, -7687084, -8245841, -12773064, -13611394, -1782042, 16646713, 24752846, 15098589, -3277312, -18174551, -25619481]
4228b5619481j203089M651103J0195707J2910594J0456718K025289r247227j4557421
4220a0387807p490055M997500Q876820K244775k584803J018061M801282J640124
4212C115897k495269n72438L461362L802779L171335M735013M103853j012363
4204A8310169l672542k49985J005889m905858p861059O70624J0254184O566202
4196B0117624n646611j1410713q954787o525698l519293N128829J1332294K817734
4188C339379j2288438j2402643M400030J6012522R591028j560276k180139K590540
4180G502003Q8070q989493j4415862j1615060l652433M629828Q174546M759799
4172a3518602N20274L880250J1449295J0924979P89878o313021m333861k820066
$$ y = [-25619481, -26822570, -22171467, -11975760, 934834, 11391552, 13416841, 4169614, -10387807, -17877862, -12880362, -4003542, -1758767, -4343570, -3325509, 1475773, 3115897, 620628, 48190, 3509552, 7312331, 10483666, 15218679, 19322532, 18310169, 14637627, 14387642, 15393531, 10487673, 2626614, 3297238, 13551422, 20117624, 14471013, 3060300, -5894487, -12420185, -15939478, -10810649, 521645, 3339379, -8949059, -21351702, -16951672, -939150, 8651878, 7091602, 4911463, 7502003, 7590073, -1399420, -15815282, -27430342, -31082775, -26452947, -18278401, -13518602, -12998328, -9118078, 2331217, 13256196, 14046074, 7733053, 3399192, 579126]
4164E79126q100121j1443015o427521k484463p150469r042441L841121K0020525
4156b0207258J9137110L828538m275894K328796R175434O073984L51418j119781
4148A5292347l555832r001172o757430Q095483J9964102J1830911r317140k1350273
4140E200996j6208989n318360J407318N811259R198020N663999n373526j2280184
4132a1899467o481919L892626O093586K154944M056611J2620906J4858579M245137
4124B9541003q509014j0591611l845153J025581O37425P41767M662815P746929
4116B1409742L861063o847624j6999792j7347716n584266Q548702J1507683K421283
4108I69075m452001J089576J0119366P411920n643693j2755956o280542L258924
$$ y = [579126, -7520995, -18964010, -25391531, -27875994, -35026463, -44068904, -40227783, -20207258, -1070148, 2758390, -1517504, 811292, 9986726, 16060710, 16412128, 15292347, 11736515, 2735343, -4022087, 4073396, 24037498, 35868409, 26551269, 5200996, -11007993, -16326353, -14919035, -9107776, 90244, 5754243, 380717, -11899467, -18381386, -14488760, -8395174, -6240230, -2183619, 10437287, 25295866, 29541003, 21031989, 10440378, 6595225, 7620806, 8258231, 8999998, 13662813, 21409742, 25270805, 18423181, 1423389, -15924327, -21508593, -12959891, -1452208, 969075, -3482926, -2393350, 7726016, 15137936, 9494243, -3261713, -9542255, -6283331]
4100f283331M064050j333861l244653J98546K433704j122568p839882j1311220
4092b4439215o984420L462707J1654917R643301p79532r321265r098772l224763
4084b9087042J811492M207884N808163P774584J0158404J1694820Q421974j673159
4076A9117120j0736383o299565J0281268J9512345P225488j4222206k0277244
4069D600823o470624P329056N857061k540763k237583N993994Q743292J433703
4061B2708959o120477n362076k73750J47358n844677j2086720j2344691n433518
4053b4609592M893404J2408496J2801871P647908J936421l028939r654873j5166668
4045a2771972j0400190N582285J6671947P812090j0768968j2837153P006681K1743266
$$ y = [-6283331, -2219281, -3553142, -6797795, -6599249, -4165545, -5288113, -13127995, -24439215, -31423635, -27960928, -16306011, -6662710, -7442242, -16763507, -25862279, -29087042, -27275550, -23067666, -17259503, -9484919, 673485, 12368305, 20790279, 19117120, 8380737, 2081172, 12362440, 31874785, 39100273, 24878067, 4600823, -1869801, 5459255, 11316316, 8775553, 6537970, 12531964, 21275256, 22708959, 16588482, 11226406, 10952656, 11100014, 5255337, -6831383, -19176074, -24609592, -19716188, -7307692, 5494179, 13142087, 15078508, 12049569, 2394696, -12771972, -23172162, -17589877, -917930, 6894160, -3874808, -16711961, -9705280, 12037986]
4037A2037986P564540k1661860l1587767j2649630J0055938J2668026Q47676n087667
4029b7812758L42744N755045L849561O83651L066400P159499N332713j024956
4021b648101k783357L479269R816620P494635j568252q531461r097998n083384
4013h922029K237352J1301940J4086242K773996j4578953j7891716j696144J3980022
4005A290710R981226n142119q848794K290096J0281322M059016o893223r501338
3997b483104l513326L207362M738946j164442j1675785j6601827p428859Q746981
3989b6174054J4626168N047682o584616p623850p02495N833682J0459878J4111853
3981H994248J2918527M050424p201565j2949876j0821142l147849N620719Q465742
$$ y = [12037986, 19602526, -2059334, -33647101, -46296731, -36240793, -23572767, -22725091, -27812758, -27470014, -21714969, -17865408, -17181757, -14115357, -6955858, -1623145, -2648101, -5431458, -1952189, 7864431, 15359066, 13790814, 5259353, -3838645, -8922029, -6684677, 4617263, 18703505, 21477501, 6898548, -10993168, -12689312, 1290710, 11271936, 6129817, -2718977, -428881, 9852441, 13911457, 7018234, -2483104, -5996430, -2789068, 1949878, 785436, -10890349, -27492176, -34921035, -26174054, -11547886, -6500204, -13084820, -20708670, -21411165, -15577483, -5117605, 8994248, 21912775, 25963199, 18761634, 5811758, -5009384, -8157233, -2536514, 5929228]
3973E929228J380695p931178p129723J923945L934415n351179j0363097m99295
3965a8106189J1126408P417556n976713r828519M61984J1855677J4091702Q329157
3957A9371063j180466j0131797j1532106l357371L482380j946111j2081249r710023
3949b7085680N756577J6581583J2903148M761472K980423K809124m415876j4220677
3941G0094j4759755m341996O438761Q717772M743586K518524M970837O794026
3933A5151849K148912o205144q964156k376772O133166P367590J163915n916379
3925H502981r348772q640483m846032q15329K41299K51104M371377R752470N539414
3916E008029q864081j6381369m628149J3817986J8027297P919559M3889k9659
$$ y = [5929228, 7309923, -621255, -7750978, -5827033, -1892618, -7243797, -17606894, -18106189, -6979781, 437775, -5538938, -15367457, -14905473, -3049796, 11041906, 19371063, 18190597, 8058800, -3473306, -6830677, -3348297, -5294408, -17375657, -27085680, -21329103, -4747520, 8155628, 12917100, 15897523, 18706647, 14290771, 70094, -14689661, -19031657, -12592896, -3875124, 868462, 3386986, 8357823, 15151849, 17300761, 11095617, 2131461, -245311, 5887855, 13255445, 14419360, 8502981, -845791, -9486274, -14332306, -15147635, -14906336, -14655232, -10283855, -531385, 5008029, -3856052, -20237421, -24865570, -11047584, 6979713, 14899272, 14943161, 14913502]
3908A4913502j495105o552742n669881K763629P007566J303478n991984q771144
3900b492681j1214393j3657168p786332N663039J1250221J818888q013774l843755
3892b8275955O833306Q992198L816741K079082L681770J129567l422331k007950
3884g173572K702652J949442r76224M853580J5617247J3734273m186239j7770713
3876H750446j0173555Q782678J7896061J2494682M004593j138363o560273j1654230
3868B2402039q364540K884390P627876k384862j3199012o710220J0582039J4103806
3860B6941516k321562j5098760m990443J3695861J4079473l911125j5280245p361086
3852E753629N266235O004435k157391p742070q758726r530106r662008o195778
$$ y = [14913502, 13418397, 6865655, 1195774, 3959403, 10966969, 12270447, 6278463, -2492681, -13707074, -27364242, -35150574, -29487535, -18237314, -16418426, -24432200, -28275955, -21442649, -12450451, -8633710, -6554628, -2872858, -1743291, -5165622, -7173572, -4470920, -2521478, -3497702, 1355878, 16973125, 30707398, 26521159, 8750446, -1423109, 7359569, 25255630, 37750312, 41754905, 40616542, 34056269, 22402039, 14037499, 16921889, 24549765, 22164903, 8965891, 2255671, 12837710, 26941516, 24619954, 9521194, 4530751, 18226612, 32306085, 28394960, 13114715, 5753629, 11019864, 17024299, 14866908, 7124838, -1633888, -11163994, -20826002, -27021780]
3844b7021780p55651K853835L762798K517055j99285r83999K900393O049609O28357
3835a0248668q399838o430120P768842J6374559Q018381m792728n029662M297433
3827A558199Q636127N225726K865206M927871P078635P472610O427170M61683
3819D4653227j0902637j7392756j0414521J157238J713463q070198j3588535r077619
3811b1922338k614234N99551M203027Q927393R630992O087140L292149j95172
3803H008508r739270j8899239j2916416P103356J9831903J1850298l800344p065018
3795e626222K802391J1293859J0004779K769430l611415n199310j576240K313669
3787A3170941o21396r252143j3009088o344872K785595N202150L318160L708074
$$ y = [-27021780, -27777431, -24923596, -21160798, -18643743, -18843028, -19827027, -16926634, -10877025, -10248668, -18648506, -25078626, -17309784, -935225, 7083156, 2290428, -2739234, 1558199, 10194326, 15420052, 18285258, 23213129, 30291764, 37764374, 44191544, 44653227, 33750590, 16357834, 5943313, 7100551, 8814014, 743816, -12844719, -21922338, -24536572, -23937021, -19733994, -10806601, -1175609, 4911531, 8203680, 8008508, -1730762, -20630001, -33546417, -26443061, -6611158, 5239140, 1438796, -5626222, -2823831, 8470028, 18474807, 21244237, 17632822, 12433512, 10857272, 13170941, 12549545, 3297402, -9711686, -16056558, -13270963, -8068813, -4750653, -1042579]
3779a042579M800155K256461J08667M383588R682189N164693p194822j3143955
3771E014397o592944K186321K742437j576228k229602J58641j178608o265193
3763g740779p902772l440173J361722K280331K974174O585857P376535p93094
3755G01801j0937139r280538L462322R580365k35031j0834041m125771J2402858
3747i265174J5844475K738652o199360J187476J1321730R424226K761074M444082
3739C2257181Q390595M7616j6055626k0801686j0643695k658674o267950r141411
3731b4873650L59640J2836851J2546199J295601o565306o432991o090316q660023
3723b5583995p466372K46763P073823P695128O995741R419160R253328O04040
$$ y = [-1042579, 3757576, 6014037, 6122704, 10506292, 20188481, 25353174, 18158352, 5014397, -1578547, 607774, 3350211, 1773983, -455619, -296978, -1475586, -7740779, -15643551, -19083724, -17722002, -15441671, -12467497, -5881640, 1494895, 701801, -10235338, -19515876, -16053554, -6473189, -6708220, -17542261, -21668032, -9265174, 6579301, 9317953, 3118593, 4306069, 15627799, 25052025, 27813099, 32257181, 40647776, 40695392, 24639766, 3838080, -6805615, -9464289, -15732239, -24873650, -24514010, -11677159, 869040, 2164641, -4400665, -10833656, -16923972, -25583995, -33050367, -32803604, -25729781, -18034653, -11038912, -1619752, 7633576, 8237616]
3715H237616r727683j0596528l945125j295829l806105k91004J1324091J5803881
3707E703314L592698j0560257o754335R911852J5832516L476727q793459n343043
3699G066013N041961N321722m605940j1181185q032530r90990M168425P517313
3691D304789R054409O513112M96364m820771p083250o770422l459665K795120
3683A029686O786448K296452p571023j1409753m081920O036501Q707221M881656
3675F675268J887106L67012m771205j1492493r449101L960018J5225676J1201614
3667A3603895j237989l508310P532859J3944343L099721j2780016j4149571k209299
3659D295633N036758M20819n221355m160907l020740o980972q220795n18400O978587
$$ y = [8237616, -1490067, -12086595, -16031720, -17327549, -21133654, -21424658, -10100567, 5703314, 9296012, -1264245, -8018580, 1893272, 17725788, 21202515, 12409056, 7066013, 12107974, 17429696, 12823756, 1642571, -6389959, -7380949, -3212524, 4304789, 13359198, 19872310, 20368674, 15547903, 8464653, 1694231, -1765434, 1029686, 7816134, 10112586, 2541563, -8868190, -12950110, -6913609, 1793612, 6675268, 8562374, 8929386, 4158181, -7334312, -16783413, -12823395, 2402281, 13603895, 12365906, 8857596, 16390455, 30334798, 33434519, 20654503, 6504932, 4295633, 9332391, 9753210, 4531855, 370948, -2649792, -9630764, -17851559, -18369959, -11391372]
3650a1391372L656773m090178l082743M252673M218164m082620o593261J776982
3642a5335582P972996K069120o650598m800536M684866Q867700M468508p02843
3634E73631j863508j122312J060542O788525J2187033Q685716l476862j1826924
3626A1005841p230846L478167O578235j155621j0327308j1620717m930476K949316
3618a1253409N131078J63332n500879k614700Q992234J6718558R737141n486407
3610A5886948j2902831q701411m182434n437244l807776O520477J4302645O946029
3602H624403q261575j3336233n553620R57901j520534m712222o28699O234728
3594a8195851Q255786N409288J173671l079485m868478j032247M006799N04096
$$ y = [-11391372, -7734599, -11824777, -14907520, -10654847, -6436683, -10519303, -17112564, -15335582, -7362586, -5293466, -11944064, -16744600, -12059734, -3192034, 1276474, 573631, -1289877, -2412189, -1351647, 5436878, 17623911, 26309627, 22832765, 11005841, 3774995, 7253162, 13831397, 12675776, 2348468, -9272249, -14202725, -11253409, -6122331, -5958999, -11459878, -14074578, -5082344, 11636214, 21373355, 15886948, 2984117, -5717294, -9899728, -15336972, -19144748, -12624271, 1678374, 8624403, 362828, -12973405, -18527025, -17569124, -19089658, -23801880, -24430579, -18195851, -9940065, -4530777, -3357106, -6436591, -11305069, -12337316, -8330517, -7826421]
3586g826421j0636069j5180285o052971N059876O164850L326583P567744J3655288
3578c921405Q667194m589555j0751184n932388q09496J13092L810287J0238699
3570c174756P549243o219298j3824322l622850R894470O104695j0174507j5226059
3562b8693384j836338J0117151L100642j2641342j3537987M951310K2581026K0796313
3554D837391N076549m421618R75902R796430P885139l377665j1295086r681023
3546b03981n152744n732923r567366q516813l48871O867429M493239l828637l910108
3537b5900775J0144182K3121079J4939698r883191k2595251p214977J6122438
3530a266797J8225290L83769j2207266j0098424q361312j4258195j2329522O701320
$$ y = [-7826421, -18462490, -33642775, -39695746, -34635870, -28471020, -25144437, -17576693, -3921405, 4745789, 156234, -10594950, -16527338, -17336834, -17223742, -13413455, -3174756, 4374487, -1844811, -15669133, -19291983, -9397513, -3292818, -13467325, -28693384, -30529722, -20412571, -17311929, -29953271, -43491258, -38539948, -15958922, 4837391, 9913940, 5492322, 6468224, 16264654, 24149793, 20772128, 9477042, -203981, -5356725, -11089648, -20657014, -29173827, -29522698, -22655269, -18162030, -21990667, -25900775, -15756593, 7364486, 22304184, 12420993, -10174258, -17389235, -1266797, 16958493, 17342262, 5134996, -4963428, -13324740, -27582935, -39912457, -33211137]
3522c3211137K4116389J8600842j462016j1196362m895589K362989K804094L468955
3514E88165O344684K751878p674102j1308370j940946P767722N775454k006371
3506B98114m809097m922576q697889r830635J148350J6135792J6901077L207442
3498I430578m675852L630788J2493822M517083j2409559j6612808l605626J0024039
3490B792465J1471870N493008J239025r63750l475830l057597K052099M319350
3482A9870640l116913j2851469j0971850K347878J1125979N041924p015905j0029432
3474e599148j934271P251322J0140277P734616K932255l291234q453397q336797
3466D43623l015175J741347K176794J636256M136822O318167J478432r298300
$$ y = [-33211137, -9094748, 9506094, 8044078, -3152284, -8047873, -5684884, -2880790, 588165, 6932849, 9684727, 2010625, -9297745, -11238691, -3470969, 2304485, 298114, -4510983, -9433559, -18131448, -27962083, -26813733, -10677941, 6223136, 9430578, 4754726, 8385514, 20879336, 25396419, 12986860, -3625948, -7231574, 2792465, 14264335, 19757343, 20996368, 20032618, 16556788, 13499191, 15551290, 19870640, 16753727, 3902258, -7069592, -4721714, 6404265, 11446189, 4430284, -5599148, -7533419, -282097, 9858180, 17592796, 20525051, 17233817, 8780420, 443623, -2571552, -830205, 1346589, 2982845, 7119667, 13437834, 14916266, 5617966]
3458E617966j6024809j1682160q51587O410600O165125K623756R48592K229156
3450d563361M755724O319154N153793J718344n85895O95037L381857M249499M335683
3441B5459835N311320K734206q356687k0854084j9562936k239478J3855108J4084313
3433A0431597N694389M444208R924313Q303124m065739j4973840j5009723q335580
3425c587251j899828L858816Q902887R145887M186523N00818R74043j67317n656314
3416A6258264p553826j12564P427497K156787j2471237j9360222j0112444M962386
3408a8805359J1103417O191711J84386J415629P038256P171701k292881j3196673
3400a189813j4563900o927910p13180Q1694L196005J2514339J7146380O107820
$$ y = [5617966, -10406843, -22089003, -22940590, -16529990, -10364865, -7741109, -6792517, -4563361, 192363, 6511517, 11665310, 13383654, 12797759, 13492796, 16874653, 21124152, 25459835, 30771155, 33505361, 25148674, 4294590, -15268346, -17507824, -3652716, 10431597, 16125986, 20570194, 30494507, 38797631, 34731892, 19758052, 4748329, -3587251, -5487079, -1628263, 7274624, 16420511, 20607034, 21107852, 22081895, 21914578, 16258264, 8704438, 8591874, 16019371, 18176158, 5704921, -13655301, -23767745, -18805359, -7701942, -1510231, -1325845, 89784, 7128040, 14299741, 12006860, -1189813, -15753713, -22681623, -23394803, -23313109, -20117104, -7602765, 9543615, 15651435]
3392A5651435j2421103j8917504p837799O532867J0376647N356086j60459m470880
3384e890710r628330j1854106m738062Q803105J6034691R406596k479374m216427
3376d562617P048516J7416584J3797858K18239r187207r473254q168706j0124568
3368c035155j0041518l825407K512665K111443k057431l234418j315517O20419
3360a8264919M154237J0568499J3169625N508652n756644p639784N85118O742007
3352I066791M008462j443700l256042m431232r246735j4151440j2786709m941745
3344c7182350L968157Q511347N790576k995781j0912074r659649J394858J3592849
3336b7492067J8091002J3870850O395703J753520K027236L119342j431703j0685951
$$ y = [15651435, 3230332, -15687172, -23524971, -16992104, -6615457, -1259371, -1419830, -5890710, -15519040, -27373146, -32111208, -23308103, -7273412, 2133184, -346190, -4562617, 2485899, 19902483, 33700341, 33918580, 24731373, 15258119, 7089413, -3035155, -13076673, -16902080, -14389415, -12277972, -14335403, -17569821, -18885338, -18264919, -14110682, -3542183, 9627442, 15136094, 9379450, 1739666, 2324784, 9066791, 13075253, 11631553, 8375511, 3944279, -5302456, -19453896, -32240605, -37182350, -33214193, -24702846, -18912270, -21908051, -32820125, -42479774, -41084916, -27492067, -9401065, 4469785, 10865488, 12619008, 14646244, 17765586, 16333883, 5647932]
3328E647932j3972529m773305P385554Q758434J755096M44773O727154P100343
3320A9073452l292417j0525076m681883K709665k437659j2509624r775106M858661
3312a6579987J3024213P122684l15545J346925N218066J080370o585343n947233
3304a635850K927106P817524K496435n031994n544032j702516j496444l913531
3296f083302j173134N592618M816302o486217j3395325k957084J4759458J8849508
3288A3922824O161131p247299j1112070j0412710q553530n9252J3235546J6734966
3280A2669606N125819n327561j87122J0624026R600053l00143l351991Q31190
3272B9683877j899714j3624470j9310815j1017665P15325M772124L629164L447614
$$ y = [5647932, -8324597, -13097902, -5712348, 3046086, 4801182, 5245955, 11973109, 19073452, 15781035, 5255959, 574076, 3283741, 846082, -11663542, -21438648, -16579987, -3555774, 3566910, 3251365, 4598290, 9816356, 10896726, 4311383, -1635850, 1291256, 9108780, 11605215, 6573221, 1029189, -673327, -2169771, -6083302, -7256436, -1663818, 3152484, -3333733, -16729058, -19686142, -4926684, 13922824, 20083955, 12836656, 1724586, -8688124, -17241654, -17300906, -4065360, 12669606, 17795425, 12467864, 12280742, 22904768, 32504821, 32204678, 28852687, 29683877, 27784163, 14159693, -5151122, -16168787, -15453462, -10681338, -7052174, -3604560]
3264c604560L333510J932194L474372Q964716J0467105K737903o687501p627049
3256A2990690j869321J032165j310428k527486K36362J144977m492129j1027034
3248e822204q619793K555970J0078750M829090n414537n538128M849696R805443
3240F724287J288335p264998j577918R704503P348548p946043j5458172n230564
3232a2412022Q513312R793378J636115l845656m165143m668846n455872q03638
3224a1408372J0403302K0422023J9107063L642987j5948436k2915222j1276817
3217g973472M856064P765293o49906m167212P68257L10337j0699290j6444730
3209b6234659m603088J2161610J3652928O00200r239808o392789K958035R954853
$$ y = [-3604560, -271050, 1661144, 5135516, 14100232, 24567337, 27305240, 20617739, 12990690, 11121369, 12153534, 10843106, 8315620, 8551982, 9696959, 5204830, -5822204, -14441997, -11886027, -1807277, 3021813, -2392724, -7930852, -3081156, 6724287, 8012622, 747624, -830294, 8874209, 16222757, 8276714, -7181458, -12412022, -3898710, 5894668, 7530783, 3685127, -480016, -5148862, -10604734, -11408372, -1005070, 19416953, 38524016, 42167003, 26218567, 3303345, -7973472, -3117408, 4647885, 3997979, -169233, 599024, 909361, -9789929, -26234659, -30837747, -18676137, -5023209, -4423009, -13662817, -20055606, -17097571, -7142718]
3201g142718J0564421L964408m902284n129100O361463J5308348P061781j0908917
3193A5177402j7780734q439157J970335L224310L092544R698577J5521794R440324
3185C1905395m214104j0285495l643482M242436J295518q948273j2394784m111539
3177f154328M376133K264019k850154L939599J8580918J9454004k23639j8503488
3169B0883064j4433867L102760J1501267O973842K368120J872909o76834l460543
3161B8130718J178740P919261L406357r632246j4509550q134705m087649n473542
3153a202616L77316J3516391J4159326l676504j6231215n233220J2449112J1395332
3145B5553922l736094r680263j726609N050864L597327N07099j494815n182214
$$ y = [-7142718, 3421703, 7386111, 2483827, -2645273, 3716190, 19024538, 26086319, 15177402, -2603332, -11042489, -9072154, -5847844, -2755300, 6943277, 22465071, 31905395, 27691291, 17405796, 13762314, 18004750, 19300268, 10351995, -2042789, -6154328, -1778195, 485824, -2364330, 1575269, 20156187, 39610191, 39386552, 20883064, 6449197, 9551957, 21053224, 28027066, 30395186, 32268095, 31591261, 28130718, 29309458, 37228719, 40635076, 31002830, 16493280, 8358575, 4270926, -1202616, -825300, 12691091, 26850417, 23173913, 6942698, 1709478, 14158590, 25553922, 21817828, 12137565, 10410956, 15461820, 19059147, 19566246, 18071431, 12889217]
3137A2889217n855812K887361J2071713O093155j1065611j7522739l984253J4406478
3129I919509J9946990J1012627l938322j6278826j8083688p264120M825028M097652
3121D236850n792144p847026J794833Q645999M934925J249608N325048P268816
3113A9816909k206603j3950807j4598522o783223j258543J185384N688913R507234
3105b599258O975114K213480K695216N070930J523828m020726j363296O553414
3097A7048702N958547m969115j1402334m379973N959671O904294J406790k5128
3089A6501454K239783j474514j2299905j7460019o549134J2733246K1215729J0269757
3081B5176397p900337j5230960r298288l001080l822819l833194M564222J2891792
$$ y = [12889217, 7033405, 9920766, 21992479, 28085634, 17020023, -502716, -4486969, 9919509, 29866499, 40879126, 36940804, 20661978, 2578290, -4685830, 139198, 4236850, -1555294, -9402320, -7607487, 1038512, 5973437, 7223045, 12548093, 19816909, 17610306, 3659499, -10939023, -17722246, -18980789, -17795405, -12106492, -2599258, 4375856, 6589336, 9284552, 14355482, 15879310, 11858584, 10495288, 17048702, 23007249, 18038134, 6635800, 2255827, 8215498, 15119792, 16526582, 16501454, 18741237, 17266723, 4966818, -12493201, -19042335, -6309089, 14906640, 25176397, 17276060, 2045100, -7253188, -10254268, -14077087, -17910281, -13346059, -454267]
3073d54267P863728o665485j2660763l381533O911297L731655p447267j0093151
3065b2195786N25267J2844529J5437013R228560J663742m288758j0003429j3181721
3057i970583p269267Q156241K1144791J8152014R74881j3433879j2572410k180326
3049C001462L653919P52670l374761k576820J054213K910085J815370m87564r49860
3040E798714L332443J0381643J1621049J655058j1296295j3284211l586651L834535
3032H456285P07993m020804M42539Q674926O534372p393513j8280830j3677603
3024a8556635J556537J1588918P480077l643048p256654J127273J0045068P467359
3016I808895j318862p91073R803949J2309618k649010j7716041j2396076N511625
$$ y = [-454267, 7409461, 743976, -11916787, -15298320, -8387023, -4655368, -12102635, -22195786, -21670519, -8825990, 6611023, 15839583, 17503325, 13214567, 3211138, -9970583, -17239850, -9083609, 12061182, 30213196, 31188077, 17754198, 5181788, 3001462, 6655381, 7408051, 4033290, 1456470, 2510683, 5420768, 7236138, 6748574, 5798714, 9131157, 19512800, 31133849, 32788907, 21492612, 8208401, 4621750, 8456285, 9164278, 5143474, 5586013, 14260939, 20795311, 13401798, -4879032, -18556635, -17000098, -5411180, 2068897, -1574151, -8830805, -7703532, 2341536, 9808895, 8490033, 7698960, 17502909, 29812527, 27163517, 9447476, -2948600, 2563025]
3008B563025J0726399j830791j1370363m975650M740951M243397J453438Q443386
3000A3993792J6850360J0263683p143330j5141725q195254j565036m357551n759905
2992a054966M068786J5632490J4668853L678349m634407p800622j2735519j8091406
2984f268442j3138042L490374J6922141J4099882K75881r164242p680079j550355
2976c012882J718791J715967J720321K295248R51519l198068o498589m075049
2968h382742L206921P324718K071673p601852j0354646l448073K874106p81470
2960a5091365j0067657j3053517n504801N980891J3487167J3782252O521648n583063
2952i528445j4162179j0742805K005240J1058412Q922412K807992L050283Q064172
$$ y = [2563025, 13289424, 11458633, 88270, -4887380, -146429, 4096968, 5550406, 13993792, 30844152, 41107835, 33964505, 18822780, 10627526, 9062490, 4704939, -1054966, 3013820, 18646310, 33315163, 36993512, 32359105, 24558483, 11822964, -6268442, -19406484, -15916110, 1006031, 15105913, 15381794, 6217552, -1462527, -3012882, -1294091, 421876, 2142197, 4437445, 5388964, 2190896, -4307693, -8382742, -5175821, 2148897, 4220570, -3381282, -13735928, -17184001, -14309895, -15091365, -25159022, -38212539, -43717340, -37736449, -24249282, -10467030, -3945382, -9528445, -23690624, -34433429, -32428189, -21369777, -12447365, -9639373, -6589090, 1475082]
2944A475082Q140973Q35213n928764n857029j753933Q01696J047669J402658K894873
2935C058438N265923P927546Q073313J747153r611027j7128523j3539434k229248
2927a6435859O718142P428314J254195p911994j5046644j2985157J135783J7249206
2919a8594014J8966191K972728j5149072j9334130j0653711p36636N028930Q518422
2911b8981292Q905626M074258o8043M928621J3946162J1398159m757448j5672835
2903f226792p334769Q070300R516636k366314q156799K29317R402158P209468
2895A0343205K22394P03778P128876Q117313J31604q547772r989828n569562k290661
2886B49347m221936q183679o871393K264189J1386410R944559r36982q016847
$$ y = [1475082, 9616055, 10451268, 4522504, -1334525, -3088458, -2286762, -1239093, 163565, 3058438, 8324361, 16251907, 24325220, 26072373, 16461346, -667177, -14206611, -16435859, -9717717, -2289403, -1035208, -8947202, -23993846, -36979003, -35843220, -18594014, 372177, 3344905, -11804167, -31138297, -41792008, -42528644, -37499714, -28981292, -20075666, -16001408, -16069451, -11140830, 2805332, 14203491, 9446043, -6226792, -13561561, -5491261, 4025375, 1659061, -6497738, -6268421, 3133737, 10343205, 10565599, 11269377, 18398253, 26515566, 26647170, 18099398, 8109570, 2540008, 249347, -3972589, -12156268, -19027661, -16763472, -5377062, 4567497, 3630515, -4386332]
2878d386332l179144N826363P637172L361238J524933K165290k249967j1438709
2870g39156j5186710q901854l72606L179509M724691Q115769Q615770J568523
2862A003936o412636n286837L293480Q790866P379107M429357K323159k923762
2854A2596670j0803021j2835900m961755M967097P820853M406833K68116l659852
2846b200959p677866o894098K056553J1583345J0830065J324732n308627n054459
2838a341314n727565j1207345j3063807m210764Q269259J2481071P991741M069034
2830b739690N289928P381164N843767J210734m038223p658787o873537r60109
2822b544753N441450O693731L573874J323637J125440l86614l490776m584256
$$ y = [-4386332, -7565476, -1739113, 5898059, 9259297, 10784230, 12949520, 10699553, -739156, -15925866, -24827720, -25200326, -22020817, -17296126, -9180357, -564587, 1003936, -5408700, -10695537, -7402057, 1388809, 8767916, 13197273, 15520432, 12596670, 1793649, -11042251, -16004006, -11036909, -3216056, 1190777, 1458893, -2200959, -9878825, -16772923, -14716370, -3133025, 7697040, 9021772, 3713145, -1341314, -7068879, -18276224, -31340031, -35550795, -27281536, -14800465, -6808724, -2739690, 2550238, 9931402, 15775169, 16985903, 12947680, 5288893, -1584644, -2544753, 2896697, 9590428, 13164302, 14487939, 15613379, 15226765, 11735989, 7151733]
2814G151733m196453p958338j6244272k0062276j2664503K5153O613053M314046
2806d3021857m4399n22336K581615O802265J0984328J3871685J3530179R744257
2798A3925737M839756J566973J266943L027144L175046k071166j0773268j4788819
2790A68346r108660P70745N799534N191587M469170L743378j995671r645739p123394
2781g730704P516619J6797642N362383j5953384k2056631p384639P927050P956946
2773g564718Q29658P81736N177651L096661l319725l033796L159646L660489k715008
2764G2594m238721J760614K363031p526892j2182800R63231J7488964J3927619
2756A2627640p444543k0405088j0226762R407367J7644961J0628551o86148o102168
$$ y = [7151733, 2955280, -5003058, -21247330, -41309606, -53974109, -53948956, -47335903, -43021857, -43066256, -43588592, -41006977, -34204712, -23220384, -9348699, 4181480, 13925737, 18765493, 20332466, 21599409, 24626553, 27801599, 25730433, 14957165, 168346, -8940314, -8169569, -2370035, 2821552, 7290722, 11034100, 9038429, -607310, -7730704, -214085, 16583557, 21945940, 5992556, -16064075, -23448714, -15521664, -7564718, -6735060, -5953324, -775673, 2320988, -998737, -4032533, -872887, 2787602, 72594, -4166127, -2405513, -42482, -7569374, -19752174, -18788943, -1299979, 12627640, 5183097, -15221991, -25448753, -16041386, 1603575, 12232126, 11545978, 5443810]
2748E443810l537345K081077K964661l267394q466868l980579M836614M518843
2740E92819n350078j0086045l150326K934650k605357j0532254o782025M636906
2732c0341710R259580N650397M369730O771811K869583p954923j1225788Q87248
2724a9714072J5416627J5554411K836826p234375o069197O73117L606238o20230
2716D449345r065147j5445201j3399406k285915R537569J1663667L223932n729004
2708a7050160n742806J961153Q591742Q381237L297550j543831l718242l908461
2700i731818l109573j688991l78433j52793j037687k246243l180981l008700r6514
2691b4631733N728486J0622815R626144L209292k028380j343628J821017O48217
$$ y = [5443810, 1906465, 3987542, 6952203, 3684809, -4782059, -8762638, -3926024, 592819, -4757259, -14843304, -17993630, -15058980, -17664337, -28196591, -34978616, -30341710, -21082130, -15431733, -11062003, -4290192, -1420609, -9375532, -20601320, -19714072, -4297445, 11256966, 14093792, 6859417, 790220, 1463337, 5069575, 4449345, -4615802, -20061003, -33460409, -35746324, -26208755, -14545088, -11321156, -17050160, -22792966, -20831813, -12240071, -3858834, -561284, -2105115, -5823357, -9731818, -12841391, -14530382, -14908815, -15061608, -16099295, -18345538, -21526519, -24535219, -24631733, -18903247, -8280432, 1345712, 4555004, 2526624, 1182996, 3004013, 3652230]
2683C652230n036881p624974k116635N513533M632300n325495j1658954m171480
2675b2136356R516497J2191809M19073r881125n396275O362468R054213M49456
2667E79760p587586p575499k728712L054614Q750345R858589J610963r488983
2659c526509j0059843Q36852Q961933N411908k622362o240459o574021n927445
2651a9739946j093587O325820O728952p24276k238163Q278454J5627733O545487
2643A9710474p586123q997819k082509k895900r830456q081729K350059P173690
2635a0240313M192500N459666J2214448J0813199k345317j3097959j2366106p361926
2627a2731808m034335K429692J1983921J3156612J979245q395794p061420m47943
$$ y = [3652230, -1384651, -9009625, -11126260, -5612727, -980427, -6305922, -17964876, -22136356, -12619859, -428050, -8977, -9890102, -15286377, -8923909, 130304, 579760, -7007826, -14583325, -17312037, -14257423, -5507078, 4351511, 5962474, -3526509, -13586352, -12749500, -3787567, 1624341, -998021, -7238480, -13812501, -19739946, -20833533, -14507713, -7778761, -8503037, -10741200, -2462746, 13164987, 19710474, 12124351, 3126532, 1044023, -1851877, -11682333, -19764062, -17414003, -10240313, -6047813, -588147, 11626301, 22439500, 20094183, 6996224, -5369882, -12731808, -16766143, -14336451, -2352530, 10804082, 12783327, 4387533, -2673887, -3121830]
2619c121830J166221j112573k090305k246504j502621M218133J1911081J0029600
2611A7251202l145537j2763619q172728K476695P307555O607847M100135k826011
2603A0835539j2629899j3703487j696917J0408827J1676919Q480523Q052570L634738
2595B5058813q140035j2671658n98459J0323314O58107j6439047j3629225O837797
2587h600393J6882592O365409n776104n095623O74442K043382J664508J146332
2579I304545m711976j2919200j0597454L578768J3270216Q057688k112863m031340
2571a61616J339928O455029R269802R835067O213728Q65079O40366M566254K355170
2562D1378807r165668j8714042j5657543l185844Q512077J3416907J0492142K496228
$$ y = [-3121830, -1955609, -3068182, -5158487, -7404991, -8907612, -4689479, 7221602, 17251202, 14105665, 1342046, -6830682, -4353987, 2953568, 9561415, 13661550, 10835539, -1794360, -15497847, -17194764, -6785937, 4890982, 13371505, 21424075, 25058813, 16918778, 4247120, 3648661, 13971975, 14630082, -1808965, -15438190, -8600393, 8282199, 14647608, 8871504, 3775881, 4450323, 6493705, 8158213, 9304545, 4592569, -8326631, -18924085, -15345317, -2075101, 5982587, 3869724, -161616, 1178312, 7633341, 16903143, 26738210, 32951938, 33817017, 34457383, 39023637, 41378807, 32213139, 13499097, -2158446, -5344290, 3167787, 16584694, 27076836, 29573064]
2554B9573064l276712j955195O92121k885711p154498j834598P052150L503796
2546B3714417j0229030j3527279l74911J0216523N200429l835684m720902m684705
2538A758858j0568849j0723925L103322J4332512N557520j0286812q167048R285459
2530e708963J6270239L499197j1333182j2629678m676834K462761O629606Q394758
2522B907904N806040j007944q204441j1813569p229857R240408K9661735L4052568
2514E3412844J3990569j1346229j8245814r664227n204567p882543m291359N754863
2506A6523537O068818o644013j4924417q531086J524984M495175M430675M379251
2498G322924k599019j4860141j5292954J831363J5765980Q867165n305810m228517
$$ y = [29573064, 26296352, 24341157, 25033278, 22147567, 14993069, 13158471, 20210621, 23714417, 13485387, -41892, -416803, 9799720, 15000149, 11164465, 6443563, 1758858, -8809991, -19533916, -16430594, -2098082, 3459438, -6827374, -14994422, -5708963, 10561276, 14060473, 2727291, -9902387, -14579221, -12116460, -5486854, 2907904, 8713944, 7706000, -498441, -12312010, -19541867, -10301459, 19360276, 53412844, 67403413, 56057184, 37811370, 28147143, 22942576, 15060033, 10768674, 16523537, 22592355, 15948342, 1023925, -7507161, -5982177, -1487002, 2943673, 7322924, 4723905, -10136236, -25429190, -23597827, -7831847, 1035318, -4270492, -8499009]
2490h499009P306468P959406j978412j172895J4425650K0802885J733857k5357256
2482A5220694l2304703j5663230M039740J0622812O876709L525361M621671O274495
2474C213549L785981l333509j1161247j3857831p619661M999767J4295022J0545582
2466H67653m645928j6649805j2887026J346233Q944594L260367m476685l195079
2458b7435676K501800K343508k553151l569729j93033Q10217l50443L654411J1923092
2449a2869004J2747730J087385j2198158j5028230r126355l189309Q22895N554893
2441c2198153Q859343P192652M591166P167660J0414994L805963j0952353j8161089
2433a9279817r067634N546013J0354234N024667O73487K746763O730973P847789
$$ y = [-8499009, -1192541, 6766865, 4788453, 3615558, 18041208, 38844093, 40577950, 15220694, -17084009, -32747239, -28707499, -18084687, -11207978, -7682617, -3060946, 3213549, 6999530, 3666021, -7495226, -21353057, -28972718, -23972951, -9677929, 867653, -3778275, -20428080, -33315106, -31968873, -23024279, -19763912, -24240597, -27435676, -24933876, -22590368, -25143519, -28713248, -28906281, -28096064, -28446507, -24792096, -12869004, -121274, 966111, -11232047, -26260277, -35386632, -38575941, -37753046, -32198153, -23338810, -16146158, -11554992, -4387332, 6027662, 9833625, -1118728, -19279817, -28347451, -22801438, -12447204, -7422537, -6749050, -4002287, 2728686, 10576475]
2425A0576475O044966K180710l142047p095748p637081q434780j3614999j7993933
2417c9116437j1332792N774883J8939182J7069927N446714l035057l435937P3507
2409i616010L399799N966477P551450P526742O297659M059598m7385n073116p666360
2400A2398854o870538n498130m214870N9729O124996O029266l028374j1252106
2392f251173r238945k256847j071690l885889p18459P177207P967679L47450k327955
2383a0258622N569651J0769811J844920j1791883j4299311p024982k693647k418034
2375c0302097L854197J4907481J4751688k305937j8178945j3615183N612035J7910739
2367g366022J5337705R450423R158004Q357363N70182p621069p686343m256992
$$ y = [10576475, 16621441, 18802151, 15660104, 8564356, 927275, -7507505, -21122504, -39116437, -50449229, -44674346, -25735164, -8665237, -3218523, -6253580, -9689517, -9616010, -6216211, -249734, 7301716, 14828458, 21126117, 25185715, 25138330, 20065214, 12398854, 5528316, 30186, -4184684, -4124955, 2000041, 8029307, 5000933, -6251173, -15490118, -17746965, -18818655, -22704544, -23423003, -16245796, -8278117, -7930667, -10258622, -4688971, 6080840, 7925760, -3866123, -18165434, -25190416, -27884063, -30302097, -26447900, -11540419, 3211269, 905332, -17273613, -30888796, -25276761, -7366022, 7971683, 17422106, 26580110, 34937473, 35507655, 27886586, 20200243, 15943251]
2359A5943251o810025j2250493r990287j834243o96196p445536n956450J0898044
2351a8141935K5472798J8733986j302415j0410993j463059R847084J0755065N876151
2343C9366682K964943k58661p511321j3528774j1657157m942216r37763J33710
2335C629443L844202J0323009J2098625M065547r087708j7328652j5454410p724023
2327a5633967k479112k633248l071530J380003P760839Q187722M75131q098539
2319a4112701q436147O62971J0442631R677728l310477j5713044j2332155N217211
2311b7903983J8103825J3448923p5425p010444o456639o913648p523761r72872
2303b5304024Q199690O735159m299356p693346L307493J3391816Q583624l677752
$$ y = [15943251, 9133226, -3117267, -13107554, -14941797, -15637993, -23083529, -29039979, -18141935, 7330863, 26064849, 24762434, 14351441, 12888382, 22735466, 33490531, 39366682, 42331625, 42072964, 34561643, 21032869, 9375712, 4433496, 3495733, 3629443, 7473645, 17796654, 29895279, 33960826, 24873118, 7544466, -7909944, -15633967, -18113079, -20746327, -23817857, -22437854, -14677015, -6489293, -6014162, -14112701, -22548848, -21885877, -11443246, -1765518, -5075995, -20789039, -33121194, -27903983, -9800158, 3648765, 3573340, -3437104, -9893743, -16807391, -24331152, -25304024, -17104334, -10369175, -14668531, -22361877, -19054384, -5662568, 2921056, -756696]
2295g56696q678950o087813m770584n393417j760131N877412J0659207R415278
2287a495694M648654n24408l008927j42649M625888K795704o199622j0676399
2279i977453k769754R306317J3485440R821758M913790j23673m664761j411824
2271A8579840J1295721J8578532P363125j0782950j3690666j215018O126666n74001
2263C5681249q880230r116207o687439n215097J563386J2230342J1570025n601375
2255B5544654k0867246j6668284r28849P621863O938914P561892R909603M677061
2247B3789608p446051j3932308r028828m24773M056893M507259K195590l629553
2239H7837r301156p531961J212024O863162L609643k279564l195244j063914j151678
$$ y = [-756696, -9435646, -15523459, -20294043, -25687460, -27447591, -21570179, -10910972, -1495694, 3152960, 2628552, -380375, -523024, 4102864, 6898568, 698946, -9977453, -12747207, -3440890, 10044550, 19866308, 24780098, 24656425, 19991664, 18579840, 29875561, 48454093, 55817218, 45034268, 31343602, 30128584, 36255250, 35681249, 26801019, 17684812, 10997373, 5782276, 7345662, 19576004, 31146029, 25544654, 4677408, -11990876, -12919725, -5297862, 1641052, 9202944, 19112547, 23789608, 16343557, 2411249, -6617579, -7042352, -2985459, 1521800, 3717390, 87837, -9213319, -16745280, -15533256, -8670094, -5060451, -7340015, -10535259, -11599173, -12750851]
2230a2750851j512944L009723R810665J0452155L393517k834144j275013M496584
2222A2789692O545326L466594L50272j70716j496467o690274j2454190j2272647
2214i932410m294941N910540J0186843M700046o848471j5843353j5594589o823591
2206c8539926L936150J1196547J4054698J3257714Q695220J818694l195024m252492
2198F971581m540041p038827q548022m031297N077423J2192580J3611513R752742
2190B3447652O62668j1955064j9342670j2364451M204015J3833016R064222P44354
2182H293742K53343K608945k206221r237290m900326R341599J5843948O439853
2174B6437593n411273n567337J46866k225876j1116025j2618076m203399P09965
$$ y = [-12750851, -14263795, -11254072, -1443407, 9008748, 12402265, 9568121, 8293108, 12789692, 19335018, 22801612, 23151884, 22981168, 21484701, 14794427, 2340237, -9932410, -14227351, -8316811, 1870032, 6570078, -278393, -16121746, -31716335, -38539926, -34603776, -23407229, -9352531, 3905183, 12600403, 14419097, 11224073, 6971581, 2431540, -4607287, -13155309, -17186606, -12109183, 83397, 13694910, 23447652, 24110320, 12155256, -7187414, -19551865, -15347850, -1514834, 7549388, 8293742, 8547085, 11156030, 8949809, -287481, -5187807, 4153792, 19997740, 26437593, 21026320, 15458983, 15605849, 13379973, 2263948, -10354128, -14557527, -13847562]
2166a3847562n173162j0637555l572675R721165J3980630P439147K445964N602618
2158E958570R349726N361011l586401r296598q605977m092620O8731j85467n578440
2149a0607465r319882k998676R936344J4628432M199659r425474j1562571l941699
2141a9091332J795239K997841O077907J1639587J3041449R252412O632074O711892
2133C9057069L766138l366085q160473p937543p612874q417745m153158O151712
2125I327041J2737121R066574J698673j027465j010174l109474m928828l458906
2117A9294562l827954j0344293j5254793q433658O081474J4937093J3620007Q434210
2109B4506648L379228k582707o842635m725470L3023j139613o682196o352922
$$ y = [-13847562, -19020724, -29658279, -33230954, -23509789, -9529159, -2090012, 355952, 5958570, 15308296, 20669307, 17082906, 7786308, -819669, -4912289, -4843558, -5029025, -10607465, -19927347, -22926023, -12989679, 1638753, 5838412, -3587062, -15149633, -19091332, -17296093, -14298252, -8220345, 3419242, 16460691, 25713103, 32345177, 39057069, 42823207, 39457122, 31296649, 23359106, 15746232, 7328487, 3175329, 9327041, 22064162, 31130736, 32829409, 31801944, 30791770, 27682296, 22753468, 19294562, 15466608, 5122315, -10132478, -18566136, -12484662, 2452431, 16072438, 24506648, 27885876, 25303169, 18460534, 13735064, 13768087, 12628474, 5946278, -406644]
2101d06644N20932K414080m366310p649008N85736R504677O130936l760572n109115
2092b135288K911717P320341K323788l805041l109193K422250P459206R855092
2084B3242872Q172295J255180o727122q140656j861788M917713P151190P295182
2076C5304866P579575M823798k309786p968298p205794l939615m367428p077687
2068A4839631o656926l463205k421172m477047o315720o794324o840880m696554
2060b6826197J459325P493752P681131M086442L155434L808647n67074p344022
2052g052562m482312R736229J8804443R099734r960569j8008088j0199489L11018
2044a1751596L354558K448655L390322L658848j405812q836312j0665370l891577
$$ y = [-406644, 114288, 2528368, -1837942, -9486950, -8901214, 603463, 6734399, 2973827, -2135288, 776429, 8096770, 10420558, 6615517, 3506324, 5928574, 13387780, 23242872, 31415167, 32670347, 25943225, 17802569, 15940781, 20858494, 28009684, 35304866, 42884441, 47708239, 45398453, 37430155, 30224361, 26284746, 21917318, 14839631, 8182705, 4719500, 2298328, -2178719, -8494439, -15288763, -22129643, -26826197, -25366872, -17873120, -10191989, -6105547, -2950113, 858534, 291460, -7052562, -11534874, -1798645, 17005798, 26105532, 16144963, -1863125, -12062614, -11751596, -8397038, -5948383, -2558061, 1100787, -305025, -9141337, -19806707, -23698284]
2036b3698284N987162J0787954P697636J945834Q32143M265239L875459n504843
2028F188300j6367154j5909708k187310J2512382J5388416O057850n353187r340182
2020i010593m506724L403789P721304O469131K430557j398473m107580m647502
2012c646091j673817K280069J365811m820633p666308l54306J1398015J5792749
2004A2675489R437193r52355q490390j0634066o459709K099307P697596M912745
1996A0285810o12352Q20269P581633Q604224J064919n475619n437439n631520
1988A1199925j1305598j4693655o708641P276207J3368721P368853j413189l203148
1980A889475J847347O244428M040375l037197o962440k295588O337903R185506
$$ y = [-23698284, -17711122, -6923168, 774468, 2720302, 3552445, 7817684, 11693143, 6188300, -10178854, -26088562, -28275872, -15763490, -375074, 5682776, 329589, -9010593, -13517317, -10113528, -2392224, 4076907, 6507464, 5108991, 1001411, -3646091, -5319908, -3039839, -1674028, -6494661, -14160969, -14515275, -3117260, 12675489, 22112682, 21160327, 12669937, 2035871, -4423838, -2324531, 5373065, 10285810, 9673458, 10493727, 18075360, 26679584, 27744503, 22268884, 16831445, 11199925, -105673, -14799328, -21507969, -14231762, -863041, 6505812, 5092623, 1889475, 3736822, 9981250, 14021625, 10984428, 4021988, 1726400, 8064303, 17249809]
1972A7249809L841712k343326l090710k42565J777322J799942o27569o616077
1964A1748538j2684910j0888953L19598J0739684R756680p46102r494686q307580
1956i557731K138005J4622447J9709781J2493777q75057p797947l780540K766480
1948B9719215L350232k131j741125k723938n804133p653832l616731L083618M919050
1939A9530225K48152o613958j2390574j5264274j1657263l98066J1477179J4248280
1931h20299O693775l237519p971562o261965j350188K451330K759446J902348
1923e834634M373508R121297Q768111J95320r004325r635070k279000N383394
1915A088601Q513820P375502L821955P35933J163374L351908R37113p410967j3497372
$$ y = [17249809, 21091521, 18748195, 15657485, 15414920, 17192242, 18992184, 18364615, 11748538, -936372, -11825325, -11505727, -766043, 8990637, 8244535, -1250151, -9557731, -7419726, 7202721, 26912502, 39406279, 38531222, 30733275, 26952735, 29719215, 33069447, 33067316, 31326191, 28602253, 22798120, 15144288, 11527557, 14611175, 19530225, 19778377, 13164419, 773845, -14490429, -26147692, -26545758, -15068579, -820299, 5873476, 2635957, -5335605, -11597570, -12947758, -10496428, -7736982, -5834634, -1461126, 7660171, 16428282, 16623602, 7619277, -2015793, -4294793, 1088601, 9602421, 16977923, 20799878, 21535811, 22699185, 26051093, 26988206, 19577239, 6079867]
1906F079867r754075R18975J0038461J2975267R474560J478697m972120l345817
1898B2893815K742146J260078j0027385j7404725j0998311K78787L363762l46081
1890h237914k481223k765218l159345K213944J5348835K2111557R784102j0404421
1882B2410317j6911949q239964p44189j439445l412514m440569q290660r209810
1874c0278783K263247J7628077J7526511K930884l974855N302034J3270108O702558
1866C1369781l518016l723418J467628K062134l83250j401519m168073r392413
1858A2312854q674671M53499O396136J675099m491881l366528j966176p648465
1850e310133j1411813k796286R693371J0216463m4702o093378j310814P320998
$$ y = [6079867, -3674208, -2755233, 7283228, 20258495, 29733055, 31211752, 26239632, 22893815, 25635961, 26896039, 16868654, -536071, -11534382, -11255595, -7891833, -8237914, -10719137, -13484355, -16643700, -14429756, 919079, 23030636, 32814738, 22410317, 5498368, -2741596, -3485785, -4925230, -8337744, -12778313, -21068973, -30278783, -28015536, -10387459, 7139052, 10069936, 6095081, 11397115, 24667223, 31369781, 27851765, 24128347, 25595975, 27658109, 27274859, 25873340, 21705267, 12312854, 3638183, 4091682, 10487818, 12162917, 7671036, 4304508, 2338332, -5310133, -16721946, -19518232, -9824861, 391602, 346900, -5746478, -7057292, 263706]
1842B63706J1589775Q054235k977949j3909350j1915323M492109J8092405J3675216
1834B7364824j364587r575228q503993q112635r585830m385298P274821J3440944
1826F553018P806224k526976q665079q894639m649025K729500R004740Q773931
1818A0131694K606176k930085l291256M628K426068j81684q768314j7622866j7220594
1809c4846233n161793R257927J5672039J3593932Q812070M611432J711139J160721
1801A4811234J718617k23359l449272j479640N808105Q465187O59362r968178
1793A6342056j4006793j2241481q537394j234352Q946725J2938769O519396k11087
1785H515839J693607N135031P09211n245548k374220L222205j160022j1088301
$$ y = [263706, 11853481, 19907716, 16929767, 3020417, -8894906, -4402797, 13689608, 27364824, 26000237, 16425009, 7921016, -191619, -9777449, -14162747, -6887926, 6553018, 14359242, 11832266, 3167187, -5727452, -10376477, -7646977, 1357763, 10131694, 12737870, 9807785, 6516529, 6521157, 8947225, 8765541, -2773, -17625639, -34846233, -40008026, -30750099, -15078060, -1484128, 7327942, 11939374, 13650513, 14811234, 16529851, 16306492, 12857220, 11377580, 17185685, 25650872, 26310234, 16342056, 2335263, -9906218, -18443612, -19677964, -10731239, 2207530, 8726926, 8515839, 10209446, 15344477, 16053688, 10808140, 8433920, 11656125, 10496103, -592198]
1777e92198j0992005n30450M777433j105935p081935m202972L599219J0261013
1769e867830J4492652J3825456N316424n652681r503221o492297m847993n439306
1761d168796j752491N070870O044052O52375j253226L580616O879403L747584
1753A8800387j066048m750612j0395262j5734069j2099345K06207Q646635O280554
1745a0111553N74281j155178k294036n913035n680558K845028J1786773J1778706
1737A830428N800631K698038K664626j058050q865231j2084071m546399Q170060
1729e389968J3529485N572447p651865j2535618n776510K922344N434099N054349
1721A158763P160277Q384011L215604n327779j0522343j1457562r428497k328725
$$ y = [-592198, -11584203, -12114653, -7337220, -8443155, -15525090, -19728062, -16128843, -5867830, 8624822, 22450278, 27766702, 22114021, 12610800, 6118503, 1270510, -4168796, -5921287, -850417, 5193635, 5846010, 4592784, 8173400, 15052803, 18800387, 17734339, 12983727, 2588465, -13145604, -25244949, -25038742, -16392107, -10111553, -9537272, -10692450, -12986486, -18899521, -24580079, -21735051, -9948278, 1830428, 7631059, 10329097, 12993723, 11935673, 3070442, -9013629, -13560028, -5389968, 8139517, 13711964, 6060099, -6475519, -12252029, -9329685, -3895586, 1158763, 8319040, 16703051, 19918655, 14590876, 4068533, -7389029, -16817526, -19146251]
1713a9146251P930412J1271249M020838k070458J547091L978933n736964j4527490
1705a2732640k928905K0764264K8714945J3083633o113528j1873574o698599J595816
1697B3811412Q821620Q640319j731414j0348199m432290P816666R933174N041308
1689D7552596O384849Q685709q71545j1647051m633255J0774727J6521475K9703143
1681A02470648O8826562Q3267859l240261j58050603k32906681j43305702J3332690
1674b69605488Q4083886M9675367R136700J7035727L1576905J5422180m502266
1667f7176989J698792J6309603J4873499O847641O580654L626576j0511974j7989010
1659d5741208l256840J7970034K1220444O711402p438489j0454932m171908L779776
$$ y = [-19146251, -11215839, 55410, 4076248, 2005790, 3552881, 7531814, 1794850, -12732640, -15661545, 5102719, 33817664, 46901297, 40787769, 28914195, 22215596, 23811412, 32633032, 41273351, 39541937, 29193738, 24761448, 32578114, 42511288, 47552596, 53937445, 62623154, 61751609, 50104558, 45471303, 56246030, 72767505, 102470648, 171297210, 254565069, 251324808, 93274205, -139632476, -282938178, -269605488, -185521602, -135846235, -126709535, -109673808, -78096903, -62674723, -67176989, -65478197, -49168594, -34295095, -27447454, -20866800, -17240224, -27752198, -45741208, -48998048, -31028014, -9807570, -3096168, -10534657, -20989589, -25161497, -21381721]
1651b1381721L619898o929267j3775626l251422J2910791J1127432n693474j0377152
1643c3750541M261965J3407455J946442j1493502p212228N210671P613020K444498
1635a7572220J810419M763802M066224J601587J010695k179189r188075j0064465
1627b5751222k63041Q503636O777770K530146M918426Q008340M949745K978525
1619A2652325Q053064R339825k571091j5188930j2145623q88838p32713j1036351
1611a2518332j3762566l814833N190489N382281M638816Q758297J0981210N536600
1603A0391962j573247k650154p8654r64457n537516p239182k466521M223497N771848
1594a22424J922253j83667L569344P226737L370268m765261p867085m914363k983398
$$ y = [-21381721, -17761823, -24691090, -38466716, -41718138, -28807347, -17679915, -23373389, -33750541, -29488576, -16081121, -14134679, -25628181, -32840409, -27629738, -20016718, -17572220, -15761801, -10997999, -6931775, -5330188, -4319493, -6498682, -15686757, -25751222, -26014263, -17510627, -10732857, -8202711, -3284285, 4724055, 9673800, 12652325, 20705389, 30045214, 27474123, 12285193, 139570, -749268, -1481981, -12518332, -26280898, -30095731, -24905242, -19522961, -14884145, -6125848, 4855362, 10391962, 8818715, 6168561, 6089907, 5125450, -412066, -7651248, -10117769, -5894272, -122424, 1799829, 1616162, 5185506, 12412243, 15782511, 11017250, 3150165, -1764198, -4747596]
1585d747596l890521k593842J145261K346790K730498Q534784J4886135R366294
1577B7777803n082112j0018031j162353K620796q827763j7496016o364324J0976035
1569g575965J1209943k809198j0428656o836413l825911l600907L093196J4529068
1561f244843J7040807Q063392k02920k387936n805795j1410433q532733M667164
1553d813297J3063242O258691n713650q581040m161734l284018o916458o631798
1545b0780062n0402N209227L454070j010035p18372M235446O703050L214251p40189
1536d83016L23941K086417k638451r562196p206409K934113M606846q055517j7693677
1527c5687949p974836J0871495J6240265N041707n532584m855636O93265L195962
$$ y = [-4747596, -8638117, -11231959, -10086698, -7739908, -5009410, 3525374, 18411509, 27777803, 22695691, 12677660, 11515307, 14136103, 5308340, -12187676, -18552000, -7575965, 3633978, 824780, -9603876, -16440289, -20266200, -23867107, -20773911, -6244843, 10795964, 18859356, 18656436, 16268500, 10462705, -947728, -9480461, -4813297, 8249945, 14508636, 8794986, 213946, -3947788, -7231806, -14148264, -20780062, -20830464, -15621237, -12167167, -13177202, -13895574, -9660128, -2957078, 257173, -483016, -159075, 1927342, -711109, -10273305, -17479714, -14545601, -9938755, -17994272, -35687949, -43662785, -32791290, -16551025, -11509318, -17041902, -21897538, -21204273, -18008311]
1519a8008311K999254J424353k384094m876715n96536O548160O225275j892014
1511a0560628o405647j820991L727236K489882j876246k456350P26614L824410
1503a2351720N282452M845167K694524J749672M069561M407264l633909j4097135
1495g034124j2714467J936613J2971550P519802n370639p705456L551268J4420403
1487G574950J2038229k139249j5260646j5015887j109269J2796719J2329809q52532
1479A0362124j0961112q330347k74689J957504j228111k093462J012257L340406
1471f215430L369445L921981M574625J024097o567114j1111594p584342q715M416298
1462a4180749N204115P444474J1539137J0572155J156727q641109q809693j703801
$$ y = [-18008311, -15009057, -13584704, -15968798, -20845513, -21442049, -14893889, -8668614, -10560628, -16966275, -18787266, -15060030, -12570148, -14446394, -16902744, -16176130, -12351720, -7069268, -2224101, 470423, 2220095, 6289656, 10696920, 7063011, -7034124, -19748591, -17811978, -4840428, 2679374, -2691265, -10396721, -6845453, 7574950, 19613179, 17473930, 2213284, -12802603, -13911872, -1115153, 11214656, 10362124, -598988, -8929335, -9204024, -7246520, -8474631, -10568093, -9555836, -6215430, -2845985, 1075996, 5650621, 6674718, 107604, -11003990, -18588332, -18597047, -14180749, -8976634, -1532160, 10006977, 20579132, 21735859, 13094750, 4285057, 2581256]
1454B581256J361892l389267q671313r499766q718784o548881K050486J3343593
1446a7490784J2432103m326428j7693529j0759660N554902R456614J026028k760024
1438b4560778J023114m33704p942779o413463P048363J5060239Q284289Q6744
1430g847975J888980M118200l752419j1643020n148318R182790J3400814N296870
1422E495922j198876J331375N762417L926691l227913q992877p485907J197161
1414c192007Q241129M006409p344069j0074852L11411P927351j01675j2723978
1406a2950281j1310617K335796J0700608P304587J449667q53858l121471n067425
1398a1512994J58647J1289248J5541249O168958p008956j0916771n262739L80220
$$ y = [2581256, 3943148, 553881, -8117432, -17617198, -26335982, -32884863, -30834377, -17490784, -5058681, -9385109, -27078638, -37838298, -32283396, -22826782, -21800754, -24560778, -23537664, -23971368, -31914147, -38327610, -31279247, -16219008, -7934719, -7847975, -5958995, -1840795, -5593214, -17236234, -22384552, -13201762, 199052, 5495922, 4297046, 5628421, 11390838, 15317529, 12089616, 3096739, -4389168, -3192007, 5049122, 9055531, 1711462, -8363390, -8051979, -124628, -226303, -12950281, -24260898, -21925102, -11224494, -3919907, -2470240, -3324098, -6445569, -11512994, -11354347, -65099, 15476150, 21645108, 14636152, 3719381, -1543358, -1163138]
1390a163138m27880o065754j0959871j0664427n128972J086192L497103K688979
1382b7137768K677923N319057Q646632R371246N475964r48291k857632M048463
1374D595594J1562360O132395j0108966j7163379m585431J0981750R024679m612844
1366E826158q413403J089027P228836K678564r07731M078967Q582390M169778
1358B4332586l700369p261269o826398k938375O904978J6503365J2114056n274509
1350C3854065j5403717q394345j833393j2038072k4450438j4962028J0152272
1343c3075656K1294760Q766751o264104n959325K444835N882411N772285P888161
1335F750118Q022835J269229n551896m251585l38297m466117j3700033j4632465
$$ y = [-1163138, -1591018, -7656772, -18616643, -29281070, -34410042, -33323850, -29826747, -27137768, -24459845, -19140788, -10494156, -1122910, 4353054, 3404763, 547131, 4595594, 16157954, 22290349, 12181383, -4981996, -9567427, 1414323, 10439002, 5826158, -2587245, -1498218, 5730618, 8409182, 7501451, 11580418, 20162808, 24332586, 20632217, 13370948, 6544550, 3606175, 10511153, 27014518, 39128574, 33854065, 18450348, 10056003, 8222610, -3815462, -28265900, -43227928, -33075656, -11780896, -3014145, -9278249, -15237574, -12792739, -6910328, -1138043, 6750118, 14772953, 16042182, 10490286, 6238701, 5900404, 1434287, -12265746, -26898211]
1327b6898211l923490O450898O580929J369536J110787O024982O908435r43212
1319c319346j0736259j3038676p737361k696643j678361n285N214893P729232
1311b6267806K307986l143387K874785J5237472J5348672j674215j6556273j1376077
1303b3248843N586674J2729267N128816k812046j233028L840041M404157K610275
1295G005313M098165Q146184R544541M984501m708631j3830980j3661365k110193
1287e32465R349586P730732k621946m846201M936781J0509279l43426j7603486
1279F578854k3853865j6717595o437644o0064J371931k186736o457012j751327
1271d9513458J3028629K2135245J1847792p947621j5226388n096393O819549P953671
$$ y = [-26898211, -30821701, -24370803, -17789874, -16420338, -15309551, -9284569, -2376134, -3319346, -14055605, -27094281, -34831642, -37528285, -39206646, -39211931, -33997038, -26267806, -23959820, -27103207, -24228422, -8990950, 6357722, 4683507, -11872766, -23248843, -17662169, -4932902, 195914, -2616132, -3849160, -9119, 4395038, 7005313, 11103478, 19249662, 28794203, 33778704, 29070073, 15239093, 1577728, -532465, 8817121, 16547853, 13925907, 9079706, 14016487, 24525766, 24182340, 6578854, -17275011, -33992606, -40430250, -40490314, -39118383, -41305119, -47762131, -49513458, -36484829, -14349584, -2501792, -10449413, -25675801, -30772194, -23952645, -15998974]
1263a5998974J256043n180940p216529l180500M424694O577600p71764n789585
1255b5879955L999890J9118023J9297504N274582k755936L60711k458132j6302658
1247F54029k0149358j753801J7581435J3680969l999149r720924j092188L579222
1239a219765j513793m429367o2183K933652L75233j386797M90867J104129p94528
1230d502552r36010K20937j877371n323296m205097j12827J591080L954897J1874658
1221F84419J6690565N893715j2584042j6515761k712089P071427J60284q373879
1213i685361k459045Q734784P507963l442486p153257N52132P597438O112811
1205G764979J431593K73340J383481L95312l280615o940782q248176p159381n280522
$$ y = [-15998974, -14742931, -19923871, -27140400, -30320900, -25896206, -19318606, -20090370, -25879955, -21880065, -2762042, 16535462, 21810044, 19054108, 19414819, 16956687, 654029, -19495329, -21249130, -3667695, 10013274, 6014125, -3706799, -4798987, -1219765, -2733558, -7162925, -7225108, -4291456, -3916223, -5303020, -4812153, -3708024, -4502552, -5438562, -5217625, -7094996, -12418292, -16623389, -16736216, -15145136, -11190239, 684419, 17374984, 23268699, 10684657, -5831104, -8543193, -1471766, -1311482, -9685361, -12144406, -3409622, 4098341, 655855, -6497402, -5945270, 1652168, 7764979, 9196572, 9469912, 10853393, 11248705, 7968090, 1027308, -7220868, -14380249, -19660771]
1196a9660771k764720K959563J1745998J5954711Q446054m820494r493105k201750
1188A65486M812660K407139k806093j261863L964813L849292j438611m384965
1180E307858k794656r62649m98571J491914N523895P425655L492805n093864j2160405
1171A731982j0122584K427616J5784421J7625305Q031921j168068l794824o073326
1163B4442443j1858953j2952711k911484R319454J0679462K080345n481986p205705
1155F110865o308918m584585j708272J97763R66038O174704J6361563J9068225
1147C6277383M840149j4234481j7459257m224973O265534L241776m192250n616628
1139D897253k956268r05449J928335O089351P214337M457428K541834J640828
$$ y = [-19660771, -22425491, -19465928, -7719930, 8234781, 16680835, 11860341, 2367236, 165486, 4978146, 7385285, 4579192, 3317329, 7282142, 11131434, 9692823, 5307858, 2513202, 1550553, 1051982, 2543896, 8067791, 15493446, 18986251, 13892387, 1731982, -8390602, -5962986, 9821435, 27446740, 35478661, 34310593, 30515769, 24442443, 12583490, -369221, -3280705, 6038749, 16718211, 18798556, 13316570, 6110865, -198053, -4782638, -6490910, -6293147, -5327109, 847595, 17209158, 36277383, 41117532, 26883051, 9423794, 5198821, 11464355, 14706131, 10513881, 4897253, 1940985, 1035536, 2963871, 9053222, 16267559, 20724987, 23266821, 24907649]
1131B4907649l005948p961135k613685J0732677J3783768p03797j3933609p000169
1123A4205751J0771427J6179171N751423l712607l492568k419680p387030j1913970
1115A7981917r348690m319612m151767p611612q418102m446256Q76842K735821
1107a6701459r78160n978557l217329R571110J9804613J2986185o064498j6122077
1099f700172p029786P182918R240468J973900J96755O715622R726939K078494
1091B3385138r256116j4784590j3618680r293098k635353N568607J0336560P463553
1083b833979L34593l563338j721735K252149N364061P785824Q516622M398839
1075B0533036l870058r530158p746723k412370j39917l87567J904667N462347
$$ y = [24907649, 21901701, 13940566, 11326881, 22059558, 35843326, 35139529, 21205920, 14205751, 24977178, 41156349, 46907772, 43195165, 39702597, 37282917, 29895887, 17981917, 8633227, 4313615, 161848, -7449764, -15867866, -20314122, -19437280, -16701459, -17679619, -23658176, -26875505, -17304395, 2500218, 15486403, 9421905, -6700172, -13729958, -6547040, 2693428, 4667328, 4864083, 11579705, 21306644, 23385138, 14129022, -655568, -14274248, -23567346, -26202699, -20634092, -10297532, -2833979, -2499386, -6062724, -7784459, -5532310, -168249, 7617575, 16134197, 20533036, 16662978, 7132820, -613903, -3026273, -3166190, -3553757, -1649090, 3813257]
1067C813257L128968n214749r205727k538994O722065P673288K080005r48393
1059E509720q37759m102774r011912n669539O069738J2433837N974963k104655
1051H261619M13526O841006K434384j0893791j5795179m725898R909836J4078111
1043A0523614R076527M389835K469121j237448p538853j0810487p172050p27600
1035a027341K72672p081054j5493226j4004223r49971J2123353J3051757L547102
1027i560931l631139o32934P901842J2692125R384933J38009q560401r385655
1019a654151j424119O069304L752144m427301o292693K56373N039141L790053
1011E108751N241521J3463856J6332901L361533j4533438j7542158m524068O119611
$$ y = [3813257, 6942225, 1727476, -7478251, -10017245, -3295180, 4378108, 6458113, 5509720, 4671961, 569187, -8442725, -14112264, -8042526, 4391311, 10366274, 8261619, 8675145, 15516151, 17950535, 7056744, -8738435, -13464333, -3554497, 10523614, 19600141, 23989976, 26459097, 25221649, 17682796, 6872309, -299741, -1027341, -754669, -7835723, -23328949, -37333172, -38283143, -26159790, -13108033, -9560931, -13192070, -13825004, -5923162, 6768963, 16153896, 16291905, 7731504, -1654151, -3078270, 2991034, 6743178, 2315877, -3976816, -3720443, 1318698, 5108751, 10350272, 23814128, 40147029, 43508562, 28975124, 11432966, 6908898, 13028509]
1003A3028509K180448q415953j1366707l707729N823493P844393R46114p389230
995a056662q404144k879758p08271n641815p064218M242937J7928972J4972023
987A1389064m566540j8963519j3224274K699375J0387855O966309L301666M993463
979B983399O262591J969885l262769j794783N264666Q360386K360137n535240
971A6608272n538683J22145Q65497m166181l484396O655585J2539064L516279
963B7117582r319356r372461k81207K360892j391759K159392J2380422J1642335
955C5295840m638853j7150618j1564791L30535R81069o728419q255168j059439
947a2789844N653299P433540O919894M472424j208955n932186l704936M013668
$$ y = [13028509, 15208957, 6793004, -4573703, -8281432, -2457939, 5386454, 6332568, -1056662, -9460806, -12340564, -13048835, -18690650, -25754868, -21511931, -3582959, 11389064, 6822524, -12140995, -25365269, -22665894, -12278039, -5311730, -2010064, 2983399, 9245990, 11215875, 7953106, 6158323, 11422989, 19783375, 22143512, 16608272, 11069589, 11191734, 12057231, 7891050, 4406654, 11062239, 23601303, 27117582, 17798226, 8425765, 8144558, 10505450, 9113691, 11273083, 23653505, 35295840, 30656987, 13506369, 1941578, 2272113, 3253182, -3475237, -11730405, -12789844, -7136545, 296995, 7216889, 11689313, 10480358, 4548172, 843236, 4856904]
939D856904J0146613J0835000O842916j51279p219423j0153951q547237o543409
931F6134n215712p19134O312047P921287Q04990p100525p900863l429699J727934
922g533541P126549J0219533M700551o618460r250137K205696J2610868Q020733
914B1481792k784269l452575L687044M014431m419641j0713312j0943960j0282192
906a3412682q784826k686309K670747j007710p446463k774506J0143013J3459739
898i838997K691089n846249j232710O294028L992395m163484p100910l997466
890a9202304j493245j254120L59465M579403Q782505J0222493P905069L063195
882A2962461j524036n033620r189844j2165592p650708L586865Q729398o1174
$$ y = [4856904, 15003517, 25838517, 32681433, 32530154, 25310731, 15156780, 6609543, 66134, -5149578, -5868712, 443335, 8364622, 9169612, 2069087, -5831776, -9261475, -7533541, -406992, 9812541, 14513092, 7894632, -1355505, 850191, 13461059, 21481792, 18697523, 15244948, 18931992, 22946423, 18526782, 7813470, -3130490, -13412682, -22197508, -24883817, -22213070, -23220780, -30667243, -33441749, -23298736, -9838997, -7147908, -12994157, -14226867, -7932839, -3940444, -8103928, -15204838, -19202304, -20695549, -21949669, -21590204, -17010801, -8228296, 1994197, 9899266, 12962461, 11438425, 6404805, -2785039, -14950631, -22601339, -19014474, -10285076, -10346250]
874a0346250j0721299o987140O764844J2425003N919952J62534J911571M546873
866C676088M555762O232118P732301J651919p026802l588556J0300620J3639178
858C7172628k211869j8285834j5544811o50910P796123M113240m963068j2457020
850e031521j2463087k152072Q711727M684748j0631732j4218334J805292J5373407
842a3921572Q651727l961144j905108O787619K247249j0413333j0152333K335217
834b0331678N853071m222286q379150L781815J7468162J7403000Q361733J719963
826B1654630k224496p989606j2779791j0929052l552417L527671O858004O218057
818G83000K849619n32974j709293j824794k882657l468054j168441K688720N192507
$$ y = [-10346250, -21067549, -28054689, -21289845, -8864842, -2944890, -2782356, -870785, 3676088, 8231850, 14463968, 22196269, 23848188, 16821386, 13232830, 23533450, 37172628, 34960759, 16674925, 1130114, 479204, 8275327, 12388567, 7425499, -5031521, -17494608, -19646680, -10934953, -6250205, -16881937, -31100271, -29294979, -13921572, -5269845, -9230989, -11136097, -4348478, -2101229, -12514562, -22666895, -20331678, -14478607, -18700893, -27080043, -23298228, -5830066, 11572934, 19934667, 21654630, 19430134, 11440528, -1339263, -12268315, -15820732, -12293061, -5435057, 783000, 3632619, 3099645, 1390352, -434442, -3317099, -6785153, -7953594, -5264874, -72367]
809g2367N965649M692722j083565j0141549j4731387j0262071k489587K056756
801b6065399O145232J3401849J7138622R764284j880107m180405K737242N308294
793B2369612l089621j3864216j6143857q341819L710837J2156798J1202809K838568
785A0839111l453816k656015j014900m069202n875690o00569L731970k727101
777e826212j2801688j1855652j330069M756785L554112M888252J0091431Q830557
769C07516q18261p385234n024780j108824o28903J379475P166583J0586764Q641368
760A3115704N270509O98087q494019j6410429j1704008K043030P652527R59797
752f868802k940571L256024O380822k383364j0230954m764575M456441L469036
$$ y = [-72367, 5893282, 10586004, 9502439, -639110, -15370497, -25632568, -28122155, -26065399, -19920167, -6518318, 10620304, 20384588, 18504481, 14324076, 17061318, 22369612, 19279991, 5415775, -10728082, -19069901, -15359064, -3202266, 8000543, 10839111, 7385295, 4729280, 3714380, -354822, -6230512, -6831081, -3099111, -5826212, -18627900, -30483552, -31813621, -27056836, -23502724, -18614472, -8523041, 307516, -510745, -7895979, -12920759, -14029583, -14658486, -13279011, -6112428, 4474336, 13115704, 18386213, 19084300, 10590281, -5820148, -17524156, -15481126, -7828599, -6868802, -9809373, -6553349, -172527, -2555891, -12786845, -17551420, -13094979, -9625943]
744i625943j791202K307515J1713303J1315207L64142o990829l487992L953813
736G758014O750508K422080p460009j6571912j4919593r95971J1523091R874234
728a619558L10540j503055N940420R170099J122191r314250j0972581m159385
720a1025579K161062J336428m438154o089524K274179J3919622J5408159M702443
712A8248636m323874p32434Q388231R320313Q06372p309127q660472m507718J872374
703A3102301O522827M934304j904546o572381o210565o856275j0330075p591581
695a4905991M780127J3133077O010764n340207l303007O980306N309632j0168077
687B496624j8856050q934459O771475J1665268O258134J321915K404732P520583
$$ y = [-9625943, -11417145, -9109630, 2603673, 13918880, 14283022, 7292193, 3804201, 7758014, 14508522, 16930602, 9470593, -7101319, -22020912, -23016883, -11493792, -1619558, -1309018, -2812073, 3128347, 12298446, 13420637, 4106387, -6866194, -11025579, -8864517, -7528089, -11966243, -18055767, -15781588, -1861966, 13546193, 18248636, 13924762, 13192328, 21580559, 30900872, 31707244, 24398117, 15737645, 11229927, 13102301, 19625128, 24559432, 22654886, 16082505, 9871940, 3015665, -7314410, -14905991, -10125864, 3007213, 9017977, 3677770, 374763, 7355069, 12664701, 2496624, -16359426, -25293885, -18522410, -6857142, -599008, 722907, 3127639, 10648222]
679A0648222J1074908O242293p966360k0494800j8901908o674816J546334J865860
671b2660267L765434R393876P715313m396716j2153345m478067Q160496R852698
663d800578K225891j796267J213536M196716L813405K727253J019260l143519
655E455697o352146l725215J785314L277339J367219K044857M326329R30074p740310
646A369158j1200966m363264L788196K979879l586196m468036L650464J1963395
638A32630J1241506J991877p907551j1762108q710427k495270K411240M408514
630a0689589N454581P564772R062669O621623J283296j230410J464578L648432
622B3179952q94512q858330j0730408l635723M934010O971274K075930n293240
$$ y = [10648222, 21723130, 27965423, 19999063, -495737, -19397645, -26072461, -24526127, -22660267, -18894833, -9500957, -1785644, -6182360, -18335705, -22813772, -14653276, -4800578, -2574687, -4370954, -3157418, 1039298, 4852703, 7579956, 8599216, 5455697, -896449, -4621664, -2836350, 440989, 1808208, 3853065, 8179394, 9109468, 1369158, -9831808, -14195072, -10406876, -7426997, -11013193, -15481229, -11830765, 132630, 11374136, 13366013, 5458462, -6303646, -15014073, -17509343, -15098103, -10689589, -5235008, 2329764, 11392433, 18014056, 19297352, 18066942, 19531520, 23179952, 22285440, 13427110, 2696702, -939021, 3994989, 10966263, 13042193, 7748953]
614G748953j0759108j0496317l227268N323073O246893p59920n806625k834773
606a4565092K130575J963812m31865M91076K024237o73952l824970j357838K945776
597a1298241J556008k373404K00744P339645Q423144L040181K225757Q372502
589A7486336R667082N54769o989243k109162P067613O050595l927215r126918
581A8673857m108084K607000K594362k473625o033907n173397k316096k013489
573A756621o307630j1143904r173210J181754J1912747J4095839Q098993J415488
565A1836698j458917k291352l157304k238510K682518R184905J1287337O033999
557C1879374k152080n731778l126721o65998l527555q409453r232401o393685
$$ y = [7748953, -3010155, -13506472, -16733740, -11410667, -5163774, -5923694, -11730319, -14565092, -12434517, -10470705, -10902570, -10411494, -8387257, -9061209, -12886179, -14244017, -11298241, -9742233, -12115637, -11914893, -4575248, 3847896, 6888077, 9113834, 17486336, 27153418, 27708187, 20718944, 18609782, 25677395, 31727990, 27800775, 18673857, 14565773, 17172773, 19767135, 17293510, 11259603, 6086206, 3770110, 1756621, -4551009, -15694913, -24868123, -23686369, -11773622, 2322217, 10421210, 11836698, 10377781, 8086429, 4929125, 2690615, 5373133, 14558038, 25845375, 31879374, 29727294, 23995516, 20868795, 20202797, 16675242, 8265789, -966612, -7360297]
549g360297m156133j985156L094620P271035L575209m497201m618191N234500
541c441614J0879438K376464r934888j0110492K92903O135601J824847k411794
533d389535K223231J0798851J3198854P077929k066600q494666r789180o399729
525B159155j501078N77592j213839k759937L75472O675824R368243M021912n926736
516A1776608j2637192j2224079p499464k233919L669834J0548060J3957393Q883830
508A4241071j750268q582658o961398j572640J699148L162842N385412O705386
500A2326895L775058j914454n247365m828007m813808q259532j1642473q649393
492b9253079J133768J0011374J0507537M371116J1782J418916M142838L122401
$$ y = [-7360297, -11516430, -13501586, -10406966, -3135931, 439278, -4057923, -8676114, -3441614, 7437824, 9814288, -120600, -10231092, -9938189, -3802588, -1977741, -4389535, -2166304, 8632547, 21831401, 28909330, 26842730, 18348064, 8558884, 2159155, 658077, 1235669, 21830, -2738107, -2362635, 4313189, 13681432, 17703344, 11776608, -860584, -13084663, -20584127, -22818046, -19148212, -8600152, 5357241, 14241071, 12490803, 3908145, -3053253, -4625893, -2926745, 236097, 5621509, 12326895, 16101953, 14187499, 8940134, 4112127, -701681, -8961213, -20603686, -29253079, -28119311, -18107937, -7600400, -3229284, -3217502, -1798586, 2344252, 5466653]
484E466653j065642o006047j0904293j2378305m663349R253079J4860802M583069
476h54033q026432n410833Q140904J3421353N928153J0804K470118K203216p264979
467A0618271j3825176o654233N206077P500155K099349k49346J073097n17049
459E251145l786524k227044K592649L544320R64868Q91464K384533j324341r466706
450a175636j2568498o018833L732923Q207972O022468K029694J373675M204100
442E807865M834245n82326n580772p97124Q812766P178230p004766j3799979k792288
433c924149P033931l106706j7728831r129330J5519716K0887114k280394k1871638
425a4600287j3017728O969389R417358l127422p721399P25912O516882J892540
$$ y = [5466653, 4401011, -1605036, -12509329, -24887634, -29550983, -20297904, -5437102, -854033, -8880465, -14291298, -6150394, 7270959, 13199112, 13209916, 15680034, 17883250, 10618271, -3206905, -9861138, -4655061, 2845094, 4944443, 4695097, 5768194, 5251145, 1464621, -762423, 1830226, 5374546, 6339414, 7230878, 9615411, 8291070, -1175636, -13744134, -19762967, -16030044, -7822072, -1799604, 230090, 1603765, 5807865, 10642110, 10059784, 4479012, 3681888, 12494654, 19672884, 12668118, -1131861, -3924149, 3109782, 3076, -17725755, -26855085, -11335369, 9551745, 7271351, -14600287, -27618015, -20648626, -11231268, -14358690, -22080089, -21354177, -14837295, -12944755]
417a2944755l642139k524707L90062j22881q38809J822192M763696M297968K133702
408f665671P34043j519330n575374o685876m65491P971187Q080407j315004p933946
399a3375055j908516R215434R884791j009957q149872k502817N865845M396229
391B416082l435641o430728l589581j111414J546255Q018049J2271043N758123
383A5442188m840139m120712P421946J2672233M395375n183809o220871m783637
375A4782574o758686n772366J610825M495471m346255j2227343m600256J0466526
367b349510J3347031K248951o089908k817450K549104k19320p512296r410373
359a0253771k929396O216125R968915M636425m822625p991703o53764Q658178
$$ y = [-12944755, -16586894, -19111601, -18721539, -18844420, -19683229, -17861037, -13097341, -8799373, -6665671, -5931628, -7450958, -13026332, -19712208, -20177699, -12206512, -4126105, -5441109, -13375055, -15283571, -6068137, 3816654, 2806697, -5343175, -7845992, -1980147, 2416082, -1019559, -7450287, -11039868, -12151282, -10605027, -2586978, 9684065, 15442188, 10602049, 6481337, 13903283, 26575516, 30970891, 25787082, 19566211, 14782574, 8023888, 2251522, 3862347, 8357818, 4011563, -8215780, -12816036, -2349510, 10997521, 13246472, 7156564, 4339114, 6888218, 6668898, -843398, -10253771, -13183167, -6967042, 3001873, 7638298, 2815673, -5176030, -5829794, 2828384]
351B828384Q579612p00292q170671n695719L464005Q878710L295349r162306j4799222
342a1482150n441732Q562928R476392k688493r243538j555685N539532o79917
334g512663q715920l264517O600920K335160j0213146q112327J0072140J9892349
326A081996Q929247n953072p542068j788664l81363J92984O437235J0365890K103935
317A3446120j0484687j2099226l229695K833917J632630Q13933L878817N160499
309A952308J850041j179413j086504j915114o412126j0177368p511546J210687
301b3269035J0061632J2805994P781958K56001j594813L789054Q320329M754994
293B2906114k947137n331110j018835K127445j388994q201552j1523322q140997
$$ y = [2828384, 11407996, 10707704, 2537033, -3158686, 305319, 9184029, 12479378, 3317072, -11482150, -16923882, -8360954, 1115438, -1573055, -10816593, -12372278, -6832746, -7512663, -16228583, -19493100, -12892180, -10557020, -20770166, -28882493, -18810353, 1081996, 10011243, 4058171, -3483897, -5272561, -5653924, -5460940, 976295, 11342185, 13446120, 2961433, -9137793, -12367488, -9533571, -7900941, -7087008, -3208191, 1952308, 3802349, 2622936, 1536432, -378682, -6790808, -16968176, -24479722, -23269035, -13207403, -401409, 7380549, 7636550, 6041737, 9830791, 18151120, 22906114, 19958977, 14627867, 13609032, 15736477, 14347483, 6145931, -5377391, -13518388]
285a3518388J04267P593494Q395915K760847j318503J962881O829202L360685
277A6170400o827674j0983955k942376P808594Q958038R54362n709282m861587
269B566520m59459J038315m47286O67315O709700J0853507M156451j0396526j7122958
260b434421o871413Q260736R203085l950936j2673270p393513N63696q3345k652657
251a8032038L023497J0097634M848922q805237j2399373j45394J2781531J2569705
243C939247L774860j898450k437066k956703m353845l541750p58936Q68092Q46690
234f517861R58568J199155J87523k075719m600111o197372m268089L074122J1612030
225f627754J3180152O439825l78369j491538j352498m639870o317672q90407M973492
$$ y = [-13518388, -13414121, -5820627, 2575288, 5336135, 4017632, 5980513, 12809715, 16170400, 9342726, -1641229, -4583605, 3224989, 12183027, 13137389, 7428107, 2566520, 2107061, 3145376, 2698090, 3365405, 10075105, 20928612, 25085063, 14688537, -2434421, -9305834, -1045098, 8157987, 4207051, -8466219, -15859732, -15296036, -15379381, -18032038, -15008541, -4910907, -61985, -8867222, -21266595, -21411989, -8630458, 3939247, 7714107, 5815657, 3378591, 421888, -3931957, -7473707, -8232643, -7364551, -6517861, -5559293, -4360138, -4172615, -6248334, -10848445, -17045817, -21313906, -18239784, -6627754, 6552398, 12992223, 12613854, 11122316, 9769818, 5129948, -1187724, -2078131, 2895361]
216B895361J262063p581997p482420K873076Q758926K074391o228458l693047
208g122105M724029N504324k772729q750666n405586J939029M841132J844828
200e197744j983973j369990L938329P930788L865888o422787j2029159o146637
192a7415285L799025N694775j88844k446535L172075O961189J031332p258120
184f650388n987039K941224O731679J469730k392809K646190Q737503N163263
176A2659353m091262n944371J550829O359858J283787n618974m725399N31648
168B005469J170740j917058n34357N998853R461400O302436K633733L093376L304377
159C1518969j946566r339986j1395939o589690l16487K217282M54509k801480
$$ y = [2895361, 4157424, -3424573, -10906993, -8033917, 725009, 2799400, -3429058, -7122105, -2398076, 3106248, 333519, -8417147, -13822733, -11883704, -7042572, -5197744, -7181717, -8551707, -4613378, 3317410, 7183298, 760511, -11268648, -17415285, -13616260, -7921485, -8110329, -10556864, -7384789, -423600, 607732, -6650388, -12637427, -9696203, -2964524, -1494794, -3887603, -1241413, 7496090, 12659353, 8568091, 2623720, 4174549, 10534407, 11818194, 6199220, 1473821, 2005469, 3176209, 1259151, 724794, 6723647, 16185047, 22487483, 25121216, 28214592, 31518969, 29572403, 20232417, 8836478, 2246788, 1930301, 4147583, 4602092, 1800612]
151A800612m376381l103641o71982N47801N80809J159776K389019K625516J455126
142B406655k8315j580473l297664l312981J48366M600345N221875J091250m101867
133A147191p022466o541945k198003M056300O290520J229321m958273l912469
125a1909824K238151M370595J558982J644951N821757N475490j823703o138240
117A238159j423245M057653J877294k979527k482219L32127j259397m392618k433691
108g465464K674358N328322P051357J0533954R622238r81733j1487280p948573
100G327179N487048J0824052J757248j0151547j4922616j4257137j0389404q19899
92b5145076J0967931J3960462N671552k218127j247755J886907j473715p139744
$$ y = [1800612, -2575769, -5679410, -6351392, -5803591, -5222782, -4063006, -1673987, 951529, 2406655, 2378340, 797867, -2499797, -5812778, -5664412, -1064067, 4157808, 5249058, 1147191, -5875275, -12417220, -14615223, -10558923, -4268403, -3039082, -7997355, -11909824, -9671673, -5301078, -3742096, -2097145, 3724612, 9200102, 7376399, 1238159, -185086, 3872567, 5749861, 2770334, 288115, 620242, -639155, -5031773, -7465464, -4791106, 537216, 7588573, 18122527, 27744765, 26763032, 15275752, 7327179, 12814227, 23638279, 25395527, 15243980, 321364, -13935773, -24325177, -25145076, -14177145, -216683, 5454869, 3236742, 1988987, 3875894, 2402179, -4737565]
84d737565n978863J111605N984761N892122M495528L686050K232739O45915J064666
75A4396958L228415M745462M141492J112709l774056p482541o037330j21110M392792
66A4602791L838252Q30509j313440l601203p477440j0042707p304809J42726P574640
57b750681J0418074O957712k70508n155069l945822p52596k022183n592751k914512
48f028336N888126Q536373j878188j3822691j0989331N065486J5822505R310088
40A1904032n513492j0846408j322420J1223358J2814515L131005n817886n047969
32A0524735J614089M693208J730319j806192j846438k61825m39790l191288p214991
23C801827r694443p124707K25369N929554M410369j032549k647852Q50557L890344
$$ y = [-4737565, -10716428, -9604823, -3620062, 2272060, 6767588, 10453638, 12686377, 13332292, 14396958, 17625373, 22370835, 26512327, 27625036, 23850980, 16368439, 10331109, 10209999, 14602791, 18441043, 19271552, 17958112, 14356909, 6879469, -3163238, -10468047, -10325321, -2750681, 7667393, 14625105, 14354597, 9199528, 5253706, 4501110, 2478927, -3113824, -6028336, -140210, 8396163, 6517975, -7304716, -18294047, -13228561, 2593944, 11904032, 6390540, -4455868, -5778288, 5445070, 18259585, 21390590, 15572704, 10524735, 12138824, 16832032, 18562351, 16756159, 14909721, 14647896, 14208106, 11016818, 3801827, -5892616, -13017323, -12791954, -6862400, -2452031, -3484580, -6132432, -5281875, -1391531]
14a391531K999179m51569m654130p307080l701130O301408J2109244M429502q131396
5B02497p742005O715934J6599129R615906m995102
0B0396359
$$ y = [-1391531, 1607648, 1156079, -3498051, -10805131, -14506261, -8204853, 3904391, 8333893, 202497, -7539508, -823574, 15775555, 25391461, 20396359]
##END NTUPLES=NMR SPECTRUM
##END=
