##TITLE=31Pdec_LR-618-R4-C1LC
 CDCl3, 124 sc
 7.07.2021
##JCAMPDX= 6.0         $$ Bruker NMR JCAMP-DX V2.0
##DATA TYPE= NMR SPECTRUM
##DATA CLASS= NTUPLES
##ORIGIN= UXNMR, Bruker Analytische Messtechnik GmbH
##OWNER= root
$$ XWIN-NMR		Version 3.5
$$ Wed Jul  7 13:33:43 2021 Russian Standard Time (UT+4h)  she@DPX200
##.OBSERVE FREQUENCY= 81.013821
##.OBSERVE NUCLEUS= ^31P
##.ACQUISITION MODE= SIMULTANEOUS
##.ACQUISITION SCHEME= undefined
##.AVERAGES= 124
##.DIGITISER RES= 16
##SPECTROMETER/DATA SYSTEM= spect
##.PULSE SEQUENCE= zgpg30
##.SOLVENT NAME= CDCl3
##.SHIFT REFERENCE= (INTERNAL, CDCl3, 0, 248.564)
##AUDIT TRAIL= $$ (NUMBER, WHEN, WHO, WHERE, WHAT)
$$ ##TITLE= Audit trail, XWIN-NMR		Version 3.5
$$ ##JCAMPDX= 5.01
$$ ##ORIGIN= Bruker BioSpin GmbH
$$ ##OWNER= she
$$ F:/spectra/data/she/nmr/P31/1/pdata/1/auditp.txt
$$ ##AUDIT TRAIL=  $$ (NUMBER, WHEN, WHO, WHERE, WHAT)
(   1,<2021-07-07 13:30:57.18 +0400>,<she>,<DPX200>,
      <continue with go, POWCHK disabled, PULCHK disabled
       configuration hash MD5:
       00 E9 B6 7A A2 85 ED C7 34 08 36 98 17 FE 4E 26
       data hash MD5: 32K
       FD 02 8B 1A D2 21 38 4F F6 95 8D 09 21 29 E3 D1>)
(   2,<2021-07-07 13:32:30.07 +0400>,<she>,<DPX200>,
      <Start of raw data processing
       efp BC_mod = 2 LB = 1 FT_mod = 6 PKNL = 1 PHC0 = -7429.848 PHC1 = 215.2861 SI = 64K 
       data hash MD5: 64K
       06 FB 9A AE 7E D8 89 2E 5B 40 B1 2A EB 35 95 B7>)
(   3,<2021-07-07 13:33:10.00 +0400>,<she>,<DPX200>,
      <pk PHC0 = -550.063 PHC1 = 477.8002 
       data hash MD5: 64K
       D2 1F 26 E7 1C 12 34 53 94 D1 45 86 69 69 52 6B>)
(   4,<2021-07-07 13:33:13.07 +0400>,<she>,<DPX200>,
      <abs ABSG = 5 
       data hash MD5: 64K
       58 5B B0 E9 BC D3 6A C4 50 72 29 85 D8 9D 28 BE>)
$$ ##END=
$$ 
$$ hash MD5
$$ 58 BA D8 8B 57 4E DD CE 0C 57 09 41 13 79 5F 40
##$RELAX= 
##$RELAX= 
##$RELAX= 
##$RELAX= 
##$RELAX= 
##$RELAX= 
##$RELAX= 
##$RELAX= 
$$ Bruker specific parameters
$$ --------------------------
##$DU= <F:/spectra>
##$EXPNO= 1
##$NAME= <P31>
##$PROCNO= 1
##$TYPE= <nmr>
##$USER= <she>
##$AMP= (0..31)
100 100 100 100 100 100 100 100 100 100 100 100 100 100 100 100 100 100 
100 100 100 100 100 100 100 100 100 100 100 100 100 100 
##$AQSEQ= 0
##$AQ_mod= 1
##$AUNM= <au_zg>
##$AUTOPOS= <>
##$BF1= 81.014009
##$BF2= 200.13
##$BF3= 200.13
##$BF4= 200.13
##$BF5= 200.13
##$BF6= 200.13
##$BF7= 200.13
##$BF8= 200.13
##$BYTORDA= 1
##$CFDGTYP= 0
##$CFRGTYP= 5
##$CHEMSTR= <none>
##$CNST= (0..31)
1 1 145 1 1 1 1 1 1 1 1 1 1 1 1 1 1 1 1 1 1 1 1 1 1 1 1 1 1 1 1 1 
##$CPDPRG= <waltz16>
##$CPDPRG1= <>
##$CPDPRG2= <waltz16>
##$CPDPRG3= <>
##$CPDPRG4= <mlev>
##$CPDPRG5= <mlev>
##$CPDPRG6= <mlev>
##$CPDPRG7= <mlev>
##$CPDPRG8= <mlev>
##$CPDPRGB= <>
##$CPDPRGT= <>
##$D= (0..31)
0 1 0 0 0 0 0 0 0 0 0 0.03 2e-05 3e-06 0 0 0 0 0 0 0 0 0 0 0 0 0 0 0 0 
0 0 
##$DATE= 1625650092
##$DBL= (0..7)
120 120 120 11 120 120 24 19 
##$DBP= (0..7)
150 150 150 150 150 150 150 150 
##$DBP07= 0
##$DBPNAM0= <>
##$DBPNAM1= <>
$$ [...]
##$SUBNAM3= <"">
##$SUBNAM4= <"">
##$SUBNAM5= <"">
##$SUBNAM6= <"">
##$SUBNAM7= <"">
##$SUBNAM8= <"">
##$SUBNAM9= <"">
##$SW= 501.771253377433
##$SWIBOX= (0..15)
0 1 3 0 0 0 0 0 0 0 0 0 0 0 0 0 
##$SW_h= 40650.406504065
##$TD= 32768
##$TD0= 1
##$TE= 0
##$TE2= 300
##$TE3= 300
##$TEG= 300
##$TL= (0..7)
0 120 53 12 22 120 120 120 
##$TP= (0..7)
150 150 150 150 150 150 150 150 
##$TP07= 0
##$TPNAME0= <>
##$TPNAME1= <>
##$TPNAME2= <>
##$TPNAME3= <>
##$TPNAME4= <>
##$TPNAME5= <>
##$TPNAME6= <>
##$TPNAME7= <>
##$TPOAL= (0..7)
0.5 0.5 0.5 0.5 0.5 0.5 0.5 0.5 
##$TPOFFS= (0..7)
0 0 0 0 0 0 0 0 
##$TUNHIN= 0
##$TUNHOUT= 0
##$TUNXOUT= 0
##$USERA1= <user>
##$USERA2= <user>
##$USERA3= <user>
##$USERA4= <user>
##$USERA5= <user>
##$V9= 5
##$VALIST= <valist>
##$VCLIST= <CCCCCCCCCCCCCCC>
##$VD= 0
##$VDLIST= <DDDDDDDDDDDDDDD>
##$VPLIST= <PPPPPPPPPPPPPPP>
##$VTLIST= <TTTTTTTTTTTTTTT>
##$WBST= 1024
##$WBSW= 4
##$XGAIN= (0..3)
0 0 0 0 
##$XL= 0
##$YL= 0
##$YMAX_a= 12204
##$YMIN_a= -15363
##$ZGOPTNS= <>
##$ZL1= 120
##$ZL2= 120
##$ZL3= 120
##$ZL4= 120
##$ABSF1= 248.5645
##$ABSF2= -253.2056
##$ABSG= 5
##$ABSL= 3
##$ALPHA= 0
##$AQORDER= 0
##$ASSFAC= 0
##$ASSFACI= 0
##$ASSFACX= 0
##$ASSWID= 0
##$AUNMP= <proc_1d>
##$AZFE= 0.1
##$AZFW= 0.5
##$BCFW= 0
##$BC_mod= 2
##$BYTORDP= 0
##$COROFFS= 0
##$CY= -3
##$DATMOD= 1
##$DC= 0
##$DFILT= <>
##$DTYPP= 0
##$F1P= 0
##$F2P= 0
##$FCOR= 1
##$FTSIZE= 65536
##$FT_mod= 6
##$GAMMA= 0
##$GB= 0
##$INTBC= 1
##$INTSCL= 5.30512e-09
##$ISEN= 30
##$LB= 1
##$LEV0= 0
##$LPBIN= 0
##$MAXI= 10000
##$MC2= 0
##$MEAN= 0
##$ME_mod= 0
##$MI= 50
##$NCOEF= 0
##$NC_proc= -7
##$NLEV= 6
##$NOISF1= 182.463
##$NOISF2= 159.3651
##$NSP= 0
##$NTH_PI= 0
##$NZP= 0
##$OFFSET= 248.5645
##$PC= 4
##$PHC0= -7979.911
##$PHC1= 693.0863
##$PH_mod= 1
##$PKNL= yes
##$PPARMOD= 0
##$PSCAL= 0
##$PSIGN= 0
##$REVERSE= no
##$SF= 81.014009
##$SI= 65536
##$SIGF1= 159.3651
##$SIGF2= -187.1042
##$SINO= 113.3802
##$SIOLD= 16384
##$SREGLST= <1H.CDCl3>
##$SSB= 0
##$STSI= 65536
##$STSR= 0
##$SW_p= 40650.406504065
##$SYMM= 0
##$S_DEV= 0
##$TDeff= 32768
##$TDoff= 0
##$TI= <>
##$TILT= no
##$TM1= 0
##$TM2= 0
##$TOPLEV= 0
##$USERP1= <user>
##$USERP2= <user>
##$USERP3= <user>
##$USERP4= <user>
##$USERP5= <user>
##$WDW= 1
##$XDIM= 65536
##$YMAX_p= 517206813
##$YMIN_p= -84183218
$$ End of Bruker specific parameters
$$ ---------------------------------
##NTUPLES= NMR SPECTRUM
##VAR_NAME=  FREQUENCY,     SPECTRUM/REAL,   SPECTRUM/IMAG
##SYMBOL=    X,             R,               I
##VAR_TYPE=  INDEPENDENT,   DEPENDENT,       DEPENDENT
##VAR_FORM=  AFFN,          ASDF,            ASDF
##VAR_DIM=   65536,         65536,           65536
##UNITS=     HZ,            ARBITRARY UNITS, ARBITRARY UNITS
##FACTOR=    0.620285442955139, 1,           1
##FIRST=     20137.2065510759, 0,            0
##LAST=      -20513.1999529892, 0,           0
##MIN=       -20513.1999529892, -84183218,   0
##MAX=       20137.2065510759, 517206813,    0
$$ Real data points
##PAGE= N=1
##DATA TABLE= (X++(R..R)), XYDATA
$$ [...]
13031E49447M718109k173592o218557l151017J426440J884504K01431J79434N69973
13022b013828j185519l202625k202224R06293K752510K374780J104365M8329K59355
13013a158564K508203M630274K760577k283100m302705p92920K197637q88150
13005B671252n878552n206292m5012J726210j658041l296797J023492O307095
12997d356645O224909J829790j561644k099162j563072m13939K454279N603236
12989F117752N066498j92591n614606n908893j331490K922939L228907J274445
12981E562961O09151J465867J059824j757871m501300m162183p82455K718941
12973B12935L418922R22751k177863k624933j92386J664949K35508k496648k581312
$$ y = [549447, 5267556, 3093964, -3124593, -6275610, -4849170, -2964666, -2763235, -2583801, -2013828, -3199347, -6401972, -8604196, -7697903, -4945393, -2570613, -1466248, -1417919, -1158564, 1349639, 5979913, 8740490, 6457390, 2154685, 1361765, 3559402, 2671252, -3207300, -8413592, -8458604, -6732394, -8390435, -11687232, -10663740, -4356645, 1868264, 3698054, 2136410, 37248, -1525824, -1939763, 514516, 6117752, 11184250, 10991659, 5377053, -531840, -1863330, 1059609, 4288516, 5562961, 6172112, 7637979, 8697803, 6939932, 2438632, -1723551, -2506006, 212935, 3631857, 4554608, 2376745, -248188, -440574, 1224375, 1459883, -1036765, -3618077]
12964c618077J82691K332637K141720J366347J279742P11547q78820j880271j527154
12955A10362j189204j248724r1945K162542K583869J61687j994926j508234q1908
12946a096481M36088J137620K239778R78794k682429l386812J158048M221837
12938C006443j96894o262576m381002K639090L090524m028154n788259M026203
12930g894625J3044517P686688o197661j1183671k622283O277003L926259m878939
12922a842712p461908j98207Q320293Q748084J346723n605872n742536j204824
12914c640959J289989m49993j880254Q47253M897292M960951P83459l274949m644810
12905a112021m398337l315358m65395L539519N536401L606772m66993l551496
$$ y = [-3618077, -3435386, -1102749, 1038971, 2405318, 3685060, 4396607, 3517787, 1637516, 110362, -1078842, -2327566, -2419511, -256969, 2326900, 2488587, 493661, -1014573, -1096481, -660393, 477227, 2717005, 3695799, 1013370, -2373442, -1215394, 3006443, 2809549, -3453027, -7834029, -5194939, -2104415, -6132569, -11920828, -7894625, 5149892, 12836580, 6638919, -4544752, -7167035, -890032, 3036227, -1842712, -9304620, -9502827, -1182534, 7565550, 8912273, 3306401, -2436135, -3640959, -2350970, -2800963, -4681217, -3833964, 1063328, 6024279, 6807738, 3532789, -1112021, -5510358, -8825716, -9291111, -5751592, -215191, 3391581, 2924588, -626908]
12897f26908l980443j701173J858869L660392J716305j426694j141313K351561
12889G10596L446127m75483m440671l211225N87368O90434k983321m691905k177696
12880a2545776N70950O37598M34206K441027M632356M277383K494903J712744
12872D655391J676212J184695Q50875P83709j325789n709994p270567k225984
12864g381452M304504L905280k791133o453481k547317K703090K454235j307123
12856g113397k782124j453190o68823p58039O72737L443663M835588L944724K083697
12847B204836O7855j385561m40959K679594L496342q67466n625660m004965K373182
12838a502802N538616L191772J085141K346288K549117j412698n089767l955792
$$ y = [-626908, -4607351, -6308524, -4449655, -789263, 927042, -499652, -1640965, 710596, 4156723, 3681240, -759431, -3970656, -3383288, -2692854, -5676175, -10368080, -12545776, -11974826, -11337228, -10903022, -8461995, -3829639, 447744, 2942647, 4655391, 6331603, 7516298, 8367173, 9150882, 7825093, 2115099, -5155468, -7381452, -3076948, 828332, -1962801, -8416282, -10963599, -8260509, -5806274, -7113397, -9895521, -11348711, -12017534, -12775573, -12102836, -8659173, -3823585, 121139, 2204836, 2272691, 887130, 446171, 3125765, 6622107, 5754641, 128981, -3875984, -1502802, 4035814, 7227586, 8312727, 10659015, 13208132, 11795434, 6705667, 2749875]
12830B749875q23880j61400m03518J686717L585130J235149k621953k177576J361707
12821D430251J449224k752661n063976k613713L68348Q11285J227413K885926
12813G42097J862797l399650o718182k470347M866221O029366k62943n979737
12805e330378m771433Q62162M192695K328902j709410l024337o0401L662033L578850
12796b71317N4097j835726M85739L255207K255628o43253q34171J469805J991192
12787E927201l18554j928075r12781L21307l87604j862743k570793k907816k742200
12778g382058k83564M291964P178246N512246J191662k233278m019002m975411
12770g19195m269400r53440K893363M111762K780763J477229R65572n0703j329084
$$ y = [2749875, 1925995, 1764595, 1361077, 3047794, 6632924, 7868073, 5246120, 3068544, 4430251, 5879475, 3126814, -1937162, -4550875, -4182527, -3371242, -2143829, 742097, 2604894, -794756, -7512938, -9983285, -5117064, 912302, 649359, -5330378, -10101811, -9239649, -5046954, -2718052, -4427462, -7451799, -7512200, -3850167, -271317, -217220, -2052946, -1567207, 1688000, 3943628, 3300375, 2466204, 3936009, 5927201, 5608647, 3680572, 2767791, 3089098, 2701494, 838751, -1732042, -4639858, -7382058, -7665622, -3373658, 3804588, 9316834, 10508496, 8275218, 4256216, -719195, -4988595, -5942035, -3048672, 1063090, 3843853, 5321082, 6286654, 6235951, 4906867]
12761D906867r98822N57925N28712j400210j617604J651078M407436K198167k728413
12752G505136l959231k23892K440314n06594n042057m023465K218339N486319
12744C894869P84569o326900o625311O79183O983963N605138o8809k130709R83900
12735C779893L208892n5398n610389p003273k829473K151816L192326L67319k722605
12726e520892k994490j59465L426497M524809J922678j785280k584946J46614
12718c024475K701355J845414j150044k859611k454481j740013j470788m80301
12710h632944J570049L178916L254115K358485J349676O28891P48544J573403
12702F029135J017139k479287o140199n216210J7452L776852L002526J538870
$$ y = [4906867, 3908045, 4465970, 4994682, 3594472, 1976868, 3627946, 8035382, 10233549, 7505136, 3545905, 3322013, 5762327, 5255733, 213676, -3809789, -1591450, 3894869, 4679438, -1647462, -8272773, -7593590, -609627, 4995511, 4926702, 2795993, 3779893, 6988785, 6933387, 1322998, -5680275, -8509748, -6357932, -3165606, -2798287, -5520892, -8515382, -8674847, -5248350, -723541, 1199137, -586143, -3171089, -3024475, -323120, 1522294, 372250, -2487361, -4941842, -6681855, -8152643, -8632944, -7062895, -3883979, -629864, 1728621, 3078297, 3707188, 4455732, 6029135, 7046274, 4566987, -1573212, -6789422, -6771970, -2995118, 7408, 1546278]
12694A546278L107263M728663J971739k763877l307110O41501L172057J319861
12686A0416375j320325j253290j90288j268412l965842n353375m160615j696835
12678h792607j9120J5403k19681J388059L960242L507247q39538l432098L49579
12669d082514N807562M824876j494958m294917j150401O82975k363175l583266
12661e653818J743433O558107K634003n667826p502529j181418N311734O614468
12653B856154M035542o31824o269697q315967k775402N131584N398685j982152
12645b553077n645307N17707Q058566O693908r39147m519542j321937J832929
12637B124100K89050k319060j060177K549221L109190n91694l513713j079375
$$ y = [1546278, 4653541, 9382204, 11353943, 8590066, 5282956, 5924457, 9096514, 10416375, 9096050, 7842760, 7652472, 6384060, 2418218, -2935157, -7095772, -8792607, -8811727, -8796324, -9016005, -7627946, -3667704, -160457, -999995, -4432093, -4082514, 1725048, 6549924, 5054966, 760049, -390352, 292623, -2070552, -5653818, -3910385, 2647722, 5281725, -386101, -7888630, -9070048, -3758314, 2856154, 6891696, 6259872, -9825, -8325792, -11101194, -5969610, -570925, -2553077, -8198384, -7680677, 377889, 7071797, 6132650, 1613108, 291171, 2124100, 2413150, 94090, -966087, 1583134, 4692324, 4100630, 586917, -492458]
12629d92458M157456N230062J18531n090503m490458l51073J211594k26226o6369
12620E56K340310K448351q32781k360047M55741K506019q16075n428398m323152
12611f009476J759782N372857K605496k933277n948661m874950j273858K492897
12603h809190M199823K951672K95041j286601j100727l81248j76352l41068k26856
12594d875506N40189J500623J314632n95105k352106j512879J227550K777576
12586a975026K357284K127728K475855R43820k477036l718111j164865Q55618
12578e74733j013080l276330j590284J438952O00294k866975l472364q66904J69372
12569a1452052j552644k122968j59073R81327j6532J28196K878114M630493K608212
$$ y = [-492458, 3664998, 8895060, 9013591, 3923088, -567370, -918443, 293151, 66925, 556, 2340866, 4789217, 3956436, 1596389, 2052130, 4558149, 3742074, -1686324, -6009476, -4249694, 1123163, 3728659, 795382, -5153279, -10028229, -11302087, -8809190, -4609367, -1657695, -1362654, -2649255, -3749982, -4131230, -4307582, -4648650, -4875506, -4335317, -2834694, -1520062, -2115167, -4467273, -5980152, -4752602, -1975026, 382258, 2509986, 4985841, 5929661, 3452625, -265486, -1430351, -574733, -1587813, -4864143, -6454427, -5015475, -4415181, -7282156, -10754520, -11621424, -11452052, -13004696, -15127664, -15286737, -14305410, -14321942, -14193746, -11315632, -6685139, -4076927]
12560d076927p52283j929554p32033J547958M235174N546828L191269j120082
12552E910350k297867O16915K405629m2755k609210r82050K146590J872430r85380
12543F034652k202705j366624j300543k491001l221110l427771l616856j865162
12535a3457120L046104P260875O003079Q83476k243741j641666m41013n2159J044173
12526D02008K184287N76499k879304l869700j750374m02373r38268m4201K647856
12517d073570K570937j353882l287333J70421L673455J658797k651276l258717
12509f551168j246188r58080n24567M616745J0923758R537521M16028n861075
12501A0352974l199381J545370j94785n985990p204704k023430L212646L653513
$$ y = [-4076927, -4829210, -6758764, -7490797, -5942839, -1707665, 3839163, 7030432, 5910350, 3612483, 4229398, 6635027, 6592272, 3983062, 3001012, 5147602, 7020032, 6034652, 3831947, 2465323, 1164780, -1326221, -4547331, -7975102, -11591958, -13457120, -10411016, -3150141, 2852938, 3736414, 1492673, -148993, -590006, -642165, 402008, 2586295, 3162794, 283490, -3586210, -5336584, -5738957, -6677225, -6721426, -4073570, -1502633, -2856515, -6143848, -5973427, -2299972, -641175, -3292451, -6551168, -7797356, -8755436, -9280003, -4663258, 6260500, 15798021, 16214049, 10352974, 7153593, 8698963, 8504178, 2518188, -4686516, -6709946, -3497300, 156213]
12493A56213J008938q97234r62880k55049L34055O59503R31754J245272J115885
12484C336457J88423m16791O13305J561431j125207o506969p770057j133235O887907
12475d364736O777071p87912n501312j674641M756140N910681K369814n52238
12467F932867j837322l869442n546147l284930J700936L672332R88908j267483
12459b510281M96213K644027L50291m398676n318398n08304N449715P468953M789100
12450H462640J7532l861834n206636m444727l408194k866266j445239J645346
12442a1107378M298972M311615L131825L530603M375403J898669l490189o144583
12434H04937k783362K615554M225704J753177p50953j304669j559169k740945
$$ y = [156213, 1165151, 267917, -694963, -950012, -615957, 43546, 975300, 2220572, 3336457, 3524880, 3108089, 3721394, 5282825, 4157618, -2349351, -10119408, -11252643, -4364736, 2412335, 1624423, -3876889, -5551530, -795390, 5115291, 7485105, 6932867, 5095545, 1226103, -4320044, -7604974, -5904038, -2231706, -1242798, -2510281, -2014068, 629959, 980250, -3418426, -8736824, -9245128, -3795413, 3673540, 8462640, 8480172, 4618338, -588298, -5033025, -8441219, -11307485, -12752724, -11107378, -6808406, -2496791, 635034, 4165637, 8541040, 10439709, 6949520, 804937, -1978425, 637129, 4862833, 6616010, 5865057, 4560388, 3001219, 260274]
12426B60274l347340j434183K551586N623822M457327j379691p755673r145215
12418a0169093m593853J272021M325192N332322O239610N439509P87542m891631
12410C741619o300855l024899K01662M52252o62584j362798j919849j625138J437595
12401i062995N759077O298831J599972l228455l507390q27160J359682L509769
12393A901331O747207P783357L099378m100992p339628o049728n012569n121247
12385h092891j874958N375988R605713N372128l045083p201414m828321l49124
12377e037962K312984K827846J852005m5407j006548P40542L691965M284013J754458
12368A1373896r34128j503299r63079j038285j648303k146132k705104l051574
$$ y = [260274, -3087066, -4521249, -1969663, 3654159, 8111486, 6731795, -1023878, -10169093, -14762946, -13490925, -9165733, -3833411, 2406199, 7845708, 8633250, 3741619, -2559236, -5584135, -5382473, -4930221, -5592805, -6955603, -8875452, -10500590, -9062995, -3303918, 2994913, 4594885, 1366430, -2140960, -2968120, -1608438, 1901331, 8648538, 16431895, 19531273, 15430281, 8090653, 2040925, -2971644, -8092891, -9967849, -4591861, 5013852, 10385980, 7340897, 139483, -4688838, -5037962, -2724978, 102868, 1954873, 1909466, 902918, 1643460, 5335425, 9619438, 11373896, 10439768, 8936469, 7973390, 6935105, 5286802, 3140670, 435566, -2616008]
12360b616008j955572M54380J930641J409541R40912K128377K816737L29186l678970
12351A759224n144327l307629p67952J314905L661489M855553K217257k377072
12343B211448l197153O42085K911800M1720k830047p09199K121324p10817n660600
12334e179439l881295L911529P361057K208506l643145k915845J056574J988569
12326I06511O83981J173062K617439J749195p27688k263374l400362m886035l687055
12317g834326J798991O205955M062344q26202q09638L055068K847824k632922
12309E867094n749689k731333P88087Q3j663049J67628L080345K848136O91581
12300C298883L1111J11527j701396m261364m289934j638402J156263K653458K476561
$$ y = [-2616008, -4571580, -4117200, -2186559, -777018, 163894, 2292271, 5109008, 5438194, 1759224, -3385103, -6692732, -7460684, -6145779, -2484290, 2371263, 4588520, 2211448, -985705, -343620, 2568180, 2609900, -220147, -929346, 1191978, 481161, -5179439, -9060734, -5149205, 2211852, 4420358, 777213, -2138632, -1082058, 906511, 1590492, 2763554, 5380993, 7130188, 6402500, 4139126, 738764, -4147271, -7834326, -6035335, 170620, 4232964, 3406762, 2597124, 5652192, 8500016, 5867094, 117405, -2613928, -1825841, -1825758, -3488807, -3321179, -240834, 2607302, 3298883, 3329994, 3441521, 1740125, -2521239, -6811173, -8449575, -7293312, -4639854, -2163293]
12291b163293j11088m035858n193020j268936M068898N423989K447817r23215
12283a754706k090766j209604J056761L432603L357099K27113k182874l84303
12275D51323L182920L271072n38389l574598k837427J0907K056640J862537p12971
12266C172014l812468l470571J772440O813165N051024k523112p775055n471205
12258f243768J140392N302064L565794k564901p958804o887386J002783P967114
12250d676712O374442n64643k456059L298493P654807L704122l333706m944808
12242E055936j784682n43417k607918l291510n92649K002147J555813m68906j076359
12233a751545P49234L518848M183564P61581m034742m214579J598934O609816
$$ y = [-2163293, -2274381, -6310239, -11503259, -12772195, -8703297, -3279308, -831491, -1754706, -3845472, -5055076, -3998315, -565712, 2791387, 3018500, 835626, 451323, 3634243, 6905315, 6366926, 2792328, -45099, -34192, 2022448, 3884985, 3172014, -640454, -4111025, -2338585, 4474580, 9525604, 7002492, -772563, -6243768, -5103376, 198688, 3764482, 1199581, -6759223, -13646609, -12643826, -4676712, 1697730, 1133087, -1322972, 1975521, 9630328, 13334450, 10000744, 5055936, 3271254, 2727837, 119919, -3171591, -3764240, -1762093, -206280, -675186, -1751545, -1002311, 2516537, 6700101, 7461682, 3426940, -787639, 811295, 7421111]
12225G421111M232688k637221n815439l285515m74432q23276j530217J91430K312957
12216d07914J995556L76351M62818K479155L548064J217578l379943n640128k078213
12207a426676M225654N702574L50883m144202j025264M718813L370380m225275
12199G546887p548288k469183L311453L111975J50974n21555l00087j596390j722001
12190c6215J167675K508097j102754m543792k228185J688658P4579m398917l309716
12181a0180570L108104O184327K996072m0646R26633J528149j533241m174404
12173a185576k283583J444549K569520J434935O02751M05084N18410J551594K197533
12164G255217k92285m076507l139299K629898M568066j984234q644739n555886
$$ y = [7421111, 11653799, 9016578, 3201139, -84376, -558808, -1382084, -2912301, -2720871, -407914, 1587642, 1963993, 2426811, 4905966, 8454030, 9671608, 6291665, 651537, -1426676, 2798978, 8501552, 8852435, 4708233, 3682969, 8401782, 11772162, 7546887, -1401, -2470584, 840869, 3952844, 4103818, 3582263, 3282176, 1685786, -36215, 1131460, 3639557, 2536803, -2006989, -4235174, -2546516, -2471937, -6870854, -10180570, -7072466, -888139, 2107933, 2067287, 2993920, 4522069, 2988828, -1185576, -3469159, -2024610, 544910, 1979845, 2582596, 2987680, 3506090, 5057684, 7255217, 6962932, 2886425, -252874, 2377024, 6945090, 4960856, -3683883, -9239769]
12156i239769L211990N523438m08950m302478p10194L201103M72629m268550k838623
12147i359404L258450N535727J697197j687063J02379L243505K117358j965301
12139B942848l125714J36399L112550K279073K27798Q18989K497484N42190m944011
12130D487606p835651m116216K388437N034879K735668L6173K1325R04896K45935
12121C903052p48237N77355L456941L923515J63859m647038o194636l998562n10833
12112d074584L175127P131496Q602952L410403o451547j1607421o266015L094386
12104b985203N621641L45125l962989k110339J698034K274377N04661o73027j263865
12095e51585j774519q41982J212215J030355k153065m068667k182239j74852j499420
$$ y = [-9239769, -6027779, -504341, -913291, -5215769, -5925963, -2724860, -2252231, -6520781, -9359404, -6100954, -565227, 1131970, -555093, -452714, 2790791, 4908149, 2942848, -182866, -46467, 3066083, 5345156, 5572954, 6391943, 8889427, 9431617, 4487606, -3348045, -7464261, -5075824, -40945, 2694723, 2730896, 2752221, 3657117, 3903052, 3154815, 3732170, 7189111, 11112626, 11276485, 6629447, 434811, -3563751, -4074584, -899457, 6232039, 14834991, 18245394, 11793847, 186426, -6079589, -2985203, 2636438, 2981563, -981426, -3091765, -1393731, 880646, 1385307, 712280, -551585, -2326104, -3168086, -1955871, -925516, -3078581, -7147248, -9329487, -9504339, -11003759]
12086a1003759l236626j404090J993684K960380K699294M440008O238907L954001
12078F641799o26625j745656J171525L044118J524146n28785j210140k136732
12070F133650l967856m735194l771009k703205j729259P27759M012862N149061
12062h83191L355075P68059j415869l468053m146931j845898J434956K091415
12054d110437P04861P32445J814615M10870k742671k572123J652146M271509K093479
12045B254694r49170p24415J288613K099050J692659L73527k972805o599227n349245
12036h886319J482562O706554M371466j771216l812075l74233L146056K696133
12028C558928n74319l235892k974777l2394K728949K569929N34951m5563J094395
$$ y = [-11003759, -14240385, -15644475, -13650791, -10690411, -7991117, -3551109, 2687798, 6641799, 6015174, 4269518, 5441043, 8485161, 10009307, 9480522, 8270382, 6133650, 2165794, -2569400, -6340409, -9043614, -10772873, -10045114, -6032252, -883191, 2471884, 3239943, 1824074, -1643979, -5790910, -7636808, -6201852, -4110437, -3405576, -2673131, -858516, -447646, -3190317, -5762440, -4110294, 161215, 2254694, 1305524, 581109, 1869722, 3968772, 5661431, 6034958, 3062153, -3537074, -8886319, -7403757, -697203, 3674263, 1903047, -1909028, -2283261, 862795, 3558928, 2984609, -251283, -3226060, -3258454, -529505, 2040424, 2575375, 2529812, 3624207]
12019C624207J159726o2900K22194J639880L09571l290338l106250K444531O310396
12010I251017L368504j666952k570311j265788k333634l841733j708362J490683
12002G23424O58317k284093j539081K290013L390398O02320j829644k225143k599822
11993b813311k689733k64311L063229L352030J196230L50559M24319j754570m313256
11984c448814k046229L832218N869061J540173l371968m124126k495034j184470
11976e429189J94547J428340O23850j117276k13772K615486K698062j23622q31096
11967a54670J256171P02607l540206m797888p7778M087067K850536J471370N164189
11958F961398Q337834L273694o091600r177049m344219K62523L1771j157049L71827
$$ y = [3624207, 4783933, 4721033, 4943227, 6583107, 6892678, 3602340, 496090, 2940621, 9251017, 12619521, 10952569, 8382258, 7116470, 4782836, 941103, -767259, 723424, 1381741, -902352, -2441433, -151420, 3238978, 3841298, 2011654, -213489, -2813311, -5503044, -5767355, -2704126, 647904, 1844134, 2194693, 2619012, 864442, -3448814, -5495043, -1662825, 4206236, 5746409, 2374441, -1749685, -4244719, -5429189, -5234642, -3806302, -3182452, -4299728, -4513500, -1898014, 800048, 676426, -154670, 1101501, 1804108, -1736098, -6533986, -6611764, -2524697, 325839, 1797209, 6961398, 15299232, 18572926, 12481326, 3304277, -1039942, -777419, -745648, -1902697, -1530870]
11949a530870K507497K303590M69562j071126j700746r41436J359201K907756
11941D303428Q71283l228285m205825q3378M801303N078997N43409m277284n260837
11932a457189k365635J047051J971994Q05502J80973J118282K098428K110219
11924E509625K004856J925327M03394k354950l411433j563279J98550o28012k010645
11915G3433j228449K86444j29358j233979j17242K345497K796773P87323j410166
11906B170276l031101m441179l844560N83902N773718O047885P57157m727503
11898g11405o126173m275309j568260J410950M450749O262900N829774L159288
11890H432514j263572n586743o383340k682851J117738N25921k220080j689385
$$ y = [-1530870, 976627, 3280217, 3749779, 2678653, 977907, 36471, 1395672, 4303428, 5174711, 1946426, -2259399, -2342777, 2458526, 7537523, 8080932, 3803648, -1457189, -3822824, -2775773, -803779, 1723, 182696, 1300978, 3399406, 5509625, 7514481, 9439808, 9843202, 7488252, 4076819, 2513540, 2712090, 2084078, 73433, -1155016, -868572, -997930, -2231909, -2349151, -3654, 2793119, 3580442, 2170276, -860825, -5302004, -9146564, -8562662, -2788944, 3258941, 4016098, -711405, -6837578, -11112887, -12681147, -11270197, -6819448, -556548, 5273226, 8432514, 7168942, 1582199, -4801141, -7483992, -6366254, -5840333, -8060413, -9749798]
11882i749798J617775K216776m58471p42630L011975M777099J078526k496397
11874g45145m65825L114165J353291l800939m479620P56854N290612M871721K480165
11865H375279J496771M77746k258388l865638j237478K728816K018428l716019
11857D019517p638400m701683J221283K767799q7465J8247N958345J0104869M863112
11848A6525624n083014q148723j855272M359100L084448k042703m098387k666666
11840G4407j341958q82412k2733P73025J009978K189718M089440K938804k322325
11831F505944o265921m574441j073695j226582k937327j057399K636748K373635
11823e619038j097038j748359J153023K542267J199047R27784J792397n35932
$$ y = [-9749798, -8132023, -5915247, -6373718, -7116348, -4104373, 672726, 1751252, -745145, -1210970, 1903195, 3256486, -544453, -5024073, -4267219, 1023393, 5895114, 8375279, 9872050, 10349796, 8091408, 4225770, 2988292, 5717108, 7735536, 4019517, -3618883, -8320566, -7099283, -4331484, -4418949, -4400702, 1557643, 11662512, 16525624, 11442610, 3293887, 1438615, 5797715, 8882163, 6839460, 2741073, 74407, -1267551, -2149963, -2172696, -1399671, -389693, 1800025, 5889465, 8828269, 6505944, 240023, -4334418, -5408113, -6634695, -9572022, -10629421, -7992673, -5619038, -6716076, -8464435, -7311412, -4769145, -3570098, -2642314, -849917, -1385849]
11815a385849n286868n747397m15710L856415K990928J270894K113046K106806
11807d97735q69433k076227J537571M817917K981841j92923L60120K012786J62269
11798H236186k934374k878330j436240k110077k341454J344156M867870K366142
11790E113879l194792m378341j195958N50225o4827K56760L94213k723690n117524
11781a0360055n77075O671385O312468q91198l228360K704898O263917P03383
11773G599363n911927m645606M49482R18255k297676k716715L11567K637534L148495
11764e07228L146528J713784j738801l758753j601663J583146J616055j20578
11756C32490p4584J058389N62941q86443j101982p36313j221403j389645k53365
$$ y = [-1385849, -6672717, -12420114, -12835824, -8979409, -5988481, -4717587, -2604541, -497735, -1367168, -3443395, -1905824, 2912093, 5893934, 5701011, 6061131, 8073917, 8236186, 5301812, 2423482, 987242, -1122835, -3464289, -2120133, 2747737, 5113879, 1919087, -2459254, -3655212, -3104987, -3169814, -2913054, -2518841, -5242531, -10360055, -10937130, -4265745, 2046723, 1155525, -2072835, 632063, 6895980, 7599363, 1687436, -2958170, -2508688, -1590433, -3888109, -6604824, -6293257, -3655723, -507228, 2639300, 4353084, 2614283, -1144470, -2746133, -1162987, 453068, 332490, 257906, 1316295, 1879236, 992793, -109189, -845502, -2066905, -3456550, -3709915]
11747c709915K42285r45674j373771q6571k56127k641215k221404L247738P413730
11738c30924M764949L4142K80977K984281J279651l263791l482767M07665J421531
11729D095714j481179j777896K678362N710646L025950j674134l471941k585622
11721D519900j484945j034751j392163k278526j608461J781897M411967K269980
11713E184898k148493k916713j27531N83790k009472k668591J079892M629987
11705A607767L635233K7530j797835n46415J926013K816851L79184l224678k722305
11696B101345K665449N694406J035033n270558m486148N38421M40984m037344
11688a318412l556014K164001K800526l817963o329937R72670P534274L653898
$$ y = [-3709915, -3467630, -4413304, -5787075, -5873646, -6129773, -8770988, -10992392, -7744654, -330924, 4434025, 4468167, 4749144, 7733425, 9013076, 5749285, 2266518, 2674183, 4095714, 2614535, 836639, 3515001, 9225647, 12251597, 10577463, 7105522, 4519900, 3034955, 2000204, 608041, -1670485, -3278946, -1497049, 2914918, 5184898, 3036405, 119692, -7839, 575951, -1433521, -4102112, -3022220, 1607767, 5243000, 5270530, 3472695, 2926280, 4852293, 7669144, 8048328, 4823650, 2101345, 4766794, 10461200, 11496233, 6225675, 1739527, 2277948, 2718932, -1318412, -4874426, -2710425, 90101, -3727862, -10057799, -9085129, -1550855, 2103043]
11680B103043l812151l252307L720178P150333M479497O76593j966105m171316
11672D927765m088174m95804K096833k17880l199622j248569K507667J552248
11664A834464k474513k825195O83838K366826R62585J17129K3443k408215n720526
11655g440164m956239n68935J769233N46091q1876J416004J806482K77551L90997
11646f840856L054538M089486J041220l018165m500673l536829j771456p6695
11638a1559430O33351P9620J51604J936177K321197j442804n186216k397830N009015
11629a0455316P867162K836437k877638k328028K090072L770923R72262k905511
11621a029637m440289k657700Q12649K423986N45217r43794K780100Q836222Q428626
$$ y = [2103043, -1709108, -4961415, -1241237, 5909096, 10388593, 11065186, 9099081, 4927765, 839591, 343787, 2440620, 2222740, -976882, -2225451, 282216, 1834464, -640049, -3465244, -2781406, -414580, 548005, 665134, 688577, -1719638, -7440164, -12396403, -12965338, -11196105, -10650014, -10731890, -9315886, -7509404, -7231853, -6840856, -3786318, 303168, 1344388, -1673777, -6174450, -9711279, -11482735, -11559430, -10926079, -10846459, -10694855, -8758678, -6437481, -7880285, -13066501, -15464331, -10455316, -2588154, 248283, -2629355, -4957383, -2867311, 903612, 1875874, -1029637, -5469926, -8127626, -7314977, -4890991, -4345774, -5289568, -2509468, 6326754, 14755380]
11612A4755380o23347r140954q146774k34161N144534L864908m03749l201183
11604B014654l413515j462209J841830M190323K991313j180295m368555l545785
11596b932239r1585J968364Q81759p31660M15824L186046K904986k010153p030290
11587c438948p050053k476241K716331O315795P776681N548691m67729n410077
11579C514450m096936J129446K755508j292038m893182k841258K445932N334321
11571B056243L846977P7280k784689k275438J309113L848530J788859k251877
11563E614998k655522M01025J095057k165544l770197m41674K957741J457571
11555B493455j902556j318119K702306M960348L228959n20858l917909n010531
$$ y = [14755380, 14132033, 4991079, -3155695, -3389856, 1754678, 5619586, 5215837, 2014654, -1398861, -2861070, -1019240, 3171083, 6162396, 4982101, 613546, -2932239, -3023824, -1055460, -173701, -905361, -489537, 2696509, 5601495, 3591342, -3438948, -10489001, -12965242, -10248911, -3933116, 3843565, 9392256, 8924527, 3514450, -582486, 546960, 3302468, 2010430, -2882752, -5724010, -3278078, 2056243, 5903220, 5980500, 3195811, 920373, 2229486, 6078016, 7866875, 5614998, 2959476, 3360501, 4455558, 2290014, -1480183, -1921857, 1035884, 2493455, 590899, -727220, 1975086, 6935434, 10164393, 9643535, 5725626, 715095]
11547G15095k204673K428219L047399k121443o342662l275741L044930L918295
11539g90581p94430l093243K02925L283004J618217j282640p54704J566932J587263
11530A542743l78433j226100o53452p50288j729815j852773o09734J026744K521835
11521b109273L283878J683428k164534l991225j11151N790264N850527o62924
11513G568990m893647q77807M740360J919998p038049r630742j384274P090119
11505b505052N286212k615623n119663j6836M763742M216326J287149r71975l699739
11496F24541o638405n741616l1376M887320M177976J80919k198869k282232j843340
11487h865082n03376K480462M820608M194004K285701J570408N25705l125748
$$ y = [715095, -1489578, 938641, 3986040, 1864597, -4478065, -7753806, -4708876, -790581, -1585011, -4678254, -4475329, -1192325, 425892, -856748, -1611452, -44520, 1542743, 1164310, -61790, -715242, -1465530, -3195345, -5048118, -5657852, -4631108, -2109273, 1174605, 2858033, 693499, -3297726, -3408877, 2381387, 8231914, 7568990, 2675343, 1797536, 6537896, 8457894, 1419845, -8210897, -9595171, -2505052, 2781160, 165537, -4954126, -4970962, -207220, 4009106, 5296255, 4324280, 624541, -6013864, -11755480, -11786856, -6899536, -2721560, -2540641, -4739510, -7021742, -8865082, -9368458, -6887996, -2067388, 2126616, 4412317, 5982725, 6508430, 3382682]
11479C382682o525782m732063J120268M379280K071633j563064j993057j74230
11471d034333Q51268J222453K689800M022360J938945l312430o421345k974013
11463f017295M324942P982123M711054o58215k248973j179088k294179m931478
11455c11109l546429K036481M542002N35530l433163j282914K567391J063378
11447B171167k926695j496254L895912L817320l332913p736732l236660L560307
11439e284548M129248J53223j337947Q87962K655315K148436J022681q8578j917755
11430B368037l667128l755067k331688l04868K189994M027610K866197n10342
11422H82745j349544K008707M365043J476683k743618k696781n67196j878528
$$ y = [3382682, -3143100, -7875163, -6754895, -2375615, -303982, -1867046, -3860103, -4034333, -3183065, -1960612, 729188, 4751548, 6690493, 3378063, -3043282, -6017295, -1692353, 6289770, 11000824, 10342609, 8093636, 6914548, 4620369, -311109, -3857538, -1821057, 2720945, 3256475, -176688, -1459602, 1107789, 2171167, -755528, -2251782, 1644130, 5461450, 2128537, -5608195, -8844855, -5284548, -1155300, -1002077, -2340024, -1452062, 1203253, 3351689, 4374370, 4285792, 2368037, -1299091, -5054158, -7385846, -7690714, -5500720, -1473110, 1393087, 882745, -466799, 1541908, 5906951, 7383634, 4640016, 1943235, 1376039, -502489]
11414e02489m863308l152148K527686M837420J976933l24020j05075k147210o643927
11405h396138n592461L722223J1184948P721573q54949k866280K140677N037924
11397A2097517J972462k350650m324460n076509n033184l117484j184892j744235
11389h761435j894362K551266P739341N830152j516074m059001Q79973M208387
11381D978247P11365k480154N42906L254950j596058p880017n233758L591117
11373d111402O979367K892180L21698K799617L166258k448807o814394l379826
11365e95309K856702L344043j089528k872758L2343J944011r55019m986005m584494
11356f906014K78650M640490M780742J766821r92327j998108k319960k718052
$$ y = [-502489, -5365797, -8517945, -5990259, -1152839, 824094, 500074, 394999, -1752211, -8396138, -13988599, -10266376, 918572, 8640145, 7785196, 4918916, 7059593, 12097517, 14069979, 11719329, 7394869, 2318360, -2714824, -5832308, -7017200, -8761435, -10655797, -8104531, -365190, 5464962, 3948888, -110113, 769860, 4978247, 5689612, 3209458, 3752364, 7007314, 5411256, -2468761, -7702519, -4111402, 2867965, 5760145, 6081843, 8881460, 12047718, 9598911, 2784517, -595309, 2261393, 5605436, 4515908, 1643150, 1675493, 3619504, 2664485, -2321520, -6906014, -6627364, -1986874, 2793868, 4560689, 3568362, 1570254, -749706, -3467758]
11348c467758k075471N22603L640768M753648K860793r18050m170794m139451
11340b993712p7224M220994L212987k841393o352375j970468N271647O330697
11332D801153O72408l621309j847190J730518J866172q5683p5924J463277Q51918
11323E755340k437116m689955l113210O02765K561052J264149r14093r08711J103086
11314g76693K281616J508500P15440R17049K19577j873974j843674K134100N199757
11305H481698K152664l635330m439388n2118K314288J55285q57892K262597M114102
11296A0495906N25824l739609l060868m67820j643572m116376j112921O014917
11288B895481Q108276J557375o184491o884762j698321K232681J474043j147817
$$ y = [-3467758, -5543229, -5020626, -1379858, 3373790, 6234583, 5316533, 1145739, -2993712, -3070936, 1150058, 4363045, 1521652, -4830723, -6801191, -1529544, 4801153, 5473561, 1852252, 5062, 1735580, 3601752, 3516069, 3440145, 4903422, 5755340, 3318224, -1371731, -4484941, -3882176, -1321124, -56975, -971068, -1879779, -776693, 1504923, 3013423, 3728863, 4645912, 4865489, 2991515, 1147841, 3281941, 8481698, 10634362, 6999032, 2559644, 2507526, 4821814, 4977099, 4119207, 6381804, 10495906, 11021730, 7282121, 4221253, 3753433, 2109861, -2006515, -3119436, 2895481, 11003757, 12561132, 6376641, -508121, -2206442, 26239, 1500282, 352465]
11280C52465j814087r0793K018936L190138L673947L604374J995277j426573m393590
11271G110094m239279j657545J68000L08661P86015J800685L58633m008904o163728
11262e537368k018434M531816O152862K071826j515820p85234J098077M4730k671990
11253A370465l028279n16565J383092K00834k503541l406859j305778J912729
11245e893902L594857K858193P37674j405124k761976k753158j140304J233795
11237e529945K868901L142835K539772J315285o97755k728369l218080j997575
11229d304931o80193j03253Q01090K450769K913448O59597k429260l077036r57384
11220d727153J102855J056449k12466r44417q98895p08337o8801J775864L843211
$$ y = [352465, -1461622, -1552415, 466521, 3656659, 7330606, 10934980, 12930257, 11503684, 7110094, 2870815, 1213270, 1381270, 1689931, 2475946, 4276631, 4635264, 626360, -5537368, -7555802, -3023986, 3128876, 5200702, 3684882, 2899648, 3997725, 4042455, 1370465, -1657814, -2174379, -791287, -590453, -3093994, -6500853, -7806631, -5893902, -2299045, 559148, 1296822, -108302, -2870278, -5623436, -6763740, -5529945, -2661044, 481791, 3021563, 4336848, 3639093, 910724, -2307356, -4304931, -4985124, -5088377, -4287287, -1836518, 1076930, 1736527, -692733, -3769769, -4727153, -3624298, -2567849, -2780315, -3724732, -4623627, -5331964, -5400765, -3624901, 218310]
11211B18310L501554L906l278843k432750J446066L117051L36705l063897l011289
11202c163187p41337M06070N09570J240719J248989j356637l736561j591014L031031
11193d152357L663062n22993l266983j152096J794496J861210J314461K597249
11185B136049K988327q9636l384199k690012M99208K295916K794611L804142L450938
11176A1805344q41297n962580n876472k67505M730660M487704L37187l864749
11168D548292n696027m391723n83279L333474M777103L442086J092578m87838
11160F034666m22289R34129J573638k83286k946921k678582N10470K143522Q8603
11151D953950k278090k236245k066902l517527l117708J719785O375527M971416
$$ y = [218310, 3719864, 3723770, 444927, -1987823, -541757, 2575294, 2911999, -151898, -3163187, -3904524, -3498454, -2988884, -1748165, -499176, -1855813, -5592374, -7183388, -4152357, -489295, -1012288, -4279271, -5431367, -3636871, -1775661, -461200, 2136049, 5124376, 5034740, 1650541, -1039471, -540263, 1755653, 4550264, 8354406, 11805344, 10964047, 5001467, -875005, -1142510, 3588150, 8075854, 8413041, 4548292, -1147735, -5539458, -6122737, -2789263, 1987840, 5429926, 6522504, 6034666, 5612377, 6546506, 8120144, 7836858, 4889937, 2211355, 2721825, 4865347, 4953950, 2675860, 439615, -1627287, -5144814, -8262522, -6542737, -167210, 4804206]
11143D804206p21763m396661m106726j945626J657483O216296P058578J199424
11135I765211n116816l814849J763933J153142o079756q755847j788387N695306
11127g178063M658322j099868k870377J05848K886686L933130M502962L241726
11119H180366j308564n511365m578279j14512J979405M7285k006185j305573P68435
11110c848987K010983K219559K065200J822016J633369J412878P26020j76106
11102G864932l19523k7382j108865l582320m454902j863840J599574K081179o65084
11093d76231l734336m694926k804655J248041M563407L437068j614606m667330
11085h743568j635400L601299M398807O65036j984533j145077R0148q2868P97754
$$ y = [4804206, 4082443, -314218, -4420944, -6366570, -4709087, 1507209, 8565787, 9765211, 4648395, 833546, 2597479, 3750621, -2329135, -11084982, -12873369, -7178063, -2519741, -3619609, -6489986, -6384138, -3497452, 435678, 4938640, 8180366, 6871802, 1360437, -3217842, -3332354, -1352949, -1305664, -3311849, -4617422, -3848987, -1838004, 381555, 2446755, 4268771, 5902140, 7315018, 8041038, 7864932, 7545409, 7518027, 6409162, 2826842, -1628060, -3491900, -1892326, 188853, -476231, -4210567, -8905493, -11710148, -10462107, -5898700, -2461632, -4076238, -8743568, -10378968, -6777669, -2378862, -1713826, -3698359, -4843436, -4753288, -4836156, -4038402]
11076d038402L677228M697339J221906k938335k622025R90543K267741o31882
11068B624113l769180l519159p94394J565447K501587K550814K186185J657312
11060E002725J074605O810j605520k160099k41483K185400J564677j542121k396580
11051A888414M62164K078151j175790m935196l170054J998884L386313m5898k413551
11042a926563j227750p04419l073938m162721j053977K479870K540838J347126
11034e781534K109063K909205J090916q95070J08114J764105N39847j535215q93042
11025e83611L26354j745683m555442k930513J306496K118221J7983O76150L426211
11016a943834J579067m595449o031838N06822O168670L783671j185645m74776
$$ y = [-4038402, -361174, 4336165, 5558071, 2619736, -2289, 988254, 3255995, 2624113, -1145067, -4664226, -5458620, -3893173, -1391586, 1159228, 3345413, 5002725, 6077330, 6084140, 4478620, 2318521, 2077038, 4262438, 5827115, 4284994, 1888414, 2350578, 4428729, 3252939, -1682257, -4852311, -2853427, 532886, 486988, -1926563, -3154313, -3858732, -6932670, -11095391, -12149368, -9669498, -7128660, -5781534, -3672471, -763266, 327650, -567420, -459306, 1304799, 1844646, 309431, -583611, -257257, -2002940, -6558382, -9488895, -8182399, -6064178, -6046195, -5370045, -1943834, -364767, -4960216, -10992054, -10485232, -4316562, -532891, -1718536, -2193312]
11008b193312L764177L902964m11284l153600k284901j000933m40125J244067
11000e72947L164268J956638j869963l738408k008284q4087m23901j089947M5481
10991d621150J577789J273025l03029j107603q16312p12121j232777j160902O75449
10982f427631L427625M360557J600615l135631n595625l335162J887445O327004
10974h90803P475840M864350j03660m080875l861895j99518K406643J317652j021902
10965E905832j244899J64242Q38664P86391J317780J606002L9423k211892k633147
10956D568396j496316j062680j534662j396133q22231q02759L3807K991415M698141
10947E176978R34560m980098m781378K113726O281302K270464k865628j165806
$$ y = [-2193312, 1570865, 5473829, 5062545, 1908945, -375956, -1376889, -1817014, -572947, 2591321, 4547959, 2677996, -1060412, -3068696, -3152783, -3576684, -4666631, -4621150, -3043361, -1770336, -2073365, -3180968, -3997280, -4709401, -5942178, -7103080, -6427631, -3000006, 1360551, 2961166, -174465, -5770090, -9105252, -7217807, -890803, 6585037, 11449387, 11345727, 7264852, 3402957, 3203439, 5610082, 6927734, 5905832, 4660933, 4825175, 5663839, 6450230, 7768010, 9374012, 9413435, 7201543, 4568396, 3072080, 2009400, 474738, -921395, -1743626, -2546385, -2512578, 478837, 5176978, 6111538, 1131440, -3649938, -1536212, 4745090, 7015554, 4149926, 2984120]
10939B984120L111121Q75627n968969o938804Q7817N388005K702144k058607j676036
10930a493582J394639J068138j828161k167976N02208K457400K586099K479861
10922D998626J689478j257490m440512m508969j991486J02501J341517K528656
10914a537679J577374k991315o354256k718405M498029O067331Q40218k605558
10906c224261J24231L027822J047972j499727L37064K822494L87692m055819l769955
10897d802487O46348K636276J36277k422221j677201R55948K803231K618019K66018
10888A160208k724937l394484j052888J142048R21356K49286J065922J659364
10880i74125Q94090J366718L785965L514897j385643m312638L3992N357735K893146
$$ y = [2984120, 6095241, 6970868, 1001899, -5936905, -5849088, -461083, 2241061, 182454, -1493582, -98943, 969195, -858966, -3026942, -2524734, -67334, 2518765, 4998626, 6688104, 5430614, 990102, -3518867, -5510353, -5407852, -4066335, -1537679, 39695, -2951620, -9305876, -12024281, -7526252, -1458921, -618703, -3224261, -3100030, -72208, 975764, -523963, -186899, 2635595, 3023287, -1032532, -4802487, -4156139, -1519863, -1383586, -3805807, -5483008, -4527060, -1723829, 894190, 1160208, -1564729, -4959213, -6012101, -4870053, -3948697, -3699411, -2633489, -974125, -80035, 1286683, 5072648, 8587545, 7201902, 2889264, 2923256, 8280991, 11174137]
10871A1174137l659664l883034J419692J363518n784536q512786r06172P307368
10863a481477O071618l58143k228102P19492K103379O26694k46250l43461j892190
10854B971560l134320q59500K293168Q87677l487140l271698L025945P141849
10846E567541K612062n637017p859953k255299L811744M031004j16039l317375
10838c163332l148400r49368J144642J494487p23124l665134l016166K532750
10830i493645P493345N674140q13711l924395r13503K932598L497639K577420
10822G029888J448950k101385o437002m468642M420709R289066K858085n854399
10814F185270m600173K934271L792189k768827n041329Q30504N033212R77886
$$ y = [11174137, 7514473, 3631439, 5051131, 6414649, 630113, -7882673, -8788845, -1481477, 4590141, 4231998, 2003896, 2723388, 4826767, 5453461, 5207211, 4863750, 2971560, -162760, -1022260, 1270908, 2158585, -1328555, -4600253, -1574308, 5567541, 8179603, 2542586, -5317367, -7572666, -3760922, 270082, 154043, -3163332, -6311732, -7261100, -6116458, -4621971, -5345095, -9010229, -12026395, -9493645, -2000300, 3673840, 2860129, -1064266, -1977769, 954829, 4452468, 7029888, 8478838, 6377453, -59549, -4528191, -107482, 9181584, 12039669, 6185270, 1585097, 4519368, 8311557, 5542730, 501401, 1331905, 6365117, 7343003]
10806G343003n114151n867740k845695o6522K712275N105782L544620j124266
10798C687306j993762K663845N110317R00030l037756m25895K874440j078311
10790H700214p605931n964011L207076Q294232L826199k895275l800110l79627
10782C382767J267352k38946j507101o18650N64976j27157j958884k562312j441717
10773c239672m45554l56311P82010M082475O645370N062703P27941j913827j592411
10764I752724j034761k110421l734987m198282k477447J656580N762298N208722
10756H824426n59075n216967l910001o73117j178028k471170J242208O337633
10748B395909M478447k308126l721120J582313M048083N41878k11804N794454
$$ y = [7343003, 2228852, -3638888, -6484583, -6551105, -3838830, 1266952, 4811572, 3687306, 1693544, 4357389, 9467706, 10367736, 7329980, 6904085, 9778525, 8700214, 1094283, -4869728, -1662652, 6631580, 10457779, 7562504, 3762394, 3382767, 4650119, 4411173, 2904072, 2285422, 2850398, 2723241, 764357, -1797955, -3239672, -3685226, -4041537, -3259527, 822948, 7468318, 12531021, 13258962, 11345135, 9752724, 8717963, 6607542, 2872555, -1325727, -3803174, -2146594, 3615704, 8824426, 8265351, 3048384, -861617, -1534734, -2712762, -5183932, -3941724, 2395909, 6874356, 4566230, 845110, 2427423, 6475506, 7017384, 6805580, 12600034]
10740A2600034R143940K297528p575578r726066m935133r98466m50392q79108
10732e23241j377835j535651N03721L233104J315049m823073o433313N21915P762177
10723a357147O959546J519051j505570k853827n394281n157620J143982O272663
10715c73203J965227o475729p032604P65028O246768M570947J652580J946111
10707C265125K107505q48784l668564k472052J477718M254972L780265O00212
10699H496397k973749m242903k755834q16185O5318J015173K592518L071258J900773
10690F352766J110589J263685L45580j455658j148297Q46152J32257l487797m388436
10681d29159q40194J446934o02086k264530o79261n33059m091349n014407L77188
$$ y = [12600034, 21743974, 24041502, 16465924, 6739858, 1804725, 806259, 355867, -523241, -1901076, -3436727, -2933006, 300098, 1615147, -3207926, -9641239, -9119324, -1357147, 5602399, 7121450, 5615880, 2762053, -2632228, -7789848, -6645866, -373203, 1592024, -4883705, -11916309, -11151281, -4904513, -333566, 1319014, 3265125, 5372630, 4523846, 855282, -1616770, -139052, 4115920, 7896185, 8496397, 5522648, 1279745, -1476089, -2292274, -2226956, -1211783, 1380735, 4451993, 6352766, 7463355, 8727040, 9072620, 7616962, 6468665, 7314817, 7447074, 3959277, -429159, -1269353, 177581, -424505, -2689035, -3368296, -3901355, -7992704, -13007111, -12629923]
10672a2629923M861657K040636k385736p09765L571853L180491K73596R73315
10664h23876L161987J339615j997907j446790J87443k266242m597093l0803O738328
10655B64662N896344m82928j857363K403882K546556l825782p666121l951475
10647f672225J486861L435361M202617N534892L854234j970833o330393m868181
10639a327667o19980J399140P45033j45367k23928j07430m56004j048954n50817
10630b335974J615222K927855R83099p24497L224143R081944O155118n911575
10622A5015335j2874059o033289M174383M545934j103938r82583M286995M817589
10614A1846367l86400l033350p05962O41900j785707m512990n098968l628605
$$ y = [-12629923, -7768266, -5727630, -8113366, -8823131, -5251278, -2070787, -1797191, -823876, 2338111, 3677726, 1679819, 233029, 420472, -1845770, -6442863, -6473666, 264662, 6161006, 5678078, 3820715, 6224597, 8771153, 4945371, -2720750, -6672225, -5185364, -1750003, 2452614, 7987506, 11841740, 9870907, 3540514, -1327667, -1947647, -548507, 196526, 51159, -172769, -280199, -736203, -1785157, -2335974, -720752, 2207103, 3190202, 2465705, 5689848, 14771792, 20926910, 15015335, 2141276, -3892013, 282370, 4828304, 3724366, 2741783, 7028778, 11846367, 11459967, 8426617, 7720655, 8362555, 6576848, 2063858, -3035110, -6663715]
10606f663715O72494O236131O633456m33464o765083m898641N20219J717483N96263
10597b384857K113169L049686o83697l705399q46386J471893k751062n344471
10589i081124J883681R107631L336326p335751n451075O277938R688871J509007
10581I935504m032812j460591j28989l214706k431483L459654M707105j285765
10573E547917n476775l666064j187859J73675L665876N863661N38849o296636
10565h37356l259779N364071M869870m209060o687170M92477M138270k58903j826538
10556b214118L318863M731898j653022n706544k149085J271766K22843N00157
10548a677242L460234K342667k587379k506607K972388M428648L97313j020546
$$ y = [-6663715, -5991221, 244910, 6878366, 6444902, -320181, -5218822, -4698603, -2981120, -2384857, -271688, 2777998, 2094301, -1611098, -2457484, -985591, -3736653, -9081124, -7197443, 1910188, 5246514, -2089237, -7540312, -1262374, 8426497, 9935504, 5902692, 4442101, 4313112, 1098406, -1333077, 2126577, 6833682, 5547917, 71142, -3594922, -4782781, -4609106, -943230, 4920431, 5459280, -837356, -4097135, 1266936, 6136806, 1927746, -4759424, -4266947, -128677, -387580, -2214118, 1104745, 5836643, 4183621, -1522923, -3672008, -2400242, -2177399, -1677242, 1782992, 4125659, 1538280, -968327, 2004061, 6432709, 6830022, 5809476]
10540E809476R32572l39817k439780K249052P871023K334025q544979q333861
10532d62289M93191Q77055o659169n493853L848531L668493o067293o037648N712626
10523a0120356R341524M89995k688820M236982M389873m803597n141944N317042
10515A020699O489937m107548n227700N950021P007881n129913o953443M402684
10507C452618M204733q791180o205925J2366456J2521894q851028j2964341O833445
10499B566672R523881j2096430j2073848J6611812J8339170j6561380j9277064
10492a2967187K5531256L0157087k9062485k1159713J29435890K53485435J41786530
10485E17206813j23811787k50801616j36594454J8321240L1106956l2306736l1873876
$$ y = [5809476, 6742048, 6402231, 3962451, 6211503, 14082526, 16416551, 7871572, -462289, 30902, 907957, -5751212, -11245065, -7396534, -3728041, -9795334, -15832982, -10120356, -778832, -288837, -2977657, 1259325, 5649198, 845601, -4296343, 1020699, 7510636, 3403088, -1824612, 4125409, 11133290, 6003377, -950066, 3452618, 7657351, -1133829, -7339754, 5026702, 17548596, 8697568, -4266773, 2566672, 12090553, -5877, -12079725, 4532087, 22871257, 6309877, -12967187, 12564069, 42721156, 13658671, -7501042, 121934848, 375420283, 517206813, 393395026, 142593410, 5998956, 24320196, 55427152, 23120416, -8753460]
10478h753460J6946081J8589409j9936351k3169588Q472744J5171438n457933
10471A862340o836344J0677632P421750j2582421j0572115R778640R858477j0091205
10463d83246j3794258K410145P630443k339268j601276J0972000R528037o387216
10455E935361r394250M072926Q187684l115582p057475L128754P063960k366390
10447F454988o898548P78341M499203k818849o659877P8038M912236J176025j062219
10438D59338K777521L267069k377344m111618L37577N17771n610474o651460O96217
10429a0695403N177047J510024j434594J684084M278424K099191n8891l381j680178
10420H76323m273243k151070K649231K315803j654086k98611N443118N059205
$$ y = [-8753460, 8192621, 26782030, 6845679, -16323909, -7851165, 7320273, 1862340, -4974004, 5703628, 13125378, 542957, -10029158, -250518, 9607959, -483246, -14277504, -11867359, -4236916, -6576184, -8177460, 2794540, 12322577, 5935361, -3458889, 614037, 8801721, 5686139, -1371336, 1757418, 8821378, 6454988, -443560, 334781, 4833984, 2015135, -4644742, -4566704, 345532, 1521557, 459338, 3236859, 6503928, 4126584, 14966, 352543, 870314, -4740160, -11391620, -10695403, -5518356, -4008332, -5442926, -3758842, 519582, 2618773, 2559882, 2556501, 876323, -3396920, -5547990, -2898759, -582956, -2237042, -2535653, 2907465, 7966670]
10412G966670k613299o606158k190765K749711K223484n73551k571587m745455
10404f360950n290184r64448M191722L264733j017566l60439M097514M174298
10396A734680K66423J1004K528135l45680o940931o014765L796788J0119927N966276
10387A1121857j067053k801509j320951j335328k217653j986567j119667J66143
10379e60728J808671J247535k331509l646591Q03952M735033J638949k917896
10371G77416m40478M492490J574571o365495p721382k289988k91106k917642j464084
10362a4645698M198410M300477j873453l387276K645936N761544J078971k729309
10354d650398l3485K557753J87827j323551K075439M187802L38323l706843k257928
$$ y = [7966670, 5353371, -1252787, -3443552, -693841, 1529643, 956092, -1615495, -6360950, -11651134, -12615582, -8423860, -5159127, -6176693, -6537132, -2439618, 1734680, 2001103, 2012107, 4540242, 4194562, -2746369, -8761134, -4964346, 5155581, 11121857, 10054804, 7253295, 5932344, 4597016, 2379363, 392796, -726871, -560728, 1247943, 2495478, 163969, -3482622, -2678670, 2056363, 3695312, 777416, 336938, 4829428, 6403999, 38504, -7682878, -9972866, -10263972, -13181614, -14645698, -10447288, -6146811, -8020264, -11407540, -8761604, -3000060, -1921089, -4650398, -4683883, -2126130, -1938303, -3261854, -1186415, 3001387, 3339710, -367133, -2625061]
10345b625061Q48799M93773j012383r9902J197872M31295l79419L08887O36015
10336b00124O96058L371957P083141N728109j353202p204476p337555m354079
10328c570171j287778J429818J913555j228533l105414J344598O596979L738010
10320E831064l061715j829370N813103N645442m539540r804467k909976M217866
10312f37593K018359j651165J147736K836946m252435j1150359o454939L780754
10304a4362696O076347R82309q22148K468233L522329N13570j406397q15917q86719
10295d731089j655121r45047l38870j774316j840488K258852N635691L441867
10287E1479M99375L160846O549766J684073q035087j0103165j818607N928182
$$ y = [-2625061, -1776262, -1282489, -2294872, -2394774, -1196902, -765607, -1145026, -836139, -200124, 495934, 3867891, 10951032, 16679141, 15325939, 8121463, 783908, -3570171, -4857949, -3428131, -1514576, -2743109, -5848523, -4503925, 2093054, 5831064, 2769349, 939979, 6753082, 12398524, 7858984, -1945483, -4855459, -637593, 1380766, -270399, 877337, 3714283, -538152, -11688511, -18143450, -14362696, -8286349, -7304040, -8126188, -5657955, -2135626, -1622056, -3028453, -3844370, -4731089, -6386210, -7331257, -7670127, -9444443, -11284931, -9026079, -3390388, 51479, 550854, 3711700, 10261466, 11945539, 3910452, -6192713, -8011320, -2083138]
10279b083138M736246j682708n709696m878123p12890M120007N740584K303455
10271A833737j859575j177630K311867J716866l316585n561471j527311L625162
10263c954940M481625K028255m50187k045899k211956K63836L386152K318112
10255C814998l163947o457591l035959K830308M417109J763756l56786p13920
10247i02032j975974l903080k361672L453481P729809N113124j757919n312558
10239H3179k459635K403982L769560J307105j267476j160915J325806L908424
10231G910030L987048O51078l479238m092512n97212K328775R16790k274116k511263
10222B839380l74191l71832k989739l560398R0687L863163L352421k38682k587894
$$ y = [-2083138, 2653108, 970400, -4739296, -9617419, -10330309, -6210302, -469718, 1833737, -25838, -1203468, 1108399, 2825265, -491320, -6052791, -7580102, -3954940, 526685, 2554940, 2104753, 58854, -2153102, -1889266, 1496886, 3814998, 651051, -5806540, -8842499, -6012191, -1595082, 168674, -188112, -902032, -2878006, -6781086, -9142758, -5689277, 2040532, 7153656, 5395737, 83179, -2376456, 27526, 3797086, 5104191, 3836715, 2675800, 4001606, 7910030, 11897078, 12548156, 9068918, 4976406, 4379194, 6707969, 7624759, 5350643, 2839380, 2465189, 2093357, -896382, -4456780, -4366093, -502930, 2849491, 2610809, 22915]
10213B2915j793626P55606K703696K104076j298281m609187l994095J04415K644506
10204c359975Q51637j478672M88555N132894O398649K451651j877571k162018
10196F445150k54267n94088k989496k986588O66404L174132O77126l278147k506912
10187a646686K374294M615844J373896k613084k839767r40066j68449k98231m74786
10178f17035k009876m192282k537626L708216P577132M129334r19605K0911L741588
10169H900757J939592l764190l994679J838873L296581m177717j1118630q005653
10161a5085066J391461O943169N828730K621771M61235j088166j918696j019387
10153a864949O09061Q68723K2423K41834J894196K556270J72709l821177n319370
$$ y = [22915, -1770711, -1015105, 1688591, 3792667, 2494386, -2114801, -6108896, -6004481, -3359975, -2508338, -3987010, -3498455, 1634439, 8033088, 10484739, 8607168, 6445150, 6190883, 5596795, 2607299, -379289, 287115, 3461247, 4138373, 860226, -1646686, 727608, 5343452, 6717348, 4104264, 1264497, 324431, 155982, -142249, -617035, -2626911, -6819193, -9356819, -5648603, 1928529, 6057863, 5138258, 5159169, 8900757, 10840349, 7076159, 3081480, 4920353, 8216934, 4039217, -7079413, -15085066, -13693605, -6750436, -921706, 1700065, 2161300, 1073134, -845562, -1864949, -1255888, -387165, -364742, -122908, 1771288, 4327558, 4500267, 679090, -4640280]
10144d640280k140848K581747L675155Q64281r61490L92249J205157o25749q54174
10135e03952K964753M757940o36658o596451l578226M726119O115227o49469m187344
10126B411939N47789M981224K342495k192389k601800j892241l539865l136792
10118c079640K708467P388630L613680m517553p764619n015175j745831K86914
10110h125127L019836N100447L543294K86921n19738L3793j958455n054429m042946
10101g716404J088746M572210L271413n5237j972396j837558r9057K365495L255920
10092B873132R82070k595618m541195m452381k766046J559455P390816Q879490
10084G329723K655612m928204m801353J890848N431150J959579j923922p74295
$$ y = [-4640280, -6781128, -4199381, -524226, 340055, -621435, -229186, 975971, 350222, -503952, 2460801, 7218741, 6582083, -14368, -3592594, 1133525, 7248752, 6599283, 2411939, 2959728, 7940952, 10283447, 8091058, 5489258, 3597017, 57152, -3079640, -371173, 7017457, 10631137, 6113584, -1651035, -6666210, -8412041, -8125127, -5105291, -4844, 3538450, 3825371, 3305633, 3339426, 1380971, -3673458, -7716404, -6627658, -2055448, 1215965, 1160728, -811668, -2649226, -2748283, -382788, 2873132, 3855202, 1259584, -3281611, -7733992, -10500038, -8940583, -1549767, 7329723, 9985335, 5057131, 255778, 2146626, 7577776, 9537355, 7613433, 6839138]
10076F839138J552970l22958l766743k510647K869900N188853Q42942n165427
10068E528028n830950r48461K937423Q47781m362599n589026o61003M829941N110632
10059A861766J675644R879J049776P43647k173667l443823l87808K897295J285045
10050C517754l406076m822592j264791K272147J734016n82663k52625K768173
10042c6657M704632L376428L35776j676853j267758J016575K757887J178513l323541
10033G065002o202297l997213M63930J561634j014044k059368P56051L217903
10025b08402J421887k049398k196853J159695L869852L419334J184305m14338
10017F186082o12589m75291j466031l317658l571502q78085K130183K163065L73700
$$ y = [6839138, 8392108, 8069150, 4302407, 1791760, 4661660, 9850513, 10693455, 5528028, -302922, -1251383, 1686040, 2533821, -1828778, -7417804, -8078807, -3248866, 1861766, 3537410, 3547289, 4597065, 5340712, 3167045, -276778, -664586, 2232709, 3517754, 111678, -4710914, -5975705, -3703558, -1969542, -2552205, -2804830, -36657, 4667975, 8044403, 8380179, 6703326, 5435568, 6452143, 9210030, 10388543, 7065002, 862705, -3134508, -2670578, -1108944, -2122988, -4182356, -3426305, -208402, 1213485, -835913, -3032766, -1873071, 1996781, 5416115, 6600420, 6186082, 5573493, 5098202, 3632171, 314513, -3256989, -4135074, -2004891, 158174, 531874]
10008E31874P154J57367k325855n291856l057592L443159O394631L063807m34509
9999B488180k56138n26621l695259m726190o15638L416445L387409K853769L516168
9990E842125L99853o024972n447868M431253R150900j6667q530293r59963J1690284
9981A0534652Q736055n762980j0332956k147728J385902m154554l790494O163581
9973F31478Q951860k131573r852660k314140O886158L185696m540871k058043
9965a242095M666170J891234o531733o624089J193974M321841j85280l364233
9957e874211j354532O27996L66373J510088M272875M306092J409758K33160J709266
9948G206865J466828k405393n974307m797411Q60025O059978N129537k224317
$$ y = [531874, 539028, 696395, -1629460, -6921316, -9978908, -6535749, -141118, 2922689, 2488180, 2232042, 1705421, -1989838, -6716028, -7331666, -3915221, -527812, 2325957, 5842125, 6241978, 217006, -5230862, -799609, 8351291, 8334624, -195669, -1155632, 10534652, 19270707, 13507727, 3174771, 1027043, 2412945, -1741609, -5532103, 631478, 9583338, 7451765, -2400895, -4715035, 2171123, 5356819, 815948, -1242095, 3424075, 5315309, -1216424, -7840513, -6646539, -2324698, -2509978, -5874211, -7228743, -6600747, -6234374, -4724286, -451411, 3854681, 5264439, 5497599, 7206865, 8673693, 6268300, 293993, -4503418, -3643393, 2416585, 7546122, 5321805]
9940E321805q486527o417187O75489L492254J349726K485468Q242665Q974843
9932A5638536N60285p010413n010774Q34141J401294j211450j85707K882400K045739
9923I944051j606006k602808q68480k50999q90993l02787J186112J733201J284144
9914G625435k10333l276951n225755k373217K287188J903725k220122j773964
9906c263994L491748M288826j497366m468631n42369K548366R35063J154585M794441
9897G440669L391858l992333n851673R61335M539042P81548J492644R133693P719445
9888B5616228p205148j5289838n323662M467123L45088j846869R489927J3938257
9880B4191106l085075j5934138j129188J6446986P008385m080118K0228384M7809381
$$ y = [5321805, -3164722, -9581909, -8906420, -5414166, -4064440, -1578972, 6663693, 15638536, 16198821, 9188408, 4177634, 5011775, 6413069, 5201619, 5015912, 7898312, 9944051, 8338045, 5735237, 4866757, 4615758, 3724765, 3421978, 4608090, 6341291, 7625435, 7415102, 4138151, -1087604, -3460821, -1173633, 730092, -1490030, -3263994, 227754, 4516580, 3019214, -1449417, -1991786, 556580, 1491643, 2646228, 7440669, 10832527, 6840194, 988521, 1949856, 6488898, 7270446, 8763090, 17896783, 25616228, 18411080, 3121242, -2202420, 2264703, 2609791, 762922, 10252849, 24191106, 21106031, 5171893, 4042705, 20489691, 27498076, 23417958, 43646342, 91455723]
9872I1455723J4479399o3084856r1765385l5268099L2226569L6967811K502115
9865a2486723q944145N493572P304105o816075p693531P170299J1825083Q11946
9857c335469n393045k01688K031905k725005k864074L176849M361849j11269m02289
9848e462236K979928J009103l544279n27794N625249J549817r372374j0244077
9840a7986663R39982Q641772O092558K507467K643552N07672l880440j996284
9832b530384N107820N603957j874079m557412J811002N227412r82943o563053
9824A242320k899614K740541J500600k271464j231999J392632m91553l605458
9816c623995j665168K574200J775284l705814o607273l433920K076083M574362
$$ y = [91455723, 105935122, 42850266, -48915119, -84183218, -51956649, -14988838, -12486723, -21430868, -15937296, -8633191, -15449266, -23142797, -15972498, -4147415, -3335469, -8728514, -8930202, -6898297, -9623302, -12487376, -9310527, -4948678, -5059947, -5462236, -2482308, -1473205, -5017484, -5545278, 79971, 1629788, -7742586, -17986663, -17046681, -8404909, -2312351, 195116, 2838668, 3346340, -534100, -2530384, 2577436, 8181393, 6307314, 1749902, 3560904, 8788316, 7805373, 1242320, -1657294, 1083247, 2583847, 312383, -919616, 473016, -18537, -3623995, -5289163, -2714963, -939679, -4645493, -11252766, -14686686, -12610603, -8036241]
9808h036241J983465l458883o385816k888655M349898Q307768N950727R26499
9800G48762k409241l339883k610126o79894P38791k18329j962242j088974J861250
9791h959886K724017L29732j747277q32415J642087L204428K852998M53932k666062
9782b998446l170829K28355L415431K164497r62554o13552K273176K202960j232044
9773A306994l115152k347293k793127m513022k544919L286848N904356K116622
9765b698693j570680P26762N004082M559393R37479M64117L222760L044272k215368
9756A1474124o927730n729769q46864J327919j085801l237996n69000M236948
9748a358169M366166j182009n134036k101661L020109K153122l265176m061232
$$ y = [-8036241, -6052776, -9511659, -15897475, -18786130, -14436232, -6128464, -177737, 748762, -1660479, -5000362, -7610488, -8290382, -7551591, -7769920, -9732162, -10821136, -8959886, -6235869, -5906137, -7653414, -8485829, -6843742, -3639314, -786316, -332384, -2998446, -6169275, -5940920, -2525489, -360992, -1323546, -1937098, 336078, 2539038, 1306994, -1808158, -4155451, -6948578, -11461600, -14006519, -10719671, -4815315, -2698693, -4269373, -3542611, 1461471, 6020864, 6958343, 7422460, 10645220, 13689492, 11474124, 4546394, -1183375, -2030239, -702320, -1788121, -5026117, -5595117, -1358169, 3007997, 1825988, -3308048, -5409709, -2389600, -236478, -3501654, -7562886]
9740g562886K409668P795181N224884q67722k343633N80088J303608k109427m788970
9731c59209l538804j209269j009268j434993J18224K127501J268297j650276k225130
9722g912927R81202M156534L788078J255998l15087r83659k502392l801836j988836
9713g322925K589052N895470N090647J104868l407418n782176l777604J895687
9705c714399N875878L285509l398386p026619n211293j913933K91044K901114
9697h911085N328159L611445j763365m122486r02321J447682j729530m637648
9689a1679149m79478O338672O421598O8253l714055j294783J651064O49535j465863
9680c504206j071657L13458k01427j744783j507311R20976L337200L651860J701608
$$ y = [-7562886, -5153218, 2641963, 7866847, 6999125, 4655492, 5235580, 6539188, 4429761, -359209, -3898013, -5107282, -6116550, -7551543, -7433319, -5305818, -4037521, -5687797, -7912927, -6931725, -2775191, 1012887, 2268885, 1953798, 970139, -1532253, -5334089, -7322925, -4733873, 1161597, 6252244, 7357112, 3949694, -1832482, -5610086, -3714399, 2161479, 5446988, 2048602, -4978017, -10189310, -12103243, -11812199, -8911085, -3582926, 28519, -1734846, -5857332, -6759653, -5311971, -7041501, -11679149, -12158627, -5819955, 601643, 669896, -3044159, -4338942, -2687878, -2038343, -3504206, -4575863, -4262405, -4463832, -6208615, -7715926, -6794950, -3457750, 194110, 1895718]
9671A895718p91147j846683j259093l20850M57793J327845R98032k085689n356050
9662f980124l728473K376696N901629L283216L6815J568177M272115K367024j543698
9653G553377j149628J801986k0815o420408q624722k643702M676083N717092J490748
9644B380011k385198l693711l664618k716116j79484L198703N120951L887475
9636A948013P6972l432340l665723p76037J955060K354921J706808J478491N61055
9627B207220j731183k896069r46258J660141J581184j89246o03074J80140R6716
9618f40429l16541O14900J358634q27267m462007n002787j187672L457622N192099
9609a813448L449349N59420M7303L240658O043486K727598n057124q378386l559988
$$ y = [1895718, 1104571, -742112, -2001205, -2322055, -1864262, -536417, 461615, -1624074, -6980124, -10708597, -8331901, -2430272, 852944, 889759, 2457936, 6730051, 9097075, 7553377, 6403749, 8205735, 8184920, 1764512, -6860210, -9503912, -4827829, 889263, 2380011, -5187, -3698898, -7363516, -10079632, -10259116, -7060413, -1939462, 1948013, 2024985, -1407355, -5073078, -5849115, -3894055, -1539134, 167674, 1646165, 2207220, 476037, -2420032, -3366290, -1706149, -124965, -314211, -917285, -737145, -640429, -956970, -342070, 1016564, 189297, -4272710, -9275497, -10463169, -7005547, -1813448, 1635901, 2195321, 2242624, 5483282, 11526768, 14254366, 9197242, 818856, -2741132]
9600b741132J777936O32856k255330Q52295O758799O315002l85486m655682l312685
9591B986573j410076j288335M44557L869114L779222p40313l591840j563840Q44073
9582C329135k52050k036035r31447J268371J002846j607903l747813l181884N37375
9573e619405M979804N467980P44503l644203k698895o7104j846041n147669k292392
9564a0123422N020240O829656J020496l085136r861M117068L481513J650805K621500
9555A1522859K381990k860902p675995n119609J851157M658376J216057l134199
9547B839734m157228k295471L30459J731142M94062k135311k629891j25895J880949
9538d067450J053442k05261O37306J860494R47798q31103n95273J720512L625283
$$ y = [-2741132, -963196, -330340, -2585670, -1733375, 5025424, 11340426, 10954940, 6299258, 2986573, 1576497, 288162, 732719, 4601833, 8381055, 7640742, 4048902, 2485062, 3329135, 3077085, 1041050, 109603, 1377974, 2380820, 772917, -2974896, -6156780, -5619405, -639601, 4828379, 5572882, 1928679, -770216, -837320, -2683361, -7831030, -10123422, -5103182, 1726474, 2746970, -338166, -348027, 3769041, 7250554, 8901359, 11522859, 13904849, 11043947, 3367952, -1751657, 99500, 4757876, 5973933, 2839734, -1317494, -3612965, -3282506, -1551364, -1057302, -3192613, -5822504, -5948399, -4067450, -3014008, -3219269, -2581963, -721469, 226329, -604774, -1200047, 520465, 4145748]
9529D145748L054140N5637k615908j225288L606845N254657k51592o431772m612160
9520I80307K073213K766603l480332n891010R3297N476120L180389j057136l20956
9511C820495J796511j74666k731422r13482J394112j015262l791186n73775M367874
9502B179199K582221l704542m914769J96983L509039J155423k261859l034355
9494d292660k461598j146420K162311N234271L848827m02316j281799K018237
9486C678853L262829o89186m990223m534456q29585J700576J798862R58963P0255
9477D26888j113932k698848l850836k732461J600035O204294N864668n8457n506465
9468a865114n349733j644168J064024K382747L584643L086086J10741j442014
$$ y = [4145748, 7199888, 7255525, 4639617, 3414329, 7021174, 12275831, 12024239, 5592467, 980307, 3053520, 5820123, 2339791, -3551219, -3457922, 2018198, 5198587, 4141451, 3820495, 5617006, 5442340, 2710918, 1797436, 3191548, 2176286, -1614900, -2188675, 2179199, 4761420, 1056878, -3857891, -3660908, -151869, 1003554, -1258305, -4292660, -6754258, -7900678, -5738367, -504096, 3344731, 2942415, 1660616, 3678853, 6941682, 6252496, 1262273, -3272183, -4101768, -2401192, -602330, 356633, 426888, -687044, -3385892, -7236728, -9969189, -8369154, -2164860, 3699808, 3641351, -1865114, -7214847, -8859015, -7794991, -5412244, -1827601, 1258485, 1369226, -72788]
9460g2788P75259J798753k717593p132428l497516M703844O894781J702962k125500
9451C29774q29307l6860k376759k306971K581763N474873J364732m281446m348124
9442d428325p79157K38474j458699j289195J965801N145933N624308L013682j782703
9433F250119n837628n115665O06023O048227O325545K172640k605465n688125
9425B155671o198462l818942n22088L16865j016521j98156L936099O287083L041561
9416C983110k087142l539002j954091j499096k248118q15231L146649O224538
9408A211617O225190L857376M74482k304093k246658N01384J863428p30442l477925
9399E374359j646387K178286J525265l191036m543916K02215M408349K192463
$$ y = [-72788, 702471, 2501224, -216369, -7348797, -10846313, -6142469, 752312, 2455274, 329774, -499533, -536393, -2913152, -5220123, -2638360, 2836513, 4201245, -80201, -4428325, -5207482, -4969008, -6427707, -7716902, -5751101, -605168, 5019140, 8032822, 6250119, 412491, -4703174, -4097151, 1951076, 8276621, 10449261, 7843796, 2155671, -4042791, -7861733, -8383821, -8066956, -9083477, -9281633, -5345534, 941549, 3983110, 1895968, -1643034, -3597125, -5096221, -7344339, -8159570, -5012921, 1211617, 7436807, 11294183, 11768665, 9464572, 7217914, 7719298, 9582726, 8852284, 5374359, 3727972, 5906258, 7431523, 4240487, -303429, -101214, 4307135, 6499598]
9391F499598k842279l685650l35998J397458q30927l304406k529239L71759K375900
9382b883784K493648J669430O83930m77259j811057k564172j545576J233738L289093
9373H7991J641529l077434o237588m431295M54080M082464M850822L999664K386810
9364C757043K60305j038481n93807k21140j692481k756574k86181L556979L758860
9355D744523P56322j62756J621129P62084l641814m832704K3257L604521L94741
9346C269303l297435j89740M352189R30745o923340p650031q46643K632340l18019
9337h040631o52623N395388Q906814M084555j515399m55427K128469j059229n994908
9328B797009m808164L74458J772547r37517j993253l03051N33167R8132N92676
$$ y = [6499598, 3657319, -28331, -364329, 1033129, 202202, -3102204, -5631443, -5259684, -2883784, -390136, 1279294, 1963224, 1485965, -325092, -2889264, -4434840, -3201102, 87991, 1729520, -1347914, -7585502, -12016797, -11562717, -7480253, -2629431, 1370233, 3757043, 4017348, 2978867, 2385060, 2163920, 471439, -2285135, -2571316, 985663, 4744523, 5500845, 5338089, 6959218, 7721302, 4079488, -753216, -729959, 2874562, 3269303, -28132, -217872, 4134317, 5065062, -1858278, -9508309, -10354952, -7722612, -8040631, -8693254, -3297866, 5608948, 9693503, 8178104, 7722677, 9851146, 8791917, 2797009, -2011155, -1636697, 135850, -801667, -2794920, -3097971, -2564804, -2466672, -1873996]
9319a873996R84470n95311j468972J204394M020673K805753N45502J667310K837266
9310A0127089r86649n549942l449973J980439J279645m511135n078586J357242
9302d831870N107820J801475j276308O86345K280893m90148k509410J01923K276514
9293C147234l60742l334917j954215L11599o48847j605785R44179L156125J077864
9284G32495j463010j79136J302206j174844l291139l4858L769743J210478l675351
9275b803416j999617M660868O871115K958878K51929J682695K587471Q76945n80666
9266A4506202k125090o725500j0411741n264144N763831R433240J752971n377116
9258A552653k922485K190224J038943j944957R62740M914957P53975o970774n618428
$$ y = [-1873996, -889526, -1484837, -2953809, -1749415, 2271258, 5077011, 5622513, 7289823, 10127089, 9140440, 3590498, 140525, 2120964, 3400609, -1110526, -6189112, -4831870, 275950, 2077425, 801117, 1487462, 3768355, 3278207, 768797, 870720, 3147234, 2786492, -548425, -2502640, -2191041, -2839888, -4445673, -3501494, -345369, 732495, -730515, -909651, 392555, -782289, -4073428, -4108286, -338543, 871935, -2803416, -4803033, -142165, 6728950, 9687828, 9939757, 11622452, 14209923, 15086868, 14506202, 12381112, 5655612, -4756129, -10020273, -4256442, 5176798, 6929769, 1552653, -1369832, 820392, 1859335, -85622, 877118, 5792075, 6546050, -424724, -6043152]
9249f043152M177909Q138329P08247o566263l627622L682676M982043R86815j131842
9240E307140n58047j130425j736857J376644N217719L095767l326740m836322
9232C408879Q51484M788301Q31067m491842k532161L510000L619048l231896p354130
9223f01250k830624M087250M259563k028595o539200m249356J364607L900926
9215b636679J540822k249996l722023k505391k49664K383624N411387P008129
9207D980209M397238j591551n632214l965147N93016K469092N23615j943434l091822
9198c260998m095990m885628l089073J250663M045412K766731M28243J010276
9190e830364L546077M253515K674333J646792J876143P70283k572741m991229
$$ y = [-6043152, -1865243, 6273086, 6981333, 415070, -3212552, 470124, 5452167, 6438982, 5307140, 4749093, 3618668, 1881811, 3258455, 8476174, 11571941, 8245201, 3408879, 4260363, 9048664, 9879731, 5387889, 2855728, 6365728, 9984776, 6752880, -601250, -3431874, 655376, 4914939, 2886344, -3652856, -7902212, -6537605, -2636679, -1095857, -3345853, -7067876, -9573267, -9822931, -7439307, -2027920, 4980209, 9377447, 7785896, 2153682, -1811465, -1218449, 1250643, 1774258, -169176, -3260998, -7356988, -12242616, -15331689, -14081026, -10035614, -7268883, -6840640, -5830364, -2284287, 1969228, 4643561, 6290353, 8166496, 8936779, 6364038, 1372809]
9182A372809l877174j319371p33270j192804J020201N429110O316817P70907n818648
9173A968577o235766j328409J564332m43244k245787K30678L323066J930506k024781
9164c260828k845473O122J965020R77143n09091p09883m21727L07893K404680
9155b086144M223998K698565j201517k961891j416719k29474j284088j811676
9147d068946J9449J793476J586869J219509K079127K291446Q12883k92917m44776
9138D996120k295644n677066n482807R2257M877097L576357j77025p59757l4153
9129h84621k242775m339854p94125N148650N165399o25953m115330k925954k931599
9120h546162n675789m529417K625495P341906L518865k304390j244426M101760
$$ y = [1372809, -2504365, -3823736, -4557006, -5749810, -4729609, 699501, 7016318, 7787225, 1968577, -4267189, -5595598, -4031266, -4474510, -6720297, -6489619, -3166553, -1236047, -3260828, -6106301, -6100179, -4135159, -3158016, -3667107, -4376990, -4798717, -4490824, -2086144, 2137854, 4836419, 3634902, 673011, -743708, -973182, -2257270, -4068946, -4049497, -2256021, -669152, 550357, 2629484, 4920930, 5733813, 5440896, 4996120, 2700476, -2976590, -8459397, -8367140, -3490043, 86314, -90711, -850468, -884621, -3127396, -7467250, -8261375, -3112725, 2052674, 1426721, -2688609, -5614563, -8546162, -14221951, -18751368, -16125873, -8783967, -5265102, -7569492, -8813918, -4712158]
9112d712158M782546r7183l075947m09721L667661M504626K211387j159919m090237
9103A621055m560703j397439K393545J975137k369829m574315q65953M841943
9095b936559O058936J877044k709892l460260j083865J300583K348946K462666
9087C857599J173645k311037n683315m401322J570260N286077J428298n127713
9079d207508n321924P57218L994553L80353l411981j757784J108056j88185k190439
9070a0837641N80786M662062K991078k556996m090758j064054j25272k089959
9062a2530754l04563O056686Q089768J126068o762178o304472L20217M851610
9054e457618M840938L272951J120452k433141n262674m253371k63374L623468
$$ y = [-4712158, 70388, -26795, -3102742, -3512463, 155198, 4659824, 6871211, 5711292, 1621055, -2939648, -4337087, -1943542, 31595, -2338234, -6912549, -7778502, -2936559, 3122377, 4999421, 2289529, -1170731, -2254596, -954013, 1394933, 3857599, 5031244, 2720207, -2963108, -7364430, -5794170, -508093, 920205, -4207508, -9529432, -8772214, -4777661, -4397308, -7809289, -9567073, -8459017, -8647202, -10837641, -10256855, -5594793, -2603715, -5160711, -9251469, -10315523, -10440795, -12530754, -12835317, -6778631, 1311137, 2437205, -4324973, -10629445, -10309228, -5457618, -616680, 2656271, 3776723, 1343582, -3919092, -8172463, -8435837, -4812369]
9046d812369O433117P611122M477342l219858r374331q289579k917454o4030J95529
9037i960511K908767P489995P120450M163o468531n693031j22051L640020L375907
9028B295178J515538K93389m6415j76633j069557l094137m708136l728883m55044
9019i174700K339292K773790J373101m95502j558836p19213J280592J334981j848650
9010d695145m411517j990109L581808O651962N645708L482658J218587k488945
9002F995007n848799m884340q65391K22777k689485l847066p39670J626443J91693
8993i838831k89038L680824O559224K274912m949176o345216j635166J716132
8985h826335L33183j673985p54683J418462K220738J809319J271649O18090l73684
$$ y = [-4812369, 1620748, 9231870, 13709212, 10489354, 1115023, -7174556, -10092010, -10156040, -9960511, -7051744, 438251, 7558701, 7562864, 1094333, -4598698, -4720749, -1080729, 2295178, 3810716, 4104105, 4057690, 3881057, 2811500, -282637, -4990773, -8719656, -9174700, -6835408, -4061618, -2688517, -3184019, -4742855, -5462068, -4181476, -2846495, -4695145, -9106662, -11096771, -7514963, -863001, 4782707, 8265365, 9483952, 6995007, 1146208, -3738132, -4603523, -4380746, -7070231, -10917297, -11656967, -10030524, -9838831, -10127869, -6447045, 112179, 2387091, -2562085, -8907301, -10542467, -8826335, -8493152, -10167137, -10921820, -9503358, -7282620, -5473301, -4201652, -3583562, -3957246]
8976c957246j482190k232532j492235J596917M859188M060805j010007m666484
8968d323784k647434J988027L925200L032796K287358J648978o08142k991330
8960B311669k776346j064365o73278q23314Q88400L129117K889116J114985P57903
8951E753887J044503n04600k307354j334169L87949j110231l752832k342925J617283
8942b548489J708786j852190j790699L591710O718604K832598k841432m346043
8934A472845l617950m466660m559431N8889O805120R126435N002244j459638n107068
8925C254786l625889J317450M683498K500241k838797n024181k459611J03297
8917b089206l10972r05205M67203J066288q52112j662017J402029M461355K631418
$$ y = [-3957246, -5439436, -7671968, -9164203, -7567286, -2708098, 1352707, 342700, -4323784, -6971218, -4983191, -1057991, 1974805, 4262163, 5911141, 5302999, 2311669, -464677, -1529042, -2202320, -3025634, -2137234, 991883, 3880999, 4995984, 5753887, 6798390, 6293790, 3986436, 2652267, 3040216, 1929985, -1822847, -4165772, -2548489, -839703, -2691893, -4482592, -890882, 5827722, 8660320, 5818888, 1472845, -2145105, -6611765, -11171196, -11112307, -4307187, 4819248, 9821492, 8361854, 3254786, -371103, 946347, 5629845, 8130086, 5291289, 267108, -2192503, -2089206, -2400178, -3305383, -2838180, -1771892, -2624004, -4286021, -2883992, 1577363, 4208781]
8908D208781k290526m759501l127246N0579K563027L409741J878333o52354r08922
8899C71912J183409J351674j815382l241869N96034M835383L206452k175293m440031
8890a27711k293781l4883M94563J177268K116987J322900n21560n54857J262241
8881B841167K444659K575622K946695K669170L3376l269756m199585l508358l794795
8872a261805l823317n33859M265264N369438K063674j330937k519291k841919
8864f12752k204804Q41967L710028J711836l417199m281894Q20632M662739K284299
8855C514852j694193j203061K225160L678858K761871J632530m35428m545274
8847E935315p550000n923050j960588n06279j271284j140L819626O011542M358500
$$ y = [4208781, 1918255, -2841246, -5968492, -5917913, -3354886, 54855, 1933188, 1280834, 371912, 1555321, 2906995, 1091613, -2150256, -1554222, 3281161, 6487613, 4312320, -127711, -2421492, -2456375, -1961812, -784544, 1332443, 2655343, 2133783, 1578926, 2841167, 5285826, 7861448, 10808143, 13477313, 13510689, 10240933, 6041348, 2532990, -1261805, -5085122, -5618981, -1353717, 4015721, 6079395, 4748458, 2229167, -612752, -2817556, -1975589, 1734439, 3446275, 29076, -4252818, -3432186, 1230553, 3514852, 1820659, 617598, 2842758, 6521616, 9283487, 10916017, 10480589, 5935315, -1614685, -7537735, -9498323, -10004602, -11275886, -11277026, -7457400, -1445858, 2912642]
8838B912642J303122m86087j025110q30596L81464J838476J712300k3632j283040
8829D499539j026169l39211q1362n824l60457j520518j942177J05808K408177
8820A737806N91866m627335o610729j971055L796953M010909L98097n56684J701922
8811a528250J688561k027764m030174j253927J847376J099131l24228J965788
8803b563487M929848K496041l824076o148768j916348K561591J807844j546574
8795d203929k012431R34082L709314L997583K016720j182805l899201m241464
8787d882131k640616j828905k463146j527244K510156N995389M957614J214659
8779A335776l70576R28567J508164l20230k057666j336052Q29029J953503J032743
$$ y = [2912642, 4215764, 3729677, 2704567, 1873971, 2255435, 4093911, 5806211, 5782579, 4499539, 3473370, 3134159, 3052797, 3046973, 2686516, 1165998, -776179, -670371, 1737806, 2329672, -2297663, -8908392, -10879447, -7082494, -3071585, -2673488, -3230172, -1528250, 160311, -1867453, -5897627, -7151554, -5304178, -4205047, -4529275, -2563487, 2366361, 4862402, 1038326, -5110442, -7026790, -4465199, -2657355, -4203929, -6216360, -5282278, -1572964, 2424619, 4441339, 3258534, -640667, -4882131, -7522747, -9351652, -11814798, -13342042, -10831886, -4836497, 121117, 1335776, 965200, 1893767, 3401931, 3081701, 1024035, -312017, 517012, 2470515, 3503258]
8770C503258r64790k059883q79598J404261J691849r02250l051471j668400J329709
8761a597315J883295Q1136l79923J408617J998136p65557m192981m448706j288835
8752g302133K245058L066712L39974l644469m739215j252302L116792L371061
8744d798522J43137j026147K074651M946273L161490j247060l216252j676001
8736a638431L65673R72178Q74968O71829k08119j556958k005209j141258j68534
8727c833861L4511O1242P42409J834875K251005R64606k012363m767444m417112
8718i142132m13522L750106M212970J785841O88297K058165K146779j374959m784761
8709a073216l411506R64969K327678p59862l402000k094650N43735P57886q04319
$$ y = [3503258, 2538468, 478585, -401013, 1003248, 2695097, 1792847, -1258624, -2927024, -1597315, 285980, 367116, -12807, 1395810, 3393946, 2628389, -1564592, -6013298, -7302133, -5057075, -1990363, -1650389, -5294858, -10034073, -11286375, -8169583, -4798522, -4655385, -5681532, -3606881, 1339392, 4500882, 3253822, 37570, -1638431, -1272758, -300580, 574388, 1246217, 1038098, -518860, -2524069, -3665327, -3833861, -3799350, -3738108, -2995699, -1160824, 1090181, 2054787, 42424, -4725020, -9142132, -9555654, -5805548, -1592578, 193263, 881560, 2939725, 5086504, 3711545, -1073216, -4484722, -3519753, -1192075, -1951937, -5353937, -7448587, -6904852, -6146966, -6951285]
8700f951285j475952j083485o98619K37495J930665K120226J0021m96779L463125
8691b944588P285563M603595k127420m297626m14411J604422k481839o225670
8683d997974l153663K700692L418616o28589k428185N70053L817545L225528k29875
8674B294148l372022m048966j722635J701561K370310q62194l473725p72906M761443
8665c124986O094885J329023l732916l501821P87345L865391K901309o11901l585423
8656D20906m171392k522459M1672K152389K761122J402064p11155q82467J504961
8647d359K641292r54834n996778n714037O1845M072314K485734j66320P4006J14367
8637c386770k683275l775958O49861N216127L305442j486614j277299K627157
$$ y = [-6951285, -8427237, -9510722, -10209341, -9971846, -8041181, -5920955, -5910934, -6407713, -2944588, 4340975, 8944570, 6817150, 2519524, 2105113, 3709535, 1227696, -4997974, -8151637, -5450945, -2032329, -2660918, -5089103, -4519050, -701505, 2524023, 2294148, -1077874, -5126840, -6849475, -5147914, -2777604, -3639798, -7113523, -7886429, -3124986, 2969899, 4298922, 566006, -2935815, -2148470, 1716921, 4618230, 4006329, 420906, -3750486, -6272945, -6231273, -4078884, -1317762, 84302, -626853, -1509320, -4359, 2636933, 1682099, -4314679, -10028716, -9966871, -5894557, -3408823, -3575143, -3501137, -3386770, -6070045, -9846003, -9196142, -3980015, -674573, -2161187, -3438486, -811329]
8629h11329K589662j561989k787255l6299K86416l051960l401141J277906M023139
8620c472850R86999k029732k36757K099792L27525k079112o20953J649600K20703
8611c154785k014311L9302M100091M260223J121052J08396J572764N38681l935851
8602B635562o381961l254384J891309L622746J338749j213621r76129J361115
8594i76614K680305J494186K62453J989620M734079L078688l551269q197771n138817
8585c625140K153433N925236M279740J569116L89044j265549m617571o812874
8577b004565m978059n83667K438704K569822J966597L057429M943506M174673
8569A1584440m64570n163329n051283n29991L027666K269430m39034j475873j061425
$$ y = [-811329, 1778333, 216344, -2570911, -2607210, -2320794, -5372754, -8773895, -7495989, -3472850, -2485851, -4515583, -4752340, -2652548, -2325023, -4404135, -5025088, -3375488, -3154785, -5169096, -5129794, -1029703, 3230520, 4351572, 4459968, 6032732, 6571413, 2635562, -3746399, -7000783, -5109474, -1486728, -147979, -1361600, -2337729, -976614, 1703691, 3197877, 3460330, 5449950, 10184029, 13262717, 9711448, 1513677, -3625140, -1471707, 4453529, 8733269, 10302385, 10691429, 9425880, 4808309, -2004565, -6982624, -7566291, -5127587, -2557765, -591168, 2466261, 7409767, 11584440, 11119870, 5956541, 905258, 375267, 3402933, 5672363, 5233329, 3757456, 2696031]
8560B696031j685014l685507m950561l842246n54387L455348O040307N488450
8552B962421K221434j531462m099188n011021l610671K59872L999593M073378
8544g35644J117274j95704K157024M478641K895185j400513m680428n233686l102610
8535d700461J212198N001279M008599j503805m748353q74793N419989N868870
8527I683523J66611m292120l458958j253043k048300m161954l792739j477065
8519a0634045o59553j725859j387182K030676N800481O420876L924057R16967
8511D686418j140784k408910k366547j34351K789379L429488J793532Q79595J053793
8502H581613r99008n296407n975758k30767N358887L890190q12947k68678M662590
$$ y = [2696031, 1011017, -2674490, -7625051, -11467297, -12021684, -8566336, -2526029, 2962421, 5183855, 3652393, -446795, -5457816, -9068487, -8808615, -4809022, -735644, 381630, 185926, 2342950, 6821591, 9716776, 8316263, 3635835, -1597851, -4700461, -3488263, 1513016, 5521615, 4017810, -730543, -1605336, 3814653, 9683523, 9850134, 5558014, 2099056, 846013, -1202287, -5364241, -9156980, -10634045, -11293598, -13019457, -14406639, -12375963, -6575482, -154606, 3769451, 4686418, 3545634, 1136724, -1229823, -1364174, 1425205, 4854693, 6648225, 7527820, 8581613, 7582605, 2286198, -3689560, -3920327, 1438560, 5328750, 4515803, 4247125, 8909715]
8493H909715N292349o07010n893997n919099l711063j904575R12855L504195J358577
8484A941947l955138m465065J152649M145952L49209k268552K215227O282704
8476E398933J375026o934971p506415j214063J905766p06351k084700J109790
8468h656985M062433K970700J84283j007472l16498J444903L160354K638578n92213
8459C888083l032772j847038N63731Q65469M45175J853336L204129J721655o24955
8450G036813p60548q9873p63337q58827N10169j165245p357879r767932j864419
8441a5081078Q161571P653755j158490m972418m73258K299729j889931n656680
8433a1116800k559877L250304N429254M049499J686752j020536k491785l24659
$$ y = [8909715, 14202064, 13595054, 7701057, 1781958, -1929105, -3833680, -2920825, 583370, 1941947, -2013191, -6478256, -5325607, -1179655, -830446, -3098998, -883771, 5398933, 6773959, -161012, -7667427, -8881490, -6975724, -7682075, -9766775, -8656985, -4594552, -1623852, -1439569, -2447041, -2763539, -1318636, 1841718, 4480296, 3888083, 855311, -991727, -427996, 437473, 882648, 2735984, 5940113, 7661768, 7036813, 6276265, 6186392, 5423055, 4564228, 5074397, 3909152, -3448727, -13216659, -15081078, -6919507, 734248, -424242, -5396660, -5869918, -3570189, -5460120, -11116800, -13676677, -10426373, -4997119, -947620, 739132, -281404, -2773189, -3097848]
8425c097848L046315K082131k550131m090671p02597K031041J435255J469372
8417c77133L550869L081229j138423l039238N70216M135816K540679j165814k130820
8408F027381j208505j379949k393586k954321l071368j635320K597591O083965
8400B065888L648594k131398l140194J126739K549528j052681j777343L540881
8392D830014O309763P19499n816942n027335o59941L359j505271n63929O51262
8383a059521r64787j116114L946939P917214L759832l386782l894707Q36633K099254
8374H137961j019554k099334j02130L9572k049543k009602j73535q93261l018457
8365c187883j036489M246236N699764J295018l039711k956225n15196J223457
$$ y = [-3097848, -51533, 2030598, -519533, -4610204, -5312801, -3281760, -1846505, -377133, 3173736, 6254965, 5116542, 2077304, 2647520, 6783336, 9324015, 8158201, 6027381, 4818876, 3438927, 1045341, -1908980, -4980348, -6615668, -4018077, 2065888, 5714482, 3583084, 442890, 1569629, 4119157, 3066476, 1289133, 4830014, 11139777, 11859276, 6042334, 1014999, 355058, 358417, -1146854, -1710783, -1059521, -2024308, -3140422, 806517, 8723731, 12483563, 9096781, 5202074, 6038707, 8137961, 7118407, 5019073, 4916943, 4956515, 2906972, 897370, 723835, -169426, -3187883, -4224372, 21864, 5721628, 7016646, 3976935, 1020710, 505514, 1728971]
8357A728971J617071K43900k458620l014617N19114L604155J645030j339085J163537
8348C709456N935656M029879m133311q429973m361241J649354L809181L793362
8340F002363L654976J484705k467020l749079j290586L82748o53173p23670J634384
8331D275648K556902M18191j107027m14715o21610k063940o85422K797988J631869
8322F787884m443082n556271K531030Q889855L155742p389667q231993K23129
8314d033373M075504j981640p110131j842811P546028Q664748O32405n570467
8306C80263k619190L962894M209015k764789q042891n046567K402433O305322
8298a213510M686743J487376o96121k292583k786574r81288J224563R45197j70034
$$ y = [1728971, 3346042, 3589942, 1131322, -1883295, -1364181, 2239974, 3885004, 2545919, 3709456, 9645112, 13674991, 9541680, 1111707, -3249534, -1600180, 2209001, 6002363, 9657339, 11142044, 8675024, 4925945, 3635359, 4018107, 3364934, 2641264, 4275648, 6832550, 7250741, 6143714, 5728999, 5107389, 3043449, 2358027, 5156015, 6787884, 2344802, -3211469, -680439, 8209416, 11365158, 3975491, -4256502, -4033373, 42131, -1939509, -9049640, -10892451, -3346423, 5318325, 5950730, 380263, -2238927, 1723967, 5932982, 3168193, -4874698, -9921265, -7518832, -1213510, 3473233, 4960609, 4264488, 1971905, -814669, -1795957, -571394, 373803, 203769]
8289B03769J577327M413447K989393k097274m460545k547802j625300l275584
8281d822569k237098K837968N138929J407018j501780J514809M389453P55010
8273G481740m006457j852877L392648K209674m384645o852616k989911K81532
8265f720912M13737K636575Q207558J0101849M160402l940341o932706m630402
8257C295760j003104J566199J973850m45489l521219l387669j04948K120350J519896
8248B013626O05015N04603n94047k007074l52446L023942J950095l715783n226774
8239c798843J389365O680759J200666q535475q330141K310649Q870038L011817
8231B798835n923805n443023K657076O864948K949877k196290k509516m85337
$$ y = [203769, 1781096, 6194543, 9183936, 7086662, 2626117, 78315, -1546985, -4822569, -7059667, -4221699, 917230, 2324248, 822468, 2337277, 6726730, 7481740, 3475283, 1622406, 5015054, 7224728, 2840083, -4012533, -7002444, -6720912, -6307175, -3670600, 4536958, 14638807, 18799209, 14858868, 7926162, 3295760, 2292656, 3858855, 5832705, 5387216, 1865997, -1521672, -1626620, 493730, 2013626, 2618641, 3123244, 2529197, 522123, 169677, 3193619, 5143714, 1427931, -3798843, -2409478, 4271281, 5471947, -3063528, -11393669, -9083020, -212982, 2798835, -3124970, -8567993, -5910917, 954031, 3903908, 1707618, -801898, -1287235]
8223a287235p70214k230929j016778J946460K029006j413492l653221j860145
8215h256548Q48626Q65609m26487n096J248602P45311l44892J061650L688761
8206e74464K919310j605000m609332k818916O15577J406848m4257o26407O73769
8197d662872K385966K884655J523738n94785n16373K997601N780326K513091m766872
8188G544475q003701m647181j339313k810327m142066K85476O474837P018380
8180C80580K920121P34912J218158K5481k171945j81420M995958N622809o69233
8171A2875421o832914p169241m256779k002900M53553L745604M359756Q18246
8163A990746k215071j180818M15014j487080m193861l214991j6890J186032O12908
$$ y = [-1287235, -2057449, -4288378, -5305156, -3358696, -1329690, -2743182, -6396403, -8256548, -7407922, -6542313, -6968800, -6973896, -5725294, -4979983, -5324875, -4263225, -574464, 2344846, 739846, -3869486, -6688402, -6072825, -4665977, -4710234, -5336641, -4662872, -2276906, 607749, 2131487, 1536702, 1020329, 4017930, 9798256, 12311347, 7544475, -459226, -5106407, -6445720, -9256047, -13398113, -13112637, -6637800, 380580, 3300701, 4035613, 5253771, 5279252, 3107307, 2925887, 7921845, 13544654, 12875421, 6042507, -1126734, -5383513, -7386413, -6932860, -3187256, 1172500, 1990746, -224325, -1405143, -990129, -2477209, -6671070, -9886061, -9902951, -8716919, -8104011]
8154h104011R54346J524517K08359j592281j425638m32522n08758j68621J637191
8145g907418J681805j646669l218091R21740N144289K364214l580115l751870
8137i992115Q88747J830882j314909k17418O356615Q921568K694246m826158o056343
8128a714885k922226K24344L359750N491340K433146m320515n895357M75244N520544
8119B651385K380150k557938j503152J497949o29073m181008j548219M204082
8111C14176M081849j373366l413304K89028L463639K552694J45470k050487m370047
8102c60348m271315O43104N616209L841100k247499l982669q0103K343941K74866
8093A777286j475735M0012J687486J143596j88816k056361n236566o468712j993824
$$ y = [-8104011, -7149665, -5625148, -5416789, -7009070, -8434708, -8867230, -9375988, -9544609, -7907418, -6225613, -7872282, -11090373, -10168633, -5024344, -2660130, -6240245, -9992115, -9103368, -7272486, -8587395, -8804813, -2448198, 6473370, 9167616, 4341458, -1714885, -4637111, -4412767, -1053017, 4438323, 6871469, 2550954, -3344403, -2869159, 2651385, 5031535, 2473597, 970445, 2468394, 1839321, -2341687, -3889906, 314176, 4396025, 3022659, -390645, -101617, 3362022, 5914716, 6060186, 4009699, -360348, -4631663, -3988559, 1627650, 5468750, 3221251, -761418, -841521, 1502420, 1777286, 301551, 341563, 2029049, 3172645, 2983829, 927468, -4309098, -10777810, -12771634]
8084a2771634M112274M440977O65279R81751N281495M959527j166632l793808
8076B709229P16578M021559N05349l956851l768747k388413k836311r68054M468619
8067a497042O343604J741287j130466K591775M561099j799976p808872l528453
8059e27044M785556N257740p5937j370507M72402k292526o815242l451035N224621
8050A208028O395530j632363o319518j557956L665821J556024k973597k773168
8042b431199O89762K953129L931039M220169J890756k309451l678711j401509
8034C863985n72007k918428l091632J732179N944690M026913j331607m315184
8026C338909l700006j410547J367129K925407J068128k255975j647142L355466
$$ y = [-12771634, -8659360, -4218383, -3553104, -2571353, 2710142, 7669669, 6503037, 2709229, 3425807, 7447366, 7952715, 3995864, 227117, -2161296, -4997607, -5965661, -1497042, 4846562, 6587849, 5457383, 8049158, 12610257, 10810281, 3001409, -527044, 4258512, 9516252, 9440315, 8069808, 8542210, 6249684, -565558, -4016593, 1208028, 7603558, 5971195, -348323, -1906279, 1759542, 3315566, 341969, -2431199, -1741437, 1211692, 5142731, 9362900, 11253656, 8944205, 5265494, 3863985, 3291978, 373550, -2718082, -985903, 4958787, 8985700, 7654093, 3338909, -361097, -1771644, -404515, 2520892, 3589020, 1333045, -314097, 3041369]
8018C041369O267193L178292j791385l983193m607527n448535l864665J387024
8010e821427N109389K643765k569167m250510k214529m16379L77389K170001M543210
8001d28258N073997L198671K7851l288912m329794n48397N104102M811266l227588
7992F392938r766616o384634K263191N280401J073226k071615P65144N385525
7984B937560O183664K862331j589590m375869l486102P84876M352517L187862
7976A0857249j284789m185430l983656l283424l382958k574578n9279K531273
7968e365592L944280M160680K495332j491596n219099n055158j400553J661588
7960f270118J987387J219526R82312R37925R75187J709096K329506J434879K55059
$$ y = [3041369, 9308562, 12486854, 10695469, 6712276, 2104749, -3343786, -7208451, -5821427, -712038, 1931727, -637440, -4887950, -7102479, -7518858, -7141469, -4971468, -428258, 4645739, 7844410, 7872261, 4583349, 253555, -294842, 4809260, 9620526, 6392938, -3373678, -9758312, -7495121, -2214720, -1141494, -3213109, -2447965, 2937560, 9121224, 11983555, 10393965, 6018096, 2531994, 3316870, 7669387, 10857249, 9572460, 5387030, 1403374, -1880050, -5263008, -7837586, -7896865, -5365592, -1421312, 2739368, 5234700, 3743104, -1475995, -6531153, -7931706, -6270118, -4282731, -3063205, -2080893, -1142968, -167781, 1541315, 3870821, 5305700, 5560759]
7951E560759J152052K578886K33692n432805p877950l483995K438750K758143
7943b072468j543106l543866q93149J512626J5491k051019l35690K617274P28126
7934e565781n394359p589115j484832O536869P966302L761144J320533K391510
7926A942271J717910k330182m237582j139901J704727J4897j730311J922868P102461
7917D967158N797032j763749p514099o781731k239431K308269N301189M983658
7909E058296L45116m873633n095812p36394K252149J279073q5024Q23814J812380
7900G79965Q89184j11918M76114J069048L27234k04720N69852Q77314n86372j971560
$$ y = [5560759, 6712811, 9291697, 9525389, 4092584, -3785366, -7269361, -4830611, -2072468, -3615574, -7159440, -8052589, -6539963, -6524472, -8575491, -8911181, -6293907, -5565781, -10960140, -18549255, -20034087, -13497218, -5530916, -1769772, -449239, 1942271, 3660181, 1329999, -2907583, -4047484, -2342757, -2327860, -4058171, -2135303, 4967158, 10764190, 9000441, 1486342, -5295389, -7534820, -5226551, 74638, 5058296, 5403412, 529779, -4566033, -5302427, -3050278, -1771205, -1856229, -1032415, 779965, 1669149, 1557231, 2033345, 3102393, 3429627, 3224907, 3794759, 4672073, 4085701, 2114141]
$$ [...]
##END NTUPLES=NMR SPECTRUM
##END=
