##TITLE=31Pdec_LR-618-R4-C1
 CDCl3, 124 sc
 7.07.2021
##JCAMPDX= 6.0         $$ Bruker NMR JCAMP-DX V2.0
##DATA TYPE= NMR SPECTRUM
##DATA CLASS= NTUPLES
##ORIGIN= UXNMR, Bruker Analytische Messtechnik GmbH
##OWNER= root
$$ XWIN-NMR		Version 3.5
$$ Wed Jul  7 12:35:26 2021 Russian Standard Time (UT+4h)  she@DPX200
##.OBSERVE FREQUENCY= 81.013821
##.OBSERVE NUCLEUS= ^31P
##.ACQUISITION MODE= SIMULTANEOUS
##.ACQUISITION SCHEME= undefined
##.AVERAGES= 124
##.DIGITISER RES= 16
##SPECTROMETER/DATA SYSTEM= spect
##.PULSE SEQUENCE= zgpg30
##.SOLVENT NAME= CDCl3
##.SHIFT REFERENCE= (INTERNAL, CDCl3, 0, 248.564)
##AUDIT TRAIL= $$ (NUMBER, WHEN, WHO, WHERE, WHAT)
$$ ##TITLE= Audit trail, XWIN-NMR		Version 3.5
$$ ##JCAMPDX= 5.01
$$ ##ORIGIN= Bruker BioSpin GmbH
$$ ##OWNER= she
$$ F:/spectra/data/she/nmr/P31/1/pdata/1/auditp.txt
$$ ##AUDIT TRAIL=  $$ (NUMBER, WHEN, WHO, WHERE, WHAT)
(   1,<2021-07-07 12:34:04.45 +0400>,<she>,<DPX200>,
      <continue with go, POWCHK disabled, PULCHK disabled
       configuration hash MD5:
       00 E9 B6 7A A2 85 ED C7 34 08 36 98 17 FE 4E 26
       data hash MD5: 32K
       C2 DD D7 68 55 5B 49 A3 29 45 85 04 BD 61 64 BB>)
(   2,<2021-07-07 12:34:06.17 +0400>,<she>,<DPX200>,
      <Start of raw data processing
       efp BC_mod = 2 LB = 1 FT_mod = 6 PKNL = 1 PHC0 = -7379.406 PHC1 = 72.88605 SI = 64K 
       data hash MD5: 64K
       C2 60 0D DB 54 94 50 E3 22 89 19 73 CA 74 7A 24>)
(   3,<2021-07-07 12:34:32.34 +0400>,<she>,<DPX200>,
      <pk PHC0 = -50.44192 PHC1 = 142.4 
       data hash MD5: 64K
       6A 3F DB 3D 07 80 98 6C 4D 8E 56 94 14 0E E6 F6>)
(   4,<2021-07-07 12:34:37.03 +0400>,<she>,<DPX200>,
      <abs ABSG = 5 
       data hash MD5: 64K
       CA 0D B0 09 B1 86 34 0D D7 C6 31 99 C5 8D 14 2A>)
$$ ##END=
$$ 
$$ hash MD5
$$ 6A C7 86 08 53 1D 41 9C 82 F4 33 04 A0 75 E4 0A
##$RELAX= 
##$RELAX= 
##$RELAX= 
##$RELAX= 
##$RELAX= 
##$RELAX= 
##$RELAX= 
##$RELAX= 
$$ Bruker specific parameters
$$ --------------------------
##$DU= <F:/spectra>
##$EXPNO= 1
##$NAME= <P31>
##$PROCNO= 1
##$TYPE= <nmr>
##$USER= <she>
##$AMP= (0..31)
100 100 100 100 100 100 100 100 100 100 100 100 100 100 100 100 100 100 
100 100 100 100 100 100 100 100 100 100 100 100 100 100 
##$AQSEQ= 0
##$AQ_mod= 1
##$AUNM= <au_zg>
##$AUTOPOS= <>
##$BF1= 81.014009
##$BF2= 200.13
##$BF3= 200.13
##$BF4= 200.13
##$BF5= 200.13
##$BF6= 200.13
##$BF7= 200.13
##$BF8= 200.13
##$BYTORDA= 1
##$CFDGTYP= 0
##$CFRGTYP= 5
##$CHEMSTR= <none>
##$CNST= (0..31)
1 1 145 1 1 1 1 1 1 1 1 1 1 1 1 1 1 1 1 1 1 1 1 1 1 1 1 1 1 1 1 1 
##$CPDPRG= <waltz16>
##$CPDPRG1= <>
##$CPDPRG2= <waltz16>
##$CPDPRG3= <>
##$CPDPRG4= <mlev>
##$CPDPRG5= <mlev>
##$CPDPRG6= <mlev>
##$CPDPRG7= <mlev>
##$CPDPRG8= <mlev>
##$CPDPRGB= <>
##$CPDPRGT= <>
##$D= (0..31)
0 1 0 0 0 0 0 0 0 0 0 0.03 2e-05 3e-06 0 0 0 0 0 0 0 0 0 0 0 0 0 0 0 0 
0 0 
##$DATE= 1625646640
##$DBL= (0..7)
120 120 120 11 120 120 24 19 
##$DBP= (0..7)
150 150 150 150 150 150 150 150 
##$DBP07= 0
##$DBPNAM0= <>
##$DBPNAM1= <>
$$ [...]
##$SUBNAM3= <"">
##$SUBNAM4= <"">
##$SUBNAM5= <"">
##$SUBNAM6= <"">
##$SUBNAM7= <"">
##$SUBNAM8= <"">
##$SUBNAM9= <"">
##$SW= 501.771253377433
##$SWIBOX= (0..15)
0 1 3 0 0 0 0 0 0 0 0 0 0 0 0 0 
##$SW_h= 40650.406504065
##$TD= 32768
##$TD0= 1
##$TE= 0
##$TE2= 300
##$TE3= 300
##$TEG= 300
##$TL= (0..7)
0 120 53 12 22 120 120 120 
##$TP= (0..7)
150 150 150 150 150 150 150 150 
##$TP07= 0
##$TPNAME0= <>
##$TPNAME1= <>
##$TPNAME2= <>
##$TPNAME3= <>
##$TPNAME4= <>
##$TPNAME5= <>
##$TPNAME6= <>
##$TPNAME7= <>
##$TPOAL= (0..7)
0.5 0.5 0.5 0.5 0.5 0.5 0.5 0.5 
##$TPOFFS= (0..7)
0 0 0 0 0 0 0 0 
##$TUNHIN= 0
##$TUNHOUT= 0
##$TUNXOUT= 0
##$USERA1= <user>
##$USERA2= <user>
##$USERA3= <user>
##$USERA4= <user>
##$USERA5= <user>
##$V9= 5
##$VALIST= <valist>
##$VCLIST= <CCCCCCCCCCCCCCC>
##$VD= 0
##$VDLIST= <DDDDDDDDDDDDDDD>
##$VPLIST= <PPPPPPPPPPPPPPP>
##$VTLIST= <TTTTTTTTTTTTTTT>
##$WBST= 1024
##$WBSW= 4
##$XGAIN= (0..3)
0 0 0 0 
##$XL= 0
##$YL= 0
##$YMAX_a= 50483
##$YMIN_a= -62357
##$ZGOPTNS= <>
##$ZL1= 120
##$ZL2= 120
##$ZL3= 120
##$ZL4= 120
##$ABSF1= 248.5645
##$ABSF2= -253.2056
##$ABSG= 5
##$ABSL= 3
##$ALPHA= 0
##$AQORDER= 0
##$ASSFAC= 0
##$ASSFACI= 0
##$ASSFACX= 0
##$ASSWID= 0
##$AUNMP= <proc_1d>
##$AZFE= 0.1
##$AZFW= 0.5
##$BCFW= 0
##$BC_mod= 2
##$BYTORDP= 0
##$COROFFS= 0
##$CY= -3
##$DATMOD= 1
##$DC= 0
##$DFILT= <>
##$DTYPP= 0
##$F1P= 0
##$F2P= 0
##$FCOR= 1
##$FTSIZE= 65536
##$FT_mod= 6
##$GAMMA= 0
##$GB= 0
##$INTBC= 1
##$INTSCL= 5.30512e-09
##$ISEN= 30
##$LB= 1
##$LEV0= 0
##$LPBIN= 0
##$MAXI= 10000
##$MC2= 0
##$MEAN= 0
##$ME_mod= 0
##$MI= 50
##$NCOEF= 0
##$NC_proc= -7
##$NLEV= 6
##$NOISF1= 182.463
##$NOISF2= 159.3651
##$NSP= 0
##$NTH_PI= 0
##$NZP= 0
##$OFFSET= 248.5645
##$PC= 4
##$PHC0= -7429.848
##$PHC1= 215.286
##$PH_mod= 1
##$PKNL= yes
##$PPARMOD= 0
##$PSCAL= 0
##$PSIGN= 0
##$REVERSE= no
##$SF= 81.014009
##$SI= 65536
##$SIGF1= 159.3651
##$SIGF2= -187.1042
##$SINO= 113.3802
##$SIOLD= 16384
##$SREGLST= <1H.CDCl3>
##$SSB= 0
##$STSI= 65536
##$STSR= 0
##$SW_p= 40650.406504065
##$SYMM= 0
##$S_DEV= 0
##$TDeff= 32768
##$TDoff= 0
##$TI= <>
##$TILT= no
##$TM1= 0
##$TM2= 0
##$TOPLEV= 0
##$USERP1= <user>
##$USERP2= <user>
##$USERP3= <user>
##$USERP4= <user>
##$USERP5= <user>
##$WDW= 1
##$XDIM= 65536
##$YMAX_p= 293017783
##$YMIN_p= -102844651
$$ End of Bruker specific parameters
$$ ---------------------------------
##NTUPLES= NMR SPECTRUM
##VAR_NAME=  FREQUENCY,     SPECTRUM/REAL,   SPECTRUM/IMAG
##SYMBOL=    X,             R,               I
##VAR_TYPE=  INDEPENDENT,   DEPENDENT,       DEPENDENT
##VAR_FORM=  AFFN,          ASDF,            ASDF
##VAR_DIM=   65536,         65536,           65536
##UNITS=     HZ,            ARBITRARY UNITS, ARBITRARY UNITS
##FACTOR=    0.620285442955139, 1,           1
##FIRST=     20137.2065510759, 0,            0
##LAST=      -20513.1999529892, 0,           0
##MIN=       -20513.1999529892, -102844651,  0
##MAX=       20137.2065510759, 293017783,    0
$$ Real data points
##PAGE= N=1
##DATA TABLE= (X++(R..R)), XYDATA
$$ [...]
$$ plain form
42339 -2150105 -1999447 -627028 2616277 5698218 6360239 5283899 5769693 9921547 15484448
42330 15484448 17574607 14256129 9048354 6208591 5061425 2152642 -1942563 -2569396
42322 -2569396 1557708 5637078 5580231 3222642 2013920 1578957 -37918 -2378536 -4486398
42313 -4486398 -7205945 -9579571 -6923480 2269127 10880125 10729425 3349062 -2733900
42305 -2733900 -3433110 -1546755 405681 2718843 4573766 4410552 4029263 5886195 6904673
42296 6904673 2191740 -5313001 -6889859 -484399 6855680 10039413 10969186 10982968 7730444
42287 7730444 2704182 2293247 6737607 7367057 691690 -3922602 1794633 11606637
42279 11606637 14274318 9745925 6085129 5505701 3869045 664736 -771643 -1149927
$$ packed form
42339b150105J50658J372419L243305L081941O62021j076340M85794M151854N562901
42330A5484448K090159l318478n207775k839763j147166k908783m095205o26833
42322b569396M127104M079370n6847k357589j208722m34963j616875k340618k107862
42313d486398k719547k373626K656091R192607Q610998j50700p380363o082962
42305b733900o99210J886355J952436K313162J854923j63214l81289J856932J018478
42296F904673m712933p504741j576858O405460P340079L183733R29773J3782l252524
42287G730444n026262m10935M444360O29450o675367m614292N717235R812004
42279A1606637K667681m528393l660796n79428j636656l204309j436379l78284
$$ plain form
42271 -1149927 -3896737 -7066859 -5424994 103993 3525160 3725182 4759886 6509726
42263 6509726 4305025 -1150882 -2740246 1784820 5968367 5303701 3689847 4973420
42255 4973420 5437625 604921 -5906732 -6794736 -1302588 4545164 6379795 5708319 6299781
42246 6299781 9532916 13364484 14438905 11575985 7385266 5130520 4423446 2459547
42238 2459547 -931261 -2960341 -2650853 -1773453 -309633 4237903 11083639 14503116
42230 14503116 11344862 6538271 7151732 13464741 19776567 22096701 20920768 17584007
42222 17584007 12424029 7081101 4846984 6867077 10050104 10570787 8440928 7074508
42214 7074508 8819372 12470971 15276345 15738213 13651940 9153609 3646347 360916
$$ packed form
42271a149927k746810l170122J641865N528987L421167K00022J034704J749840
42263F509726k204701n455907j589364M525066M183547o64666j613854J283573
42255D973420M64205m832704o511653q88004N492148N847752J834631o71476N91462
42246F299781L233135L831568J074421k862920m190719k254746p07074j963899
42238B459547l390808k029080L09488Q77400J463820M547536O845736L419477
42230A4503116l158254m806591O13461O313009O311826K320134j175933l336761
42222A7584007n159978n342928k234117K020093L183027N20683k129859j366420
42214G074508J744864L651599K805374M61868k086273m498331n507262l285431
$$ plain form
42206 360916 1230207 3789464 4273831 3338249 4614039 7492058 6830684 1682771 -1595790
42197 -1595790 1364070 6060937 6587547 4919928 6207210 8927080 7687117 3365736
42189 3365736 1972882 4302407 5219536 3602032 4447455 9195636 11965477 8799076
42181 8799076 4007943 3355258 6182946 8160129 7594978 5613479 3691191 3739669 7137733
42172 7137733 11474479 11951004 7919017 4029407 3188777 2969436 985905 -1220408 -2221641
42163 -2221641 -3504043 -5214566 -4249766 -109431 2432336 578685 -1470586 685634
42155 685634 4608312 6060311 6646445 10099790 14290629 13864707 9099477 5591548 5784738
42146 5784738 6736462 6348816 6344363 8115003 10183367 11283180 12457015 14387271 15138144
$$ packed form
42206C60916Q69291K559257M84367r35582J275790K878019o61374n147913l278561
42197a595790K959860M696867N26610j667619J287282K719870j239963m321381
42189C365736j392854K329525R17129j617504Q45423M748181K769841l166401
42181H799076m791133o52685K827688J977183n65151j981499j922288M8478L398064
42172G137733M336746M76525m031987l889610q40630k19341j983531k206313j001233
42163b221641j282402j710523R64800M140335K541767j853651k049271K156220
42155F85634L922678J451999N86134L453345M190839m25922m765230l507929J93190
42146E784738R51724l87646m453J770640K068364J099813J173835J930256P50873
$$ plain form
42137 15138144 12393067 6756330 1463846 -989753 -1130988 -737685 848798 6269120
42129 6269120 14388041 18088933 12243928 2112733 -1974040 2161554 7017512 7278925
42121 7278925 5522208 4344059 1457654 -3186234 -3568170 3047238 9805104 10034553
42113 10034553 7154855 7558344 9630070 8425563 6022208 7262722 8987791 4401515
42105 4401515 -3716868 -5313246 1280829 6565828 4534998 438085 735712 3726217
42097 3726217 4462802 2436123 -74465 -2431738 -4581267 -5247756 -4102685 -2817517
42089 -2817517 -2333235 -2069781 -2432586 -4378671 -6148361 -4668948 -588819 2478788 3812254
42080 3812254 5818713 8559074 9763504 10520082 14445203 20108881 21015200 15079628
$$ packed form
42137A5138144k745077n636737n292484k453599j41235L93303J586483N420322
42129F269120Q118921L700892n845005j0131195m086773M135594M855958K61413
42121G278925j756717j178149k886405m643888l81936O615408O757866K29449
42113A0034553k879698M03489K071726j204507k403355J240514J725069m586276
42105D401515q118383j596378O594075N284999k030830m096913K97627K990505
42097C726217P36585k026679k510588k357273k149529o66489J145071J285168
42089b817517M84282K63454l62805j946085j769690J479413M080129L067607J333466
42080C812254K006459K740361J204430P56578L925121N663678R06319n935572
$$ plain form
42072 15079628 7765326 3737411 1981652 1461398 4155471 8829500 9220549 3599643
42064 3599643 -277817 4310427 12937363 16595775 13867060 10183638 8674359 8270836
42056 8270836 8254444 8498595 7071097 3081159 162004 1999160 6146297 7320000 5155414
42047 5155414 3611045 4198461 5047937 5618946 7170098 9135055 9741710 9661587 10585425
42038 10585425 10990770 8106852 3513034 1796432 3747485 5769070 6147922 6842302
42030 6842302 8414468 8410454 6396515 5868092 8658243 11193003 9259789 4047044 658268
42021 658268 1877767 5517062 7555629 6693050 5401903 6191694 7364193 4740787 -1630282
42012 -1630282 -5831354 -3751422 765881 1374718 -1854009 -3882841 -3026468 -2023681
$$ packed form
42072A5079628p314302m027915j755759n20254K694073M674029L91049n620906
42064C599643l877460M588244Q626936L658412k728715l683422j509279m03523
42056H270836j6392K44151j427498l989938k919155J837156M147137J173703k164586
42047E155414j544369N87416Q49476N71009J551152J964957O06655q0123R23838
42038A0585425M05345k883918m593818j716602J951053K021585L78852O94380
42030F842302J572166m014k013939n28423K790151K534760j933214n212745l388776
42021F58268J219499L639295K038567q62579j291147P89791J172499k623406o371069
42012a630282m201072K079932M517303O08837l228727k028832Q56373J002787
$$ plain form
42004 -2023681 -1828670 -443071 2223552 4352620 7037823 12442138 16710518 12551851
41996 12551851 1037573 -7066327 -5393040 30021 1388447 92622 966227 2504080
41988 2504080 1118343 -331102 2510254 5836700 2889837 -3430277 -3672077 2799665
41980 2799665 6263467 2261122 -1565823 1755214 7993548 9577698 6713637 4322389
41972 4322389 3615453 3305772 4689906 8823530 12072819 10960692 8500970 9141462 10234819
41963 10234819 6249407 -168972 -37408 8396640 16101178 15687835 10276387 6525341
41955 6525341 5250344 3791538 2615432 3649418 5101134 3775582 1087411 1461417
41947 1461417 5124310 7251769 4896282 832071 -679903 1140945 4264679 6979054
$$ packed form
42004b023681J95011J385599K666623K129068K685203N404315M268380m158667
41996A2551851j1514278q103900J673287N423061J358426j295825Q73605J537853
41988B504080j385737j449445K841356L326446k946863o320114k41800O471742
41980B799665L463802m002345l826945L321037O238334J584150k864061k391248
41972D322389p06936l09681J384134M133624L249289j112127k459722O40492J093357
41963A0234819l985412o418379J31564Q434048P704538m13343n411448l751046
41955F525341j274997j458806j176106J033986J451716j325552k688171L74006
41947A461417L662893K127459k355487m064211j511974J820848L123734K714375
$$ plain form
41939 6979054 8638359 8978378 8321824 7476799 6331764 3693069 -209576 -2247208 484534
41930 484534 6201873 9203060 6069613 -286608 -4098849 -3229678 -314931 1981480
41922 1981480 4083489 6984377 9197374 8419647 4808767 447802 -3270071 -5421709
41914 -5421709 -4077459 1623436 8405788 11619710 11576537 13382101 19079492 23622680
41906 23622680 21236037 13052403 5352990 1940707 1412057 1175908 1055379 2317630
41898 2317630 4929436 6740024 5290815 676149 -3542607 -3368408 1485952 7591298
41890 7591298 11747026 13199966 12255490 9433538 6461918 5200876 4754524 2670483
41882 2670483 -177933 256751 4563331 7623399 5702877 1866279 991042 3097947
$$ packed form
41939F979054J659305L40019o56554q45025j145035k638695l902645k037632K731742
41930D84534N717339L001187l133447o356221l812241Q69171K914747K296411
41922A981480K102009K900888K212997p77727l610880m360965l717873k151638
41914e421709J344250N700895O782352L213922m3173J805564N697391M543188
41906B3622680k386643q183634p699413l412283n28650k36149j20529J262251
41898B317630K611806J810588j449209m614666m218756J74199M854360O105346
41890G591298M155728J452940r44476k821952k971620j261042m46352k084041
41882B670483k848416M34684M306580L060068j920522l836598q75237K106905
$$ plain form
41874 3097947 5525053 8134398 11602012 13438985 10890656 5791216 1899810 -310596
41866 -310596 -1551847 404517 6592675 11366979 8548820 1552626 -464453 4248652
41858 4248652 9131053 11251309 14300313 18019822 15374557 5064585 -2660413 324824
41850 324824 7950190 9344965 4505827 2147712 5950673 11569862 15066730 16096461
41842 16096461 13725827 6962262 -186048 -1181749 4181524 9117372 9293828 7488123
41834 7488123 7226432 7282758 5359298 2798655 2111284 2862215 3345572 4049949 6145551
41825 6145551 8093550 7108753 3406391 94606 -1095705 -1306095 -1328874 404506 4939721
41816 4939721 9719584 10819733 7815234 4320464 3677514 6113951 10197785 14334486
$$ packed form
41874C097947K427106K609345L467614J836973k548329n099440l891406k210406
41866c10596j241251J956364O188158M774304k818159o996194k017079M713105
41858D248652M882401K120256L049004L719509k645265j0309972p724998K985237
41850C24824P625366J394775m839138k358115L802961N619189L496868J029731
41842A6096461k370634o763565p148310r95701N363273M935848J76456j805705
41834G488123k61691N6326j923460k560643o87371P50931M83357P04377K095602
41825F145551J947999r84797l702362l311785j190311k10390k2779J733380M535215
41816D939721M779863J100149l004499l494770o42950K436437M083834M136701
$$ plain form
41808 14334486 15972378 12650816 6067344 2036621 3254519 5043049 2517099 -892154
41800 -892154 1813542 9465463 13289647 10025354 6894877 10551167 17829135 21858303
41792 21858303 21681229 20503080 19010113 16446995 14993108 16756662 18412279 14872832
41784 14872832 7338415 2221116 2417642 4586736 5108558 4167416 3361927 3095960 3127916
41775 3127916 2949524 1529975 -905211 -1587174 1500114 6021463 8106331 7719848 7900403
41766 7900403 9797334 12126657 14404977 16687969 17161109 14421264 11245628 11204311 12180559
41757 12180559 8829669 1647158 -2293640 1042507 7613806 11575701 11631431 9222133
41749 9222133 5417202 2314752 3104934 7552602 10869060 9850164 6936517 5776063
$$ packed form
41808A4334486J637892l321562o583472m030723J217898J788530k525950l409253
41800h92154K705696P651921L824184l264293l130477L656290P277968M029168
41792B1858303j77074j178149j492967k563118j453887J763554J655617l539447
41784A4872832p534417n117299J96526K169094N21822r41142q05489k65967L1956
41775C127916j78392j419549k435186o81963L087288M521349K084868l86483J80555
41766G900403J896931K329323K278320K282992M73140k739845l175636m1317R76248
41757A2180559l350890p182511l940798L336147O571299L961895N5730k409298
41749I222133l804931l102450P90182M447668L316458j018896k913647j160454
$$ plain form
41741 5776063 6307266 7004871 8387506 10799439 11667722 8804868 4505038 2964958 4981778
41732 4981778 7891574 9462976 9636660 9684257 11198863 14233161 15485098 11148846 2946691
41723 2946691 -2126836 -109769 5445474 9459557 11379943 12092730 9889080 4756976
41715 4756976 2485560 7759040 15651719 17003199 11000828 5373115 4478596 4755752
41707 4755752 3201808 2817782 6229995 9896455 9179122 5199468 2384786 2056262 2388043
41698 2388043 2597540 3418038 4713651 5782502 7039961 8747137 9209472 7076148 4586923
41689 4586923 5478679 9737559 13140415 12466167 8980773 6075855 5273385 5565893 5461693
41680 5461693 4535512 3444640 3219462 4504963 7187164 10606077 13809514 15443010
$$ packed form
41741E776063N31203O97605J382635K411933Q68283k862854m299830j540080K016820
41732D981778K909796J571402J73684M7597J514606L034298J251937m336252q202155
41723B946691n073527K017067N555243M014083J920386P12787k203650n132104
41715D756976k271416N273480P892679J351480o002371n627713q94519K77156
41707D755752j553944l84026L412213L666460p17333l979654k814682l28524L31781
41698B388043K09497Q20498J295613J068851J257459J707176M62335k133324k489225
41689D586923Q91756M258880L402856o74248l485394k904918q02470K92508j04200
41680E461693r26181j090872k25178J285501K682201L418913L203437J633496
$$ plain form
41672 15443010 14149596 10132890 6191991 5893050 9862154 14437935 15000623 10716796
41664 10716796 5167947 1963621 837524 -614908 -2096014 -144671 6350950 12567251
41656 12567251 12571589 6950868 2353674 2894450 5307256 4618825 1864601 2574732 8510157
41647 8510157 14859960 16773687 15585576 15999007 18680820 19006047 13798007 6662629
41639 6662629 4196918 7626363 11026660 9026618 3993629 2683091 6548573 9366407
41631 9366407 6108302 605338 541258 6607467 11563835 10481992 7034789 7274619 11309273
41622 11309273 15024812 17075312 19012845 19731851 15616234 7289843 1165780 1650108
41614 1650108 5473462 6795375 4992525 3811817 4890231 6171300 5962837 4876673
$$ packed form
41672A5443010j293414m016706l940899k98941L969104M575781N62688m283827
41664A0716796n548849l204326j126097j452432j481106J951343O495621O216301
41656A2567251M338n620721m597194N40776K412806o88431k754224P10131N935425
41647H510157O349803J913727j188111M13431K681813L25227n208040p135378
41639F662629k465711L429445L400297k000042n032989j310538L865482K817834
41631I366407l258105n502964o4080O066209M956368j081843l447203K39830M034654
41622A1309273L715539K050500J937533P19006m115617q326391o124063M84328
41614A650108L823354J321913j802850j180708J078414J281069k08463j086164
$$ plain form
41606 4876673 3749701 2744001 2679199 4325380 5978049 4663868 636777 -1990453
41598 -1990453 -367572 3575609 6133237 6394059 6199056 7074864 8943096 10924853 11951181
41589 11951181 11201919 9098967 7410552 7510333 8820515 9380336 7698377 4358893 2560055
41580 2560055 6168556 15300968 24292556 26636457 22121846 16388953 13209389 10838957
41572 10838957 7192022 4396170 5238753 8424422 11111896 13688604 17903640 22114428
41564 22114428 23030342 21281995 20470364 20690470 17872099 10687199 3616638 934289
41556 934289 1227217 675470 -933277 -708477 2363906 6180295 8972288 11363663 14328664
41547 14328664 16796611 16537744 13080944 8785839 6474866 6449121 6923612 7337720 9312779
$$ packed form
41606D876673j126972j005700o4802J646181J652669j314181m027091k627230
41598a990453J622881L943181K557628K60822j95003Q75808J868232J981757J026328
41589A1951181p49262k102952j688415R9781J310182N59821j681959l339484j798838
41580B560055L608501R132412Q991588K343901m514611n732893l179564k370432
41572A0838957l646935k795852Q42583L185669K687474K576708M215036M210788
41564B2114428R15914j748347q11631K20106k818371p184900p070561k682349
41556I34289K92928n51747j608747K24800L072383L816389K791993K391375K965001
41547A4328664K467947k58867l456800m295105k310973k5745M74491M14108J975059
$$ plain form
41538 9312779 13245062 15974325 14222557 9259724 5496643 4869516 5219276 4207872
41530 4207872 2343986 1746278 3788743 7946953 11339877 10421480 5613962 2838064
41522 2838064 6657662 12968649 13456431 7116110 1434021 1044236 1826806 -709887 -3585456
41513 -3585456 -1888046 2801235 5423314 5434935 5824485 6632290 5499334 3186624 2825726
41504 2825726 4516974 5823077 6681258 8609211 10077970 8481602 6077271 7585917
41496 7585917 11691877 11639010 5628283 203348 1057178 6247764 11061034 14023600 15107186
41487 15107186 13345562 9847899 8461580 9908903 9997858 7286507 7063492 12588628
41479 12588628 17470694 13591669 3310565 -3409328 -2243085 2130809 5136590 7566874
$$ packed form
41538I312779L932283K729263j751768m962833l763081o27127L49760j011404
41530D207872j863886n97708K042465M158210L392924r18397m807518k775898
41522B838064L819598O310987M87782o340321n682089l89785P82570k536693k875569
41513c585456J697410M689281K622079J1621L89550Q07805j132956k312710l60898
41504B825726J691248J306103Q58181J927953J468759j596368k404331J508646
41496G585917M105960n2867o010727n424935Q53830N190586M813270K962566J083586
41487A5107186j761624l497663j386319J447323Q8955k711351k23015N525136
41479A2588628M882066l879025j0281104o719893J166243M373894L005781K430284
$$ plain form
41471 7566874 10609007 11896045 9435356 5574585 4234802 6257572 9237800 10573142
41463 10573142 9660437 7953015 7186298 7315816 7128983 7043013 8856075 11741494 11933205
41454 11933205 8596414 6162943 7480847 8747226 5989734 2606160 4092634 8327496
41446 8327496 8677794 5058957 3655782 5954813 6631442 3520819 1224162 2261461
41438 2261461 2695638 305253 -341557 4085593 8869886 8039128 3046977 -691398 -1663930
41429 -1663930 -1431411 92570 3038070 4561387 2801856 954596 2270739 4094666
41421 4094666 2548409 222765 2527611 8150860 10237636 6848836 3552993 4460177
41413 4460177 6431919 4505078 -946777 -4854716 -2999233 4322298 12485647 16106299
$$ packed form
41471G566874L042133J287038k460689l860771j339783K022770K980228J335342
41463A0573142r12705j707422p66717J29518j86833q5970J813062K885419J91711
41454A1933205l336791k433471J317904J266379k757492l383574J486474M234862
41446H327496L50298l618837j403175K299031O76629l110623k296657J037299
41438B261461M34177k390385o46810M427150M784293q30758m992151l738375r72532
41429a663930K32519J523981K945500J523317j759531j847260J316143J823927
41421D094666j546257k325644K304846N623249K086776l388800l295843R07184
41413D460177J971742j926841n451855l907939J855483P321531Q163349L620652
$$ plain form
41405 16106299 14040344 10569849 10226504 12647848 14343874 13671089 11511062 8990744
41397 8990744 7551075 9245331 13501034 15639248 12574570 8054397 7867365 11687409
41389 11687409 14516268 14501115 13808166 13020546 10802120 8665613 9816603 13034457 13759914
41380 13759914 11613732 10493026 10638969 7778400 1859199 -731973 3249066 8822190
41372 8822190 11026386 11937155 14953170 17911103 17405878 15365181 15547687 16951925 16200271
41363 16200271 13691091 12151043 11370206 9402076 7254411 7828616 11489776 16169526
41355 16169526 19864920 20011570 13889416 3941795 -1176051 3346867 10561514 10491019
41347 10491019 4023143 267044 1828640 2096925 -2080860 -4567347 -247387 6829131
$$ packed form
41405A6106299k065955l470495l43345K421344J696026o72785k160027k520318
41397H990744j439669J694256M255703K138214l064678m520173j87032L820044
41389A1687409K828859j5153o92949p87620k218426k136507J150990L217854P25457
41380A3759914k146182j120706J45943k860569n919201k591172L981039N573124
41372H822190K204196R10769L016015K957933n05225k040697J82506J404238p51654
41363A6200271k509180j540048p80837j968130k147665N74205L661160M679750
41355A6169526L695394J46650o122154r947621n117846M522918P214647p0495
41347A0491019o467876l756099J561596K68285m177785k486487M319960P076518
$$ plain form
41339 6829131 10545630 11609258 13731718 16000416 15439561 13795958 15172551 18496342
41331 18496342 18403440 13345176 7705371 5591124 6947694 10200371 14259723 16888564
41323 16888564 15491637 11455062 9805319 12098201 13375276 9567331 4463894 4419662
41315 4419662 8412198 9663627 6962909 7330354 14671981 22028855 20554684 12299889
41307 12299889 7475331 10499422 15470819 16080678 13745152 13333839 15686535 17997037
41299 17997037 18561631 17732888 16140647 14701853 14647849 15288767 13854545 9995501 8053470
41290 8053470 11636761 17813260 20271306 17021242 11533637 7431340 5927149 7753756
41282 7753756 13113546 19095653 21086712 18195136 14424791 13261863 13715817 13065654
$$ packed form
41339F829131L716499J063628K122460K268698n60855j643603J376593L323791
41331A8496342r2902n058264n639805k114247J356570L252677M059352K628841
41323A6888564j396927m036575j649743K292882J277075l807945n103437m4232
41315D419662L992536J251429k700718L67445P341627P356874j474171q254795
41307A2299889m824558L024091M971397O09859k335526m11313K352696K310502
41299A7997037N64594q28743j592241j438794n4004O40918j434222l859044j942031
41290H053470L583291O176499K458046l250064n487605m102297j504191J826607
41282G753756N359790N982107J991059k891576l770345j162928M53954o50163
$$ plain form
41274 13065654 11203407 10523444 12755930 16933894 19725661 17972348 12379661 8072476
41266 8072476 9164250 13350028 14947762 12911360 11720113 13756573 15583725 13920995
41258 13920995 10878602 9942848 10462664 10170907 10144061 12414052 14668752 12710769 7531390
41249 7531390 4680144 6195411 8116315 7270991 5833128 6808317 8971982 9456285 8513485
41240 8513485 8345645 9139430 9553164 9870939 11476369 13788335 14533388 12868796 10017898
41231 10017898 7284993 5650138 6515204 10017561 13121385 12615382 9820295 8623323
41223 8623323 8689136 5451772 -1318087 -3985439 3743897 17333848 25934204 24718280
41215 24718280 18274618 12984992 11040060 11838907 14054917 14931774 11914500 6876786
$$ packed form
41274A3065654j862247o79963K232486M177964K791767j753313n592687m307185
41266H072476J091774M185778J597734k036402j191247K036460J827152j662730
41258A3920995l042393r35754N19816k91757k6846K269991K254700j957983n179379
41249G531390k851246J515267J920904q45324j437863R75189K163665M84303r42800
41240H513485j67840P93785M13734L17775J605430K311966P45053j664592k850898
41231A0017898k732905j634855Q65066L502357L103824n06003k795087j196972
41223H623323O5813l237364o769859k667352P729336J3589951Q600356j215924
41215B4718280o443662n289626j944932P98847K216010Q76857l017274n037714
$$ plain form
41207 6876786 4917392 6959734 7607366 3338992 -1025546 1525558 10020289 16384469
41199 16384469 15588797 10436905 6430923 6226324 9721206 15322130 19511388 18847560
41191 18847560 14619941 12512506 15274759 18641433 17516200 13412919 11586598 12737612
41183 12737612 12910938 11287455 12065657 16709181 19923211 17362176 13142275 14261982
41175 14261982 19920672 22438609 18319100 12494011 10593204 12467869 15458598 18957745
41167 18957745 22375949 22820164 19041427 14754844 13888938 14970994 14429217 13127873
41159 13127873 14691713 18893724 21920607 22402277 21978405 20429494 16110961 11603978
41151 11603978 12573331 19032022 23581626 21410069 16917796 16522619 19303151 19667666
$$ packed form
41207F876786j959394K042342O47632m268374m364538K551104Q494731O364180
41199A6384469p95672n151892m005982k04599L494882N600924M189258o63828
41191A8847560m227619k107435K762253L366674j125233m103281j826321J151014
41183A2737612J73326j623483P78202M643524L214030k561035m219901J119707
41175A4261982N658690K517937m119509n825089j900807J874665K990729L499147
41167A8957745L418204M44215l778737m286583q65906J082056n41777j301344
41159A3127873J563840M202011L026883M81670m23872j548911m318533m506983
41151A1603978R69353O458691M549604k171557m492273l95177K780532L64515
$$ plain form
41143 19667666 16245463 12792819 11668103 11362267 10494333 10198934 11573555 13517340
41135 13517340 14417942 14505062 15364531 17520793 19331184 18997161 17602537 18390749 21697467
41126 21697467 22847649 18188209 11394729 9250547 12114053 14186769 13269370 13500832
41118 13500832 16719326 18388421 15814494 13559287 15497740 17802060 16367837 15502672
41110 15502672 20952233 28533088 29269031 23624275 20595507 22946129 23616156 18763188
41102 18763188 14485558 16126800 19210169 17337507 13159269 14313223 21709116 28568680
41094 28568680 30000319 28098597 27455103 29648869 32757634 33550051 29760319 22350707
41086 22350707 15836721 14601717 18484667 23201254 25167033 24657087 24095120 24654451
$$ packed form
41143A9667666l422203l452644j124716l05836q67934k95399J374621J943785
41135A3517340R00602Q7120Q59469K156262J810391l34023j394624P88212L306718
41126B1697467J150182m659440o793480k144182K863506K072716r17399K31462
41118A3500832L218494J669095k573927k255207J938453K304320j434223q65165
41110A5502672N449561P580855P35943n644756l028768K350622O70027m852968
41102A8763188m277630J641242L083369j872662m178238J153954P395893O859564
41094B8568680J431639j901722o43494K193766L108765P92417l789732p409612
41086B2350707o513986j235004L882950M716587J965779n09946n61967N59331
$$ plain form
41078 24654451 25391442 24941295 22979886 20149024 17584867 16770429 18630786 21858167
41070 21858167 23248895 21167397 17809178 16406484 17410711 19704436 23768360 29601861
41062 29601861 32832626 28872090 21458092 20250713 27353490 33018616 29142938 20671116
41054 20671116 17491414 20460774 23069363 22935706 22991164 23410235 21262112 17948948 18859622
41045 18859622 24646442 29724133 30520241 29051306 27559462 25833589 24682975 25750658
41037 25750658 26854711 23884477 18483842 17249001 21807147 26520815 27975478 29575965
41029 29575965 33806802 36842212 34800106 29691408 25464994 23106206 22483477 23703549
41021 23703549 24194694 20605812 16161854 18892133 28973843 35603549 31339706 21913723
$$ packed form
41078B4654451P36991m50147j961409k830862k564157q14438J860357L227381
41070B1858167J390728k081498l358219j402694J004227K293725M063924N833501
41062B9601861L230765l960536p413998j207379P102777N665126l875678q471822
41054B0671116l179702K969360K608589j33657N5458M19071k148123l313164R10674
41045A8859622N786820N077691P96108j468935j491844j725873j150614J067683
41037B5750658J104053k970234n400635j234841M558146M713668J454663J600487
41029B9575965M230837L035410k042106n108698m226414k358788o22729J220072
41021B3703549M91145l588882m443958K730279J0081710O629706m263843r425983
$$ plain form
41013 21913723 16015741 13311288 10157645 9635053 15944455 24041126 25417183 21265068
41005 21265068 19884147 22758134 23163359 18493311 14607682 16217020 20413354 22031017
40997 22031017 19928362 16277496 13929127 15185671 19465011 22591771 22069658 21323410
40989 21323410 24096442 27145590 24888588 19492419 18728722 24084931 28687408 27989277
40981 27989277 25229038 24348016 24092205 21869141 18172900 14729361 12640307 13784304
40973 13784304 19242094 25152652 25525280 20716018 17581971 19529218 22438156 22728861
40965 22728861 22844581 25037409 26016092 22864852 19160567 19519019 22122655 22695714 22687566
40956 22687566 26745601 33635526 36607598 33353795 29692295 31186163 35417111 35811835
$$ packed form
41013B1913723n897982k704453l153643n22592O309402Q096671J376057m152115
41005B1265068j380921K873987M05225m670048l885629J609338M196334J617663
40997B2031017k102655l650866k348369J256544M279340L126760n22113p46248
40989B1323410K773032L049148k257002n396169p63697N356209M602477o98131
40981B7989277k760239q81022k55811k223064l696241l443539k089054J143997
40973A3784304N457790N910558L72628m809262l134047J947247K908938K90705
40965B2728861J15720K192828R78683l151240l704285L58452K603636N73059q148
40956B2687566M058035O889925K972072l253803l661500J493868M230948L94724
$$ plain form
40948 35811835 30890645 26224712 27145188 32083247 34920008 32940132 29784146 29746097
40940 29746097 31949917 32651536 31112671 29474511 28037193 25183296 21993948 22230197
40932 22230197 26516281 30745826 31924706 31590221 31441455 29825159 25635857 21974953
40924 21974953 21911655 23178887 21342379 16793020 14529927 17415274 22983618 27020149
40916 27020149 27685554 25852086 23417493 21790427 21042626 20643628 21292368 24470910 29136349
40907 29136349 31021991 27591844 22159957 20190923 22381482 24585128 24315331 23665203
40899 23665203 24808902 26158571 25476207 24289416 25695851 28795044 29253382 26040321
40891 26040321 23795711 26241170 30322492 30495178 26874323 24602541 25740190 26844413
$$ packed form
40948C5811835m921190m665933R20476M938059K836761j979876l155986l8049
40940B9746097K203820P01619j538865j638160j437318k853897l189348K36249
40932B2230197M286084M229545J178880l34485j48766j616296m189302l660904
40924B1974953o3298J267232j836508m549359k263093K885347N568344M036531
40916B7020149O65405j833468k434593j627066p47801l98998O48740L178542M665439
40907B9136349J885642l430147n431887j969034K190559K203646k69797o50128
40899B3665203J143699J349669o82364j186791J406435L099193M58338l213061
40891B6040321k244610K445459M081322J72686l620855k271782J137649J104223
$$ plain form
40883 26844413 25471202 23992029 24677167 25594881 24633058 23557983 24201077 24212369 21128052
40874 21128052 17670331 18104058 21707768 24705430 26270763 27445917 26722183 22794699
40866 22794699 19383934 20368596 22072569 18420577 12534707 13837819 23186127 30839112
40858 30839112 31446782 30964120 34583507 37781765 35861672 33689572 37315561 42076227
40850 42076227 38518857 27034388 18064229 18743596 25905984 31946024 32576668 29023279
40842 29023279 26016668 26911988 29072559 26831594 20500625 17348585 20649311 24020352
40834 24020352 21691442 18114561 20396454 26581680 29684639 29077187 28971399 29121512
40826 29121512 26865285 25914268 32208923 41653121 43142410 35140649 28602761 30646608
$$ packed form
40883B6844413j373211j479173O85138R17714r61823j075075O43094J1292l084317
40874B1128052l457721M33727L603710K997662J565333J175154p23734l927484
40866B2794699l410765R84662J703973l651992n885870J303112R348308P652985
40858C0839112O07670m82662L619387L198258j920093k172100L625989M760666
40850D2076227l557370j1484469q970159O79367P162388O040040O30644l553389
40842B9023279l006611Q95320K160571k240965o330969l152040L300726L371041
40834B4020352k328910l576881K281893O185226L102959o07452j05788J50113
40826B9121512k256227r51017O294655R444198J489289q001761o537888K043847
$$ plain form
40818 30646608 35453917 35599093 32934180 32274363 32225610 29488633 26500576 27382812 30040501
40809 30040501 29168341 24909769 22530081 24559491 28172604 29967999 29517059 28194008
40801 28194008 27243828 27141906 27313751 26712640 25281128 23980692 23384885 23741790 25812121
40792 25812121 29166018 30530705 27495629 23313314 23512266 27869825 30994987 31158090
40784 31158090 32249690 35648030 37155673 34826650 32796109 33245897 31505633 24710338
40776 24710338 18998401 21043795 27323801 29517691 27101473 26684509 30939740 35795724
40768 35795724 37741559 37351583 36201614 35952707 39151245 45122454 46989004 39529973
40760 39529973 28348919 23820471 27351035 31890336 34730059 39470450 44720921 42609105
$$ packed form
40818C0646608M807309J45176k664913o59817m8753k736977k988057Q82236K657689
40809C0040501q72160m258572k379688K029410L613113J795395m50940j323051
40801B8194008r50180j01922J71845o01111j431512j300436n95807L56905K070331
40792B5812121L353897J364687l035076m182315J98952M357559L125162J63103
40784C1158090J091600L398340J507643k329023k030541M49788j740264o795295
40776B4710338n711937K045394O280006K193890k416218m16964M255231M855984
40768C5795724J945835l89976j149969k48907L198538N971209J866550p459031
40760C9529973j1181054m528448L530564M539301K839723M740391N250471k111816
$$ plain form
40752 42609105 32547994 25792466 30045090 38489776 41281506 39796461 40854836 43653982
40744 43653982 42683871 39178316 39076024 41839768 41385965 37211623 34772277 34617610 31195891
40735 31195891 24413357 22516598 29200544 36311186 35371253 29945655 29681188 36289064
40727 36289064 42445441 42592491 38678355 35571737 35446990 37023031 37353534 34443769
40719 34443769 29999881 28409222 31120475 34134547 33636320 31656171 32616775 36424668
40711 36424668 39223878 39426836 38428362 36523807 33187495 30833320 32821194 37492216
40703 37492216 39750526 39253563 40852948 45247083 46124890 40327548 34419925 35556482
40695 35556482 40870462 42626952 40205597 39323611 41352681 41611177 38434786 36189447
$$ packed form
40752D2609105j0061111o755528M252624Q444686K791730j485045J058375K799146
40744D3653982r70111l505555j02292K763744m53803m174342k439346j54667l421719
40735C1195891o782534j896759O683946P110642r39933n425598k64467O607876
40727C6289064O156377J47050l914136l106618j24747J576041L30503k909765
40719C4443769m443888j590659K711253L014072m98227j980149R60604L807893
40711C6424668K799210K02958r98474j904555l336312k354175J987874M671022
40703C7492216K258310m96963J599385M394135Q77807n797342n907623J136557
40695C5556482N313980J756490k421355q81986K029070K58496l176391k245339
$$ plain form
40687 36189447 37397857 38719581 37754246 37780971 41595952 45605991 45161282 42337723 42959309
40678 42959309 47749473 51665960 51429131 49061774 47672884 47727055 48425377 49539200 50574647
40669 50574647 50539538 49741152 49863350 51251949 51963709 50571772 48212060 46678387 46087658
40660 46087658 45826115 46325713 47999358 49321819 48226074 45551830 45216133 49921182
40652 49921182 57558064 62983275 63343813 60884906 60016843 61972171 63325969 60311242
40644 60311242 53807512 48771200 48687421 51840662 53675386 51902853 48435872 46907113
40636 46907113 49148537 53712442 57110323 56931763 54446037 53496384 55952942 59235610
40628 59235610 59895703 58651657 59158942 61812273 62193025 57359732 50804069 48261068
$$ packed form
40687C6189447J208410J321724r65335K6725L814981M010039m44709k823559O21586
40678D2959309M790164L916487k36829k367357j388890N4171O98322J113823J035447
40669E0574647l5109p98386J22198J388599P11760j391937k359712j533673n90729
40660D6087658k61543M99598J673645J322461j095745k674244l35697M705049
40652D9921182P636882N425211L60538k458907q68063J955328J353798l014727
40644F0311242o503730n036312q3779L153241J834724j772533l466981j528759
40636D6907113K241424M563905L397881j78560k485726r49653K456558L282668
40628E9235610O60093j244046N07285K653331L80752m833293o555663k543001
$$ plain form
40620 48261068 50350130 52676635 52364120 50894117 50336745 50341050 50074653 50149313 50780926
40611 50780926 50372566 48088039 46164157 47437687 51580260 55593036 57054035 55238962
40603 55238962 50409480 44445616 41424634 44619684 52209453 57836743 56467633 49076671
40595 49076671 41402238 38752766 41868478 47032595 50144796 50839604 51992422 55194275
40587 55194275 58469161 59425930 58725183 58506190 58845054 58147088 56253947 54911520 55519407
40578 55519407 58036854 61277195 62728402 59668878 52824897 47397468 47629230 51758800
40570 51758800 55354580 57669766 60497888 62563819 60825605 56971035 56407745 59821956
40562 59821956 61795444 59673557 57810222 60116844 63986223 65307752 64519147 63589936
$$ packed form
40620D8261068K089062K326505l12515j470003n57372M305k66397P4660O31613
40611E0780926m08360k284527j923882J273530M142573M012776J460999j815073
40603E5238962m829482n963864l020982L195050P589769N627290j369110p390962
40595D9076671p674433k649472L115712N164117L112201O94808J152818L201853
40587E5194275L274886R56769p00747k18993L38864o97966j893141j342427O07887
40578E5519407K517447L240341J451207l059524o843981n427429K31762M129570
40570E1758800L595780K315186K828122K065931j738214l854570n63290L414211
40562E9821956J973488k121887j863335K306622L869379J321529p88605r29211
$$ plain form
40554 63589936 61714782 58666170 58099890 62270414 67110776 67924779 66492319 66799840
40546 66799840 67275346 64170215 59923303 60337522 64718925 66662837 64382744 62513644
40538 62513644 63171023 63154484 61638674 62819853 68009175 72119280 71602450 69588962 69299373
40529 69299373 68541648 65429878 63787272 67066796 71474211 71375610 68173465 67552247 70272328
40520 70272328 71821304 69840471 66384136 63730327 62883472 65184917 70402222 74185346
40512 74185346 72755145 69520216 71275853 77707800 80836247 76323104 69449841 67154069
40504 67154069 69202895 71001409 71266641 72425819 75489457 78680492 80478240 80910144
40496 80910144 80029700 77545615 74138525 71459584 70472261 70582657 70336797 68605695 65652984
$$ packed form
40554F3589936j875154l048612n66280M170524M840362Q14003j432460L07521
40546F6799840M75506l105131m246912M14219M381403J943912k280093j869100
40538F2513644O57379j6539j515810J181179N189322M110105n16830k013488k89589
40529F9299373p57725l111770j642606L279524M407415r8601l202145o21218K720081
40520G0272328J548976j980833l456335k653809q46855K301445N217305L783124
40512G4185346j430201l234929J755637O431947L128447m513143o873263k295772
40504F7154069K048826J798514K65232J159178L063638L191035J797748M31904
40496H0910144q80444k484085l407090k678941r87323J10396k45860j731102k952711
$$ plain form
40487 65652984 63372944 63608385 65872607 67860145 68649462 69929847 73216564 77398575
40479 77398575 80399213 82010411 83407745 84658957 84486462 82262358 78814266 75367769
40471 75367769 72909371 72416828 74279306 77177970 78723923 77929536 76586820 77720616
40463 77720616 82642827 89280857 93193713 90990493 83822220 77192064 75917971 79012388
40455 79012388 80846619 77941449 73230193 72496731 77744808 85594316 91259633 92031598
40447 92031598 87476283 79274816 71682776 69183578 71594634 73543357 71112608 67180628
40439 67180628 67320099 72041328 76925969 79584273 81773722 84149045 84074330 80951232
40431 80951232 79106177 81615121 84782380 83438804 79363077 78987485 83509234 86981713
$$ packed form
40487F5652984k280040K35441K264222J987538P89317J280385L286717M182011
40479G7398575L000638J611198J397334J251212j72495k224104l448092l446497
40471G5367769k458398m92543J862478K898664J545953p94387j342716J133796
40463G7720616M922211O638030L912856k203220p168273o630156j274093L094417
40455G9012388J834231k905170m711256p33462N248077P849508N665317P71965
40447I2031598m555315q201467p592040k499198K411056J948723k430749l931980
40439F7180628J39471M721229M884641K658304K189449K375323p4715l123098
40431H0951232j845055K508944L167259j343576m075727l75592M521749L472479
$$ plain form
40423 86981713 85377137 82523788 84183199 89595995 92546327 89521715 83707172 80752465
40415 80752465 82576745 86154179 87555837 86126099 84211251 83433181 82966585 82211463
40407 82211463 83120887 87499442 93000618 94842858 91790715 87754977 86566032 87554120
40399 87554120 87748955 86445566 85490726 86075514 87374361 88314789 89057792 90086810 90742225
40390 90742225 89791436 87661577 87078452 90143650 95022799 97497779 96510575 95963850 99252649
40381 99252649 104019533 105210741 102243704 99765738 101204241 104624843 105949783 104109220
40373 104109220 101872540 102731355 107385046 112609418 114262756 112373295 111544792 114537771
40365 114537771 118123174 118763469 119470228 125245264 133476547 136466045 133926805 134645455
$$ packed form
40423H6981713j604576k853349J659411N412796K950332l024612n814543k954707
40415H0752465J824280L577434J401658j429738j914848p78070m66596p55122
40407H2211463R09424M378555N501176J842240l052143m035738j188945R88088
40399H7554120J94835j303389r54840N84788J298847R40428P43003J029018O55415
40390I0742225r50789k129859n83125L065198M879149K474980r87204n46725L288799
40381I9252649M766884J191208k967037k477966J438503L420602J324940j840563
40373A04109220k236680Q58815M653691N224372J653338j889461q28503K992979
40365A14537771L585403O40295P06759N775036Q231283K989498k539240P18650
$$ plain form
40357 134645455 142946035 151672977 153587329 152323481 155135776 161007683 164667990 167901266
40349 167901266 176520103 187898313 192470603 188982799 188179371 197502843 210562756 217194220
40341 217194220 217149770 217137149 219297292 220456365 220353429 222600905 227125996 228405976 223401733
40332 223401733 216274825 212337481 211040019 208480378 204391078 202400579 203769770 204520759
40324 204520759 199991403 190270436 180023538 174071155 173593245 175311839 173950898 167149762
40316 167149762 158621804 154607215 156446731 159195367 158905761 157787360 159128990 160667807
40308 160667807 158134963 153127526 151084788 152141665 151034967 146942428 145851645 150270319
40300 150270319 153805005 150744908 145001943 143708285 146773726 149096532 149127688 148509599
$$ packed form
40357A34645455Q300580Q726942J914352j263848K812295N871907L660307L233276
40349A67901266Q618837J1378210M572290l487804q03428R323472J3059913O631464
40341B17194220m4450j2621K160143J159073j02936K247476M525091J279980n004243
40332B23401733p126908l937344j297462k559641m089300j990499J369191P50989
40324B04520759m529356r720967j0246898n952383m77910J718594j360941o801136
40316A67149762q527958m014589J839516K748636k89606j118401J341630J538817
40308A60667807k532844n007437k042738J056877j106698m092539j090783M418674
40300A50270319L534686l060097n742965j293658L065441K322806L1156o18089
$$ plain form
40292 148509599 146536263 142191598 139105103 140855730 143325730 140018428 133875090 134643994
40284 134643994 143916919 151972175 151616534 146415807 142036447 138213280 134211905 134103749
40276 134103749 139697539 144376831 141537547 134803707 132381959 134669997 135482046 133599459
40268 133599459 134516197 140257478 145292921 145165739 143104582 144219090 147266022 146778555
40260 146778555 141614817 137035707 137781969 142178536 145039534 144717856 144236491 145439417
40252 145439417 145868555 143784824 142670830 146051735 150142615 148058127 141005013 138039395
40244 138039395 142937151 148720634 149009490 147604487 150671989 155363152 154446176 148956628
40236 148956628 147534518 153795610 161894366 165350811 164118720 161917792 161908124 165939384
$$ packed form
40292A48509599j973336m344665l086495J750627K470000l307302o143338P68904
40284A34643994R272925Q055256l55641n200727m379360l823167m001375j08156
40276A34103749N593790M679292k839284o733840k421748K288038Q12049j882587
40268A33599459R16738N741281N035443j27182k061157J114508L046932m87467
40260A46778555n163738m579110P46262M396567K860998l21678m81365J202926
40252A45439417M29138k083731j113994L380905M090880k084488p053114k965618
40244A38039395M897756N783483K88856j405003L067502M691163r16976n489548
40236A48956628j422110O261092Q098756L456445j232091k200928r668M031260
$$ plain form
40228 165939384 173140048 178482246 177652103 173899123 174575518 180026199 182365540 177665776
40220 177665776 172831397 175952223 184913821 191057442 190944244 188973112 189854618 193395234
40212 193395234 196603901 197403095 195849622 193661944 192402553 191254962 188146703 184075148
40204 184075148 183492395 188142664 193491364 194657318 193277275 194134070 196977574 197178993
40196 197178993 194012287 192381501 194879461 197332229 195172361 190459413 188963515 192419781
40188 192419781 196917692 197807766 193661813 186372504 179710593 177102781 178749206 181453534
40180 181453534 182860415 184574106 188818391 193456200 193904103 189761304 185653395 184525036
40172 184525036 183851382 180648445 176941258 176768729 179627016 180835244 178160670 174632710
$$ packed form
40228A65939384P200664N342198q30143l752980O76395N450681K339341m699764
40220A77665776m834379L120826Q961598O143621j13198j971132Q81506L540616
40212A93395234L208667P99194j553473k187678j259391j147591l108259m071555
40204A84075148n82753M650269N348700J165954j380043Q56795K843504K01419
40196A97178993l166706j630786K497960K452768k159868m712948j495898L456266
40188A92419781M497911Q90074m145953p289309o661911k607812J646425K704328
40180A81453534J406881J713691M244285M637809M47903m142799m107909j128359
40172A84525036o73654l202937l707187j72529K858287J208228k674574l527960
$$ plain form
40164 174632710 173962511 175746363 176564207 174301380 170173223 167219890 167355686 169304332
40156 169304332 169542454 166319617 162451354 162512351 167274493 172878140 175885143 176891920
40148 176891920 177998445 178792132 176859939 171283178 163891777 157555921 154454703 155335214
40140 155335214 159011673 162750616 164172535 162799479 159516492 155376131 151571529 149557582
40132 149557582 150047262 152272889 154718310 155799792 153749720 147869660 141105715 139140747
40124 139140747 144307053 151511941 153064628 147357033 140209145 137472858 138917729 140247015
40116 140247015 138775877 135481950 132853858 132368010 133516292 134259814 132894919 130083816
40108 130083816 128199398 127912903 126680656 122267173 116967405 115789504 119819474 123785816
$$ packed form
40164A74632710o70199J783852Q17844k262827m128157k953333J35796J948646
40156A69304332K38122l222837l868263O0997M762142N603647L007003J006777
40148A76891920J106525P93687j932193n576761p391401o335856l101218Q80511
40140A55335214L676459L738943J421919j373056l282987m140361l804602k013947
40132A49557582M89680K225627K445421J081482k050072n880060o763945j964968
40124A39140747N166306P204888J552687n707595p147888k736287J444871J329286
40116A40247015j471138l293927k628092m85848J148282P43522j364895k811103
40108A30083816j884418k86495j232247m413483n299768j177901M029970L966342
$$ plain form
40100 123785816 122185412 116306993 112365416 113183203 115321966 115537143 116119337 120321426
40092 120321426 125115243 123785056 115761713 108821539 109479303 115080865 118323867 116626931
40084 116626931 113429266 112198882 113219169 115559972 118223148 118980813 115653574 109741426
40076 109741426 105913834 106308625 107678937 106057358 102248806 100294392 101747561 104112697
40068 104112697 104518374 102473207 99079351 96203992 96877498 103339759 112901185 118573305
40060 118573305 116725338 111971910 110787328 112103127 109586804 103007066 100668821 107745411
40052 107745411 117929701 121526619 117825193 113825645 113439791 114267065 113978227 113635768
40044 113635768 114190124 114779339 115246242 116067515 115637219 112182321 108385112 108994989 113551589
$$ packed form
40100A23785816j600404n878419l941577Q17787K138763K15177N82194M202089
40092A20321426M793817j330187q023343o940174O57764N601562L243002j696936
40084A16626931l197665j230384J020287K340803K663176P57665l327239n912148
40076A09741426l827592L94791J370312j621579l808552j954414J453169K365136
40068A04112697M05677k045167l393856k875359O73506O462261R561426N672120
40060A18573305j847967m753428j184582J315799k516323o579738k338245P076590
40052A07745411J0184290L596918l701426l999548l85854Q27274k88838l42459
40044A13635768N54356N89215M66903Q21273m30296l454898l797209O09877M556600
$$ plain form
40035 113551589 116879802 117087974 116819847 115976525 110940039 103355238 101403356 107770046
40027 107770046 113735251 111104748 103593867 99607523 99456270 97835465 94812206 95395671
40019 95395671 100024784 103720411 104396038 105085768 107721283 110636831 112576949 114016661
40011 114016661 114321761 112299663 109647094 109581858 112128217 114459851 115182315 114650675 112501217
40002 112501217 108988982 107101883 108811439 110891040 109180527 105214161 103686837 105373815
39994 105373815 107829126 110698282 114310158 115462734 111538143 106781619 107172697 111000015
39986 111000015 112388315 111993079 114886306 119410850 118959859 114794250 115533040 122299024
39978 122299024 126205286 123765589 122764425 127719968 131248044 127226277 122273230 125223615
$$ packed form
40035A13551589L328213K08172k68127q43322n036486p584801j951882O366690
40027A07770046N965205k630503p510881l986344j51253j620805l023259N83465
40019I5395671M629113L695627O75627O89730K635515K915548J940118J439712
40011A14016661L05100k022098k652569o5236K546359K331634P22464n31640k149458
40002A12501217l512235j887099J709556K079601j710513l966366j527324J686978
39994A05373815K455311K869156L611876J152576l924591m756524L91078L827318
39986A11000015J388300l95236K893227M524544m50991m165609P38790O765984
39978A22299024L906262k439697j001164M955543L528076m021767m953047K950385
$$ plain form
39970 125223615 133352570 138381111 139755945 142688128 147858158 151791957 153782724 154814786
39962 154814786 153202439 148454134 145761504 149409870 155214461 156698287 155251535 156494354
39954 156494354 159787471 159818268 156625004 155625868 158420248 161240228 162476915 164801499
39946 164801499 169377810 173956464 177188440 179778689 181503158 181999935 184046775 190914377
39938 190914377 200597466 207397690 209098623 208385918 207918697 208529631 211592149 218323038
39930 218323038 226658421 232760235 235549446 236720520 237433440 238281120 240924928 246160874
39922 246160874 251843258 255730119 258118177 258961219 256209132 250719487 248246904 251750556
39914 251750556 256572908 258690115 261812914 268972731 273397034 267923294 258826640 258638299
$$ packed form
39970A25223615Q128955N028541J374834K932183N170030L933799J990767J032062
39962A54814786j612347m748305k692630L648366N804591J483826j446752J242819
39954A56494354L293117L0797l193264r99136K794380K819980J236687K324584
39946A64801499M576311M578654L231976K590249J724469M96777K046840O867602
39938A90914377R683089O800224J700933p12705m67221O10934L062518O730889
39930B18323038Q335383O101814K789211J171074P12920Q47680K643808N235946
39922B46160874N682384L886861K388058Q43042k752087n489645k472583L503652
39914B51750556M822352K117207L122799P159817M424303n473740r096654j88341
$$ plain form
39906 258638299 267834782 275492568 276580000 276203287 277019358 275492713 272170127 272921102
39898 272921102 277234326 277660003 274184467 276152150 285132874 289497454 283388759 278029070
39890 278029070 283950132 293017783 290481607 277008024 265852810 263051394 262733128 259579205
39882 259579205 254714571 249693406 243822597 237885594 233572286 229377807 222891063 216101269
39874 216101269 212731076 211721280 209120677 204865977 201669269 198619990 192359065 184034410
39866 184034410 178867529 178479697 178850457 176342586 171464950 166554104 163421920 162929421
39858 162929421 163638708 162015867 157171575 153374371 154040143 155669247 152419172 144512195
39850 144512195 137133620 133153976 132260794 134911048 140764578 144883912 142398187 136226834
$$ packed form
39906B58638299R196483P657786J087432l76713Q16071j526645l322586P50975
39898B72921102M313224M25677l475536J967683Q980724M364580o108695n359689
39890B78029070N921062R067651k536176j3473583j1155214k801416l18266l153923
39882B59579205m864634n021165n870809n937003m313308m194479o486744o789794
39874B16101269l370193j009796k600603m254700l196708l049279o260925q324655
39866A84034410n166881l87832L70760k507871m877636m910846l132184m92499
39858A62929421P09287j622841m844292l797204O65772J629104l250075p906977
39850A44512195p378575l979644q93182K650254N853530M119334k485725o171353
$$ plain form
39842 136226834 133596135 135612023 137242895 136944231 138085169 140209103 137811052 130603347
39834 130603347 126799015 131676110 139458131 141687115 138499931 136312506 138290962 142370723
39826 142370723 145908363 147415479 145576287 140911841 137273710 137992061 141171328 141786408
39818 141786408 138125399 133809579 133372317 137260770 141396110 141435292 137741128 135335218
39810 135335218 137679397 141945257 143062400 141083861 140627717 143671101 147594170 150564575
39802 150564575 153666225 156495567 156019871 152174269 149745716 151664535 154546785 154005540
39794 154005540 150661912 147869204 147121777 148696309 153013281 158132474 159768941 157159143
39786 157159143 154807730 154951485 153350514 147300849 142410839 144706096 150402465 151461033
$$ packed form
39842A36226834k630699K015888J630872k98664J140938K123934k398051p207705
39834A30603347l804332M877095P782021K228984l187184k187425J978456M079761
39826A42370723L537640J507116j839192m664446l638131P18351L179267O15080
39818A41786408l661009m315820m37262L888453M135340L9182l694164k405910
39810A35335218K344179M265860J117143j978539m56144L043384L923069K970405
39802A50564575L101650K829342m75696l845602k428553J918819K882250n41245
39794A54005540l343628k792708p47427J574532M316972N119193J636467k609798
39786A57159143k351413J43755j600971o049665m890010K295257N696369J058568
$$ plain form
39778 151461033 148148605 147266453 149691711 149337099 144760571 142163268 144435511 145882321
39770 145882321 141764500 135839136 133787278 135225323 137265345 140722224 146946265 152262150
39762 152262150 151585388 145643731 139759864 136900561 135951711 135366748 134659952 133523522
39754 133523522 132826187 134891628 139312902 140461637 133579513 122140126 114515254 113893444
39746 113893444 116190314 117668548 119079041 121025674 120853239 117389580 114524133 115809564
39738 115809564 118304762 116619910 111731720 110400227 115072931 119433892 116978814 110367141
39730 110367141 107625511 110623645 112814638 109407781 104533279 104781891 109310419 111424977
39722 111424977 108449437 104676548 104255793 106056285 107112833 107045003 106862594 106700637 106997173
$$ packed form
39778A51461033l312428q82152K425258l54612m576528k597303K272243J446810
39770A45882321m117821n925364k051858J438045K040022L456879O224041N315885
39762A52262150o76762n941657n883867k859303r48850n84963p06796j136430
39754A33523522o97335K065441M421274J148735o882124j1439387p624872o21810
39746A13893444K296870J478234J410493J946633j72435l463659k865447J285431
39738A15809564K495198j684852m888190j331493M672704M360961k455078o611673
39730A10367141k741630K998134K190993l406857m874502K48612M528528K114558
39722A11424977k975540l772889m20755J800492J056548o7830j82409j61957K96536
$$ plain form
39713 106997173 108927327 111405325 110779209 106226071 102342412 103007548 105548955 105063272
39705 105063272 102039275 100719320 101436414 100273223 96400977 94204971 96413896 99584257
39697 99584257 99020570 95052009 91618103 90705186 91075823 91504815 92340880 93284936 91807196
39688 91807196 86057569 79311787 78786564 87478182 98604067 102064282 96543263 90832026
39680 90832026 92072065 97942306 103147613 107656745 113117269 116021024 111946004 104138052
39672 104138052 100375833 102350053 105173507 106598802 109063507 112511937 113367302 112125258
39664 112125258 114002761 119502903 122015839 118292460 113992663 114403589 116483508 115539491
39656 115539491 113710283 115373596 118832242 119359678 117320955 116927479 119116808 121291570
$$ packed form
39713A06997173J930154K477998o26116m553138l883659O65136K541407m85683
39705A05063272l023997j319955P17094j163191l872246k196006K208925L170361
39697I9584257n63687l968561l433906r12917L70637M28992Q36065R44056j477740
39688I1807196n749627o745782n25223Q691618J1125885L460215n521019n711237
39680I0832026J240039N870241N205307M509132N460524K903755m075020p807952
39672A04138052l762219J974220K823454J425295K464705L448430Q55365j242044
39664A12125258J877503N500142K512936l723379m299797M10926K079919r44017
39656A15539491j829208J663313L458646N27436k038723l93476K189329K174762
$$ plain form
39648 121291570 122408645 123332619 123619093 122333259 120623131 119853466 119234461 118667944 120949480
39639 120949480 127089167 132702301 133825028 133170765 135284806 138570069 138352210 135448044
39631 135448044 134848183 137291768 139050981 139478101 141835230 146258680 148512620 147114397
39623 147114397 145972371 147984927 150612433 149909529 145768054 141800569 142131804 148006709
39615 148006709 155252034 156734899 150659424 144224527 144801345 150116460 152661117 151060537
39607 151060537 149853844 149881570 147548790 143569897 143475822 147729639 149725312 146386199
39599 146386199 143069828 144544588 148204590 150064949 150762069 151306225 149294418 144385929
39591 144385929 141936482 145774398 151963351 154800882 154646486 154764954 154793827 153015561
$$ packed form
39648A21291570J117075R23974K86474j285834j710128p69665o19005n66517K281536
39639A20949480O139687N613134J122727o54263K114041L285263k17859k904166
39631A35448044n99861K443585J759213M27120K357129M423450K253940j398223
39623A47114397j142026K012556K627506p02904m141475l967485L31235N874905
39615A48006709P245325J482865o075475o434897N76818N315115K544657j600580
39607A51060537j206693K7726k332780l978893r4075M253817J995673l339113
39599A46386199l316371J474760L660002J860359O97120N44156k011807m908489
39591A44385929k449447L837916O188953K837531j54396J18468K8873j778266
$$ plain form
39583 153015561 151424852 152636355 154626289 154202967 153173046 155336521 159397637 160705115
39575 160705115 158792907 157624825 158928488 160393725 160409702 160056263 160168031 160340710 161157951
39566 161157951 163977541 168086196 170800028 170606757 168209512 165061384 162816279 162838700
39558 162838700 163779749 161415643 154164341 147105333 146446840 151051387 154119728 153196209
39550 153196209 153405114 159095463 166599404 168501979 162862039 155085381 151398073 152983605
39542 152983605 156776009 159919550 161864510 162789027 162123204 159665327 156704586 154418921
39534 154418921 152271780 149972842 149761325 153705630 159408812 162150076 161456911 161483340
39526 161483340 164002583 165518009 163411213 160761682 161922912 166529289 171189298 174497996
$$ packed form
39583A53015561j590709J211503J989934m23322j029921K163475M061116J307478
39575A60705115j912208j168082J303663J465237J5977l53439J11768J72679Q17241
39566A61157951K819590M108655K713832j93271k397245l148128k245105K2421
39558A62838700R41049k364106p251302p059008o58493M604547L068341r23519
39550A53196209K08905N690349P503941J902575n639940p776658l687308J585532
39542A52983605L792404L143541J944960R24517o65823k457877k960741k285665
39534A54418921k147141k298938k11517L944305N703182K741264o93165K6429
39526A61483340K519243J515426k106796k649531J161230M606377M660009L308698
$$ plain form
39518 174497996 177043712 178669897 179177459 180158346 183034858 186562483 188880568 190532992
39510 190532992 192880676 195188159 196170166 197035966 199954814 204303693 207147111 207091508
39502 207091508 205727642 205746289 208976115 215311286 222285089 226681693 227413803 225755319
39494 225755319 223019329 220468372 221113370 227466487 236648966 242095531 241604465 239302483
39486 239302483 238305218 237063041 235252743 236621501 241795814 244646640 241220451 236225665
39478 236225665 234254555 230919055 221505583 213381615 218650627 236014089 250560605 252328087
39470 252328087 245861859 239960771 237078582 236050096 237268581 240261277 241541380 239341193
39462 239341193 236723315 236691760 237745224 237297275 236232540 236833140 238496732 238446405 235463575
$$ packed form
39518A74497996K545716J626185N07562R80887K876512L527625K318085J652424
39510A90532992K347684K307483R82007Q65800K918848M348879K843418n5603
39502B07091508j363866J8647L229826O335171O973803M396604P32110j658484
39494B25755319k735990k550957O44998O353117R182479N446565m91066k301982
39486B39302483r97265j242177j810298J368758N174313K850826l426189m994786
39478B36225665j971110l335500r413472q123968N269012J7363462J4546516J767482
39470B52328087o466228n901088k882189j028486J218485K992696J280103k200187
39462B39341193k617878l1555J053464m47949j064735O00600J663592n0327k982830
$$ plain form
39453 235463575 231000231 227277480 224987475 222234101 216325235 207873270 201629286 200942377
39445 200942377 203083227 203160352 200899082 199557272 199542922 197708847 192274941 184135532
39437 184135532 174255224 164385955 158979285 160606193 164259273 162578529 156478539 153539211
39429 153539211 155431132 155032062 148252309 140635997 138102345 138197621 135840540 131874840
39421 131874840 129761505 128273098 124212656 119652850 119799816 124562997 128017953 126649192
39413 126649192 123580139 123370912 125826699 126836442 123943895 119399750 117343488 118606450
39405 118606450 119746736 117879532 114434664 112024818 109661070 104726859 98486601 95135742
39397 95135742 95396588 95400357 92489622 88225031 85267562 85181745 89093047 95641963 98489495
$$ packed form
39453B35463575m463344l722751k290005k753374n908866q451965o243984o86909
39445B00942377K140850P7125k261270j341810j4350j834075n433906q139409
39437A84135532r880308r869269n406670J626908L653080j680744o099990k939328
39429A53539211J891921l99070o779753p616312k533652R5276k357081l965700
39421A31874840k113335j488407m060442m559806J46966M763181L454956j368761
39413A26649192l069053k09227K455787J009743k892547m544145k056262J262962
39405A18606450J140286j867204l444868k409846k363748m934211o240258l350859
39397I5135742K60846L769k910735m264591k957469q5817L911302O548916K847532
$$ plain form
39388 98489495 92108522 80982759 76198281 80805682 85797290 84003564 80302891 82260494
39380 82260494 87225445 86668226 79576851 73510922 73576134 77024269 78824547 77423619
39372 77423619 74430634 72184673 71940159 72316867 70484419 66571123 64468530 65880366
39364 65880366 66889359 64112149 60965013 62819762 68313758 71129479 69213691 66534442
39356 66534442 65823384 65030108 61980767 57998832 55247458 53770340 52630601 51556534
39348 51556534 50514702 49633856 49879138 51854728 54132649 55030232 55579919 57863514 60607672
39339 60607672 59910119 55135393 50843525 51170971 54682095 56752091 55387207 52579843
39331 52579843 50869240 50896968 52518161 56158101 61483791 65841651 66520570 64945779
$$ packed form
39388I8489495o380973j1125763m784478M607401M991608j793726l700673J957603
39380H2260494M964951n57219p091375o065929O5212L448135J800278j400928
39372G7423619k992985k245961k44514L76708j832448l913296k102593J411836
39364F5880366J008993k777210l147136J854749N493996K815721j915788k679249
39356F6534442p11058p93276l049341l981935k751374j477118j139739j074067
39348E1556534j041832q80846K45282J975590K277921Q97583N49687K283595K744158
39339F0607672o97553m774726m291868L27446L511124K069996j364884k807364
39331E2579843j710603K7728J621193L639940N325690M357860O78919j574791
$$ plain form
39323 64945779 65887839 70718099 74073593 70455651 62130463 56060656 54226636 52649803
39315 52649803 50068693 50759547 56357911 61473264 61791634 60951678 63786063 67449604
39307 67449604 66232504 61953263 61572247 65664988 67482308 64349393 62136005 65356350
39299 65356350 69515690 68279582 63741511 63577326 69784113 75833828 75448387 69851445
39291 69851445 64512484 61778626 59684309 56770643 54724416 55482345 58124547 60223483
39283 60223483 60766057 60225020 59289954 59343396 62331891 67478983 69875068 65872528 58504916
39274 58504916 53466773 51239836 48692884 47343093 52269077 61452520 64591235 56845951
39266 56845951 46756095 44746740 49503357 52321830 50218892 47166599 45534104 44221900
$$ packed form
39323F4945779R42060M830260L355494l617942q325188o069807j834020j576833
39315E2649803k581110O90854N598364N115353L18370q39956K834385L663541
39307F7449604j217100m279241l81016M092741J817320l132915k213388L220345
39299F5356350M159340j236108m538071j64185O206787O049715l85441n596942
39291F9851445n338961k733858k094317k913666k046227P57929K642202K098936
39283F0223483N42574n41037r35066N3442K988495N147092K396085m002540p367612
39274E8504916n038143k226937k546952j349791M925984R183443L138715p745284
39266E6845951j0089856k009355M756617K818473k102938l052293j632495j312204
$$ plain form
39258 44221900 43762911 45891406 48522227 47733820 44587825 43897049 46382605 48167262
39250 48167262 48047463 48800703 50641509 50044658 46711395 45399150 48361371 51612520
39242 51612520 51609878 50517638 51484699 53267364 53357808 52614545 52619490 51425825 46442282
39233 46442282 39897566 37228684 40282910 45134224 46982406 45403459 44238634 46834728
39225 46834728 51634972 53352200 49548317 44560129 44171913 47426183 47798704 42671314
39217 42671314 36889675 35192146 35737838 34431992 31948478 31914577 34089489 34186590 30587522
39208 30587522 27472229 29856664 37421956 44579420 46076387 41950293 36988057 35453360
39200 35453360 36972077 38305117 38143959 38015492 38663459 38445797 36532687 35295559 37524972
$$ packed form
39258D4221900m58989K128495K630821p88407l145995o90776K485556J784657
39250D8167262j19799P53240J840806n96851l333263j312245K962221L251149
39242E1612520k642j092240R67061J782665R0444p43263M945j193665m983543
39233D6442282o544716k668882L054226M851314J848182j578947j164825K596094
39225D6834728M800244J717228l803883m988188l88216L254270L72521n127390
39217D2671314n781639j697529N45692j305846k483514l3901K174912R7101l599068
39208C0587522l115293K384435P565292P157464J496967m126094m962236j534697
39200C5453360J518717J333040j61158j28467O47967k17662j913110j237128K229413
$$ plain form
39191 37524972 42591704 46967168 47593294 43831770 37734121 33601271 35125388 40758000
39183 40758000 43659357 39100617 30865394 27179270 30759067 36368096 38530314 37753119
39175 37753119 37328298 37540590 36410981 34022630 32226171 31041574 29343595 28739717
39167 28739717 32037169 36975259 36828254 30177548 25137566 28993416 37422220 40283273
39159 40283273 35702612 30940178 29950042 28575210 24068167 21164481 24140750 29281879
39151 29281879 30782220 29111668 27708968 25846242 21578597 18456889 21715665 29308644
39143 29308644 33942866 33482952 32460187 33287892 33227721 31319307 31162800 33976098 35085345
39134 35085345 31264197 26629970 26615121 29599403 29509310 24866087 20554373 20891366 24729291
$$ packed form
39191C7524972N066732M375464O26126l761524o097649m132850J524117N632612
39183D0758000K901357m558740q235223l686124L579797N609029K162218p77195
39175C7753119m24821K12292j129609k388351j796459j184597j697979o03878
39167B8739717L297452M938090j47005o650706n039982L855850Q428804K861053
39159D0283273m580661m762434r90136j374832m507043k903686K976269N141129
39151B9281879J500341j670552j402700j862726m267645l121708L258776P592979
39143B9308644M634222m59914j022765Q27705o0171j908414j56507K813298J109247
39134C5085345l821148m634227j4849K984282r0093m643223m311714L36993L837925
$$ plain form
39125 24729291 28309945 30378827 32649919 35998256 38170035 36553538 32376903 29706477
39117 29706477 29760637 29252428 26276491 24450166 27412943 31925350 31835920 27759738 26739645
39108 26739645 31765480 37688294 39602574 39687645 42152001 45804083 46282521 43056668
39100 43056668 39565801 37497374 35090822 31263679 28037936 27625786 29117151 29689247
39092 29689247 28447253 27521128 28805538 30830770 30695960 28806891 28930374 32460241
39084 32460241 35622237 34790947 31909814 31208944 32679962 33010874 31581613 30817322 31141145
39075 31141145 30403297 28539953 28212836 30188170 32333813 33750349 35467110 36472655
39067 36472655 34071249 29394551 27319925 28948981 29381466 25673495 21918203 22712365
$$ packed form
39125B4729291L580654K068882K271092L348337K171779j616497m176635k670426
39117B9706477N4160n08209k975937j826325K962777M512407q9430m076182j020093
39108B6739645N025835N922814J914280Q5071K464356L652082M78438l225853
39100D3056668l490867k068427k406552l827143l225743m12150J491365N72096
39092B9689247j241994r26125J284410K025232j34810j889069J23483L529867
39084C2460241L161996q31290k881133p00870J471018L30912j429261p64291L23823
39075C1141145p37848j863344l27117J975334K145643J416536J716761J005545
39067C6472655k401406m676698k074626J629056M32485l707971l755292P94162
$$ plain form
39059 22712365 25974951 26732844 24813781 24147875 26387645 29283261 30314755 28956156
39051 28956156 26326732 24634258 25532369 27595779 27596688 25483740 24916417 27228467 28828727
39042 28828727 27150491 24962555 25308159 26443154 26304255 27839110 33876585 39776237
39034 39776237 38346624 30897878 26207593 28044730 30489357 27553565 21462348 18082545
39026 18082545 18677457 20298262 21529130 23543587 26371476 27675301 25857909 22488280
39018 22488280 20786292 22246184 25006156 25457571 21762153 16016613 12553301 13660701
39010 13660701 17167360 18818839 17211308 15640892 18049777 23507593 26726547 24916077
39002 24916077 21805126 22465681 25892345 26390935 21970354 17331913 17380123 21098299 23760465
$$ packed form
39059B2712365L262586P57893j919063o65906K239770K895616J031494j358599
39051B8956156k629424j692474Q98111K063410R09k112948n67323K312050J600260
39042B8828727j678236k187936L45604J134995j38899J534855O037475N899652
39034C9776237j429613p448746m690285J837137K444627k935792o091217l379803
39026A8082545N94912J620805J230868K014457K827889J303825j817392l369629
39018B2488280j701988J459892K759972M51415l695418n745540l463312J107400
39010A3660701L506659J651479j607531j570416K408885N457816L218954j810470
39002B4916077l110951O60555L426664M98590m420581m638441M8210L718176K662166
$$ plain form
38993 23760465 22830668 19733225 17428130 17811371 20345756 22396795 22107920 21022056
38985 21022056 22050634 25161651 27726378 28801774 29512885 29225044 25927171 21384246
38977 21384246 20851558 25491034 29881593 29927095 28554063 30012664 33098267 34498344
38969 34498344 34844092 36276807 37225558 35056959 31464662 29905012 29858217 28973961 28607670
38960 28607670 31123089 33622651 31478573 27328555 28767042 36082343 39951332 34286871
38952 34286871 24952202 21566307 25501423 30584059 32265042 31371079 30605373 31429625
38944 31429625 33770143 36000944 35830123 33265807 31640743 33518349 36712131 37000667
38936 37000667 34152228 32237627 33587989 35364651 33747794 29442165 26579791 27162365
$$ packed form
38993B3760465r29797l097443k305095L83241K534385K051039k88875j085864
38985B1022056J028578L111017K564727J075396P11111k87841l297873m542925
38977B1384246n32688M639476M390559M5502j373032J458601L085603J400077
38969C4498344L45748J432715R48751k168599l592297j559650m6795q84256l66291
38960B8607670K515419K499562k144078m150018J438487P315301L868989n664461
38952C4286871r334669l385895L935116N082636J680983q93963p65706Q24252
38944C1429625K340518K230801j70821k564316j625064J877606L193782K88536
38936C7000667k848439j914601J350362J776662j616857m305629k862374N82574
$$ plain form
38928 27162365 29454636 31847940 34858922 37778915 36959628 31109439 25826207 27593327
38920 27593327 33781880 34419761 25356789 14222236 10361542 13660688 17478571 18621867
38912 18621867 18993031 19757238 19694039 18772567 18416285 18071273 15782370 12635669 12691936
38903 12691936 17531980 24130592 29159452 32408606 34673685 35080593 32746450 29674681
38895 29674681 29625692 33560253 37133041 34282903 24492678 15251201 14486844 20824643
38887 20824643 25197231 22754836 18116754 16603676 16373346 14247897 13753696 19614629
38879 19614629 27635606 29109645 24295448 22199467 25996510 28195646 23628110 18146256
38871 18146256 18400802 20438376 16763338 10004962 9926121 17969407 24024528 20746836
$$ packed form
38928B7162365K292271K393304L010982K919993q19287n850189n283232J767120
38920B7593327O188553O37881r062972j1134553l860694L299146L817883J143296
38912A8621867L71164P64207o3199r21472l56282l45012k288903l146701N6267
38903A2691936M840044O598612N028860L249154K265079M06908k334143l071769
38895B9674681m8989L934561L572788k850138r790225r241477p64357O337799
38887B0824643M372588k442395m638082j513078k30330k125449m94201N860933
38879A9614629Q020977J474039m814197k095981L797043K199136m567536n481854
38871A8146256K54546K037574l675038o758376p8841Q043286O055121l277692
$$ plain form
38863 20746836 13610084 12203692 16696442 19148107 16153704 13401287 16251474 21361177
38855 21361177 21848176 17662405 15373379 18140469 21337967 19825445 14965572 11376630
38847 11376630 10306481 10123115 10794929 13390227 16457529 17298844 16412793 16729799 18614789
38838 18614789 19625181 19551776 21588444 27089906 32444713 33064311 28423364 21793388
38830 21793388 16692793 14624856 14778791 15017487 14177071 13629661 15399586 18898541 21111226
38821 21111226 20055459 16701873 13678107 13352354 16519742 21285647 23869310 22305351
38813 22305351 18755027 16512541 15762122 14355290 11734809 9652768 9632240 11843333
38805 11843333 15804397 20411600 24318045 27633650 31143332 32402214 26519910 14261874
$$ packed form
38863B0746836p136752j406392M492750K451665k994403k752417K850187N109703
38855B1361177M86999m185771k289026K767090L197498j512522m859873l588942
38847A1376630j070149j83366O71814K595298L067302Q41315q86051L17006J884990
38838A8614789J010392p3405K036668N501462N354807O19598m640947o629976
38830B1793388n100595k067937J53935K38696q40416n47410J769925L498955K212685
38821B1111226j055767l353586l023766l25753L167388M765905K583663j563959
38813B2305351l550324k242486p50419j406832k620481k082041k0528K211093
38805A1843333L961064M607203L906445L315605L509682J258882n882304j2258036
$$ plain form
38797 14261874 5177207 6954874 14452244 15920306 8718375 1978512 3900267 13079611
38789 13079611 23035216 28975149 28907668 24052593 19808086 21026407 25057079 24763537
38781 24763537 19221376 15154271 16419570 19116192 19719107 20904856 25165942 28940688
38773 28940688 28247594 25313765 24489307 25436647 25158076 23522891 22340203 21697308 21038601
38764 21038601 21164054 21873672 20787976 17832260 17405380 22310199 28759617 31293758
38756 31293758 29655029 26980471 24204336 20342885 15858006 12076519 9512173 9378988
38748 9378988 13342904 18980491 20034999 15103626 11294772 14337353 19836419 20412233
38740 20412233 17117794 16431965 19214689 20800254 20306351 21622333 25334910 27118380
$$ packed form
38797A4261874r084667J777667P497370J468062p201931o739863J921755R179344
38789A3079611R955605N939933o7481m855075m244507J218321M030672k93542
38781B4763537n542161m067105J265299K696622O02915J185749M261086L774746
38773B8940688o93094k933829q24458R47340k78571j635185j182688o42895o58707
38764B1038601J25453P09618j085696k955716m26880M904819O449418K534141
38756C1293758j638729k674558k776135l861451m484879l781487k564346j33185
38748I378988L963916N637587J054508m931373l808854L042581N499066N75814
38740B0412233l294439o85829K782724J585565m93903J315982L712577J783470
$$ plain form
38732 27118380 24856872 21022099 17405386 13624582 11539305 14821608 22499024 28381217
38724 28381217 28723981 25851136 22945671 20160814 17478203 16645575 18153580 20134825
38716 20134825 21781799 23987970 25504683 23127996 17603990 14726085 17724174 22264478
38708 22264478 21981913 16098433 8982275 4834822 5291370 9756073 15408645 18663154
38700 18663154 18810571 18689744 20253912 21604911 20291034 17427918 16118739 17122605
38692 17122605 18414925 18435877 17898007 18307111 19648288 19918953 17383801 13609866 12935196
38683 12935196 17289002 22668589 23179798 17994109 11812543 8994059 9960771 12782854
38675 12782854 15045777 14498777 11351173 9560421 11914749 14479500 11261790 4521465
$$ packed form
38732B7118380k261508l834773l616713l780804k085277L282303P677416N882193
38724B8381217L42764k872845k905465k784857k682611q32628J508005J981245
38716B0134825J646974K206171J516713k376687n524006k877905K998089M540304
38708B2264478k82565n883480p116158m147453M56548M464703N652572L254509
38700A8663154J47417j20827J564168J350999j313877k863116j309179J003866
38692A7122605J292320K0952n37870M09104J341177K70665k535152l773935o74670
38683A2935196M353806N379587N11209n185689o181566k818484R66712K822083
38675A2782854K262923n47000l147604j790752K354328K564751l217710o740325
$$ plain form
38667 4521465 3645421 11532692 19151655 18238376 13260359 14119639 21285668 26170182 24483761
38658 24483761 21005477 20263292 19824453 15965545 10704893 8965630 11603772 15047806
38650 15047806 16477023 16280821 15944965 16007202 16277017 16463643 16289007 15884025 15984675
38641 15984675 16852385 17265727 15836717 13442319 12913638 15470784 18524204 18289835 14070831
38632 14070831 8654311 4848023 3257253 3411085 4924191 6679258 6815560 5049987
38624 5049987 3609977 4321066 6092416 7006080 7469918 8942673 10544433 9798769 6657515
38615 6657515 4189373 4728805 7226784 8916684 8237561 5978143 4571374 5684696
38607 5684696 7414913 5531407 -287538 -3565358 1691960 12040144 17887003 15771830
$$ packed form
38667D521465q76044P887271P618963r13279m978017Q59280P166029M884514j686421
38658B4483761l478284p42185m38839l858908n260652j739263K638142L444034
38650A5047806J429217j96202l35856O2237K69815J86626j74636m04982J00650
38641A5984675Q67710M13342j429010k394398n28681K557146L053420k34369m219004
38632A4070831n416520l806288j590770J53832J513106J755067J36302j765573
38624E049987j440010P11089J771350R13664M63838J472755J601760p45664l141254
38615F657515k468142N39432K497979J689900o79123k259418j406769J113322
38607E684696J730217j883506n818945l277820N257318J0348184N846859k115173
$$ plain form
38599 15771830 11909731 12136379 14058684 12440088 7490961 3231473 1099005 235928
38591 235928 1826013 7753266 15749692 20761538 21327512 20603120 20806597 20570657 18521287
38582 18521287 15727006 13260226 10612353 8194468 8380206 11784352 14916025 14274749
38574 14274749 11242579 10058080 11681212 12596615 10053113 6037599 4689632 7047324
38566 7047324 9944185 10055790 7940630 7252686 9970008 13348142 12878329 8354693 5290635
38557 5290635 8774181 16847358 22200032 20478048 14556953 9835372 8073231 8089436
38549 8089436 10085399 15236124 21521112 24264888 22099254 19005230 18621742 19572554
38541 19572554 18842733 16948230 16366861 16830632 16138620 14712658 15254905 17787180 18919453
$$ packed form
38599A5771830l862099K26648J922305j618596m949127m259488k132468q63077
38591B35928J590085N927253P996426N011846N65974p24392K03477k35940k049370
38582A8521287k794281k466780k647873k417885J85738L404146L131673o41276
38574A4274749l032170j184499J623132R15403k543502m015514j347967K357692
38566G047324K896861J11605k115160o87944K717322L378134m69813m523636l064058
38557E290635L483546Q073177N352674j721984n921095m721581j762141J6205
38549H089436J995963N150725O284988K743776k165634l094024l83488R50812
38541A9572554p29821j894503n81369M63771o92012j425962N42247K532275J132273
$$ plain form
38532 18919453 17108824 15369063 17009152 21049695 23861081 23983091 23577796 25556235
38524 25556235 30148626 34180324 33873938 28932072 23263796 20786016 21547819 23306336
38516 23306336 25214642 27425876 28571151 27279098 25638745 27215785 31359722 33237299
38508 33237299 30208184 24720190 20348521 18653371 20357243 25064230 28676373 26090963
38500 26090963 18598675 13834942 15850847 20136757 21502552 21416159 23153109 25021667
38492 25021667 24351911 23886646 27293121 31393666 30240884 25080913 22791563 25182849
38484 25182849 27199682 25852247 23747618 22889796 21949662 21237683 23634509 28415780
38476 28415780 30685030 29624711 30728438 36266222 40093181 36968434 31352668 30695444
$$ packed form
38532A8919453j810629j739761J640089M040543K811386J22010m05295J978439
38524B5556235M592391M031698l06386m941866n668276k477780P61803J758517
38516B3306336J908306K211234J145275j292053j640353J577040M143937J877577
38508C3237299l029115n487994m371669j695150J703872M706987L612143k585410
38500B6090963p492288m763733K015905M285910J365795q6393J736950J868558
38492B5021667o69756m65265L406475M100545j152782n159971k289350K391286
38484B5182849K016833j347435k104629q57822r40134p11979K396826M781271
38476B8415780K269250j060319J103727N537784L826959l124747n615766o57224
$$ plain form
38468 30695444 34189556 35115382 31922899 30018038 32976965 37870279 40116432 38645270
38460 38645270 35176987 31477174 28385852 25873968 23863761 23693380 27150168 32714279
38452 32714279 35441467 33186335 30249859 31367092 34644261 34866890 31698890 29278252
38444 29278252 28790905 27178594 23273207 19700427 17851912 16097873 14230928 14704913
38436 14704913 17790946 20344111 21398429 24033661 29002992 31547879 28420717 23719756
38428 23719756 23035239 25215662 25152505 22227278 20267172 20300820 19158762 15694320 13461705
38419 13461705 15702279 21121159 26078286 28436920 28221542 26669869 25518633 25528479 25408868
38410 25408868 23866252 22356443 23438351 26629516 28705488 28237296 26854210 25655623
$$ packed form
38468C0695444L494112R25826l192483j904861K958927M893314K246153j471162
38460C8645270l468283l699813l091322k511884k010207j70381L456788N564111
38452C2714279K727188k255132k936476J117233L277169K22629l168000k420638
38444B9278252m87347j612311l905387l572780j848515j754039j866945M73985
38436A4704913L086033K553165J054318K635232M969331K544887l127162m700961
38428B3719756o84517K180423o3157k925227j960106L3648j142058l464442k232615
38419A3461705K240574N418880M957127K358634k15378j551673j151236R846j19611
38410B5408868j542616j509809J081908L191165K075972m68192j383086j198587
$$ plain form
38402 25655623 23700760 20966473 19366055 19294843 18455290 16100018 15158243 17417813 19553856
38393 19553856 17486411 12612503 9961234 11496413 14881653 17776759 19349595 18094999
38385 18094999 12672910 5645283 2380252 4790882 9393517 12896870 16226966 20955536
38377 20955536 25061080 25377918 22253059 18916304 17647998 18845351 22043289 25188825
38369 25188825 24779465 19979297 15053332 14120960 14988818 12660305 7966720 7044374 11621598
38360 11621598 15765057 14697215 11594597 11969024 15558439 18200903 18541119 18145183
38352 18145183 17282247 15410487 14222574 15406543 16518387 13925265 9170585 7551000
38344 7551000 10652511 15069428 18211006 20100236 19491547 14433832 7815637 5953519
$$ packed form
38402B5655623j954863k734287j600418p1212q39553k355272r41775K259570K136043
38393A9553856k067445m873908k651269J535179L385240K895106J572836j254596
38385A8094999n422089p027627l265031K410630M602635L503353L330096M728570
38377B0955536M105544L16838l124859l336755j268306J197353L197938L145536
38369B5188825m09360m800168m925965r32372Q67858k328513m693585r22346M577224
38360A1621598M143459j067842l102618L74427L589415K642464L40216l95936
38352A8145183q62936j871760j187913J183969J111844k593122m754680j619585
38344G551000L101511M416917L141578J889230o08689n057715o618195j862118
$$ plain form
38336 5953519 9426792 11462929 8326213 5006487 6603552 10259339 10930758 9564323
38328 9564323 9156943 7585488 1923316 -3672576 -2552041 4079618 9348809 11599476
38320 11599476 14642009 18112165 17133366 12428185 10962693 13822702 13072229 5283448
38312 5283448 -909593 2450028 9966776 11458097 7657443 7639474 13429160 17262097
38304 17262097 14442030 10025665 10078849 13063753 13707395 10860743 7513252 5582515
38296 5582515 4185727 2192326 376049 1191298 6705533 15619644 22505618 22267002
38288 22267002 16006865 10245283 9328551 10951763 10757945 8897693 9063265 12210879
38280 12210879 14766863 13670169 10433556 8627457 9140775 9914200 9383895 8072854
$$ packed form
38336E953519L473273K036137l136716l319726J597065L655787O71419j366435
38328I564323m07380j571455n662172n595892J120535O631659N269191K250667
38320A1599476L042533L470156r78799m705181j465492K860009p50473p788781
38312E283448o193041L359621P516748J491321l800654j7969N789686L832937
38304A7262097k820067m416365N3184K984904O43642k846652l347491j930737
38296E582515j396788j993401j816277Q15249N514235Q914111O885974k38616
38288B2267002o260137n761582r16732J623212j93818j860252J65572L147614
38280A2210879K555984j096694l236613j806099N13318P73425n30305j311041
$$ plain form
38272 8072854 7046785 6748857 7349952 8216196 6936136 1579468 -5107734 -6727278 -681546
38263 -681546 7695034 11228848 9329692 7123823 7565880 8338334 6464435 2416687 -1035611
38254 -1035611 -1477219 1890594 7224047 10524068 9822676 8221833 9458720 11465810
38246 11465810 9110703 3136396 449261 3957332 8036423 7228556 4187864 4576576
38238 4576576 8115516 9850054 7889388 5012459 3776668 4063258 4810181 4985899 3468601
38229 3468601 550596 -1197832 305120 3993028 7346056 9097383 8726885 5709256
38221 5709256 1473323 -371932 1620448 4406853 4930393 4393550 5436058 7929117
38213 7929117 10642508 14015253 17608982 17889008 12916881 6662039 4116701 4558648
$$ packed form
38272H072854j026069k97928O01095Q66244j280060n356668o687202j619544O045732
38263f81546Q376580L533814j899156k205869M42057P72454j873899m047748l452298
38254a035611m41608L367813N333453L300021p01392j600843J236887K007090
38246A1465810k355107n974307k687135L508071M079091q07867l040692L88712
38238D576576L538940J734538j960666k876929j235791K86590P46923J75718j517298
38229C468601k918005j748428J502952L687908L353028J751327l70498l017629
38221E709256m235933j845255J992380K786405N23540n36843J042508K493059
38213G929117K713391L372745L593729K80026m972127o254842k545338M41947
$$ plain form
38205 4558648 4340488 3664331 5006422 7083892 6700786 5171183 6410036 9495626 9916110
38196 9916110 8008294 9008402 13830487 16803967 14498796 10393415 8315509 7278792
38188 7278792 5949479 6673643 11007807 15442236 15593760 11699937 6885322 2929300
38180 2929300 556588 874525 3406871 5122040 4189314 2598696 2835411 4346971 5507306
38171 5507306 6468808 7519287 7072206 4189314 1158355 650953 1769748 1729954 535374
38162 535374 1317471 6034612 12458926 15728118 12720693 5519261 186409 534124 3436335
38153 3436335 2647523 -2784313 -6967775 -4857597 1505598 6096558 5981958 3465136
38145 3465136 2588206 4998971 8727583 10632379 10292990 10244914 11280504 10158684 5028644
$$ packed form
38205D558648k18160o76157J342091K077470l83106j529603J238853L085590M20484
38196I916110j907816J000108M822085K973480k305171m105381k077906j036717
38188G278792j329313P24164M334164M434429J51524l893823m814615l956022
38180B929300k372712L17937K532346J715169r32726j590618K36715J511560J160335
38171E507306R61502J050479m47081k882892l030959n07402J118795l9794j194580
38162E35374P82097M717141O424314L269192l007425p201432n332852L47715K902211
38153C436335p88812n431836m183462K110178O363195M590960j14600k516822
38145C465136q76930K410765L728612J904796l39389m8076J035590j121820n130040
$$ plain form
38136 5028644 321944 1119694 4444348 2701412 -4430351 -8703098 -5325039 726063
38128 726063 3173340 2660774 2633950 2861118 1886965 1323795 2764619 4130586 3653988
38119 3653988 3936683 7356956 10753857 9705994 5462223 2746709 2893421 3760799 4306572
38110 4306572 4602998 3302425 -114682 -2160536 850939 6925820 10556377 9600025
38102 9600025 6112078 2044127 -1457121 -2142293 865001 3674789 1822494 -2672626
38094 -2672626 -3553726 484482 4119706 3601432 1571863 2048256 4794119 6928654 7230223
38085 7230223 6780242 7064687 8584779 10123743 9388410 5963314 3009299 3832497 7448755
38076 7448755 10116400 10598644 10953593 12491972 14072254 14483409 13757091 12019403 9443265
$$ packed form
38136E028644m706700P97750L324654j742936p131763m272747L378059O051102
38128G26063K447277n12566k6824K27168r74153n63170J440824J365967m76598
38119C653988K82695L420273L396901j047863m243771k715514J46712Q67378N45773
38110D306572K96426j300573l417107k045854L011475O074881L630557r56352
38102I600025l487947m067951l501248o85172L007294K809788j852295m495120
38094b672626q81100M038208L635224n18274k029569M76393K745863K134535L01569
38085G230223m49981K84445J520092J538964p35333l425096k954015Q23198L616258
38076G448755K667645M82244L54949J538379J580282M11155p26318j737688k576138
$$ plain form
38067 9443265 7102106 5613212 3769965 1084730 237052 3439589 7677016 7939860
38059 7939860 4417633 1668558 1154981 294574 -805971 1595180 6980772 8434700
38051 8434700 2500839 -4388329 -4662925 -495771 245688 -4041596 -7763690 -8001953 -8021385
38042 -8021385 -9864700 -10157223 -6404060 -2266062 -2291488 -4933452 -5425644 -3189523 -1390294
38033 -1390294 -529371 1997434 6008030 7885977 7043642 7330099 9611885 9039730 4038904
38024 4038904 2062040 9334403 18987205 18264522 6143308 -5316194 -7771612 -5600796
38016 -5600796 -5582853 -6616414 -4929405 -2312373 -2470616 -3940157 -3023881 -415410 777332
38007 777332 725810 1374152 2039661 1572003 1942910 4313629 4567988 -998419 -7874052
$$ packed form
38067I443265k341159j488894j843247k685235q47678L202537M237427K62844
38059G939860l522227k749075n13577q60407j100545K401151N385592J453928
38051H434700n933861o889168k74596M167154P41459m287284l722094k38263j9432
38042h021385j843315k92523L753163M137998k5426k641964m92192K236121J799229
38033a390294Q60923K526805M010596J877947q42335K86457K281786n72155n000826
38024D038904j976864P272363R652802p22683j2121214j1459502k455418K170816
38016e600796J7943j033561J687009K617032j58243j469541R16276K608471J192742
38007G77332n1522O48342O65509m67658L70907K370719K54359n566407o875633
$$ plain form
37998 -7874052 -7941760 -641314 6875239 9901466 10080558 9494193 7437145 3994013 1305505
37989 1305505 106494 -671529 -638296 1370841 3808208 4381404 4561767 6526055 6842939
37980 6842939 519318 -8727014 -10548674 -2125728 7732622 11448250 11617323 12956525
37972 12956525 13335014 9293826 4174495 3000092 3472803 95152 -5273018 -5282006 911355
37963 911355 5386052 2914592 -1931580 -2473159 345067 739515 -2162930 -3019592 1032396
37954 1032396 5391597 4613935 762110 466149 4636164 6690570 2636278 -2509364
37946 -2509364 -2337077 1233323 1578287 -1922556 -3570113 -1115266 1041921 -278137
37938 -278137 -2105531 -916182 1749651 2533410 1526107 1126149 2261902 4401203 7119743
$$ packed form
37998g874052o7708P300446P516553L026227J79092n86365k057048l443132k688508
37989A305505j199011p78023L3233K009137K437367N73196J80363J964288L16884
37980F842939o323621r246332j821660Q422946R858350L715628J69073J339202
37972A2956525L78489m041188n119331j174403M72711l377651n368170q988O193361
37963I11355M474697k471460m846172n41579K818226L94448k902445q56662M051988
37954A032396M359201p77662l851825k95961M170015K054406m054292n145642
37946b509364J72287L570400L44964l500843j647557K454847K157187j320058
37938b78137j827394J189349K665833P83759j007303l99958J135753K139301K718540
$$ plain form
37929 7119743 9483236 9990851 9048323 9359710 12006528 14204665 12846155 8542978 4592318
37920 4592318 3565399 6104578 11177291 16145827 18189106 16837066 14025491 11603496
37912 11603496 10488842 11652635 15010773 17609477 16466174 13346982 12741684 14628720
37904 14628720 13889309 8282659 2223633 274482 1269795 1901098 2176460 3651353 5326064
37895 5326064 5230018 4142024 4415469 6513586 9205248 11598837 12824520 11581616 8218386
37886 8218386 5421394 4705089 4063959 1214867 -2645014 -4449498 -3111582 -29481
37878 -29481 2690056 3142607 643303 -2756970 -3569114 -771113 3376044 6696087 8561965
37869 8561965 7904933 3748959 -1282223 -2327933 1121083 4209390 4061241 3347526 4173990
$$ packed form
37929G119743K363493N07615r42528L11387K646818K198137j358510m303177l950660
37920D592318j026919K539179N072713M968536K043279j352040k811575k421995
37912A1603496j114654J163793L358138K598704j143303l119192o05298J887036
37904A4628720p39411n606650o059026j949151R95313O31303K75362J474893J674711
37895E326064r6046j087994K73445K098117K691662K393589J225683j242904l363230
37886H218386k796992p16305o41130k849092l859881j804484J337916L082101
37878b9481K719537M52551k499304l400273q12144K798001M147157L320043J865878
37869H561965o57032m155974n031182j045710L449016L088307j48149p13715Q26464
$$ plain form
37860 4173990 3867750 646642 -1598783 902681 5353352 6934257 6253098 6751261 7779739
37851 7779739 6320999 3404296 2516092 2797672 -52175 -6319452 -11275213 -11967477 -10090594
37842 -10090594 -7577795 -4124833 -236929 1627628 909377 707071 3565060 7629092
37834 7629092 8922142 6276348 2449900 582562 488088 -799204 -4564938 -7747590
37826 -7747590 -6464301 -1320356 3487130 5844271 6984638 7282908 5436145 2693751
37818 2693751 2705287 5182166 4992554 408494 -3050589 -736206 4190421 6248758 5277047
37809 5277047 3800391 1535468 -1847297 -2717132 1601495 7412769 10101803 11334628
37801 11334628 14463274 16663431 13244111 6725223 3443169 3280234 1201394 -2401084
$$ packed form
37860D173990l06240l221108k245425K501464M450671J580905o81159M98163J028478
37851G779739j458740k916703q88204K81580k849847o267277m955761o92264J876883
37842a0090594K512799L452962L887904J864557p18251k02306K857989M064032
37834G629092J293050k645794l826448j867338r4474j287292l765734l182652
37826g747590J283289N143945M807486K357141J140367K98270j846763k742394
37818B693751J1536K476879j89612m584060l459083K314383M926627K058337r71711
37809E277047j476656k264923l382765q69835M318627N811274K689034J232825
37801A1334628L128646K200157l419320o518888l282054j62935k078840l602478
$$ plain form
37793 -2401084 -1681477 4535296 10864346 14090094 16271843 18679450 19929782 20618262
37785 20618262 22649202 23809473 20556193 16162973 17542368 23338672 24405718 17733168
37777 17733168 10398759 7259490 4775539 888287 653632 5990850 9102083 3801378
37769 3801378 -3905430 -4559087 1251317 5940334 6556104 5464748 3354996 -451399
37761 -451399 -3234705 -1713833 1854506 2373035 -828965 -4367926 -6099991 -5174041 13632
37752 13632 8092609 12013614 6824846 -1975563 -4646985 -49111 4727198 6103418
37744 6103418 7356297 10079596 10402511 5971381 300878 -2573306 -2883900 -2424329 -1601060
37735 -1601060 -1219098 -2935602 -5895892 -6831920 -5262699 -4545886 -6023603 -6624128 -4620967
$$ packed form
37793b401084P19607O216773O329050L225748K181749K407607J250332O88480
37785B0618262K030940J160271l253280m393220J379395N796304J067046o672550
37777A7733168p334409l139269k483951l887252k34655N337218L111233n300705
37769C801378p706808o53657N810404M689017O15770j091356k109752l806395
37761d51399k783306J520872L568339N18529l202000l538961j732065R25950N187673
37752A3632Q078977L921005n188768q800409k671422M597874M776309J376220
37744F103418J252879K723299L22915m431130n670503k874184l10594M59571Q23269
37735a601060L81962j716504k960290r36028J569221P16813j477717o00525K003161
$$ plain form
37726 -4620967 -3065044 -4127060 -4431620 -533969 4429506 4957134 1969342 1524799 5051064
37717 5051064 6538009 1244982 -7040827 -10387197 -6099727 1032574 4796530 3330253
37709 3330253 -1080386 -5642109 -9054727 -10728032 -9864512 -6312327 -1752612 1164202
37701 1164202 1237003 -248385 -1030581 134244 2924507 5829530 6720852 4324711 110441
37692 110441 -2289035 -811180 2661835 5031976 6031214 7224196 7614603 3830566 -4069455
37683 -4069455 -10303419 -9711207 -4387772 -832129 -1771953 -4316031 -5508250 -5494229 -4583322
37674 -4583322 -1547566 2884685 4286736 -358317 -7619703 -10867380 -7833329 -2448564
37666 -2448564 434144 -9478 -864967 859586 5035140 8289812 7595855 4074433 1603286
$$ packed form
37726d620967J555923j062016l04560L897651M963475N27628k987792m44543L526265
37717E051064J486945n293027q285809l346370M287470P132301L763956j466277
37709C330253m410639m561723l412618j673305Q63520L552185M559715K916814
37701A164202P2801j485388p82196J164825K790263K905023Q91322k396141m214270
37692A10441k399476J477855L473015K370141R99238J192982L90407l784037p900021
37683d069455o233964N92212N323435L555643r39824k544078j192219J4021R10907
37674d583322L035756M432251J402051m645053p261386l247677L034051N384765
37666b448564K882708m43622q55489J724553M175554L254672o93957l521422k471147
$$ plain form
37657 1603286 1282017 999 -4028792 -7458971 -6414951 -2412259 27579 -107592
37649 -107592 -384376 -457468 -2781414 -7414238 -10428492 -8936633 -4487459 -92694 3236413
37640 3236413 5437469 5561315 3195673 183441 -1021660 -35438 1562800 2407389 2584027
37631 2584027 3075822 4517424 6545858 8474016 10221521 11455429 10110158 4222122
37623 4222122 -4019590 -9130702 -9107415 -8098535 -9544393 -10385788 -6692965 -1811781 -2319060
37614 -2319060 -7154951 -8113644 -2108558 3940138 3173413 -2062454 -5075684 -4451607 -4044526
37605 -4044526 -5750513 -6978189 -5132469 -1520153 18408 -2705347 -7764825 -10859417
37597 -10859417 -9696926 -5875491 -1859191 1979905 5448936 6076577 2234888 -2634049
$$ packed form
37657A603286l21269j281018m029791l430179J044020M002692K439838j35171
37649a07592k76784p3092k323946m632824l014254J491859M449174M394765L329107
37640C236413K201056J23846k365642l012232j205101R86222J598238Q44589J76638
37631B584027M91795J441602K028434J928158J747505J233908j345271n888036
37623D222122q241712n111112K3287J008880j445858q41395L692823M881184n07279
37614b319060m835891r58693O005086O048696p66725n235867l013230O24077M07081
37605d044526j705987j227676J845720L612316J538561k723755n059478l094592
37597a0859417J162491L821435M016300L839096L469031O27641l841689m868937
$$ plain form
37589 -2634049 -3105907 1316721 6192087 8409742 8209325 5571447 -95205 -6086611
37581 -6086611 -7439127 -3377963 1530007 3875380 4798875 5784086 5689883 3782054 1715371
37572 1715371 710902 45077 -761342 -1600141 -3498555 -6566960 -7131641 -2452925 2764359
37563 2764359 1839827 -2398125 -624327 7499479 11166136 4968579 -2848313 -3827221
37555 -3827221 -883129 279987 1598984 5918063 8439470 4842163 798055 2879198
37547 2879198 6269351 2955553 -3217335 -2438321 3732893 4537942 -1712055 -5091063
37539 -5091063 -817558 4144216 4047956 2421336 3065002 3179384 496580 -1466426 -693808
37530 -693808 -1606681 -6995319 -11624412 -10085890 -5740750 -5408674 -8906029 -10105727 -6301125
$$ packed form
37589b634049m71858M422628M875366K217655k00417k637878n666652n991406
37581f086611j352516M061164M907970K345373R23495R85211r4203j907829k066683
37572A715371j004469o65825q06419q38799j898414l068405n64681M678716N217284
37563B764359r24532m237952J773798Q123806L666657o197557p816892r78908
37555c827221K944092J163116J318997M319079K521407l597307m044108K081143
37547B879198L390153l313798o172888P79014O171214Q05049o249997l379008
37539e091063M273505M961774r6260j626620O43666J14382k682804j963006P72618
37530f93808r12873n388638m629093J538522M345140L32076l497355j199698L804602
$$ plain form
37521 -6301125 -1129754 1087527 -881 -1682586 -1382321 1018366 3266469 3698935
37513 3698935 3504846 4130784 3704914 -228318 -5046586 -5068673 10480 3731991 1786152
37504 1786152 -2286923 -2967690 -439334 839022 -1421106 -5322872 -7678658 -6990029
37496 -6990029 -4795712 -4776374 -8613311 -12593977 -11304400 -5221125 -1020196 -2867254
37488 -2867254 -6797381 -6061314 305264 6557282 6682374 435411 -6350219 -7395568
37480 -7395568 -2824087 736525 -1401604 -5523917 -4739938 1340218 6711365 7474515
37472 7474515 5073971 1764106 -1474912 -2592622 -116752 2255270 -1033274 -8312152
37464 -8312152 -11378195 -7127875 -1786831 -721856 -849426 2478857 6955510 7222158
$$ packed form
37521f301125N171371K217281j088408j681705L00265K400687K248103M32466
37513C698935j94089O25938m25870l933232m818268k2087N079153L721511j945839
37504A786152m073075o80767K528356J278356k260128l901766k355786O88629
37496f990029K194317J9338l836937l980666J289577O083275M200929j847058
37488b867254l930127P36067O366578O252018J25092o246963o785630j045349
37480g395568M571481L560612k138129m122313P83979O080156N371147P63150
37472G474515k400544l309865l239018j117710K475870K372022l288544p278878
37464h312152l066043M250320N341044J064975j27570L328283M476653K66648
$$ plain form
37456 7222158 3336315 131127 542027 3427454 5926926 5327873 1115120 -2936568
37448 -2936568 -1979199 3069092 6029709 4244349 1615882 1001399 -53503 -2910881
37440 -2910881 -4073718 -2259305 -2393392 -6946744 -9926109 -6238227 -753792 -143915
37432 -143915 -1531110 1373455 5714231 3961505 -2160858 -4022062 -1388279 -3131100
37424 -3131100 -11066597 -14975071 -8129488 2267563 6147261 4009061 2499657 2966813
$$ packed form
37456G222158l885843l205188M10900K885427K499472n99053m212753m051688
37448b936568R57369N048291K960617j785360k628467o14483j054902k857378
37440b910881j162837J814413j34087m553352k979365L687882N484435O09877
37432a43915j387195K904565M340776j752726o122363j861204K633783j742821
37424c131100p935497l908474O845583J0397051L879698k138200j509404M67156
$$ [...]
##END NTUPLES=NMR SPECTRUM
##END=
