##TITLE=31Pdec_LR-618-R3-CR9-17
 CDCl3, 124 sc
 28.06.2021
##JCAMPDX= 6.0         $$ Bruker NMR JCAMP-DX V2.0
##DATA TYPE= NMR SPECTRUM
##DATA CLASS= NTUPLES
##ORIGIN= UXNMR, Bruker Analytische Messtechnik GmbH
##OWNER= root
$$ XWIN-NMR		Version 3.5
$$ Mon Jun 28 11:56:06 2021 Russian Standard Time (UT+4h)  she@DPX200
##.OBSERVE FREQUENCY= 81.013821
##.OBSERVE NUCLEUS= ^31P
##.ACQUISITION MODE= SIMULTANEOUS
##.ACQUISITION SCHEME= undefined
##.AVERAGES= 124
##.DIGITISER RES= 16
##SPECTROMETER/DATA SYSTEM= spect
##.PULSE SEQUENCE= zgpg30
##.SOLVENT NAME= CDCl3
##.SHIFT REFERENCE= (INTERNAL, CDCl3, 0, 248.564)
##AUDIT TRAIL= $$ (NUMBER, WHEN, WHO, WHERE, WHAT)
$$ ##TITLE= Audit trail, XWIN-NMR		Version 3.5
$$ ##JCAMPDX= 5.01
$$ ##ORIGIN= Bruker BioSpin GmbH
$$ ##OWNER= she
$$ F:/spectra/data/she/nmr/P31/1/pdata/1/auditp.txt
$$ ##AUDIT TRAIL=  $$ (NUMBER, WHEN, WHO, WHERE, WHAT)
(   1,<2021-06-28 11:51:09.93 +0400>,<she>,<DPX200>,
      <continue with go, POWCHK disabled, PULCHK disabled
       configuration hash MD5:
       00 E9 B6 7A A2 85 ED C7 34 08 36 98 17 FE 4E 26
       data hash MD5: 32K
       BC 65 B4 F4 36 D7 8D 0D 2B 6B 6D FB E7 20 5C D7>)
(   2,<2021-06-28 11:54:16.25 +0400>,<she>,<DPX200>,
      <Start of raw data processing
       efp BC_mod = 2 LB = 1 FT_mod = 6 PKNL = 1 PHC0 = -7978.984 PHC1 = 3476.687 SI = 64K 
       data hash MD5: 64K
       DB EE FE 58 40 33 B0 1B 18 B0 CD 50 0C 42 0F 43>)
(   3,<2021-06-28 11:54:51.65 +0400>,<she>,<DPX200>,
      <pk PHC0 = 28.69059 PHC1 = -80.8 
       data hash MD5: 64K
       09 43 B2 B9 63 DB 23 CA 8A B8 A5 45 CE 73 27 35>)
(   4,<2021-06-28 11:54:55.15 +0400>,<she>,<DPX200>,
      <abs ABSG = 5 
       data hash MD5: 64K
       2C 53 1F 87 DB C2 C4 06 B1 88 28 2D 02 A3 67 BE>)
$$ ##END=
$$ 
$$ hash MD5
$$ B7 71 93 F6 45 89 27 2A 09 C4 61 A6 80 8B 10 E3
##$RELAX= 
##$RELAX= 
##$RELAX= 
##$RELAX= 
##$RELAX= 
##$RELAX= 
##$RELAX= 
##$RELAX= 
$$ Bruker specific parameters
$$ --------------------------
##$DU= <F:/spectra>
##$EXPNO= 1
##$NAME= <P31>
##$PROCNO= 1
##$TYPE= <nmr>
##$USER= <she>
##$AMP= (0..31)
100 100 100 100 100 100 100 100 100 100 100 100 100 100 100 100 100 100 
100 100 100 100 100 100 100 100 100 100 100 100 100 100 
##$AQSEQ= 0
##$AQ_mod= 1
##$AUNM= <au_zg>
##$AUTOPOS= <>
##$BF1= 81.014009
##$BF2= 200.13
##$BF3= 200.13
##$BF4= 200.13
##$BF5= 200.13
##$BF6= 200.13
##$BF7= 200.13
##$BF8= 200.13
##$BYTORDA= 1
##$CFDGTYP= 0
##$CFRGTYP= 5
##$CHEMSTR= <none>
##$CNST= (0..31)
1 1 145 1 1 1 1 1 1 1 1 1 1 1 1 1 1 1 1 1 1 1 1 1 1 1 1 1 1 1 1 1 
##$CPDPRG= <waltz16>
##$CPDPRG1= <>
##$CPDPRG2= <waltz16>
##$CPDPRG3= <>
##$CPDPRG4= <mlev>
##$CPDPRG5= <mlev>
##$CPDPRG6= <mlev>
##$CPDPRG7= <mlev>
##$CPDPRG8= <mlev>
##$CPDPRGB= <>
##$CPDPRGT= <>
##$D= (0..31)
0 1 0 0 0 0 0 0 0 0 0 0.03 2e-05 3e-06 0 0 0 0 0 0 0 0 0 0 0 0 0 0 0 0 
0 0 
##$DATE= 1624866469
##$DBL= (0..7)
120 120 120 11 120 120 24 19 
##$DBP= (0..7)
150 150 150 150 150 150 150 150 
##$DBP07= 0
##$DBPNAM0= <>
##$DBPNAM1= <>
$$ [...]
##$SUBNAM3= <"">
##$SUBNAM4= <"">
##$SUBNAM5= <"">
##$SUBNAM6= <"">
##$SUBNAM7= <"">
##$SUBNAM8= <"">
##$SUBNAM9= <"">
##$SW= 501.771253377433
##$SWIBOX= (0..15)
0 1 3 0 0 0 0 0 0 0 0 0 0 0 0 0 
##$SW_h= 40650.406504065
##$TD= 32768
##$TD0= 1
##$TE= 0
##$TE2= 300
##$TE3= 300
##$TEG= 300
##$TL= (0..7)
0 120 53 12 22 120 120 120 
##$TP= (0..7)
150 150 150 150 150 150 150 150 
##$TP07= 0
##$TPNAME0= <>
##$TPNAME1= <>
##$TPNAME2= <>
##$TPNAME3= <>
##$TPNAME4= <>
##$TPNAME5= <>
##$TPNAME6= <>
##$TPNAME7= <>
##$TPOAL= (0..7)
0.5 0.5 0.5 0.5 0.5 0.5 0.5 0.5 
##$TPOFFS= (0..7)
0 0 0 0 0 0 0 0 
##$TUNHIN= 0
##$TUNHOUT= 0
##$TUNXOUT= 0
##$USERA1= <user>
##$USERA2= <user>
##$USERA3= <user>
##$USERA4= <user>
##$USERA5= <user>
##$V9= 5
##$VALIST= <valist>
##$VCLIST= <CCCCCCCCCCCCCCC>
##$VD= 0
##$VDLIST= <DDDDDDDDDDDDDDD>
##$VPLIST= <PPPPPPPPPPPPPPP>
##$VTLIST= <TTTTTTTTTTTTTTT>
##$WBST= 1024
##$WBSW= 4
##$XGAIN= (0..3)
0 0 0 0 
##$XL= 0
##$YL= 0
##$YMAX_a= 8310
##$YMIN_a= -10588
##$ZGOPTNS= <>
##$ZL1= 120
##$ZL2= 120
##$ZL3= 120
##$ZL4= 120
##$ABSF1= 248.5645
##$ABSF2= -253.2056
##$ABSG= 5
##$ABSL= 3
##$ALPHA= 0
##$AQORDER= 0
##$ASSFAC= 0
##$ASSFACI= 0
##$ASSFACX= 0
##$ASSWID= 0
##$AUNMP= <proc_1d>
##$AZFE= 0.1
##$AZFW= 0.5
##$BCFW= 0
##$BC_mod= 2
##$BYTORDP= 0
##$COROFFS= 0
##$CY= -3
##$DATMOD= 1
##$DC= 0
##$DFILT= <>
##$DTYPP= 0
##$F1P= 0
##$F2P= 0
##$FCOR= 1
##$FTSIZE= 65536
##$FT_mod= 6
##$GAMMA= 0
##$GB= 0
##$INTBC= 1
##$INTSCL= 5.30512e-09
##$ISEN= 30
##$LB= 1
##$LEV0= 0
##$LPBIN= 0
##$MAXI= 10000
##$MC2= 0
##$MEAN= 0
##$ME_mod= 0
##$MI= 50
##$NCOEF= 0
##$NC_proc= -7
##$NLEV= 6
##$NOISF1= 182.463
##$NOISF2= 159.3651
##$NSP= 0
##$NTH_PI= 0
##$NZP= 0
##$OFFSET= 248.5645
##$PC= 4
##$PHC0= -7950.293
##$PHC1= 3395.887
##$PH_mod= 1
##$PKNL= yes
##$PPARMOD= 0
##$PSCAL= 0
##$PSIGN= 0
##$REVERSE= no
##$SF= 81.014009
##$SI= 65536
##$SIGF1= 159.3651
##$SIGF2= -187.1042
##$SINO= 113.3802
##$SIOLD= 16384
##$SREGLST= <1H.CDCl3>
##$SSB= 0
##$STSI= 65536
##$STSR= 0
##$SW_p= 40650.406504065
##$SYMM= 0
##$S_DEV= 0
##$TDeff= 32768
##$TDoff= 0
##$TI= <>
##$TILT= no
##$TM1= 0
##$TM2= 0
##$TOPLEV= 0
##$USERP1= <user>
##$USERP2= <user>
##$USERP3= <user>
##$USERP4= <user>
##$USERP5= <user>
##$WDW= 1
##$XDIM= 65536
##$YMAX_p= 477662807
##$YMIN_p= -45216592
$$ End of Bruker specific parameters
$$ ---------------------------------
##NTUPLES= NMR SPECTRUM
##VAR_NAME=  FREQUENCY,     SPECTRUM/REAL,   SPECTRUM/IMAG
##SYMBOL=    X,             R,               I
##VAR_TYPE=  INDEPENDENT,   DEPENDENT,       DEPENDENT
##VAR_FORM=  AFFN,          ASDF,            ASDF
##VAR_DIM=   65536,         65536,           65536
##UNITS=     HZ,            ARBITRARY UNITS, ARBITRARY UNITS
##FACTOR=    0.620285442955139, 1,           1
##FIRST=     20137.2065510759, 0,            0
##LAST=      -20513.1999529892, 0,           0
##MIN=       -20513.1999529892, -45216592,   0
##MAX=       20137.2065510759, 477662807,    0
$$ Real data points
##PAGE= N=1
##DATA TABLE= (X++(R..R)), XYDATA
$$ [...]
##PAGE= N=2
##DATA TABLE= (X++(I..I)), XYDATA
13005c019801M310249k106825o782334l894605J774386L385640J770480J092809
12997c470001J000615k76820l387M417740Q184527M360181m725181q702541k837774
12988b052641N400061O057393q61191o241210l844656K218734L654022o66641
12980C663871l646513q09105K912529J148154l371154k884528K735481N308936
12972E057671J030235l964465l569753l59443K42092j054190O7418L453894M762289
12963E665748K435281m32136j082471m29072q69306k839497m167645k333962K409495
12954a643565O439042O423463L095447l26296k475890l873250l730850q23625
12946C084476K627809K526581r43355l206621k282145j067819j255207k83063
$$ plain form
13005 -3019801 1290448 -816377 -7598711 -11493316 -9718930 -6333290 -4562810 -3470001
12997 -3470001 -2469386 -2746206 -2749593 1668147 9852674 14212855 9487674 785133 -2052641
12988 -2052641 3347420 9404813 8543622 2302412 -1542244 676490 4330512 3663871
12980 3663871 17358 -791747 2120782 3268936 -102218 -2986746 -251265 5057671
12972 5057671 6087906 2123441 -1446312 -1805755 -1563663 -2617853 -2550435 903459 5665748
12963 5665748 8101029 7668893 6586422 6157350 5288044 2448547 -1719098 -4053060 -1643565
12954 -1643565 4795477 11218940 14314387 13988091 11512201 7638951 3908101 3084476
12946 3084476 5712285 8238866 7295511 4088890 1806745 738926 -516281 -799344
12938g99344L122746N415354L620407K2400j958717k569742k911703j528210J930043
12929D343234L455158J04745m271507l986731o3825J549417r22863l108506j556160
12920d457038J854851L455794K387431N75329J43089J470594K829258K288447
12912A0547755M51537l01471J02331j029599l985692m631173o20083L671634K702674
12903F907913k042007m191318j554408J790455K163742M37185j077707j900298
12895E33557k271980j815361p06230m8094k4812N73498K128192K997810J503194
12886B869774j699802l892503k838274Q01267L646036K979825q7474k100241j703618
12877b025010n45816K12768J258612K317873J617801k49209J80112L288977L858222
$$ plain form
12938 -799344 2323402 7738756 11359163 11381563 9422846 6853104 3941401 2413191 4343234
12929 4343234 7798392 7903137 3631630 -355101 -418926 1130491 207628 -2900878 -4457038
12920 -4457038 -2602187 853607 3241038 3816367 3959456 5430050 8259308 10547755
12912 10547755 10999292 10697821 10800152 9770553 5784861 1153688 533605 4205239 6907913
12903 6907913 4865906 674588 -879820 910635 3074377 3511562 2433855 533557
12895 533557 -1738423 -3553784 -4260014 -4308108 -4332920 -3759422 -1631230 1366580 2869774
12886 2869774 1169972 -2722531 -5560805 -4759538 -1113502 1866323 1778849 -321392 -2025010
12877 -2025010 -2570826 -2358058 -1099446 1218427 2836228 2587019 2767131 6056108 9914330
12868I914330j633261q391386q765950k434026L569909M023665M63353k550671
12860e804037k339697N88592L211658K451172p76286j615202J917395M773126
12852B406721J629921m617655o486171k554259J437056J686590M48848M87888
12844e561061J254581J920634K904834K888106l91049m637543m005710J782054
12836c845154N150911J393358l783994k753919K464753L864100L2359k448744
12828G3670J2845K912604J707893j066159p89190J362934Q16156k170724k521034
12819C38995J109008L462261R25199k227822m83554L453989K305562l894593o938506
12810a949461k803355K442174K636307O47681J810804L870639J198060m365310
$$ plain form
12868 9914330 8281069 -110317 -8876267 -11310293 -7740384 -3716719 -3253366 -5804037
12860 -5804037 -8143734 -7555142 -4343484 -1892312 -2668598 -4283800 -2366405 2406721
12852 2406721 4036642 -581013 -7067184 -9621443 -8184387 -6497797 -6048949 -5561061
12844 -5561061 -4306480 -2385846 518988 3407094 3016045 -1621498 -5627208 -3845154
12836 -3845154 1305757 2699115 -1084879 -3838798 -1374045 2490055 2522414 73670
12828 73670 86515 2999119 4707012 3640853 2851663 4214597 5030753 2860029 338995
12819 338995 1448003 4910264 5835463 3607641 3124087 6578076 8883638 4989045 -1949461
12810 -1949461 -4752816 -2310642 325665 973346 2784150 6654789 7852849 3487539
12802C487539n479815j122108J862578k48616l142639k527116k14653Q56112J726658
12793d802060L769759M724876K444323r85423k520986k482651k281162r14178
12785c047502K530721N350139M194422J68597k484895j990719m69062k60396j294815
12776B696490k247485k679664l344200m425632l925575L83166O301084P450777
12768B08961J576150m257855k312702L981320M392115k239019n718814n01674
12760d871518N675565M530036j40949l91350K361280J398716k447824k595264
12752C518692Q09275Q04950l724381n169414N51512P013956O386019l88628o279536
12743C522445o788090k751290K121910L979033J688826j426670j131855J927412
$$ plain form
12802 3487539 -1992276 -3114384 -1251806 -1500422 -4643061 -7170177 -7384830 -6528718 -4802060
12793 -4802060 -1032301 3692575 6136898 5151475 2630489 147838 -2133324 -3047502
12785 -3047502 -516781 4833358 9027780 9196377 6711482 4720763 4251701 3991305 2696490
12776 2696490 449005 -2230659 -5574859 -10000491 -13926066 -13542900 -7241816 208961
12768 208961 1785111 -2472744 -4785446 -804126 3587989 1348970 -4369844 -4871518
12760 -4871518 804047 5334083 5193134 4801784 7163064 8561780 6113956 3518692
12752 3518692 4327967 5132917 1408536 -3760878 -3209366 3804590 10190609 9801981 3522445
12743 3522445 -3265645 -6016935 -3895025 84008 1772834 346164 -785691 1141721
12735A141721L110666P33875j814291j648492Q6078J402657K020080J409373j296563
12726E145104l754087j534123M619677P320889K023924n809685p304751j257171
12718e50223N574914P263303L570796k618703q198263j0069818o397256Q04620
12710a0620630O314662O384812K265380j402549j428097R55912K136183Q54674
12702E460347n06293r3111K02304j883189m376284l653469n22431Q63530j15847
12693d624443R3413K398543L245976J362910N45782K743319L796468J72754m681574
12684E053148n398310k334965N02834J733077J963404K76650l186970m045978
12676e437110Q46423O731152N961026j334721p370211o877413j844778L242489
$$ plain form
12735 1141721 4252387 4986262 3171971 1523479 1609557 3012214 5032294 6441667 5145104
12726 5145104 1391017 -143106 4476571 11797460 13821384 8011699 706948 -550223
12718 -550223 5024691 12287994 15858790 13240087 5041824 -5027994 -11425250 -10620630
12710 -10620630 -4305968 2078844 4344224 2941675 1513578 2469490 4605673 5460347
12702 5460347 4954054 4860943 5063247 3180058 -1196226 -4849695 -5372126 -4508596 -4624443
12693 -4624443 -4531030 -2132487 1113489 2476399 3022181 5765500 9561968 9734722 5053148
12684 5053148 -345162 -2680127 -2177293 -444216 1519188 1795838 -1391132 -5437110
12676 -5437110 -4590687 2140465 8101491 6766770 -603441 -7480854 -9325632 -6083143
12668f083143N546789L787375o46783k846464K65203M530181L935352J49r82671
12659G505988J016082r2824m875518o150067j021658L729853K540765o77613m67060
12650A507948J269256O49420j57188K428596N494125L886466j005550l771277
12642A0301796l541508l243975k776023n1934K785964J409059l025043m805397
12634b947061k146403J206153K629323K990621K484524J23204k344276j852911
12626A43174L02522O4361j981342j337800J832982K359417l27322n09552K963070
12617C509510K905609l940271r176998m850299L437246M847391L9434j218795
12609d447173K893082L474239l052794p429132j843764O918505O980176j073906
$$ plain form
12668 -6083143 -536354 3251021 2604238 -242226 22977 4553158 8488510 8488659 7505988
12659 7505988 8522070 8429246 3553728 -2596339 -3617997 111856 2652621 1975008 1507948
12650 1507948 2777204 3426624 3269436 5698032 11192157 15078623 14073073 10301796
12642 10301796 6760288 3516313 740290 688356 3474320 4883379 1858336 -2947061
12634 -2947061 -5093464 -3887311 -1257988 1732633 4217157 4340361 1996085 143174
12626 143174 445696 510057 -1471285 -2809085 -976103 1383314 1055992 546440 3509510
12617 3509510 6415119 2474848 -6702150 -11552449 -8115203 -3267812 -3228378 -4447173
12609 -4447173 -1554091 1920148 -1132646 -8561778 -10405542 -3487037 3493139 2419233
12601B419233n611301j464882L449821J338319l738385l015730L162393O145548
12593B685016K051407l411171m442550k733654k052172r59567L358950P674318
12585B170577O161980J60175k542517Q64302L954118R09029m839903n970126j550850
12576f83215K679299K412065r99260l664205l228172n2680L237146L604323Q44226
12567D149527j560218n53334K303789K775398m05892l948727m209693j401177
12559b850327R37006k0444l234322m899581l016987K9680J003707Q54083K996174
12550h201011O629410O305073K09287n450961m222051J502479L943176Q19949
12542A535351k398145j068726K649897L922213J762201q73646j597869j025469
$$ plain form
12601 2419233 -3192068 -4656950 -1207129 131190 -3607195 -6622925 -3460532 2685016
12593 2685016 4736423 1325252 -3117298 -5850952 -7903124 -8862691 -5503741 2170577
12585 2170577 8332557 8492732 5950215 6814517 10768635 11677664 6837761 867635 -683215
12576 -683215 1996084 4408149 3408889 -255316 -3483488 -3536168 -299022 3305301 4149527
12567 4149527 2589309 2035975 4339764 7115162 6709270 2760543 -1449150 -2850327
12559 -2850327 -1913321 -1933765 -5168087 -10067668 -13084655 -13054975 -12051268 -11197185 -8201011
12550 -8201011 -1571601 4733472 4942759 -508202 -4730253 -3227774 715402 1535351
12542 1535351 -862794 -1931520 718377 4640590 6402791 5529145 3931276 2905807
12534B905807j109596k259599k676642q89800J601056J948029L47044M9331J795461
12525A711091J752205k168203n463097l210537J476346J423249k932583l061789
12517a0473318M517395J1337481P917573k797550q907011m926828K044356K581138
12509A293236l025143o115240j348737O547102Q843085L375467l619196n730781
12501B19793l235306n56788J32115R2379O25256J529266K186518J841801k68683
12492B566351k967366k990271M51444L013019R19612k620245j697302K903736
12484d21022M666800J575869j363869j125822j082675l374692l700139J219581
12476c605969O405395N098491j043266m501157k521739P50832J594957N76464
$$ plain form
12534 2905807 1796211 -463388 -3140030 -4029830 -2428774 -480745 -133701 -84370 1711091
12525 1711091 3463296 1295093 -4168004 -7378541 -5902195 -4478946 -7411529 -10473318
12517 -10473318 -5955923 5381558 13299131 10501581 1594570 -3332258 -1287902 1293236
12509 1293236 -1731907 -7847147 -9195884 -2648782 6194303 9569770 5950574 219793
12501 219793 -3015513 -3572301 -3440186 -3347807 -2722551 -1193285 993233 2835034 2566351
12492 2566351 -401015 -3391286 -2939842 73177 992789 -1627456 -3324758 -421022
12484 -421022 4245778 5821647 4457778 3331956 2249281 -1125411 -4825550 -3605969
12476 -3605969 2799426 7897917 6854651 2353494 -168245 582587 2177544 2754008
12468B754008n98228j144708J9880L213183N498935L363015j788243m757957l634888
12459B924997j750879j844753k443258j563612j76267K49225N84096J961482L194402
12450A135433K719853J402507J099967J637850J273085n73232k660148l455899
12442B579416k201479Q27247M064163N322935L684531L42993k737479m222684
12434G659643l518335j148786M85449j251974n551959p832629m809469J309704
12426a4658356N361995M912821J770410r67127j250877J536215N779167P388292
12418I872540L263858m153796q155887m978733J830292N533743L372288j656589
12410D927716m934904m497173j813505J99231M0244q23450J55225K780203L769152
$$ plain form
12468 2754008 2155780 1011072 1030952 4244135 9743070 13106085 11317842 6559885 2924997
12459 2924997 1174118 -670635 -3113893 -4677505 -4853772 -4604547 -4020451 -2058969 1135433
12450 1135433 3855286 5257793 6357760 7995610 9268695 8695463 6035315 2579416
12442 2579416 377937 1205184 5269347 10592282 14276813 14619806 11882327 7659643
12434 7659643 4141308 2992522 3477971 2225997 -3325962 -11158591 -15968060 -14658356
12426 -14658356 -9296361 -4383540 -2613130 -3580257 -4831134 -3294919 2484248 9872540
12418 9872540 13136398 8982602 826715 -4152018 -2321726 3212017 6584305 4927716
12410 4927716 -7188 -4504361 -6317866 -6118635 -6078391 -6901841 -6746616 -3966413 -197261
12401a97261J464647j058725p6317L030810L519879L28846k527969k283008j134098
12392A066804j747896k691055j405223R61832J356776j90282j056608n72545m23834
12383d702031q62919j93208J571967J944410p7716k075958j595880O86338K478922
12374b826075K824630K349528J899852J849055J790750O67549j620665l034675
12366C899949j709252P74157R00422j766469l766841k591581L74990K729141M035455
12357B879971M405327K746060j300274n352191o368848l969599n33304J184468
12349f308390J61686j809987j200556L123777P181954O208761J463315j279054
12341G541506l89504m57989l969792o430172l388486K336542M969747L631370
$$ plain form
12401 -197261 1267386 208661 132344 3163154 6683033 7011879 4483910 2200902 1066804
12392 1066804 -681092 -3372147 -4777370 -3815538 -2458762 -2649044 -3705652 -4278197 -4702031
12383 -4702031 -5564950 -5758158 -4186191 -2241781 -2319497 -4395455 -5991335 -5304997 -2826075
12374 -2826075 -1445 2348083 4247935 6096990 7887740 8555289 6934624 3899949
12366 3899949 2190697 2964854 3865276 2098807 -1668034 -4259615 -3884625 -1155484 2879971
12357 2879971 7285298 10031358 8731084 3378893 -2989955 -6959554 -7492858 -6308390
12349 -6308390 -6146704 -7956691 -9157247 -6033470 1148484 7357245 8820560 7541506
12341 7541506 7152002 6694013 2724221 -3705951 -7094437 -4757895 211852 3843222
12333C843222J172139j473225m417654n025770r89831M253438M921586R91893
12325C275798k330893k560582j862739j294375J002646M809381O225678K975744
12317A0240658k362740n766893n398768j523684L680161O028440K877110k812310
12309D961974n484507l925254j307077Q82376L702591N859333M258896L48596
12301I296928n92174J866725K134953j489955l208968k1926J942586k413147p208018
12292C07004l936250M597708P715985K389931l376004k929791R90569K494585
12284H253737N91067j880211k998760k521867o97383J368866J970053Q69253k93795
12275D660960l02345M24960J099588J314006M62112j762114m180314n075262m184772
$$ plain form
12333 3843222 5015361 3542136 -875518 -5901288 -6891119 -2637681 2283905 3275798
12325 3275798 944905 -1615677 -3478416 -4772791 -3770145 1039236 7264914 10240658
12317 10240658 7877918 2111025 -3287743 -4811427 -1131266 4897174 7774284 4961974
12309 4961974 -522533 -4447787 -5754864 -4872488 -1169897 4689436 8948332 9296928
12301 9296928 8704754 10571479 12706432 11216477 8007509 7985583 9928169 7515022 307004
12292 307004 -3629246 968462 8684447 11074378 7698374 4768583 5759152 8253737
12284 8253737 8844804 6964593 3965833 1443966 746583 2115449 4085502 4954755 4660960
12275 4660960 4358615 4783575 5883163 7197169 7659281 5897167 1716853 -3358409 -7543181
12266g543181k289334L68525L216515M008134J333346k075488j979093J298743
12258c661833K997325Q58023j750346j304486O96196P19980j124896j702574Q1118
12249d191493K001750K143138J136920L22852j48280m67012j75756O25028L50619
12240A597766k005999m498714l955980k01900L457108M488301L627116K110561
12232D618259o47373m151905m510174O60961O640698O229624j79018m778686l560647
12223C21739j185112k082544l110945p3757L638344J767537m259589o596574k126434
12214a3707335L836964N431608K693633o98541j836194P8455L230703L753988
12206B783281J65108l343415k155025J301343R99203k265927j312683N017790
$$ plain form
12266 -7543181 -9832515 -9463990 -6247475 -2239341 -905995 -2981483 -4960576 -3661833
12258 -3661833 -664508 193515 -1556831 -2861317 -2165121 -1445141 -2570037 -4272611 -4191493
12249 -4191493 -2189743 -46605 1090315 1413167 1264887 797875 622119 1247147 1597766
12240 1597766 -408233 -4906947 -8862927 -9064827 -5607719 -1119418 2507698 4618259
12232 4618259 3970886 -181019 -4691193 -4030232 2610466 8840090 8661072 3882386 321739
12223 321739 -863373 -2945917 -6056862 -6130619 -2492275 -724738 -4984327 -11580901 -13707335
12214 -13707335 -9870371 -4438763 -1745130 -2443671 -4279865 -4201410 -970707 2783281
12206 2783281 2948389 -395026 -2550051 -1248708 -249505 -2515432 -3828115 1189675
12198A189675Q022956K106060n598793n286915J062574L500627m36145l129754
12190A430285j665L372115O92788m970987n892089r05667L830465M121416K260535
12181C937196J361701J93273l093277n573782k925632K884529M820946P93991
12173B398945k909822j115252K425730J647724j606385j010621K872737L041848
12165E744904j842335m473445q35519K961421Q77474k807191n14300N885369P403904
12156A2400282J275145n479174o120702j861574J738682J518603j510808l909286
12148a948832k534247J982316M771055K507116j444241j491253J690091K265757
12140E797762j267637l661602j528140J406308P20376j894950k259203m34917
$$ plain form
12198 1189675 9212631 11318691 5719898 432983 1495557 4996184 4560039 1430285
12190 1430285 1428620 4800735 5493523 522536 -5369553 -6275220 -2444755 1676661 3937196
12181 3937196 5298897 5492170 2398893 -3174889 -6100521 -3215992 1604954 2398945
12173 2398945 -510877 -1626129 799601 2447325 840940 -169681 2703056 5744904
12165 5744904 3902569 -570876 -1406395 1555026 2432500 -374691 -888991 4996378 12400282
12156 12400282 13675427 8196253 2075551 213977 1952659 3471262 1960454 -1948832
12148 -1948832 -4483079 -2500763 2270292 4777408 3333167 1841914 3532005 5797762
12140 5797762 4530125 868523 -659617 746691 1467067 -427883 -2687086 -3122003
12132c122003N58577J59645J7611J11363o69550j242618K98591K698250K802038
12123A611904N07147j292530j577089k014204k560852o94710L413967N145002
12115B538635J615449l542739m858138k177598L49753P76126Q60606J660433J691839
12106a085634J99664j116209r63889l40130p1054R89753L294398M294900J551445
12097F753244k913540m111414j5229N816668P792271L508884m167504r233823
12089C429557p502526p47758M715673M715129J392491o10370k40671K86543K32426
12080E670494Q87295J830403Q05995k009182l485678k454751j396770j701003
12072a853197j211095J207386K646150R77812r33783k7745J076366j732825o053084
$$ plain form
12132 -3122003 -2563426 -2403781 -2386170 -2274807 -2944357 -4186975 -3888384 -1190134 1611904
12123 1611904 2119051 826521 -750568 -2764772 -5325624 -6020334 -2606367 2538635
12115 2538635 4154084 611345 -4246793 -6424391 -6074638 -5298512 -4437906 -2777473 -1085634
12106 -1085634 -885970 -2002179 -2966068 -3306198 -3377252 -2387499 906899 5201799 6753244
12097 6753244 3839704 -271710 -286939 5529729 13322000 16830884 12663380 3429557
12089 3429557 -4072969 -4820727 -105054 4610075 6002566 5392196 5151525 5438068 5670494
12080 5670494 6557789 8388192 9194187 7185005 3699327 1244576 -152194 -1853197
12072 -1853197 -3064292 -1856906 789244 1767056 833273 805528 1881894 149069 -5904015
12063e904015n377723P03855M959994K812574j306957j064218K532255L421681
12055G77446r7837k959167o72281M333022N596277N64945o266959q491608m822128
12046a2038290L00934K624350K440260K273082K579276K053305Q49470O17780
12038A700167J505557J617506j34544k499666l562252k516309K01715L072182
12030f15644M034162K509746N53334K74739P75527j50550j978887k041104r558
12021C351765J388150O47567n62236o40017m05273r88946j891787k467501l095209
12012d663487l612478k741232l87401J458868J367243K55295m12032m11108l7154
12003i183486N16856O51091K97232J189553M287396O297383K984955l658297o583434
$$ plain form
12063 -5904015 -11281738 -10577883 -5617889 -2805315 -4112272 -5176490 -2644235 777446
12055 777446 679609 -2279558 -2951839 1381183 6977460 7542405 1275446 -7216162 -12038290
12046 -12038290 -11737356 -9113006 -6672746 -4399664 -1820388 232917 1082387 1700167
12038 1700167 3205724 4823230 4688686 2189020 -1373232 -3889541 -3687826 -615644
12030 -615644 3418518 5928264 6481598 6756337 7531864 7381314 5402427 3361323 3351765
12021 3351765 4739915 5387482 4825246 4185229 3779956 2791010 899223 -1568278 -4663487
12012 -4663487 -8275965 -11017197 -11404598 -9945730 -8578487 -8323192 -8735224 -9146332 -9183486
12003 -9183486 -8666630 -8015539 -7718307 -6528754 -2241358 4056025 7040980 3382683 -3200751
11994c200751l420584L72303M41940l05080J632903L388539J208501j748365j11134
11985a741728M111996L984289j537809o132835n439514j768033J027781J913938
11977e581915J056180j167236k336768M25458N692074Q253553N526801K55221
11969A2123368l693366m858176l252350K99992L120107K413251r77716l219619
11961A955491k231460N50676K567177J809938k307587o638388n426061J900087
11953g820127P226408M068257j956140j093681M809517N029983k291842p080749
11945H91626l907333M88434L17796m92214J487937J746873j846445k339406L539811
11936a12921O556234j10559p164033l592261M149806K969791l869858k680183
$$ plain form
11994 -3200751 -6621335 -6249032 -5807092 -6112172 -4479269 -1090730 117771 -1630594 -1741728
11985 -1741728 2370268 6354557 4816748 -1316087 -6755601 -8523634 -7495853 -5581915
11977 -5581915 -4525735 -5692971 -8029739 -7604281 -1912207 6341346 11868147 12123368
11969 12123368 8430002 3571826 319476 619468 3739575 6152826 5175110 1955491
11961 1955491 -275969 274707 2841884 4651822 2344235 -4294153 -9720214 -7820127
11953 -7820127 -593719 3474538 1518398 424717 5234234 10264217 7972375 891626
11945 891626 -3015707 -2527273 -2209477 -2701691 -1213754 533119 -1313326 -3652732 -112921
11936 -112921 6443313 6332754 -831279 -4423540 -273734 2696057 -1173801 -3853984
11928c853984N629312O299548l219672p998505r00460N758699J960589l533718
11920A41809J58984O839424M436470m575056q286107m405724n79234K37439J808946
11911d223049M131011K951044n72429n12763K866189K681841k514677n560710
11903g53543k311607J885219J264911j761289j812152R78285K650536J885623
11895B025983J83264j774961l732391l730912l95676L667973M323409J388203
11887A954892j350103j490834m38964o6338K5310M80208M2781k059566l283753
11878f186367o12967M228363N983211K976796n83821j068261l97636j569868k778591
11869i141o35104L080663L375426j66787l001580k911155k219265k275092j362712
$$ plain form
11928 -3853984 1775328 8074876 4855204 -3143301 -4043761 1714938 3675527 141809
11920 141809 300793 7140217 11576687 7001631 -1284476 -5690200 -6269434 -6031995 -4223049
11911 -4223049 -92038 2859006 2286577 1773814 4640003 7321844 4807167 -753543
11903 -753543 -3065150 -1179931 84980 -1676309 -3488461 -2510176 140360 2025983
11895 2025983 2209247 434286 -3298105 -7029017 -7424693 -3756720 566689 1954892
11887 1954892 604789 -886045 -1325009 -1391347 -1366037 -885829 -843048 -2902614 -6186367
11878 -6186367 -6799334 -2570971 3412240 6389036 5805215 4736954 4339318 2769450 -9141
11869 -9141 -644245 2436418 5811844 5645057 2643477 -267678 -2486943 -4762035 -6124747
11860f124747O62750J171095o2167J89662K524949L331688J576837J206902L688119
11851H165088M320611R7281m647021n202659l407555k295299K54177N817075Q757153
11842A1858851L462088n373217q059496l247970J879846K880266J567726m70504
11834D497590l703615o033892l868896J383789M127746K380548o14514k089758
11826c921002j627464J266839N334454N314044j202531o831627l024634O098318
11818A406397Q651994K806117j915438j605355k903610p757921p350489J734059
11810f934246P976438J668568q630487q012845L047959J0663370P443762m69167
11802F753352m722342l662203P0019L373267L439905p6664l604739m050349l139689
$$ plain form
11860 -6124747 -5461997 -4290902 -4353069 -4163407 -1638458 1693230 3270067 4476969 8165088
11851 8165088 12485699 12582980 7935959 2733300 -674255 -2969554 -2715377 3101698 11858851
11842 11858851 15320939 9947722 1888226 -1359744 520102 3400368 4968094 4497590
11834 4497590 793975 -5239917 -9108813 -7725024 -3597278 -1216730 -1831244 -3921002
11826 -3921002 -5548466 -4281627 1052827 6366871 5164340 -1667287 -4691921 1406397
11818 1406397 10058391 12864508 10949070 9343715 6440105 -1317816 -8668305 -6934246
11810 -6934246 1042192 2710760 -5919727 -13932572 -10884613 -221243 7222519 6753352
11802 6753352 2031010 -1631193 -1561174 1812093 5251998 5175334 1570595 -2479754 -5619443
11793e619443l759930m542089k447026J700518M663252N446924M607638J874326
11785A924170j602224k247315M19515J466039j556073l505459l46481K748810
11777b699018j20425m253237j410465N503291O133671m61841m410320j238418
11769b956762J975575l68385l558804j572899L407840N868090M901894K340767
11761A0037316j430637m998080m415464O94553L829406k80558p480772r339965
11753a3384201m247069J696374L721418L481892M583822O655373N919069P01890
11745I128568n300400o460265j894759L166617L933875J804664J114275K309995
11737G802570K249865J65348j153164l09235N21488p72191l416784n266264m902886
$$ plain form
11793 -5619443 -9379373 -13921462 -16368488 -14667970 -10004718 -4557794 49844 1924170
11785 1924170 321946 -1925369 -1505854 -39815 -1595888 -5101347 -5447828 -2699018
11777 -2699018 -2819443 -7072680 -8483145 -2979854 3153817 2691976 -1718344 -2956762
11769 -2956762 -981187 -1349572 -4908376 -6481275 -3073435 2794655 7696549 10037316
11761 10037316 8606679 3608599 -806865 -112312 3717094 3436536 -4044236 -13384201
11753 -13384201 -17631270 -15934896 -12213478 -8731586 -4147764 2507609 8426678 9128568
11745 9128568 3828168 -2632097 -4526856 -1360239 2573636 4378300 5492575 7802570
11737 7802570 10052435 10217783 9064619 8755384 9276872 8504681 5087897 -178367 -5081253
11728e081253k244259J005555K355214J839221K321118M181589L186031k366623
11720E196593o395090k985181L791111N465825K035120N48960K337177J581157
11712A1575672k964653n105711k354586k10160j791876k424833Q31271K849310
11704D04434o68905n337834n190451j415310J714679L769039N363892M164967
11696B804511l68965l408886j689425Q89625J422k062783j701403p17275j540155
11687g793334j459750J573319L177700J82238j743315L062913Q974912O759725
11679A2734408j346568n026569j922867O75419q46280k284409j207592n37155
11671B38387j166175j81501J961482J174245j798945j422780K292836K685493
$$ plain form
11728 -5081253 -7325512 -6319957 -3964743 -2125522 195596 4377185 7563216 5196593
11720 5196593 -1198497 -4183678 -392567 5073258 7108378 7657338 9994515 11575672
11712 11575672 8611019 3505308 1150722 940562 -851314 -3276147 -2444876 404434
11704 404434 -264471 -5602305 -10792756 -12208066 -10493387 -6724348 -1360456 2804511
11696 2804511 2435546 -973340 -2662765 -1773140 -1771718 -3834501 -5535904 -6253179 -7793334
11687 -7793334 -9253084 -7679765 -4502065 -4319827 -6063142 -3000229 5974683 12734408
11679 12734408 11387840 6361271 4438404 5113823 4267543 1983134 775542 238387
11671 238387 -927788 -1109289 852193 2026438 227493 -1195287 1097549 3783042
11663C783042j632407l207590J720914O172677L603688j768377k542207M65338
11655F595078J706379P08545P56600J323433n95221l624181l569395r54468n13072
11646A833698l099301m132758j307009J481138L75182k308959j651030K422697
11638f386342N056174L469167N04699k09799K48635j415314m298633l903078L25711
11629f608780K969362O95908k148008k06045M248556M802297O89471k907040l095531
11620a559810j647316L10487L354646N121630J610797n068146o985799j430198
11612f293709M460565L961340Q8195k79217K881468L779528N9431m534787n829696
11603a706882l310204R34028M031380L689218N40194j586785k30610J889200L66022
$$ plain form
11663 3783042 2150635 -1056955 663959 6836636 10440324 8671947 6129740 6595078
11655 6595078 8301457 9010002 9766602 11090035 10494814 6870633 3301238 2346770 1833698
11646 1833698 -1265603 -5398361 -6705370 -5224232 -4849050 -7158009 -8809039 -6386342
11638 -6386342 -1330168 2138999 2643698 2433899 2682534 1267220 -3031413 -6934491 -6608780
11629 -6608780 -3639418 -2943510 -5091518 -5297563 -1049007 3753290 4442761 1535721 -1559810
11620 -1559810 -3207126 -2896639 458007 5579637 7190434 2122288 -4863511 -6293709
11612 -6293709 -1833144 2128196 2216391 1937174 4818642 8598170 8657601 4122814 -1706882
11603 -1706882 -5017086 -4083058 -51678 3637540 4177734 2590949 2360339 4249539 4615561
11594D615561m428764p431564n378542m64627L057313L700681K988979K300050
11586a040913J243144o91306k294240j944354l81325k5731r41536j72098L116687
11577c131672M797216J385678l901055m992998j279905K637418M230134M615780
11569D360596L679633J58122l059753r03189M787056N459590j513620p471021
11561E497414m665100K387413M094918m44249m078596l067168n70572K91412L03009
11552b51519O50511P04404K82655M13710J064461Q74707m80138j792857k077562
11543f11628j219154L06811R85873q03624l807008m149251o29790K986668L519963
11534c421140K944632L930392M338456J169360k683542j728702L124282M922213
$$ plain form
11594 4615561 186797 -7244767 -12623309 -13087936 -10030623 -6329942 -3340963 -1040913
11586 -1040913 202231 -489075 -2783315 -4727669 -5108994 -5134725 -6076261 -6248359 -3131672
11577 -3131672 1665544 3051222 -849833 -5842831 -7122736 -4485318 -255184 4360596
11569 4360596 8040229 8198351 5138598 4235409 9022465 14482055 12968435 5497414
11561 5497414 832314 3219727 7314645 6870396 2791800 -275368 -845940 -554528 -251519
11552 -251519 398992 1103396 1386051 1799761 2864222 3738929 3258791 1465934 -611628
11543 -611628 -1830782 -1523971 -538098 -1341722 -5148730 -9297981 -9927771 -6941103 -3421140
11534 -3421140 -476508 3453884 7792340 8961700 6278158 4549456 7673738 12595951
11526A2595951M29370n658635p359702m081267M97051K754385J372078j849238
11518a300007k894342Q5909L467480K405371j911630l287112N98924M458642K482866
11509D106101l759410o971820k680398N344888Q567853L114742m755062n330184
11501b363290J844758O604671K322480m230299l197723L071805M046204k109651
11493E988955o275667l589062q0016p18630j119285K742446N356955O12010o391738
11484c474032n929912J486621O207270L974290L76184K18928P71118j598137m591409
11475b559079m044301p59266J049574J52889n79481R81392L123408K926773N39891
11466H31800q34743N46922K170026Q02045k316224l031304r09085l7789j874944
$$ plain form
11526 12595951 13025321 7366686 6984 -4074283 -3577232 -822847 549231 -1300007
11518 -1300007 -4194349 -4108440 -640960 1764411 -147219 -3434331 -2835407 1623235 4106101
11509 4106101 346691 -6625129 -9305527 -3960639 4607214 7721956 2966894 -2363290
11501 -2363290 -518532 6086139 8408619 4178320 980597 4052402 8098606 5988955
11493 5988955 -286712 -3875774 -3955790 -4674420 -5793705 -3051259 2305696 2917706 -3474032
11484 -3474032 -9403944 -7917323 -1710053 2264237 2640421 2859349 3630467 2032330 -2559079
11475 -2559079 -6603380 -7362646 -6313072 -6160183 -6739664 -5758272 -2634864 291909 831800
11466 831800 -2943 543979 2714005 3516050 1199826 -1831478 -2740563 -2778352 -4653296
11457d653296k210480J525284M773370K841026o23615Q78917N166296L731998
11449A1429500m285655r138780m283765M223513O685256K496825j373704p70040
11441D983150K106615L286003Q20754m332828p993417n594424J561546N826122
11433F63521K573936l266835m375068j074454J408048K244290M249366O062907
11425H485711L566981j304327j891064K001459K960354j646098m960372k256954
11417D955690J303233K51303j651051J096177N028701L264676k509799m651390
11409G087540j711396P24113J16479m86130J76286l45211j937500j132445J889265
11400D381001K341297r87664k912083o1657L548851K560214k317694o169497o011750
$$ plain form
11457 -4653296 -6863776 -5338492 -565122 2275904 1652289 2531206 7697502 11429500
11449 11429500 7143845 -1994935 -6278700 -2055187 4630069 7126894 5753190 4983150
11441 4983150 7089765 10375768 11196522 6863694 -1129723 -6724147 -5162601 663521
11433 663521 3237457 -29378 -4404446 -5478900 -4070852 -1826562 2422804 8485711
11425 8485711 12052692 10748365 8857301 10858760 13819114 12173016 7212644 4955690
11417 4955690 6258923 6510226 4859175 5955352 10984053 14248729 11738930 7087540
11409 7087540 5376144 6100257 6216736 5730606 5906892 5561681 3624181 2491736 4381001
11400 4381001 6722298 5734634 2822551 2760894 6309745 8869959 6552265 382768 -5628982
11391e628982k470960K067357M920773M752058K928237J567142N40921j132381
11383G544165k195105j212206l21402k100729m009057j824870K378741K661321
11375I20858p22748j558686J473223K770846K74982j143815M20136P1715l678351
11366a171840m407168Q73749M950983J802976l666721m759082l581408m111466
11358a4069977k890023L344410Q138177M796095r03915K35131M460300J464869
11350D575067o711486q228327j442562L012278R23871n9217L331348L393991l245853
11341d450890p483487k653968M072295M064263J024770K599486O367148M913433
11333H453050q03228l626345k083796n87257l42525J046199K646534J371602q82481
$$ plain form
11391 -5628982 -8099942 -6032585 -1111812 3640246 6568483 8135625 8676546 7544165
11383 7544165 5349060 4136854 3815452 1714723 -2294334 -4119204 -1740463 920858
11375 920858 198110 -1360576 112647 2883493 3158475 2014660 2434796 2506511 -1171840
11366 -1171840 -5579008 -4705259 245724 2048700 -1618021 -6377103 -9958511 -14069977
11358 -14069977 -16960000 -13615590 -5477413 -681318 -1585233 -1350102 3110198 4575067
11350 4575067 -2136419 -10364746 -11807308 -8795030 -7871159 -7930376 -4599028 -1205037 -4450890
11341 -4450890 -11934377 -14588345 -10516050 -6451787 -5427017 -2827531 3539617 8453050
11333 8453050 7649822 4023477 1939681 1352424 1009899 2056098 4702632 6074234 5191753
11324E191753N33121L929936K728872l087276n369547m98186M063395R69211n298295
11315C162984m923882K228658N992827O14359o987240o995454K67608O108089
11307e32051N491508J471056j696457l669458m817507l581910j45228J785118
11299e694929M70895n57046J439549L167685R28416k439550k109233N32884Q63823
11290c397506m96367L81965K248252L65508m011535m409208J33464L532310L052001
11281b601116K666001M029381L012300j333208k986540J060530M805356K864231
11273A1516935q58067n14973J774458N88279k959659l615010j117501J56252j218901
11264C751813k691586k915826k484942p41461K942569N633429L636215j410612
$$ plain form
11324 5191753 5724874 9654810 12383682 9296406 3926859 3428673 7492068 8461279 3162984
11315 3162984 -1760898 467760 6460587 7074946 87706 -6907748 -6640140 -532051
11307 -532051 4959457 6430513 4734056 1064598 -3752909 -7334819 -7480047 -5694929
11299 -5694929 -5224034 -5781080 -4341531 -1173846 -245430 -2684980 -4794213 -4261329 -3397506
11290 -3397506 -3893873 -3511908 -1263656 -898148 -4909683 -9318891 -9185427 -5653117 -2601116
11281 -2601116 64885 4094266 7106566 5773358 2786818 3847348 8652704 11516935
11273 11516935 10658868 10143895 11918353 12506632 9546973 5931963 4814462 4970714 3751813
11264 3751813 1060227 -1855599 -4340541 -5082002 -2139433 3493996 7130211 5719599
11256E719599l701673q51632L293045M053318J382250j035440o92460P47037j90639
11247H723405l388459m287058p62008J960180j611547p225934n531609L255266
11239h867764Q264908L977549k033333k098124N4164j872468m506882j136569
11231h218519N272776O006336O61209k898153j504675Q731j172971j451757J576476
11222a720547M510849M005002J663048K95331m03277j825364l267082l085605
11214A72355j221887P74728J319292L25785k76215J202551K927734J241122l215434
11205C250031n058902k193263M10078j250989l266699l59234M799534N504177
11197A834733J470979j511779p08393J319956K420778K572127Q28209l399523
$$ plain form
11256 5719599 2017926 1166294 4459339 8512657 9894907 8859467 8167007 8914044 8723405
11247 8723405 5334946 1047888 285880 2246060 634513 -6591421 -12123030 -8867764
11239 -8867764 -602856 3374693 1341360 -756764 -702600 -2575068 -7081950 -8218519
11231 -8218519 -2945743 3060593 3721802 823649 -681026 -672295 -1845266 -3297023 -1720547
11222 -1720547 2790302 6795304 8458352 8753683 8350406 6525042 3257960 172355
11214 172355 -1049532 -274804 1044488 1370273 1094058 2296609 5224343 6465465 3250031
11205 3250031 -1808871 -4002134 -3592056 -4843045 -8109744 -8468978 -3669444 1834733
11197 1834733 3305712 1793933 1085540 2405496 4826274 7398401 8226610 4827087
11189D827087o711315n160085o13526J862518J785852K402915L387039J363364
11181C143849k718210l865892j138961J149355R00751M82806R00533K75941q93653
11172a763481M96387L777327M219345P03875k417092k738170k897009m363945
11164d982763m348028j372538J763473L112956M248177N397312L532060j728955
11156E621694n518366m311722o66161J544901K297915K971277K923141J502046
11148F364725n0405j042877k204373k549362L03178M846883N511500M04121n035736
11139F547654m934038l721M562704M902058P22790m638477n622136k40099N248652
11130F545387K978425m883276q102158l134753K281077J968919j59583P79688
$$ plain form
11189 4827087 -1884228 -7044313 -7657839 -5795321 -4009469 -1606554 1780485 3143849
11181 3143849 425639 -3440253 -4579214 -3429859 -2529108 -2046302 -1145769 -869828 -1763481
11172 -1763481 -1267094 2510233 6729578 7433453 5016361 2278191 -618818 -4982763
11164 -4982763 -9330791 -10703329 -8939856 -5826900 -1578723 3818589 7350649 5621694
11156 5621694 103328 -4208394 -4874555 -3329654 -1031739 1939538 4862679 6364725
11148 6364725 6314320 5271443 3067070 517708 820886 5667769 11179269 11583390 6547654
11139 6547654 1613616 1609895 6172599 11074657 11797447 7158970 1536834 1296735 6545387
11130 6545387 9523812 4640536 -3461622 -6596375 -4315298 -2346379 -2505962 -1726274
11122a726274J566386k137363o594836n656091o51707K822631L846771M698639
11114c831844M301037P46132k606422j187669K661950K859112o99527k648624
11106d05855j348773n17486j747788j917629J018474M774039O135645L841303
11098I831930j615252p235324p701539r64741P118777Q499568K798635l124667
11090G607387m720841l673012k512488r81566J089825K032407J120285l65830
11082d03833j783503l533521m408094k335514J394922K444484n90463l673093
11074a2888615k484873K249700O026751N496410J281950k846136l396258p99931
11066g361002J015184j75720j878070j080754R25355J319512J063459K707542
$$ plain form
11122 -1726274 -159888 -2297251 -8892087 -14548178 -15199885 -12377254 -8530483 -3831844
11114 -3831844 469193 1215325 -1391097 -2578766 83184 2942296 2242769 -405855
11106 -405855 -1754628 -2272114 -4019902 -5937531 -4919057 -145018 5990627 9831930
11098 9831930 8216678 981354 -6720185 -7684926 -566149 7933419 10732054 7607387
11090 7607387 2886546 -786466 -3298954 -4280520 -3190695 -1158288 -38003 -403833
11082 -403833 -2187336 -5720857 -10128951 -12464465 -11069543 -8625059 -9215522 -12888615
11074 -12888615 -15373488 -13123788 -7097037 -1600627 -318677 -3164813 -6561071 -7361002
11066 -7361002 -6345818 -6521538 -8399608 -9480362 -8555007 -7235495 -6172036 -3464494
11058c464494M398227J960850l078573l939812J183602N398205L047312j805336
11050C699981j853239K115521K746158k075788n651013k722037K221263J634629
11042A15475l145747l244540M029096R653511N312830l936575o491216j008291
11034A284543K420498j650655o150825l561148K517919M353448K175907J311038
11026B700725J715643p44989m877103m892486k21268L291707K500545K26871j164792
11017a465147k468878k988471k85495L877151M315202J005432k89424J794065
11009C494435J391546l678027o565083k491009K644495K058011m41143K084973
11001a501802O160086K898937n960976q815111j760461N554123M934502P22730
$$ plain form
11058 -3464494 933733 2894583 -183990 -4123802 -2940200 2458005 5505317 3699981
11050 3699981 1846742 3962263 6708421 4632633 -1018380 -3740417 -1519154 115475
11042 115475 -3030272 -6274812 -2245716 7407795 12720625 8784050 2292834 1284543
11034 1284543 3705041 2054386 -4096439 -7657587 -5139668 -786220 1389687 2700725
11026 2700725 4416368 3671379 -1205724 -6098210 -6319478 -3027771 -527226 -300355 -1465147
11017 -1465147 -3934025 -6922496 -7207991 -3330840 984362 1989794 1700370 3494435
11009 3494435 4885981 1207954 -5357129 -7848138 -5203643 -3145632 -3586775 -1501802
11001 -1501802 4658284 7557221 1596245 -7218866 -8979327 -3425204 1509298 2232028
10993B232028L24465J831704r32185o123741n735538J572261P605708O050811
10985F825513N35744j727801k2559L06691l541608p832459p459951k395455K677069
10976a2634816M020379K335194O10317J81170P1593n97299j167860o45991P51205
10967g076108J791794J519133J85401q02692k30736J118670R61694r58497j249024
10958d740365K546146O694457M858041k414069o739977l145740K483235J822200
10950A363928l805507o058896k187038K262927L204024K959850L633631K649083
10942D022002j418336m464706k992899l6889j9564j515390m76936K313791K720522
10933a868405L55619j184546k16633J561684K679265K832263J330013j340898
$$ plain form
10993 2232028 2556493 4388197 3456012 -2667729 -8403267 -6831006 774702 6825513
10985 6825513 7361257 5633456 5610897 5917588 2375980 -5456479 -12916430 -15311885 -12634816
10976 -12634816 -8614437 -6279243 -5668926 -5487756 -5416163 -6013462 -7181322 -7827313 -7076108
10967 -7076108 -5284314 -3765181 -3579780 -4382472 -4613208 -3494538 -2532844 -3491341 -4740365
10958 -4740365 -2194219 4500238 9358279 6944210 204233 -2941507 -458272 1363928
10950 1363928 -2441579 -8500475 -10687513 -8424586 -5220562 -2260712 1372919 4022002
10942 4022002 2603666 -1861040 -4853939 -4890828 -4910392 -6425782 -6902718 -4588927 -1868405
10933 -1868405 -1512786 -2697332 -2913965 -1352281 1326984 4159247 5489260 4148362
10925D148362j884549J448977M545109K542697k232864l291035q385J837433l47595
10916F758150k543124j568854K60204J26690r80859j372277j465469j300159L78358
10907a707340K488339J549209k364179l960605K8376N562533O303686J282706
10899I182725m847389p062574l886218J805162M933273L185089k73820j389119
10891A647129r64848j894145k751194j80093L598321L036421j066414k137175
10883g11998R91174J951154k052080n585140m464970j531726M88610L306653O347488
10874a260835M875634k88170p90363N417008Q220310J081454p242890o391950
10866C620198o71984j63341l491947k670229R24228j42876l780774j062381O636019
$$ plain form
10925 4148362 2263813 3712790 8257899 10800596 8567732 5276697 5268312 7105745 6758150
10916 6758150 4215026 2646172 2906376 3033066 2052207 679930 -785539 -2085698 -1707340
10907 -1707340 780999 2330208 -33971 -3994576 -3966200 1596333 7900019 9182725
10899 9182725 4335336 -2727238 -6613456 -4808294 124979 3310068 3036248 1647129
10891 1647129 682281 -1211864 -3963058 -4143151 -544830 2491591 1425177 -711998
10883 -711998 279176 2230330 178250 -5406890 -9871860 -11403586 -10914976 -7608323 -1260835
10874 -1260835 3614799 3326629 2536266 7953274 16173584 17255038 10012148 3620198
10866 3620198 2948214 2784873 -707074 -3377303 -2453075 -2595951 -6376725 -7439106 -803087
10857h03087P861718j55905o439526l256929L539529N516419K941754J20060k056593
10848G267440l622227k437385J352621L087342J42203l676793l788418r57763
10840b632980J224578J539979J214146J375286K079359J999225p79242n280226
10832G40125o542965j819318L985674M067701o17930l150921r79307J710573J441257
10823a165111q53790l344292m683966k430938L819176Q473891N740092j214015
10815D341047l840712m32478K632093J514374j121061k847465l999208l089873
10807f843283J756850O141403L232702m472943o717639p78724M545881L019034
10799a16719q83297j648463q18569p74772L27313K325262O58902m486416n630066
$$ plain form
10857 -803087 7058631 6902726 463200 -2793729 745800 6262219 9203973 9324033 7267440
10848 7267440 3645213 1207828 2560449 5647791 5789994 2113201 -1675217 -2632980
10840 -2632980 -1408402 131577 1345723 2721009 4800368 6799593 6020351 740125
10832 740125 -5802840 -7622158 -3636484 431217 -186713 -3337634 -4316941 -2606368 -1165111
10823 -1165111 -2018901 -5363193 -10047159 -12478097 -8658921 -185030 5555062 4341047
10815 4341047 500335 67857 2699950 4214324 3093263 245798 -3753410 -6843283
10807 -6843283 -5086433 1054970 4287672 -185271 -6902910 -7681634 -3135753 -116719
10799 -116719 -1000016 -2648479 -3467048 -4241820 -3914507 -1589245 -930343 -5416759 -11046825
10790a1046825l34136L212697l74954m192830j175532L445536J762885k621833
10782a1324992j381733L537883L711214q27378k335391Q41224K452322N3656j611438
10773f884633J29099K006974J754008J486928K475547K854398K079245K112120
10765H013686K861535J496402k459426n801753o366122n091054k923171K56502
10757a0013401L164150L601693K089443J453097K299041K261916J31318k474578
10749B512679l843241l622774j614936J764679L973922K702837j28622k19530
10741A525014K789722M372955J600335k663347l876574j743746K05443l37063
10733A872739k009664k230219m48765J766887K975016K836702J031062k757654
$$ plain form
10790 -11046825 -11380961 -8168264 -8543218 -12736048 -13911580 -10466044 -8703159 -11324992
10782 -11324992 -12706725 -9168842 -5457628 -6285006 -8620397 -7779173 -5326851 -5273195 -6884633
10773 -6884633 -6755534 -4748560 -2994552 -1507624 967923 3822321 5901566 8013686
10765 8013686 10875221 12371623 9912197 4110444 -2255678 -7346732 -10269903 -10013401
10757 -10013401 -6849251 -3247558 -1158115 294982 2594023 4855939 4987257 2512679
10749 2512679 -1330562 -4953336 -6568272 -4803593 -829671 1873166 1744544 1525014
10741 1525014 4314736 8687691 10288026 7624679 3748105 2004359 2209802 1872739
10733 1872739 -136925 -2367144 -2815909 -1049022 1925994 4762696 5793758 3036104
10725C036104o745578p197186k999518J711655K514943O87174N10403K211312
10717f270691K566987J576628K339432M022765J926408l580310n349096k44903
10709c012780M978657L520063j518607k995224p96813q9661j699371j654090R25509
10700b342317K334401Q64065q74782j050987j132408j970490j562029J270590
10692d463957M049944L804515J170340q71909j352822k094529l952240m558463
10684h269121j689570K530606L998608K935520L412514N387373K988994n373658
10676E921266j1068330o161185M164887Q492478N270297K232156J736294j493490
10668I094373p276195p242099P97267P139008M717707o53335j325984J77051j773026
$$ plain form
10725 3036104 -3709474 -10906660 -13906178 -12194523 -9679580 -8992406 -8482003 -6270691
10717 -6270691 -3703704 -2127076 212356 4235121 6161529 2581219 -2767877 -3012780
10709 -3012780 1965877 5485940 3967333 972109 175296 85635 -1613736 -3267826 -2342317
10700 -2342317 -7916 856149 -18633 -1069620 -2202028 -4172518 -5734547 -4463957
10692 -4463957 -414013 3390502 4560842 3688933 2336111 241582 -3710658 -8269121
10684 -8269121 -9958691 -7428085 -3429477 -493957 2918557 8305930 11294924 5921266
10676 5921266 -5147064 -11308249 -7143362 1349116 6619413 8851569 10587863 9094373
10668 9094373 1818178 -5423921 -4626654 2512354 7230061 6576726 5250742 5427793 3654767
10659C654767m912110m163372j339054p56180m86488L061547O491520M589095
10651F139725L78641O13431L992711L378017j803050m692110k342563N96297M06191
10642F667290q90664p87709k36094n13402q69341p59995p51893m30856J329809
10633B757145L654680M160735K319919j24486j877873l042855l724379l531192
10625E91694k265304l34102R28175q1900k373281j637153L836655Q118692M343428
10616A1126904m292786p555198k677765K395874J982761j19659L68055J133007
10608B361193k3807N5599K824382L603968P166k892923j674923q47255l643172
10599b29772m869872l37955M606359M089137J674970K815568M619221K199344
$$ plain form
10659 3654767 -1257343 -5420715 -6759769 -7515949 -8002437 -4940890 1550630 6139725
10651 6139725 6518366 7131797 11124508 14502525 12699475 8007365 5664802 6261099 6667290
10642 6667290 5776626 4988917 4752823 4239421 3370080 2610085 1858192 1427336 2757145
10633 2757145 6411825 10572560 12892479 12767993 10890120 7847265 4122886 591694
10625 591694 -1673610 -2007712 -1079537 -1161437 -3534718 -5171871 -1335216 6783476 11126904
10616 11126904 6834118 -721080 -3398845 -1002971 979790 860131 1228186 2361193
10608 2361193 2337386 2392985 5217367 8821335 8828501 5935578 4260655 3413400 -229772
10599 -229772 -5099644 -5437599 -831240 3257897 4932867 7748435 12367656 14567000
10591A4567000j488934j430485m2251j844749m556724m205557k967851l397550
10583e367101j715379M154228P300898K474893l478426k404332J571715P29539
10575C266035j656972J613464O728938M900175j811159m330064j942978p63442
10567F003997r77386J395623L830170J105848l794586m566120l063815m046968
10559d113237l849500K724170R587874P305262q90588m570257k600123p10282
10551B883319J394721O041721P180547l52692p501994l425560N142968M474194
10543A5837224k728552l505090J669144J733006l086198l073720R98491M31801
10535H276106k405171J377845P334017M086665m040353l407189L407632K125528
$$ plain form
10591 14567000 13078066 11647581 11605330 9760581 5203857 998300 -1969551 -5367101
10583 -5367101 -7082480 -2928252 4372646 6847539 3369113 964781 2536496 3266035
10575 3266035 1609063 3222527 9951465 14851640 13040481 8710417 6767439 6003997
10567 6003997 5026611 6422234 10252404 11358252 7563666 2997546 -66269 -4113237
10559 -4113237 -7962737 -5238567 4349307 11654569 10763981 6193724 3593601 2883319
10551 2883319 4278040 10319761 17500308 17147616 9645622 6220062 11363030 15837224
10543 15837224 13108672 9603582 11272726 13005732 9919534 6845814 7844305 8276106
10535 8276106 5870935 7248780 14582797 18669462 14629109 11221920 14629552 16755080
10527A6755080o187840p181634k8522K745634J17037K011193O450551L263627
10519A7945126k635556J067978P512762J279197r676258n487545P437019O037665
10511B3480388o067770m921829P240775N669563p733744o276530R175495J0189687
10503C0756035l645844l175638J1561199R959140n533682k99747J9414301J0174601
10495F9210365j8574514p320152L7459011L5909186j4467477m969109Q8838728
10488A86086038J08619229n8208239k56512326k43506999l4358616J19452408
10482a78428505Q5319118p171879j0803782L4912411K8536591j2194711j1363384
10475g1194141K0422563K0295471p442180j0707178R898189J1469374o041700
$$ plain form
10527 16755080 10567240 3385606 3357084 6102718 6219755 8230948 14681499 17945126
10519 17945126 15309570 16377548 23890310 25169507 15493249 10005704 17442723 23480388
10511 23480388 17412618 12490789 19731564 25401127 17667383 11390853 20566348 30756035
10503 30756035 27110191 23934553 35495752 45454892 39921210 39621463 59035764 69210365
10495 69210365 50635851 43315699 80774710 116683896 102216419 97247310 186086038
10488 186086038 294705267 236497028 -20015298 -263522297 -297880913 -178428505
10482 -178428505 -93109387 -100281266 -111085048 -76172637 -47636046 -59830757 -71194141
10475 -71194141 -50771578 -30476107 -37918287 -48625465 -38727276 -27257902 -33299602
10468c3299602n860997J1411987J1380832p074019j1773001K317441Q804694J585066
10460b2507599L45162P431386N174584n599764o099488L134610L741485m065470
10452a8445094l090619N605458M739919m191766l042984P159046P081634m113150
10444h297556o733935K811086O244148j959649n691609J339738M879259j744678
10436i153196n921547o14763L723729Q02919n48678M063360M982656k282929p048189
10427a1996638k034932M483415L824963k58433j476090r24077r60348n76919q05955
10418a0725014l620732m129099L401572J1738827Q127828l953609p677263M06736
10410f430754N045246j741431q202758m153211K610742J579546l192034k595162
$$ plain form
10468 -33299602 -39160599 -27748612 -16367780 -23441799 -35214800 -32897359 -24092665 -22507599
10460 -22507599 -22162437 -14731051 -9556467 -15156231 -21255719 -18121109 -14379624 -18445094
10452 -18445094 -21535713 -15930255 -11190336 -15382102 -18425086 -11266040 -4184406 -8297556
10444 -8297556 -15031491 -12220405 -5976257 -7935906 -13627515 -12287777 -7408518 -9153196
10436 -9153196 -15074743 -15689506 -11965777 -11162858 -11711536 -7648176 -2665520 -4948449 -11996638
10427 -11996638 -14031570 -9548155 -5723192 -5981625 -7457715 -8381792 -9342140 -9919059 -10725014
10418 -10725014 -14345746 -18474845 -15073273 -3334446 4793382 839773 -6837490 -6430754
10410 -6430754 -1385508 -3126939 -11329697 -15482908 -12872166 -11292620 -14484654 -17079816
10402a7079816J897380L346649J806342J668917K670438J771284n35019j756792
10394f210617j365405K61343K532808K826360n29721l383819r36696K944047O35431
10385c226269n615249n963522O40966M616787K230079P46557L401652K890054
10377b78945l984955q134277k954464M032013L780994J79334J367553M719785
10369a272962K260161m206522n304136O16342M875430J619723m630352o553030
10361a2595346l420701q7651M36665L50104K734031N702071M047257k275604n733910
10352a0843084j320489N084153M817472m99195k369693K69231L47574l752454
10344h266485n011525o86628K389636p57j949856J600922N191470K072434l779478
$$ plain form
10402 -17079816 -15182436 -11835787 -10029445 -8360528 -5690090 -3918806 -4453825 -6210617
10394 -6210617 -7576022 -7314679 -4781871 -1955511 -2485232 -5869051 -6805747 -3861700 -3226269
10385 -3226269 -8841518 -14805040 -14164074 -9547287 -7317208 -6570651 -3168999 -278945
10377 -278945 -4263900 -12398177 -15352641 -11320628 -7539634 -7360300 -5992747 -1272962
10369 -1272962 987199 -3219323 -8523459 -7907117 -3031687 -1411964 -6042316 -12595346
10361 -12595346 -16016047 -16103698 -15667033 -15316929 -12582898 -6880827 -2833570 -5109174 -10843084
10352 -10843084 -12163573 -7079420 -2261948 -2761143 -5130836 -4861605 -4514031 -8266485
10344 -8266485 -13278010 -13964638 -11575002 -11575759 -13525615 -11924693 -6733223 -4660789 -8440267
10335h440267l711498K057796N610443L524253n1690j511353j867886k299840
10327f690042j580522L82838Q38730j525615l315565m50222N341117P281340K371882
10318B653941l265345j972107L743593L577658m879299j0602601m660063N814701
10310i589522P739028J101432k745495O77560M044612J945703j634820k322445
10302g83947k051478k758953j735568K129559M426353K108408j519617k581795
10294b767038j858433q39946J583020M743944M234875j422388o968158p177322
10286a0471446l152073J203921M239009N135951K631291j504322k675253l07642
10278d900564O91643j696669k819717K62491L033856J291922j273226M80815L988729
$$ plain form
10335 -8440267 -12151765 -10093969 -4483526 -959273 -1010963 -2522316 -4390202 -6690042
10327 -6690042 -8270564 -7887726 -7048996 -8574611 -11890176 -12340398 -6999281 282059 2653941
10318 2653941 -611404 -2583511 1160082 4737740 -141559 -10744160 -15404223 -9589522
10310 -9589522 -1850494 -749062 -3494557 -2816997 1227615 3173318 1538498 -783947
10302 -783947 -2835425 -5594378 -7329946 -5200387 -774034 1334374 -185243 -2767038
10294 -2767038 -4625471 -5465417 -3882397 861547 5096422 3674034 -3294124 -10471446
10286 -10471446 -13623519 -12419598 -8180589 -3044638 -413347 -1917669 -4592922 -4900564
10278 -4900564 -4208921 -5905590 -8725307 -8462816 -5428960 -4137038 -5410264 -4929449 -940720
10269i40720L222862j239902l392346j290721R54835K77030j390980q66394J813698
10260b852638L391989Q00655m797147p524860l017906M708176O682911N01788
10252b107032o009556m812666K744379Q830107Q018881J045425o802275r120156
10244h212893l804719L464141M942415P25116j928610M06016L425156L386261
10236B402883J831785j43456m105855p500001l763999N693442Q989078N16617
10228C920494q453393n212637N526548R066979K007350n508383o307127l632238
10220h592407k174019j549278k90266J186796K977582N159204M801484m01030
10212A118066n866632m362479L012371O940400K504850m500634o185505k252472
$$ plain form
10269 -940720 2282142 1042240 -2350106 -3640827 -2685992 -2408962 -3799942 -4666336 -2852638
10260 -2852638 539351 1340006 -3457141 -10982001 -13999907 -9291731 -2608820 -2107032
10252 -2107032 -8116588 -12929254 -10184875 -1354768 6664113 7709538 907263 -8212893
10244 -8212893 -12017612 -8553471 -3611056 -2885940 -4814550 -4408534 -983378 2402883
10236 2402883 4234668 4091212 -14643 -7514644 -11278643 -5585201 3403877 3920494
10228 3920494 -4532899 -9745536 -4218988 4847991 6855341 1346958 -4960169 -8592407
10220 -8592407 -10766426 -12315704 -12605970 -11419174 -8441592 -3282388 1519096 1118066
10212 1118066 -4748566 -9111045 -6098674 841726 3346576 -1154058 -7339563 -9592035
10204i592035J877758K854866K119278K478516M026363L602552j126957o965317
10196g24976p311433p34090N929240O137318K013339J03366J794307K901674P41957
10187A0850702l217933o271667o007265j102421N422344O796210J031210m701645
10179B799535l759236Q4058m58838l650624k493233J870087J693760k980262l364783
10170a0259536K604387N542289k2124o130918m103050J861152K188057l016831
10162a1336574n401334j593974L266252M208664J987520j80813n37892R06159
10154h681992K524511J763523j470294l099164J72601N140057N264145l88070
10146A225317n276564l781854J648810M079823J045537k904824k589046J338646
$$ plain form
10204 -9592035 -7714277 -4859411 -2740133 -261617 3764746 7367298 6240341 -724976
10196 -724976 -8036409 -8770499 -2841259 3296059 5309398 5412764 7207071 10108745 10850702
10187 10850702 7632769 1361102 -4646163 -5748584 -326240 6469970 7501180 2799535
10179 2799535 -959701 -875643 -1334481 -4985105 -7478338 -5608251 -3914491 -6894753 -10259536
10170 -10259536 -7655149 -2112860 -2134984 -8265902 -12368952 -10507800 -8319743 -11336574
10162 -11336574 -16737908 -18331882 -15065630 -10856966 -8869446 -9050259 -9588151 -8681992
10154 -8681992 -6157481 -4393958 -5864252 -8963416 -8790815 -3650758 1613387 1225317
10146 1225317 -4051247 -7833101 -6184291 -2104468 -1058931 -3963755 -6552801 -5214155
10138e214155L799543J918776j889132l454078j524183J723713L256279J571559
10130A88322j983334l818085j881885R44100L9615l899304n026870j135962K590953
10121a3982450J815417n0863J775418M710281L282428q15350j143881K405928
10113b003072L298614o25598m014670l519709k547782l523234k780586K286824
10105a3429213P037675O061263J573818k42295J528340K331306k28204l305565
10097A327125l406657p94959J359870P43495j541325k134883K33703K446940J077846
10088f88845k236013k871273k57019J384709j96013k263639k085599n35116R48447
10079h800361K615590L614203J420054l350280n784525l253889P75373K395228
$$ plain form
10138 -5214155 -1414612 504164 -1384968 -4839046 -6363229 -4639516 -1383237 188322
10130 188322 -1795012 -5613097 -7494982 -6550882 -6511267 -10410571 -15437441 -16573403 -13982450
10121 -13982450 -12167033 -12217896 -10442478 -5732197 -2449769 -3265119 -4409000 -2003072
10113 -2003072 1295542 669944 -3344726 -6864435 -9412217 -12935451 -15716037 -13429213
10105 -13429213 -6391538 -330275 1243543 1001248 2529588 4860894 4632690 1327125
10097 1327125 -2079532 -2874491 -1514621 -771126 -2312451 -4447334 -4213631 -1766691 -688845
10088 -688845 -2924858 -5796131 -6053150 -4668441 -4864454 -7128093 -9213692 -9748808 -8800361
10079 -8800361 -6184771 -2570568 -1150514 -4500794 -10285319 -13539208 -12763835 -10368607
10071a0368607K583299L595685M288997L054579J607837J558927P46735k505484
10063D561968m973316l370746l77789l49114j894316p98256K032153K210317r8116
10054c057215q18873O7583j375733m595686l922056J626145N247927K571166j537386
10045e794128j137575J293236k37580m487829m411971J509318O250409M235904
10037b780216j052514k881371j070283j176046m883370o454384j029080P119125
10029a4208139Q949875K446621m353408l434142L527959Q060600N266188j595325
10021D660229n916419m563849L5033K992634K014879k79580M8483K569550L010546
10012D571506J33713j764627K79392K467349K2491m619279n094125j040442J569633
$$ plain form
10071 -10368607 -7785308 -4189623 99374 3153953 4761790 6320717 7067452 4561968
10063 4561968 -411348 -3782094 -4159883 -4508997 -6403313 -7201569 -5169416 -2959099 -3057215
10054 -3057215 -3876088 -3808505 -5184238 -9779924 -13701980 -12075835 -6827908 -4256742 -5794128
10045 -5794128 -6931703 -5638467 -5876047 -10363876 -14775847 -13266529 -7016120 -2780216
10037 -2780216 -3832730 -6714101 -7784384 -8960430 -13843800 -20298184 -21327264 -14208139
10029 -14208139 -5258264 -2811643 -7165051 -10599193 -7071234 989366 6255554 4660229
10021 4660229 -1256190 -5820039 -5785006 -2792372 -777493 -1057073 -1008590 1560960 4571506
10012 4571506 4705219 2940592 3219984 5687333 5709824 1090545 -4003580 -5044022 -3474389
10003c474389K3207j674419m80378P75637o47290j884196N08976L938139L632902
9994G18189Q78854J483233O184887Q172123K306426o972450j0303495m570183
9986b102416L575109N623385N60638n011476n114864p44965K590810J947601m06944
9977I16878r76047N89378K013461J781337M87268o55103j178709j024395j7885
9968A936183J411285J600669p82802m235823n111309k129948J260116J240820
9960d810809q87355r42830J009347O00808k684483l067231K133117O045224J539481
9951a064731o587424o936379J791048Q226483M665467k223599k074622M060100
9943a43657O485335J643754l636461k997192Q34382J234705k496074m718545j899185
$$ plain form
10003 -3474389 -3451182 -5125601 -5605979 -4830342 -5477632 -7361828 -6852852 -2914713 718189
9994 718189 1597043 3080276 9265163 17437286 19743712 12771262 2467767 -2102416
9986 -2102416 1472693 7096078 7656716 2645240 -2469624 -3214589 -623779 1323822 916878
9977 916878 -59169 530209 2543670 4325007 4812275 4157172 2978463 1954068 1936183
9968 1936183 3347468 4948137 4165335 -70488 -5181797 -7311745 -6051629 -4810809
9960 -4810809 -5698164 -6640994 -5631647 -5030839 -7715322 -10782553 -8649436 -2604212 -1064731
9951 -1064731 -7652155 -14588534 -12797486 -4571003 94464 -2129135 -4203757 -143657
9943 -143657 6341678 7985432 4348971 1351779 2186161 3420866 924792 -3793753 -5692938
9934e692938K404716K676736p36641k267032N37003L279329J561433j976489j793291
9925b007174J534517K135759j579217m313315k469731N07095N63890l38113J418475
9916d547814M104864L539014O09533O7953K525521L232871k77811m021088l231222
9907B001821Q62067K657766o29093n684100p196950l858738Q94893L693189M637296
9898b621849M760478K769080k194785o230238m228470K168162N573051L049357
9890C044786l11241j18263J056391l60453k578541k667343j897036j924181r39988
9881f695869J223013M82920k699295Q5458J0268127J2452555n748294k9324801
9873a9956186k9928219m707037J7964276J6789967L166223j325312L923977N240620
$$ plain form
9934 -5692938 -3288222 -611486 -1348127 -3615159 -3078156 201173 1762606 -213883 -2007174
9925 -2007174 -472657 1663102 83885 -4229430 -6699161 -6192066 -5628176 -5966289 -4547814
9916 -4547814 -442950 3096064 3705597 3773550 6299071 9531942 9254131 5233043 2001821
9907 2001821 2863888 5521654 4892561 -791539 -7988489 -11847227 -10952334 -7259145 -2621849
9898 -2621849 2138629 4907709 2712924 -3517314 -7745784 -5577622 -4571 3044786
9890 3044786 2733545 2615282 3671673 3311220 732679 -1934664 -3831700 -5755881 -6695869
9881 -6695869 -5472856 -4989936 -7689231 -7603773 2664354 15116909 9368615 -19956186
9873 -19956186 -49884405 -54591442 -36627166 -19837199 -16670976 -17996288 -14072311 -8831691
9865h831691L32216j351587J719519J182848m154538n049720J835448P465267
9857f852238M721155j420514l320237j742544j437221k087006j84721L853280
9849h470046O130059M980062K206791k16863j827317k828026l370616l139913
9841f535869j211817K420723N291100M519426O04913k961507l985095l321561
9833e179687k448361j691876r40106K2721J624494L009042J703349k458076m831148
9824a1189648j424036M488695O087212K548970o20539n24809J66948p4375J084759
9815E43177L582360K768418k806634p346809n978038j718209M47725J248144L170947
9806f088919L757670J27129l356743k83250O546452P634895Q88066n014649l409054
$$ plain form
9865 -8831691 -8499475 -9851062 -8131543 -6948695 -11103233 -16152953 -14317505 -6852238
9857 -6852238 -2131083 -3551597 -6871834 -8614378 -10051599 -12138605 -12323326 -8470046
9849 -8470046 -2339987 2640075 4846866 4630003 2802686 -25340 -3395956 -6535869
9841 -6535869 -7747686 -5326963 -35863 4483563 5088476 2126969 -1858126 -5179687
9833 -5179687 -7628048 -9319924 -10260030 -10237309 -8612815 -5603773 -3900424 -6358500 -11189648
9824 -11189648 -12613684 -8124989 -2037777 511193 -109346 -634155 -467207 -541582 543177
9815 543177 4125537 6893955 4087321 -3259488 -9237526 -10955735 -10508010 -9259866 -6088919
9806 -6088919 -2331249 -2204120 -5560863 -5844113 702339 8337234 9225300 4210651 801597
9797H01597J659729L154686J109445q8546J39188r32346l056691l012965l95809
9788f21712J388443N23638o47038K64186J956608J648643q23400k959822k791098
9779b061552p51714J246959J758073J011214M24800M85936m34345l589321o410150
9770h320100m492592J665231N273317J833515l630844k845065L682729P182514
9762C48705L645330p60387k78307J355616j798730o797482n806325J325105O431035
9753b335440M642832m38436l710237m027848j581951L417952P283774M576650
9745G827296l496763q187610m376805K642807N407822L812260J626683r99594
9737D256096n125928p366995m030831J589634L151089P85626k43494J023265P51876
$$ plain form
9797 801597 2461326 5616012 6725457 6636911 6776099 5843753 2787062 -225903 -621712
9788 -621712 766731 1290369 643331 907517 2864125 4512768 3689368 729546 -2061552
9779 -2061552 -2813266 -1566307 191766 1202980 1627780 2113716 1679371 -1909950 -8320100
9770 -8320100 -12812692 -11147461 -5874144 -4040629 -7671473 -10516538 -6833809 348705
9762 348705 3994035 3233648 2955341 4310957 2512227 -4285255 -10091580 -8766475 -2335440
9753 -2335440 2307392 1868956 -1841281 -5869129 -7451080 -4033128 3250646 7827296
9745 7827296 4330533 -3857077 -8233882 -5591075 -183253 3629007 5255690 4256096
9737 4256096 -869832 -8236827 -12267658 -10678024 -7526935 -6741309 -6984803 -5961538 -5209662
9728e209662j235353o67719K582778L224249K7217j392880J339779K428002j885323
9719g88912n586336k353405L318512K967859k110141l525775P1729J762344o85801
9710f929926j088233L208599N416302N56365n449839m716348P76104L726808L023575
9701a476593K591178K405389m06146l598928k290499J299955K14556m620640m387946
9692a0269674K712947P146557L106215k406633k096826j76418k824916n526792
9684a0335540j178868N597524M979573j175757k367792K352721L168130k671345
9676a631354n727201q27413M119621J803790k876830k297584J682377L004439
9668b750155J867488J901186K408184R41031q82941q44003j082389l434932m477676
$$ plain form
9728 -5209662 -6445015 -7112734 -4529956 -1305707 -1278490 -2671370 -1331591 1096411 -788912
9719 -788912 -6375248 -8728653 -5410141 -2442282 -4552423 -8078198 -8006469 -6244125 -6929926
9710 -6929926 -8018159 -4809560 606742 1163107 -4286732 -9003080 -8226976 -4500168 -1476593
9701 -1476593 1114585 3519974 3113828 -485100 -2775599 -1475644 -1261088 -5881728 -10269674
9692 -10269674 -7556727 -410170 2696045 289412 -1807414 -1983832 -4808748 -10335540
9684 -10335540 -11514408 -5916884 -937311 -2113068 -4480860 -2128139 1039991 -1631354
9676 -1631354 -7358555 -8185968 -4066347 -2262557 -5139387 -7436971 -5754594 -2750155
9668 -2750155 -882667 1018519 3426703 4367734 3484793 2640790 1558401 -1876531 -6354207
9659f354207j510152J489132O29064m96959K154129M194926L00480m373426j520757
9650e487770M849414L102135o444134j0030129j352903Q371596O987133j832732
9642a837390n814165j175236N271123P042268M118260M4083j902408m67824K319125
9633G597836K514871j064159m928058n143863j709566K375119M273444K730900
9625F646524j127585l651828k102691J180449J324389j800934k948036N67743
9617a911969M717634M838889J796663q24844k075691k841766k752139j529476
9609e82699j050460k424734k980120N6093M326070M845180J197566j767964r82998
9600F35934O85556q45544m435470m858460l4783N458836N574918J86672m857830
$$ plain form
9659 -6354207 -7864359 -6375227 -5746163 -6243122 -4088993 105933 406413 -3967013 -5487770
9650 -5487770 -638356 2463779 -3980355 -14010484 -15363387 -6991791 -4658 -1837390
9642 -1837390 -7651555 -8826791 -3555668 3486600 7604860 7648943 5746535 5278711 7597836
9633 7597836 10112707 9048548 4120490 -1023373 -2732939 -357820 3915624 6646524
9625 6646524 5518939 1867111 -235580 944869 2269258 468324 -2479712 -1911969
9617 -1911969 2805665 7644554 9441217 8616373 6540682 3698916 946777 -582699
9609 -582699 -1633159 -4057893 -7038013 -6981920 -2655850 2189330 3386896 1618932 635934
9600 635934 1321490 475946 -3959524 -8817984 -8852767 -3393931 2180987 2367659 -2490171
9591b490171m746803k90030M710484P429505O191720O54934n433775n668085N97866
9582I55645M946843O44410o613328o189702J337145M888574J42801m204413j011903
9573e103928M105098K674195l033689m557579n91457K789271K696746K030192
9565A008849K230216R05202k382429m040809j982023J209030K375928J645902
9557I69866O96819n7750j107478k476377l524786l054870j65730L528150M103986
9548a088170M27132k665229k36426M848109N069362n36695m304178j307157K982364
9539C189112R72110n356915p259699j982455L817306M025158N71764j419076j076216
9530d518911m99397L63950K568206L879850J179152l235473l429916J033604L466214
$$ plain form
9591 -2490171 -7236974 -7527004 -2816520 4612985 10804705 11459639 6025864 357779 955645
9582 955645 5902488 6546898 -66430 -6256132 -4918987 -30413 112388 -4092025 -5103928
9573 -5103928 -998830 1675365 -1358324 -5915903 -6507360 -3718089 -1021343 1008849
9565 1008849 3239065 4144267 1761838 -2278971 -4260994 -3051964 -676036 969866
9557 969866 1666685 1608935 501457 -1974920 -5499706 -8554576 -8720306 -5192156 -1088170
9548 -1088170 -661038 -3326267 -3562693 1285416 6354778 5818083 1513905 206748 3189112
9539 3189112 4161222 -1195693 -8455392 -10437847 -6620541 -2595383 -2023619 -3442695 -4518911
9530 -4518911 -5018308 -4654358 -2086152 1793698 2972850 -262623 -3692539 -2658935 807279
9521H07279J15542l729426k104241K001230J726949k081453k144410L005802O043957
9512C641229K151864l648798m380280r64914Q74492l3473J28423K591917L553458
9503C913918K97343m102944m385624K71608N113845N118930L97970m262959m914316
9494b552229k335685J51917J230033K005032K819579K454159P73394m62950l55972
9485C727278k37879j202975k279756k315982j788657j247628K15656K901217M258596
9476B029870J423992m013979o313984k137159M489574O033067N42456n496850
9468c443013n160366K26262L823801L270785K597512L675809K371733l288602
9460D073921p208916l500183L575533N075948L09194l197039j571517J213165
$$ plain form
9521 807279 922821 -2806605 -4910846 -2909616 -1182667 -3264120 -5408530 -2402728 3641229
9512 3641229 5793093 2144295 -2235985 -3200899 -2326407 -2359880 -2231457 360460 3913918
9503 3913918 4211261 108317 -4277307 -4005699 1108146 6227076 6625046 2362087 -2552229
9494 -2552229 -4887914 -4735997 -3505964 -1500932 1318647 3772806 4546200 4083250 3727278
9485 3727278 3489399 2286424 6668 -2309314 -4097971 -5345599 -5129943 -2228726 2029870
9476 2029870 3453862 -560117 -6874101 -9011260 -4521686 1511381 2053837 -3443013
9468 -3443013 -8603379 -8377117 -4553316 -1282531 1314981 4990790 7362523 4073921
9460 4073921 -3134995 -6635178 -3059645 2016303 2325497 -871542 -2443059 -1229894
9452a229894J426292N62990N32836J14694j523465k823100l169387l628194l286636
9443a3023864K6995M388279M910695J662261K99153K784632L970552M26138l671995
9434A772846l463021o23560P87147Q89713J724454K382250R57645j582971l119917
9425b75414l250585j892447J534408N177093N003645N16516l776032m678488l578755
9416e220059j791967J488561M390592K437662l153591m410231J710333P606735
9408C058035O118356L00337l545905n259606o486695m339101K348084O823110
9400i83385L489448k203180k002092K109495K677660j95184r94808k1126j497006
9391C79822l448809q08888L392219J520041m912917o556815j387729K795309K038783
$$ plain form
9452 -1229894 196398 759388 1292224 1406918 -116547 -2939647 -6109034 -9737228 -13023864
9443 -13023864 -12996869 -8608590 -3697895 -2035634 -1736481 1048151 5018703 5444841 1772846
9434 1772846 -1690175 -2313735 -1526588 -636875 1087579 3469829 4427474 2844503 -275414
9425 -275414 -3525999 -5418446 -3884038 1293055 6296700 6813216 3037184 -1641304 -5220059
9416 -5220059 -7012026 -5523465 -1132873 1304789 -1848802 -6259033 -4548700 3058035
9408 3058035 9176391 9476728 5930823 671217 -5815478 -10154579 -7806495 -983385
9400 -983385 2506063 302883 -1699209 410286 3087946 2892762 1897954 1876828 379822
9391 379822 -3068987 -3877875 -485656 1034385 -3878532 -10435347 -11823076 -9027767 -6988984
9382f988984J211611L187933L729042N49478j852899k96451J953102J526746l48857
9373B670721j865159k842576j708786K608606N267829M18162p712752q230429
9365a1394384J53154O412735L679768j939119l108278j540698j068021l2832K834260
9356f003415L314077o62226l603044j236206K279545K228179J194776K353482
9348a34832K321343j649529m425850j468855J912256q71730n553099l674953L029681
9339a0515568N706051K875376R80107K004729J427747j449831j584992J814521
9331A258140K843572q32508l599962j320205K077647J620668j079246j872423
9323i04317j040014j267000j930073l93348K631980L390812M71589l289289m560704
$$ plain form
9382 -6988984 -5777373 -2589440 1139602 1689080 -163819 -460270 1492832 3019578 2670721
9373 2670721 805562 -2037014 -3745800 -1137194 4130635 4548797 -3163955 -11394384
9365 -11394384 -11241230 -4828495 -1148727 -3087846 -6196124 -7736822 -8804843 -8837675 -6003415
9356 -6003415 -2689338 -3351564 -6954608 -8190814 -5911269 -3683090 -2488314 -134832
9348 -134832 2186511 536982 -3888868 -5357723 -3445467 -4317197 -9870296 -13545249 -10515568
9339 -10515568 -4809517 -1934141 -954034 1050695 2478442 1028611 -556381 1258140
9331 1258140 4101712 3269204 -330758 -1650963 426684 2047352 968106 -904317
9323 -904317 -1944331 -3211331 -5141404 -5534752 -2902772 488040 959629 -2329660 -6890364
9314f890364k919501n4423K576370M255081M314617K491944o8906j515626j481363
9305G07829j362381j783578j517243k15025k6433k063453l369366r30052K977271
9296g582431L750945J478644r8559o28541k842473n311202l024298L188400N708531
9287e360984J830031j486705P13079K913908p93946n351883k619421M446204N967564
9278B57847R53942j864088J140971L408038K62461l461873k446053J72474r42796
9269b519077l539865j442266M568002O709987J477984m847752m649089P47123
9261c494953L267258o26319n355261m414368O72983L326089J604284k27066L83601
9252d863752M93468k187261m429612k391472K224171M862070M312223K418931
$$ plain form
9314 -6890364 -9809865 -9864288 -7287918 -3032837 1281780 3773724 3704818 2189192 707829
9305 707829 -654552 -2438130 -3955373 -4170398 -4196831 -6260284 -9629650 -10559702 -7582431
9296 -7582431 -3831486 -2352842 -2451401 -3079942 -5922415 -11233617 -14257915 -11069515 -5360984
9287 -5360984 -3530953 -5017658 -4304579 -1390671 -2184617 -7536500 -10155921 -5709717 257847
9278 257847 1211789 -652299 488672 3896710 4159171 697298 -1748755 -1576281 -2519077
9269 -2519077 -6058942 -7501208 -2933206 3776781 5254765 407013 -4242076 -3494953
9261 -3494953 -227695 -854014 -6209275 -10623643 -9950660 -6624571 -5020287 -5247353 -4863752
9252 -4863752 -4370284 -6557545 -10987157 -13378629 -11154458 -6292388 -1980165 438766
9244D38766K776k790208l938339j729332J579046K337842R20869O03767J760084
9235h14729J539337o18554j537035N02307K736609J851548j571853m252990m210072
9226f375432k171055m7268R25183R55384J061180J589946J809194J335599J054762
9217A37493J716464K412455J568372r80157l696619m746073l326931k69646K431776
9208d752866L306081K460250M35282k595295m961990l195216K859179O679029
9200B34454K310250n837185p288643m64551M520113J207415l220431L72994Q070132
9191i5452Q512899J28789o783517n125474K99900J619611j086117j925275J146071
9182c308565L565284R97606m178972n409015n66566M711839M309152p8927j874539
$$ plain form
9244 438766 441542 -2348666 -6287005 -8016337 -6437291 -4099449 -3178580 -2574813 -814729
9235 -814729 724608 106054 -1430981 -928674 1807935 3659483 2087630 -2165360 -6375432
9226 -6375432 -8546487 -8593755 -7668572 -6713188 -5652008 -4062062 -2252868 -917269 137493
9217 137493 1853957 4266412 5834784 4854627 1158008 -3588065 -6914996 -7184642 -4752866
9208 -4752866 -1446785 1013465 1448747 -1146548 -6108538 -9303754 -6444575 234454
9200 234454 2544704 -3292481 -10581124 -11045675 -6525562 -5318147 -8538578 -8165584 -95452
9191 -95452 8417447 8546236 1762719 -3362755 -3062855 -1443244 -2529361 -4454636 -3308565
9182 -3308565 256719 1254325 -2924647 -8333662 -8900228 -4188389 120763 41836 -1832703
9173a832703N04896K135654J27950k422238k666483k076533j677007O07353M297949
9164c001162M293234q75942m561349j327980M419723N164354R66261k814608m044140
9155a781609l470406j90278N299922P405493K504414l607978l232285J423766
9147D351039K324714j420673l910034l607158m140672m896609j262865N032460
9139g529798N933983l75903n874215m545889L9226K122857J685371J558265K440323
9130d545780L854248N367314N018435J179692l167776l206466K88993K011064
9122F799724O06255m31268k95292j696191l586712j395173L889620N352367J306306
9113A0549636j592810M65444K462286k06914m278610n085364l602904k425226
$$ plain form
9173 -1832703 -1327807 807847 935797 -1486441 -4152924 -6229457 -7906464 -7299111 -3001162
9164 -3001162 1292072 416130 -4145219 -5473199 -1053476 4110878 5077139 2262531 -1781609
9155 -1781609 -5252015 -5442293 -142371 7263122 9767536 6159558 2927273 4351039
9147 4351039 6675753 5255080 1345046 -2262112 -6402784 -11299393 -12562258 -7529798
9139 -7529798 -1595815 -1971718 -7845933 -12391822 -12352596 -10229739 -8544368 -6986103 -4545780
9130 -4545780 -691532 4675782 9694217 10873909 7706133 4499667 4788660 6799724
9122 6799724 7405979 6974711 6679419 4983228 1396516 1343 3890963 9243330 10549636
9113 10549636 8956826 9422270 11884556 11677642 7399032 2313668 -1289236 -3714462
9105c714462j027350O58297J64601j984490j129624L219782M964397J601456p97598
9096A955009J905409M196246L38441n478891n894321j455994K397658M124701
9088B088258M613574K196682l230296n962836k206177K510559J580540j772646
9080a82342o75548K818389J599910l183805l791459L64439J737233j927493l679018
9071f919694O57364N651743N082021N01735k708808k422640J30565K808446K856399
9062E637131j069787n596855n487458q54591K904598L091268K408783K584340
9054C617429J262319k232217l662330k03477M362130M907457K119474K16602K401
9045A0389788j269158m108897n127516j924995L011461M805222J844443k103421
$$ plain form
9105 -3714462 -4741812 -4083515 -3918914 -5903404 -7033028 -3813246 1151151 2752607 1955009
9096 1955009 3860418 8056664 8395105 2916214 -2978107 -4434101 -2036443 2088258
9088 2088258 6701832 8898514 5668218 -294618 -2500795 9764 1590304 -182342
9080 -182342 -857890 1960499 3560409 376604 -3414855 -3050416 -1313183 -3240676 -6919694
9071 -6919694 -6262330 -610587 4471434 4973169 2264361 -158279 -27714 2780732 5637131
9062 5637131 4567344 -1029511 -6516969 -7371560 -4466962 -1375694 1033089 3617429
9054 3617429 4879748 2647531 -1014799 -1218276 3143854 8051311 10170785 10387387 10389788
9045 10389788 9120630 5011733 -115783 -2040778 970683 5775905 7620348 5516927
9037E516927j990612K354172N342526K044959n417514r811116o951325J4294M838142
9028d059547M863439K443186Q40870M01966o20721k313228k157915R66137L673197
9019D037384J957032k467280l588132M74402M562248L784993k04052k864610l055195
9010B636790k333550j146694N01481J143108K75878J84907J751630J568825k344704
9001B237671n375508k761502J618756K76739n389356n964981J661966Q955596
8993d740619P840215J365212k243553j014814O39707k1349j368877j601868j168394
8984b314340q23525k77384P12326J713090K352025K522799J946100N27653r50216
8975E408528j371229o06157K50978J20961q45390j510358j183195m18258p7772
$$ plain form
9037 5516927 3526315 5880487 11223013 13267972 7850458 -1960658 -8911983 -8897689 -4059547
9028 -4059547 803892 3247078 4087948 4489914 3869193 1555965 -601950 364187 4037384
9019 4037384 5994416 3527136 -60996 413406 4975654 8760647 8556595 5691985 2636790
9010 2636790 303240 -843454 -341973 801135 1077013 1261920 3013550 4582375 2237671
9001 2237671 -3137837 -5899339 -4280583 -4003844 -9393200 -15358181 -13696215 -4740619
8993 -4740619 3099596 4464808 2221255 1206441 1846148 1824799 455922 -1145946 -2314340
8984 -2314340 -3137865 -3415249 -2702923 -989833 1362192 3884991 5831091 6358744 5408528
8975 5408528 4037299 3431142 3682120 3803081 2957691 1447333 264138 -154120 -231892
8966b31892j99476n44868j427482k563452k076358R65860L759187K817440m64631
8957C4328j536326k66522j224739m663361l967212L474061R277680N048463m331975
8948A844397p152283k023836J283454j864476m221756L76114O388585N308157
8940f1644j040324l560847N05494M336123K034097l448560n148463j361798K977982
8931d767940L037506n57864l655612l833217j972737K99391K216881L011124K190393
8922d032075J264373K373229M362356L549282k65260k503847p56218J267592l1958
8913E227474k329626k038214m83722j95912P12149L969572M961262o67386p063881
8904B091716m528872N010830R172646L061722m112060l719695M47692M83286l198169
$$ plain form
8966 -231892 -431368 -976236 -2403718 -4967170 -7043528 -6077668 -2318481 498959 34328
8957 34328 -1501998 -1768520 -2993259 -7656620 -11623832 -8149771 1127909 6176372 1844397
8948 1844397 -5307886 -7331722 -6048268 -7912744 -12134500 -11758386 -5369801 -61644
8940 -61644 -1101968 -4662815 -4157321 178802 2212899 -1235661 -6384124 -7745922 -4767940
8931 -4767940 -1730434 -2288298 -5943910 -9777127 -11749864 -11450473 -9233592 -6222468 -4032075
8922 -4032075 -2767702 -394473 3967883 7517165 7251905 4748058 3991840 5259432 5227474
8913 5227474 2897848 859634 375912 180000 892149 4861721 9822983 9155597 2091716
8904 2091716 -2437156 2573674 11746320 14808042 10695982 6976287 7423979 7907265 4709096
8895D709096m553220j969776Q75751J298317k10702j947504j873869R86237L950178
8886A264508L026936n36528j088417J974364K065380l596714p878791m377940
8878i147202K181488L513685M99641j24306K076125J839649j020946j218903J610772
8869B10003J502583k997265n133371o37753M951641M396750r57978m066213k054135
8860d785738J532299K673273J178082m93307k34334J769190L057628J567082j385977
8851D878198k429216r09148m7079k139252m874298m402473n83102K900907L002713
8842d602750L32816j957031j357649J592343L659409K333182j025057k725405
8834c750142j570309q2140q9118L10893L074472N578351L381437k703687o222429
$$ plain form
8895 4709096 155876 -1813900 -938149 360168 149466 -1798038 -3671907 -2685670 1264508
8886 1264508 4291444 3754916 2666499 4640863 6706243 3109529 -4769262 -9147202
8878 -9147202 -6965714 -3452029 -2952388 -3076694 -1000569 839080 -181866 -1400769 210003
8869 210003 1712586 -1284679 -6418050 -7055803 -2104162 2292588 1334610 -2731603 -4785738
8860 -4785738 -3253439 -580166 597916 104609 -129725 1639465 4697093 6264175 4878198
8851 4878198 2448982 1539834 1492755 -646497 -5520795 -9923268 -10506370 -7605463 -4602750
8842 -4602750 -4269934 -6226965 -7584614 -5992271 -2332862 320 -1024737 -3750142
8834 -3750142 -5320451 -5402591 -5491709 -5180816 -2106344 3472007 6853444 4149757 -2072672
8825b072672l256024K087375L040985q38123l493782q99083L722850M688295J398567
8816D378388j530562r18591R45947R786l395291m377905n5673N546564N687833
8807F290496j01855m527232j980298L628259M444005o1625l125839j681116m02085
8798B482710k556554l813334j33953L895557J581336m671313o408063j737610
8790a1361224K796327K783995R58192N35799M75243m06962n23358O78850J040517
8781c022621J05682L08785J721788J033281j826870k028627J808209L748515k61765
8772A586377m979969l590074J712480L574701P62107j349889J23188K443388K715122
8763B997431J106930j232687l137283k820151j67872J438546n42587l241291k420885
$$ plain form
8825 -2072672 -5328696 -3241321 -200336 -1038459 -4532241 -5431324 -1708474 2979821 4378388
8816 4378388 2847826 1929235 2875182 2884968 -510323 -4888228 -4943901 602663 6290496
8807 6290496 6188641 1661409 -318889 3309370 7753375 7691750 4565911 2884795 2482710
8798 2482710 -73844 -3887178 -4021131 -125574 1455762 -3215551 -9623614 -11361224
8790 -11361224 -8564897 -5780902 -4822710 -4286911 -3811668 -4218630 -4741988 -4063138 -3022621
8781 -3022621 -2916939 -2608154 -886366 146915 -1679955 -3708582 -1900373 1848142 1586377
8772 1586377 -3393592 -6983666 -5271186 -1696485 -934378 -2284267 -2161079 282309 2997431
8763 2997431 4104361 2871674 -265609 -3085760 -3253632 -1815086 -2357673 -5598964 -8019849
8754h019849P45937J925433R38017J111523K527355K221986O97120J539177M048168
8745G734867L101354k027881n352389l326010k21357p58916k681810j260362K667431
8736b125073M087079J235671k411308k837174K59891L300756K072848l367283
8728B15407p163196m023990L019480N741619K212288p63896J053371K432857j956910
8719G67030p312506n336879K468341O541889L234304j098406r31468J002461O9755
8710e95479k519685k686377l11830J456801J620756J901400K732146K315919N7359
8701C971010j762227r25812J555291K556035P20449j890198k379992l98786K042034
8692C487804L543128M277693L865098R07214l787746o045452l348923O56751M74795
$$ plain form
8754 -8019849 -7273912 -5348479 -4410462 -3298939 -771584 1450402 2147522 3686699 7734867
8745 7734867 10836221 8808340 3455951 129941 -91416 -850332 -3532142 -4792504 -2125073
8736 -2125073 1962006 3197677 786369 -2050805 -1790914 1509842 3582690 215407
8728 215407 -6947789 -10971779 -7952299 -2210680 1608 -762288 291083 2723940 767030
8719 767030 -6545476 -11882355 -9414014 -2872125 362179 -736227 -1667695 -665234 -595479
8710 -595479 -3115164 -5801541 -6113371 -4656570 -3035814 -1134414 1597732 3913651 3971010
8701 3971010 2208783 1282971 2838262 5394297 6114746 4224548 1844556 1445770 3487804
8692 3487804 7030932 11308625 15173723 16080937 12293191 6247739 2898816 3555567 4030362
8683D030362l150770l942742M38079M361805K190935l563062n856912k550773
8675h043078K002409L848074L649111L468333K949821O18242k960260n298126
8667B34526m810372k485593o84430m48688k53309J758947M350212M023793M13884
8658B098970j803726P51631M197198K272171l865875o435890k423137J921133
8650c287525Q16279k490703j696212K454311M168720K031857j52296p38512j822890
8641g16971l411252k532308O42230J928893L00456k4403K703436L924975M35760
8632C250816l644259l372758o18019K99983J69458J593699J975388k322310p193598
8623i861600n003649K861477O615061K512900k081682r02438K420765K345136
$$ plain form
8683 4030362 879592 -3063150 -2625071 1736734 3927669 364607 -5492305 -8043078
8675 -8043078 -6040669 -2192595 1456516 4924849 7874670 8492912 5532652 234526
8667 234526 -4575846 -7061439 -7745869 -8194557 -8447866 -6688919 -2338707 1685086 2098970
8658 2098970 295244 1046875 5244073 7516244 3650369 -2785521 -5208658 -3287525
8650 -3287525 -2471246 -4961949 -6658161 -4203850 -35130 1996727 1844431 1105919 -716971
8641 -716971 -4128223 -6660531 -6018301 -4089408 -3788952 -3813355 -1109919 2815056 3250816
8632 3250816 -393443 -3766201 -4384220 -4084237 -3914779 -2321080 -345692 -2668002 -9861600
8623 -9861600 -14865249 -12003772 -5388711 -2875811 -4957493 -5859931 -3439166 -1094030
8615a094030N11061O05547M67965l157684o614395m280736J349073K885475p1437
8606i399161p24497L099592N310910J834730k839141k939670M79442K707424K287832
8597a82539Q55815n34695j288127j97570K299241L210366J127645j185364r67292
8588C137480M26983L45455r32162j756406k278603k998672k728790j024778J55086
8579g654407J79470J557219M521262M325297r89588m850525j174595M835063L627231
8570D376427l532983o395347k100650J132885j453940l604397N86607O815272
8562d176126P840200L638968j169063m055859l913547K30659N032287L815858
8554G243377l174418o541486j567439L593769J121414l249305m52928N413138
$$ plain form
8615 -1094030 -582969 22578 490543 -2667141 -9281536 -13562272 -12213199 -9327724 -9399161
8606 -9399161 -10123658 -7024066 -1713156 121574 -2717567 -5657237 -5177795 -2470371 -182539
8597 -182539 673276 138581 -1149546 -1347116 952125 4162491 5290136 4104772 3137480
8588 3137480 3564463 3909918 2977756 1221350 -1057253 -4055925 -6784715 -7809493 -7654407
8579 -7654407 -7474937 -5917718 -1396456 2928841 1939253 -2911272 -4085867 749196 4376427
8570 4376427 843444 -5551903 -7652553 -6519668 -7973608 -11578005 -10991398 -4176126
8562 -4176126 3664074 7303042 6133979 2078120 -1835427 -1604768 3427519 7243377
8554 7243377 4068959 -2472527 -4039966 -446197 675217 -2574088 -3027016 2386122
8546B386122L524643m954737q262868k882622K282580J598623J70755K698322
8538c439182N761506N359087L173501J334893j209456l706813k662947R44573
8530E555162J300825k276545l258019O37692K758038r28335m426959k047543J991799
8521f93885J525491j147986p81335R84168k23228k418118j030892J938399J154076
8512f93310k287417k643967N68031K300827P95793n25521J14120M73167q62105
8503b760382k383651k661315j454355J484515N022668N617522J661442l014237
8495A512207m027126k441139j563976q98355J308738K625560R8695l035925j414887
8486g836208L236441M240203M94595k432457j575886K56811J068919K443340M476241
$$ plain form
8546 2386122 5910765 956028 -7306840 -10189462 -7906882 -6308259 -6137504 -3439182
8538 -3439182 2322324 7681411 10854912 12189805 10980349 7273536 4610589 5555162
8530 5555162 6855987 4579442 1321423 1959115 4717153 3788818 -638141 -2685684 -693885
8521 -693885 831606 -316380 -1097715 -113547 -336775 -2754893 -3785785 -1847386 -693310
8512 -693310 -2980727 -5624694 -5056663 -2755836 -1960043 -2485564 -2371444 -1898277 -2760382
8503 -2760382 -5144033 -7805348 -9259703 -7775188 -2752520 2865002 4526444 1512207
8495 1512207 -2514919 -4956058 -6520034 -7418389 -6109651 -3484091 -3385396 -6421321 -7836208
8486 -7836208 -4599767 -359564 135031 -2297426 -3873312 -3616501 -2547582 -104242 4371999
8477D371999M206036P96492k760111m168414l654172j476241J504777J855215
8469F75581j904653m259861M99976P736825P706315J022711j757092K336903L397984
8460A5454689m302667j1368962p552330J980309M696503q06085m764315j870501
8452h533359K735470K961368l25946k313321n28816K962410L477195j278430o778619
8443g622048n494035K612914Q176186N030347o22031O7032M534293L295962m031856
8434E946764p397323j793246N447955O171888K226122k24163q53202l175331o355630
8425f166o033488k013670J044992R00920M09940J683776K413113O38116q35983
8416a798450J199871M167880K772287k580844n523168k621292K257334M311964
$$ plain form
8477 4371999 8578035 9374527 6614416 2446002 -1208170 -2684411 -1179634 675581
8469 675581 -1229072 -5488933 -4988957 2747868 10454183 11476894 9719802 12056705 15454689
8460 15454689 11152022 -216940 -7769270 -5788961 -1092458 -1898543 -6662858 -8533359
8452 -8533359 -5797889 -2836521 -3162467 -5475788 -6004604 -3042194 435001 -843429 -7622048
8443 -7622048 -13116083 -10503169 -2326983 2703364 2081333 2148365 6682658 9978620 5946764
8434 5946764 -1450559 -3243805 2204150 8376038 10602160 10377997 9524795 6349464 -6166
8425 -6166 -6039654 -8053324 -7008332 -6107412 -5697472 -4013696 -1600583 -962467 -1798450
8416 -1798450 -598579 3569301 6341588 3760744 -1762424 -4383716 -2126382 2185582
8408B185582L920614L374579J836584j970836n258736m546561j512965l51687
8400b323426r68878k75826J223104M78470j228536L78265L958600L021025l067668
8391A195130o371926k310704L016632K554358j028350q50111K844169M166735
8383C215933J566827p60976l05898J005818J217518N07307r77180l185861m165004
8374a881516j849984K109142L666625J568649j514631k723094j465904J100115
8366i90598K790656J776119o53531o90366K231102L277629n41328m343065k013429
8357H43189L669539M426356q45073m207426p26723M512317M410719n80689m729963
8348F772246n026516l033019j127406k75401l78590o52933l89451p1217l79465
$$ plain form
8408 2185582 6106196 9480775 11317359 9346523 4087787 -458774 -1971739 -2323426
8400 -2323426 -3292304 -3568130 -2345026 -1866556 -3095092 -2716827 1241773 4262798 1195130
8391 1195130 -5176796 -7487500 -4470868 -1916510 -2944860 -3794971 -950802 3215933
8383 3215933 4782760 4021784 3715886 4721704 5939222 6446529 5469349 2283488 -1881516
8374 -1881516 -3731500 -1622358 2044267 3612916 2098285 -624809 -2090713 -990598
8366 -990598 1800058 3576177 2922646 2232280 4463382 7741011 7199683 2856618 843189
8357 843189 4512728 8939084 8094011 3886585 3159862 7672179 12082898 11502209 6772246
8348 6772246 1745730 -1287289 -2414695 -2690096 -3068686 -3721619 -4111070 -4182287 -4561752
8339d561752k55339J503377K982971J283344j773297r13960M024218O142111J298343
8330I730016n101632n692147j301088K009012K536986K895750K734673o79640
8322G131930n064742m436419P19047K469496k251346n903824j925243M598729
8314d662372M763089n63189l136384n57467J536135r0595j910482r58657O64847
8305d915075P49641K98045k71233k358122m395512k051810L942239O623097L066558
8296F87828q33456l48946N02732k402781m192040Q55917P596695O611116q32966
8287G644099m852197k272677O06860K06175M861J469164Q83765k065438j943940
8278c19328K587511N123540J866238k250640k377838j251145k577997l623233
$$ plain form
8339 -4561752 -4817091 -3313714 -330743 952601 -820696 -1734656 2289562 8431673 9730016
8330 9730016 4628384 -1063763 -2364851 -355839 2181147 5076897 7811570 7131930
8322 7131930 2067188 -2369231 -1650184 819312 -1432034 -7335858 -9261101 -4662372
8314 -4662372 100717 -462472 -3598856 -4156323 -2620188 -2710783 -4621265 -5579922 -4915075
8305 -4915075 -4165434 -3867389 -4138622 -6496744 -10892256 -12944066 -9001827 -2378730 687828
8296 687828 -145628 -494574 8158 -2394623 -6586663 -5730746 1865949 8477065 7644099
8287 7644099 2791902 519225 1126085 1332260 1337121 2806285 3690050 1624612 -319328
8278 -319328 2268183 7391723 9257961 7007321 4629483 3378338 800341 -2822892
8270b822892m72290M485737O156797L901063M00141k858558n003674m564127k218546
8261b996349p89469k21937K202521M836170K173633m682122o772043j200635L039149
8252d411082k55157l711902N79193O333226L322398m483555m758418K963781O940519
8243B519003K292903k752145j376953K471727K590989n49864l102364l541393
8235a448097k227641r8736R07881J30359K44117K789338M056680R89803k210635
8226C133069n96679K109297m00143m871686l240189K706511L594557j246104k725617
8217a536984J743332M261228J396494k95581K006817J531241m152657o332789
8209a378899k99611M777900R08245m549228j269013O309036O514427m27627m077253
$$ plain form
8270 -2822892 -3295182 1190555 7347352 11248415 11648556 8789998 3786324 -777803 -2996349
8261 -2996349 -3785818 -4007755 -1805234 3030936 5204569 522447 -6249596 -7450231 -4411082
8252 -4411082 -4666239 -8378141 -7798948 -1465722 1856676 -2626879 -7385297 -4421516 2519003
8243 2519003 4811906 2059761 682808 3154535 5745524 5195660 2093296 -1448097
8235 -1448097 -3675738 -3774474 -2866593 -2736234 -2492117 297221 4353901 5343704 3133069
8226 3133069 2536390 4645687 4245544 -626142 -3866331 -1159820 2434737 1188633 -1536984
8217 -1536984 206348 4467576 5864070 5568489 7575306 9106547 4953890 -1378899
8209 -1378899 -1678510 3099390 4007635 -541593 -1810606 4498430 11012857 10585230 6507977
8200F507977j269656P92150j740937l800576j107493L238919M304244J609530
8192H534158j834572k899596m95287K666673J814385l375855o714235l740114
8184f044443J386812K206998k24991p9616L126394M082991O10654l269587l613623
8175a818411j045138J529032K098488M98702j165280j37608K748757K983110q33883
8166D857769l830889k228222M67146k94373k058814j03895L543509L477148N44225
8157D373604j43939J043547o47587m340645m001190M35642J866904j915329m122007
8148g451000n29789L448468K420812J74981K409152O056478L848500l472157p341019
8139d35574l413543K980897M680468J266355k355283k839366j126971M76455J290424
$$ plain form
8200 6507977 5238321 6030471 4289534 488958 -618535 2620384 6924628 8534158
8192 8534158 6699586 3799990 3304703 5971376 7785761 4409906 -2304329 -6044443
8184 -6044443 -4657631 -2450633 -2675624 -2755240 371154 4454145 5064799 1795212 -1818411
8175 -1818411 -2863549 -1334517 763971 1262673 97393 -40215 2708542 5691652 4857769
8166 4857769 1026880 -1201342 -734196 -1028569 -3087383 -3191278 352231 3829379 4373604
8157 4373604 4229665 5273212 4625625 284980 -3716210 -3280568 -1413664 -3328993 -7451000
8148 -7451000 -7980789 -4532321 -2111509 -1936528 472624 6529102 10377602 6905445 -435574
8139 -435574 -3849117 -868220 3812248 5078603 2723320 -116046 -1243017 -766562 523862
8130E23862J738072J570546L51040p95820j2324K297447L360387J778121p60228
8121A0051103k544222l954305m889654l256147J239596M699336L866026Q38588
8113F050321o66019j049247k450817l330030r94897K248581J640825k076619l454981
8104d082883j083261P11668l08218r18764J389280M303837M872229L201490L24247
8095H409625l079332m515116j377778L485002L440801k296752o309457l423433
8087e666440J964805L091964L27169j551805j478962j755705k216527m93365K893888
8078d884978M479851K816238J38846q70538K44788J810554J404918j649389m394754
8069i04464l172540Q15035K457769N28950k89139K259626L298632q69947n058142
$$ plain form
8130 523862 2261934 3832480 4183520 3387700 3375376 5672823 9033210 10811331 10051103
8121 10051103 7506881 3552576 -1337078 -4593225 -3353629 1345707 5211733 6050321
8113 6050321 5384302 4335055 1884238 -1445792 -2440689 -192108 1448717 -627902 -4082883
8104 -4082883 -5166144 -4454476 -4762694 -5681458 -4292178 11659 4883888 8085378 8409625
8095 8409625 5330293 815177 -562601 2922401 6363202 4066450 -2243007 -5666440
8087 -5666440 -3701635 -609671 -282502 -1834307 -3313269 -5068974 -7285501 -7778866 -4884978
8078 -4884978 -405127 2411111 2549957 1679419 1924207 3734761 5139679 3490290 -904464
8069 -904464 -4077004 -3261969 -804200 -275250 -564389 1695237 4993869 4123922 -934220
8060i34220k555246L624144M860589L48475k168819P94999L343217K15021n153343
8051B374817o305071k342140K887669O187291O171890K506587k521276m401772
8043D557995j612085J806001J577951j378075l629201m471895m880440l778419
8035a1808168M3447L753517L146433p95664k653839l00292K627426K997393K287633
8026g02114K340993J509606j472597l363503p67231L518485L515355j245605m860506
8017a527117l323932P28978K803775K135923N98979n93126p69085Q12552L046433
8008C913380K944304p8792k450957j643756k78943j512481l065232o70341M177243
7999A334425N412313J238913l345304l745064j033160J254087J618914M27525
$$ plain form
8060 -934220 -3489466 134678 4995267 5343742 3174923 3969922 7313139 7528160 2374817
8051 2374817 -3930254 -6272394 -3384725 2802566 8974456 11481043 8959767 4557995
8043 4557995 2945910 4751911 6329862 4951787 1322586 -3149309 -8029749 -11808168
8035 -11808168 -11764721 -8011204 -4864771 -5660435 -8314274 -8614566 -5987140 -2989747 -702114
8026 -702114 1638879 3148485 1675888 -1687615 -2454846 1063639 4578994 3333389 -1527117
8017 -1527117 -4851049 -4122071 -1318296 817627 1416606 823480 54395 866947 3913380
8008 3913380 6857684 6778892 4327935 2684179 2405236 892755 -2172477 -2842818 1334425
7999 1334425 6746738 7985651 4640347 895283 -137877 1116210 2735124 3162649
7991C162649j240729j244118J671568M512053K611119l094360n960939k927207
7983b509964J073178J206440P4352K006321M463695J926029l987741n685726r38710
7974b372126L679744K531356j436280j960973J440650L595155J315100k548061
7966D244565l100264M01820L635320K498138j804138m475539l544077j876875
7958d021050j958879k025216R3206K361498J672144o09168q44409N18731K1644
7949d791499j863549p78019L517355N130259P86293m450310m138732N71829L407279
7940b609094K007953j57035l0543J086829M25294k161444m047383k739368J322184
7931f902607M641769M144325Q94137j269581r47999l68211o60468K88208L058700
$$ plain form
7991 3162649 1921920 677802 2349370 6861423 9472542 6378182 417243 -2509964
7983 -2509964 -1436786 -230346 -155994 1850327 6314022 8240051 4252310 -1433416 -2372126
7974 -2372126 1307618 3838974 2402694 441721 1882371 5477526 6792626 4244565
7966 4244565 1144301 1546121 5181441 7679579 5875441 1399902 -2144175 -4021050
7958 -4021050 -5979929 -8005145 -7911939 -5550441 -3878297 -4487465 -5331874 -4813143 -4791499
7949 -4791499 -6655048 -7433067 -3915712 1214547 2000840 -2449470 -6588202 -6016373 -2609094
7940 -2609094 -601141 -758176 -788719 298110 723404 -1438040 -5485423 -8224791 -6902607
7931 -6902607 -2260838 1883487 2777624 1508043 560044 191833 -468635 -180427 2878273
7922B878273L769624r3467m070121k198236L654902N722888J304707l967219m793229
7913B208122k656445j378628j008005M46934K484613K968824J723181M01839m3925
7904E146510J90603N30558j47277k569381m682328k893746K371245N398735K428244
7895E773163k607221l425431l08814R96753j713443m203796k442695K136162N455979
$$ plain form
7922 2878273 6647897 6554430 2484309 286073 3940975 9663863 10968570 7001351 2208122
7913 2208122 -448323 -1826951 -2834956 -2388022 96591 3065415 4788596 5190435 5146510
7904 5146510 5337113 5867671 5720394 3151013 -1531315 -4425061 -2053816 3344919 5773163
7895 5773163 3165942 -259489 -568303 428450 -1284993 -5488789 -7931484 -5795322 -339343
$$ [...]
##END NTUPLES=NMR SPECTRUM
##END=
