##TITLE=31Pdec_LR-618-R3-CR9-17-TFA
 CDCl3, 124 sc
 28.06.2021
##JCAMPDX= 6.0         $$ Bruker NMR JCAMP-DX V2.0
##DATA TYPE= NMR SPECTRUM
##DATA CLASS= NTUPLES
##ORIGIN= UXNMR, Bruker Analytische Messtechnik GmbH
##OWNER= root
$$ XWIN-NMR		Version 3.5
$$ Mon Jun 28 12:41:49 2021 Russian Standard Time (UT+4h)  she@DPX200
##.OBSERVE FREQUENCY= 81.013821
##.OBSERVE NUCLEUS= ^31P
##.ACQUISITION MODE= SIMULTANEOUS
##.ACQUISITION SCHEME= undefined
##.AVERAGES= 124
##.DIGITISER RES= 16
##SPECTROMETER/DATA SYSTEM= spect
##.PULSE SEQUENCE= zgpg30
##.SOLVENT NAME= CDCl3
##.SHIFT REFERENCE= (INTERNAL, CDCl3, 0, 248.564)
##AUDIT TRAIL= $$ (NUMBER, WHEN, WHO, WHERE, WHAT)
$$ ##TITLE= Audit trail, XWIN-NMR		Version 3.5
$$ ##JCAMPDX= 5.01
$$ ##ORIGIN= Bruker BioSpin GmbH
$$ ##OWNER= she
$$ F:/spectra/data/she/nmr/P31/1/pdata/1/auditp.txt
$$ ##AUDIT TRAIL=  $$ (NUMBER, WHEN, WHO, WHERE, WHAT)
(   1,<2021-06-28 12:39:37.96 +0400>,<she>,<DPX200>,
      <continue with go, POWCHK disabled, PULCHK disabled
       configuration hash MD5:
       00 E9 B6 7A A2 85 ED C7 34 08 36 98 17 FE 4E 26
       data hash MD5: 32K
       E2 BB 9E F7 48 DF 6A 18 23 7A 89 E4 FB EE 00 43>)
(   2,<2021-06-28 12:39:41.54 +0400>,<she>,<DPX200>,
      <Start of raw data processing
       efp BC_mod = 2 LB = 1 FT_mod = 6 PKNL = 1 PHC0 = -8047.154 PHC1 = 3737.887 SI = 64K 
       data hash MD5: 64K
       3E B7 BD 99 FD BD 1C 82 72 D3 A4 2D 21 F8 98 F9>)
(   3,<2021-06-28 12:40:17.50 +0400>,<she>,<DPX200>,
      <pk PHC0 = 26.38718 PHC1 = -129.2 
       data hash MD5: 64K
       B4 3F 55 73 B9 46 CC C2 F2 0A CF 8F E9 76 BC 7A>)
(   4,<2021-06-28 12:40:21.54 +0400>,<she>,<DPX200>,
      <abs ABSG = 5 
       data hash MD5: 64K
       C7 3F 1F 71 6B FA F5 43 B7 18 79 F9 56 0E 13 42>)
$$ ##END=
$$ 
$$ hash MD5
$$ C6 3C 59 51 DC A6 3B 5C FB AC A4 E7 FD 8B 41 5A
##$RELAX= 
##$RELAX= 
##$RELAX= 
##$RELAX= 
##$RELAX= 
##$RELAX= 
##$RELAX= 
##$RELAX= 
$$ Bruker specific parameters
$$ --------------------------
##$DU= <F:/spectra>
##$EXPNO= 1
##$NAME= <P31>
##$PROCNO= 1
##$TYPE= <nmr>
##$USER= <she>
##$AMP= (0..31)
100 100 100 100 100 100 100 100 100 100 100 100 100 100 100 100 100 100 
100 100 100 100 100 100 100 100 100 100 100 100 100 100 
##$AQSEQ= 0
##$AQ_mod= 1
##$AUNM= <au_zg>
##$AUTOPOS= <>
##$BF1= 81.014009
##$BF2= 200.13
##$BF3= 200.13
##$BF4= 200.13
##$BF5= 200.13
##$BF6= 200.13
##$BF7= 200.13
##$BF8= 200.13
##$BYTORDA= 1
##$CFDGTYP= 0
##$CFRGTYP= 5
##$CHEMSTR= <none>
##$CNST= (0..31)
1 1 145 1 1 1 1 1 1 1 1 1 1 1 1 1 1 1 1 1 1 1 1 1 1 1 1 1 1 1 1 1 
##$CPDPRG= <waltz16>
##$CPDPRG1= <>
##$CPDPRG2= <waltz16>
##$CPDPRG3= <>
##$CPDPRG4= <mlev>
##$CPDPRG5= <mlev>
##$CPDPRG6= <mlev>
##$CPDPRG7= <mlev>
##$CPDPRG8= <mlev>
##$CPDPRGB= <>
##$CPDPRGT= <>
##$D= (0..31)
0 1 0 0 0 0 0 0 0 0 0 0.03 2e-05 3e-06 0 0 0 0 0 0 0 0 0 0 0 0 0 0 0 0 
0 0 
##$DATE= 1624869415
##$DBL= (0..7)
120 120 120 11 120 120 24 19 
##$DBP= (0..7)
150 150 150 150 150 150 150 150 
##$DBP07= 0
##$DBPNAM0= <>
##$DBPNAM1= <>
$$ [...]
##$SUBNAM3= <"">
##$SUBNAM4= <"">
##$SUBNAM5= <"">
##$SUBNAM6= <"">
##$SUBNAM7= <"">
##$SUBNAM8= <"">
##$SUBNAM9= <"">
##$SW= 501.771253377433
##$SWIBOX= (0..15)
0 1 3 0 0 0 0 0 0 0 0 0 0 0 0 0 
##$SW_h= 40650.406504065
##$TD= 32768
##$TD0= 1
##$TE= 0
##$TE2= 300
##$TE3= 300
##$TEG= 300
##$TL= (0..7)
0 120 53 12 22 120 120 120 
##$TP= (0..7)
150 150 150 150 150 150 150 150 
##$TP07= 0
##$TPNAME0= <>
##$TPNAME1= <>
##$TPNAME2= <>
##$TPNAME3= <>
##$TPNAME4= <>
##$TPNAME5= <>
##$TPNAME6= <>
##$TPNAME7= <>
##$TPOAL= (0..7)
0.5 0.5 0.5 0.5 0.5 0.5 0.5 0.5 
##$TPOFFS= (0..7)
0 0 0 0 0 0 0 0 
##$TUNHIN= 0
##$TUNHOUT= 0
##$TUNXOUT= 0
##$USERA1= <user>
##$USERA2= <user>
##$USERA3= <user>
##$USERA4= <user>
##$USERA5= <user>
##$V9= 5
##$VALIST= <valist>
##$VCLIST= <CCCCCCCCCCCCCCC>
##$VD= 0
##$VDLIST= <DDDDDDDDDDDDDDD>
##$VPLIST= <PPPPPPPPPPPPPPP>
##$VTLIST= <TTTTTTTTTTTTTTT>
##$WBST= 1024
##$WBSW= 4
##$XGAIN= (0..3)
0 0 0 0 
##$XL= 0
##$YL= 0
##$YMAX_a= 8433
##$YMIN_a= -10314
##$ZGOPTNS= <>
##$ZL1= 120
##$ZL2= 120
##$ZL3= 120
##$ZL4= 120
##$ABSF1= 248.5645
##$ABSF2= -253.2056
##$ABSG= 5
##$ABSL= 3
##$ALPHA= 0
##$AQORDER= 0
##$ASSFAC= 0
##$ASSFACI= 0
##$ASSFACX= 0
##$ASSWID= 0
##$AUNMP= <proc_1d>
##$AZFE= 0.1
##$AZFW= 0.5
##$BCFW= 0
##$BC_mod= 2
##$BYTORDP= 0
##$COROFFS= 0
##$CY= -3
##$DATMOD= 1
##$DC= 0
##$DFILT= <>
##$DTYPP= 0
##$F1P= 0
##$F2P= 0
##$FCOR= 1
##$FTSIZE= 65536
##$FT_mod= 6
##$GAMMA= 0
##$GB= 0
##$INTBC= 1
##$INTSCL= 5.30512e-09
##$ISEN= 30
##$LB= 1
##$LEV0= 0
##$LPBIN= 0
##$MAXI= 10000
##$MC2= 0
##$MEAN= 0
##$ME_mod= 0
##$MI= 50
##$NCOEF= 0
##$NC_proc= -7
##$NLEV= 6
##$NOISF1= 182.463
##$NOISF2= 159.3651
##$NSP= 0
##$NTH_PI= 0
##$NZP= 0
##$OFFSET= 248.5645
##$PC= 4
##$PHC0= -8020.767
##$PHC1= 3608.687
##$PH_mod= 1
##$PKNL= yes
##$PPARMOD= 0
##$PSCAL= 0
##$PSIGN= 0
##$REVERSE= no
##$SF= 81.014009
##$SI= 65536
##$SIGF1= 159.3651
##$SIGF2= -187.1042
##$SINO= 113.3802
##$SIOLD= 16384
##$SREGLST= <1H.CDCl3>
##$SSB= 0
##$STSI= 65536
##$STSR= 0
##$SW_p= 40650.406504065
##$SYMM= 0
##$S_DEV= 0
##$TDeff= 32768
##$TDoff= 0
##$TI= <>
##$TILT= no
##$TM1= 0
##$TM2= 0
##$TOPLEV= 0
##$USERP1= <user>
##$USERP2= <user>
##$USERP3= <user>
##$USERP4= <user>
##$USERP5= <user>
##$WDW= 1
##$XDIM= 65536
##$YMAX_p= 327118386
##$YMIN_p= -131906427
$$ End of Bruker specific parameters
$$ ---------------------------------
##NTUPLES= NMR SPECTRUM
##VAR_NAME=  FREQUENCY,     SPECTRUM/REAL,   SPECTRUM/IMAG
##SYMBOL=    X,             R,               I
##VAR_TYPE=  INDEPENDENT,   DEPENDENT,       DEPENDENT
##VAR_FORM=  AFFN,          ASDF,            ASDF
##VAR_DIM=   65536,         65536,           65536
##UNITS=     HZ,            ARBITRARY UNITS, ARBITRARY UNITS
##FACTOR=    0.620285442955139, 1,           1
##FIRST=     20137.2065510759, 0,            0
##LAST=      -20513.1999529892, 0,           0
##MIN=       -20513.1999529892, -131906427,  0
##MAX=       20137.2065510759, 327118386,    0
$$ Real data points
##PAGE= N=1
##DATA TABLE= (X++(R..R)), XYDATA
$$ [...]
##PAGE= N=2
##DATA TABLE= (X++(I..I)), XYDATA
13010C466102l744743l086772P26922J456876k066363n168877m331923p92758
13002a3541536K645930M580699M281196J539619j659522k371501p19415L42535
12994d901995K58068J837144N030261M582780j888906p639488m813472L612333
12986c923275P082278K288193k841273j716906J800336J053007k737379l500459
12978b495478k98235K191484J599296L90161O19003J128642O68516j10759o52347
12969C040283j338888j644284k64509K203436L173477J289686k184074n096521
12961h21394n472525j758536M788905Q646197N202088k290193n514225k052856
12953G27461J328232j138363n593281m559606J740562N733921L293220j074895
$$ plain form
13010 3466102 -278641 -3365413 -2638491 -1181615 -3247978 -8416855 -12748778 -13541536
13002 -13541536 -10895606 -6314907 -2033711 -494092 -2153614 -4525115 -5244530 -4901995
12994 -4901995 -4643927 -2806783 2223478 6806258 4917352 -2722136 -7535608 -3923275
12986 -3923275 3159003 5447196 2605923 889017 2689353 3742360 1004981 -2495478
12978 -2495478 -2793713 -602229 997067 1387228 2006231 3134873 3803389 3692630 3040283
12969 3040283 1701395 57111 -207398 1996038 5169515 6459201 4275127 -821394
12961 -821394 -6293919 -8052455 -3263550 5382647 10584735 8294542 2780317 727461
12953 727461 2055693 917330 -4675951 -9235557 -7494995 -1761074 1532146 457251
12945D57251j045780L275218O217021L859773j688434n128334l830102k36951
12937A879662J477171L54305q42103J0192J226563k52776m204165o604475m043612
12928a0999238K307476P675102Q256043M354264p89181m281784n078861l370889
12920a927068m47758J056788o66099l449127k856958J475967M115811R60526m526565
12911f264483n650402j146275M220738O254083M614584P81275k964221l360102
12903c514803N51173M495849L774398K31163n87351J644236K126358k39121j265217
12894G216685K09494n6056l403444n035973k562103o28919k607023m415292j862868
12885a3145499K169193L675377M484355O640046N883305j101448p907423o168586
$$ plain form
12945 457251 -588529 2686689 8903710 12763483 11075049 5946715 2116613 1879662
12937 1879662 3356833 3711138 2869035 2879227 4105790 3853014 -351151 -6955626 -10999238
12928 -10999238 -8691762 -1016660 7239383 11593647 10804466 6522682 1443821 -1927068
12920 -1927068 -2374826 -1318038 -1984137 -5433264 -8290222 -6814255 -2698444 -1737918 -6264483
12911 -6264483 -11914885 -13061160 -8840422 -2586339 2028245 2809520 -154701 -3514803
12903 -3514803 -2963630 1532219 5306617 5537780 4950429 6594665 8721023 8481902 7216685
12894 7216685 7426179 7370123 3966679 -1069294 -3631397 -4260316 -6867339 -11282631 -13145499
12885 -13145499 -10976306 -7300929 -2816574 3823472 9706777 8605329 697906 -5470680
12877e470680J209866M135120O10166j883406L04634K250261M14185j689010p20662
12868h39526R50921L96252j044850j345407j403096k193600k376586j081173N30427
12859h406638K054543M363235O124152M207804q09003l977878k831481p14323
12851A0411j060266k421419j865482K78754K027421L156587M047665L426150K39817
12842G839638l522528m369333j343476K686306L691851N18220l401792l525072
12834a426186j74407J384822j275879l353662k4046N326828N728153J139334k302199
12825E022758k229917j921758k493749j124371J763789J441801k509995l920602
12817e972044J34988L962955K081695k379579l047528N17054L902876M565545
$$ plain form
12877 -5470680 -4260814 -125694 484472 -1398934 -1094300 1155961 1570146 -118864 -839526
12868 -839526 111395 507647 -537203 -1882610 -3285706 -5479306 -7855892 -8937065 -8406638
12859 -8406638 -6352095 -1988860 4135292 8343096 7534093 3556215 724734 10411
12851 10411 -1049855 -3471274 -5336756 -5058002 -3030581 126006 4173671 7599821 7839638
12842 7839638 4317110 -52223 -1395699 1290607 4982458 5500678 2098886 -1426186
12834 -1426186 -1600593 -215771 -1491650 -4845312 -4869358 457470 6185623 7324957 5022758
12825 5022758 2792841 871083 -1622666 -2747037 -983248 458553 -2051442 -5972044
12817 -5972044 -5837056 -1874101 207594 -2171985 -5219513 -4702459 -799583 3765962
12809C765962K988871n8935l477671n140324m185094k120980o4304K316743L978777
12800a996955K542002j219579l053174j256948J027214J150836J73479p02922
12792c336047j946729k426648J79382M018810M059719K01401k210011j690009
12784c150132k484997m698654k136322N407856P792545l71037r287130p507665
12776a6435536J585680O479377M506793J843158J221666K02921j067254J9050
12768a644145K226161K163691M36659n17895j665981l899696l544778J387929
12760e058055N206707K740713j675121k027565j275859l922232m668540K553867
12752h126085R990060N841482n037580o953753J531182N914304K28825m717111
$$ plain form
12809 3765962 6754833 6695898 3218227 -1922097 -6107191 -8228171 -8292475 -5975732 -1996955
12800 -1996955 545047 -674532 -3727706 -4984654 -3957440 -2806604 -2633125 -3336047
12792 -3336047 -5282776 -7709424 -7530042 -3511232 548487 749888 -1460123 -3150132
12784 -3150132 -5635129 -10333783 -12470105 -7062249 730296 359259 -8927871 -16435536
12776 -16435536 -14849856 -8370479 -3863686 -2020528 -798862 -595941 -1663195 -1644145
12768 -1644145 582016 2745707 3182366 2664471 998490 -2901206 -6445984 -5058055
12760 -5058055 148652 2889365 1214244 -813321 -2089180 -6011412 -10679952 -8126085
12752 -8126085 1863975 7705457 2667877 -4285876 -2754694 3159610 3388435 -1328676
12744a328676j450020L041616K529944K021203N088497N132406j534027o621677
12736F879266l608915R31073k81557k389481J183727N352385K376888l800595
12728F642791m421000p25839l7398k236175j763580R49001J169971k63545P19430
12719C3656K119407p13602m788002l162724K537093L754755j141053m556915k062051
12710g979436J907228K476798Q37235R9230O25371J469873K103328J796837N92595
12701C929059J50632N56580j070455m820483n009991J169510O557456L499756
12693D962064l531436m426522L57295J390939k983578m114780R80166L793093
12685c572759o84418m600412l05529O422586N407093j959712n577602k172997
$$ plain form
12744 -1328676 -2778696 262920 2792864 4814067 9902564 15034970 13500943 6879266
12736 6879266 3270351 4201424 3919867 1530386 2714113 8066498 10443386 6642791
12728 6642791 2221791 1495952 1458554 -777621 -2541201 -1592200 -422229 -685774 33656
12719 33656 2153063 1439461 -3348541 -6511265 -3974172 -219417 -1360470 -5917385 -7979436
12710 -7979436 -6072208 -3595410 -2758175 -2658945 -2033574 -563701 1539627 3336464 3929059
12701 3929059 4079691 4636271 3565816 -1254667 -6264658 -5095148 1462308 4962064
12693 4962064 1430628 -2995894 -2638599 -1247660 -4231238 -8346018 -7365852 -3572759
12685 -3572759 -4257177 -8857589 -9163118 -2740532 2666561 706849 -4870753 -7043750
12677g043750J453700K36184k216614m55824M643682P591667N300096r6283m220943
12668E191915m588558k110387M28998J000579k15568j358175p18310J343083K274346
12659A247923K50784k689158k404607J635773M847454L493964k73431j962411
12651D146291j240476j431090l601615m827694k664465J268245L051101Q14662
12643d485041k925563l483031M48974M351423L580383L25344J42055K177729P3860
12634B06133n951267o814861J092825Q141882N323052j981671l369042J46347
12626c206602K01045l376683l566789N8658J278644j37377J600382N675209M925339
12617C451826r0918n99880M238322M391821l377469q571586m247860J673437P78771
$$ plain form
12677 -7043750 -5590050 -5353866 -7570480 -8026304 -3382622 4209045 9509141 9412858 5191915
12668 5191915 603357 -1507030 -1078032 -77453 -293021 -1651196 -2369506 -1026423 1247923
12659 1247923 1498707 -1190451 -3595058 -1959285 2888169 6382133 6108702 4146291
12651 4146291 2905815 1474725 -2126890 -6954584 -9619049 -8350804 -5299703 -4485041
12643 -4485041 -7410604 -10893635 -10444661 -6093238 -2512855 -2187511 -2045456 132273 206133
12634 206133 -5745134 -12559995 -11467170 -3325288 1997764 16093 -3352949 -3206602
12626 -3206602 -3005557 -6382240 -9949029 -9890371 -8611727 -8749104 -7148722 -1473513 3451826
12617 3451826 3360908 2761028 6999350 11391171 8013702 -557884 -4805744 -3132307 -2353536
12608b353536k127294J29385L136079k07967n217056k929606L641417L935300
12600a993278k705648o414739k452998L465897N494482L923025Q16032k431005
12592b298232k896201J175689N513369M448338k45237k107810m75798l01942k184610
12583F27566j432914K231542L056351m91741k381977O38793L109031l3040m789063
12574E34548m201081J271556N033145L474002q06815l495293k790749O1468K157203
12565A237984J499031p27906j625750o71966j40210r16573q28673J448146L608776
12556B882859L010627P33679p9923J122335J623450n28068l353655k871628J750610
12547D290286N995721M574412j837155o766240n754240j381279J177893P17201
$$ plain form
12608 -2353536 -4480830 -4351445 -1215366 -1423333 -6640389 -9569995 -5928578 -1993278
12600 -1993278 -4698926 -11113665 -13566663 -10100766 -4606284 -683259 132773 -2298232
12592 -2298232 -5194433 -4018744 1494625 5942963 5697726 3589916 3114118 2812176 627566
12583 627566 -805348 1426194 4482545 3990804 1608827 2247620 5356651 5323611 534548
12574 534548 -3666533 -2394977 2638168 6112170 5305355 1810062 -980687 -919219 1237984
12565 1237984 2737015 2009109 383359 -288607 -428817 -1345390 -2174063 -725917 2882859
12556 2882859 5893486 6627165 6547242 7669577 9293027 8764959 5411304 2539676 4290286
12547 4290286 10286007 14860419 13023264 6257024 502784 -878495 299398 1016599
12539A016599n40168j315185j598838p43704J035363J148700j496927l151323
12531e645483k40146M193162M315234L02911k540620k512198k756187l815446
12523h698773k138822K442085M635176J855764j562341j595262l95236j022109
12515f479518j402623J537375N456471N522645J608820j901777k218111m83988
12507A639294J005188J069276j26734j164788o75275M03317k16821k106673k055312
12498b228528M10728J142628k266597n714692m013431J415532M514510K931398
12490c808452L28929N80362K953189L722113Q15613l571066m679154m40499M942019
12481H43054M996331p46111n528452l995034J227800M042448K844136N81500p41044
$$ plain form
12539 1016599 476431 -838754 -2437592 -3181296 -2145933 -997233 -2494160 -5645483
12531 -5645483 -5885629 -1692467 2622767 2925678 385058 -2127140 -4883327 -8698773
12523 -8698773 -10837595 -8395510 -3760334 -1904570 -3466911 -5062173 -5457409 -6479518
12515 -6479518 -7882141 -6344766 -888295 4634350 6243170 4341393 2123282 1639294
12507 1639294 2644482 3713758 3587024 2422236 1746961 2150278 1933457 -173216 -2228528
12498 -2228528 -1817800 -675172 -2941769 -8656461 -12669892 -11254360 -6739850 -3808452
12490 -3808452 -3479523 -2899161 54028 3776141 4591754 1020688 -3658466 -4098965 843054
12481 843054 5839385 5093274 -435178 -4430212 -3202412 840036 3684172 4265672 3524628
12472C524628j645025k385675k121295o97603J038418K319665K415405P18586
12464C167104j718198k441506r11650M14217k32316j599362k249748k634123k555483
12455a0761065l75370K849180K894040o58280j961628K017664N298287K087214
12447A390042k861603j480276L807252L649210k546525n575686j852410J339735
12439d130261q25019k844483J36053L010383L8004m073032j545531N113278O833700
12430A713092K327072r31855M78070J365007k050822n608113m465104q06228N48974
12421g429907J02564J706894M648298L601480k708307p655494m709626L288495
12413i155603P026377K649829l422411l354116K182737O426100O028717L126012
$$ plain form
12472 3524628 1879603 -506072 -2627367 -3324970 -2286552 33113 2448518 3167104
12464 3167104 1448906 -992600 -1904250 -1490033 -1722349 -3321711 -5571459 -8205582 -10761065
12455 -10761065 -11136435 -8287255 -5393215 -6051495 -8013123 -5995459 -697172 1390042
12447 1390042 -1471561 -2951837 855415 4504625 1958100 -3617586 -5469996 -4130261
12439 -4130261 -4955280 -7799763 -7663710 -4653327 -4615323 -8688355 -10233886 -5120608 1713092
12430 1713092 4040164 3108309 3586379 4951386 2900564 -2707549 -7172653 -7978881 -7429907
12421 -7429907 -7327343 -5620449 -972151 2629329 -78978 -7734472 -12444098 -9155603
12413 -9155603 -2129226 520603 -2901808 -6255924 -4073187 2352913 8381630 11507642
12405A1507642o13444n652922r638107p530593K48127N695800L780317J1017J621402
12396e70761N629654L655041l663480o430910o44851N329308L248376l315153
12388C237224n495810k176102L77596p74331j944738o3879K711752L118595J361203
12379C51510k13913k34653J172678K686015J938095k074574o146730n499198l39395
12370h360165L503492K216602j059160j362423J244235L239200L275135K304007
12362E000923K75618k815197m160863j322745K725336K920181J00576n487L798176
12353F516518N953428L035908j226467k617475k401260k994772l008203j063603
12345B194074J86667j157808j763968J173141L772659J372102k915855k696587
$$ plain form
12405 11507642 10894198 5241276 -4396831 -11927424 -11679297 -5983497 -2203180 -2192163 -570761
12396 -570761 5058893 8713934 5050454 -1380456 -2025307 3304001 6552377 3237224
12388 3237224 -2258586 -4434688 -4057092 -4831423 -6776161 -6840040 -4128288 -1009693 351510
12379 351510 137597 -97056 1075622 3761637 5699732 3625158 -2521572 -8020770 -8360165
12370 -8360165 -4856673 -2640071 -3699231 -5061654 -3817419 -578219 2696916 5000923
12362 5000923 5276541 2461344 -1699519 -3022264 -296928 2623253 2723829 2718342 6516518
12353 6516518 12469946 15505854 14279387 11661912 9260652 6265880 3257677 2194074
12345 2194074 2380741 1222933 -541035 632106 4404765 5776867 2861012 164425
12337A64425J187277K300731o43932k574850j302159k38400j180557j660033q22846
12328d770344j103665k354319r17996L357560N491477L104210j79574j385414
12320A241935k247732m098246m703462k980270j085094O16357M247873P671956
12312a336683M776877l710093p917665k752726L831394L242465p43648R6114M067345
12303d46620L343751k074824m683917j895713J284551J380505J16717p82856j434153
12294e192559q59739J556470K837147P11094r45581K167111O066454L643517l301587
12285F682327o125781k620334R07805P83008J6158N63981N49332L08991K395081
12276C460568M446608J274080m629785m632768J901348N578795K199047j098809
$$ plain form
12337 164425 1351702 3652433 3008501 433651 -868508 -1106908 -2287465 -3947498 -4770344
12328 -4770344 -5874009 -8228328 -9146324 -5788764 -297287 2806923 2627349 1241935
12320 1241935 -1005797 -5104043 -9807505 -12787775 -13872869 -13256512 -9008639 -1336683
12312 -1336683 3440194 -269899 -8187564 -10940290 -7108896 -3866431 -4610079 -4513965 -446620
12303 -446620 2897131 822307 -3861610 -5757323 -4472772 -3092267 -2975550 -3758406 -5192559
12294 -5192559 -6052298 -4495828 -1658681 -947587 -1893168 273943 6340397 9983914 6682327
12285 6682327 556546 -2063788 -1155983 -372975 -356817 207164 756496 1065487 3460568
12276 3460568 7907176 9181256 4551471 -81297 1820051 7398846 9597893 8499084
12268H499084M62506Q50926m681225r507147o264474R62610M122745L544368L627893
12259A617286K874217j753815n761764k800441M034711O186926K386721j347629
12251E436212k105206j931620j266336J082325K831634R29744k004589j385254
12243A586910R55480j79444l759909m344511k029930j704533l160195j248705
12235a3884837L910892O168574L842673K017472K775304K024399j671998l813173
12227A369306k431739j488346k488608j091738L862663O312963L083525M3116
12219G171142J925595L457002j600501q625028q359769j188613L842076K554884
12211h23212k51026k21198O14277q44795l180693k925352N49938M569671N910614
$$ plain form
12268 8499084 8961590 9812516 5131291 -4375856 -10640330 -9677720 -5554975 -2010607 1617286
12259 1617286 4491503 2737688 -3024076 -5824517 -1789806 4397120 6783841 5436212
12251 5436212 3331006 1399386 133050 1215375 4047009 4976753 2972164 1586910
12243 1586910 2542390 2362946 -1396963 -5741474 -7771404 -9475937 -12636132 -13884837
12235 -13884837 -9973945 -3805371 37302 2054774 4830078 6854477 5182479 1369306
12227 1369306 -1062433 -2550779 -5039387 -6131125 -2268462 4044501 7128026 7171142
12219 7171142 9096737 12553739 10953238 2328210 -6031559 -7220172 -3378096 -823212
12211 -823212 -1074238 -1295436 -681159 -1525954 -4706647 -7631999 -7082061 -2512390 3398224
12202C398224L459962m85045j976481j5895J742672k5941l215463l318387l87730
12193h24084J158956k58222r24775J609856L588793M21731n324804o248747n64928
12184g366224M684843L341144j138369j283261K823399M148125L90960k637095
12176B963522j552083j335901n606590q252394k784346N319988N511151j537412
12168g274065n215585j710044J787463R81243J089293N391588P643558K547243
12160E240694m358971m747183M71783M130511L095022o12477m524708n857381
12152g162710j673216N342219O575022o05163o420476k068069O174296O135240
12144F297143j425307m899008o43173K804584J05479l252665k009406N02126j76718
$$ plain form
12202 3398224 6858186 6373141 4396660 4380765 6123437 6097496 2882033 -436354 -824084
12193 -824084 334872 76650 -848125 761731 4350524 4772255 -552549 -6801296 -7366224
12184 -7366224 -2681381 659763 -478606 -1761867 1061532 5209657 5600617 2963522
12176 2963522 1411439 75538 -5531052 -13783446 -16567792 -11247804 -5736653 -7274065
12168 -7274065 -12489650 -14199694 -12412231 -11430988 -10341695 -4950107 2693451 5240694
12160 5240694 881723 -3865460 -3393677 736834 3831856 3219379 -1305329 -7162710
12152 -7162710 -8835926 -3493707 3081315 2476152 -3944324 -6012393 161903 6297143
12144 6297143 4871836 -27172 -670345 2134239 2239718 -1012947 -3022353 -2520227 -2696945
12135b696945k128133k131577j393557j352188R0545L358031M050705J02635l329418
12126e429902j659719J427888L38298k554137n88513N969822R545653N738018
12118A2787408j512080n648144m196591M29351L493649J607392l384386n341023
12110a764424j546286K647311R95104m044735m602397P49548N064195L694326
12102A192642K92022l09557P20659L1117j558018j192587O57849J541488J486961
12093B862576J842120J604054o02450k465952q32986K343519K200053j124106
12085E826828k482385l16015R15868j048076j937948J352285M437701K216185
12077H964443k492384l446938q88729Q7961j060799l42927K023615J141447l234506
$$ plain form
12135 -2696945 -4825078 -6956655 -8350212 -9702400 -9611855 -6253824 -2203119 -2100484 -5429902
12126 -5429902 -7089621 -5661733 -5323435 -7877572 -8466085 -2496263 7049390 12787408
12118 12787408 11275328 5627184 1430593 1859944 5353593 6960985 3576599 -1764424
12110 -1764424 -3310710 -663399 331705 -3713030 -8315427 -7565879 -2501684 1192642
12102 1192642 1484664 1175107 1895766 1926883 368865 -823722 -165873 1375615 2862576
12093 2862576 4704696 6308750 5706300 3240348 2407362 4750881 6950934 5826828
12085 5826828 3344443 3028428 3944296 2896220 958272 2310557 6748258 8964443
12077 8964443 6472059 3025121 2136392 2224353 1163554 820627 2844242 3985689 751183
12068G51183n042446k085376R1071j657653j964671L218218P909797N173544o36946
12059E756721k82978M974233M974282k803003q831235o089461K28071K009685
12051f3685k62358j053086P03983J950022J820438J646544Q97674j498216l436807
12042G04509k268310K77237Q36189O46674L166323O315240M228878k353429n176542
12033F376769j068823K105736k363733q559328o724030J159915M622924J492651
12025b957919N4041L311693L194736m320040r447022l072073P421935Q383825
12017B569176O49301k953051J312297L536027j617790n855791j989125L956180
12009c92776L526887l76370o0849L364329L299355O6763n80072J141989k95091
$$ plain form
12068 751183 -4291263 -6376639 -6285568 -7943221 -9907892 -6689674 1220123 6393667 5756721
12059 5756721 5473743 10447976 15422258 12619255 3788020 -2301441 -2073370 -63685
12051 -63685 -326043 -1379129 -675146 1274876 3095314 4741858 5639532 4141316 704509
12042 704509 -1563801 -1286564 -450375 196299 3362622 9677862 13906740 11553311 6376769
12033 6376769 5307946 7413682 5049949 -3509379 -10233409 -9073494 -4450570 -2957919
12025 -2957919 -2903878 407815 3602551 -717489 -10164511 -13236584 -5814649 2569176
12017 2569176 3218477 265426 1577723 5113750 3495960 -2359831 -4348956 -392776
12009 -392776 3134111 2757741 2696892 6061221 9360576 9427339 8847267 9989256 9694165
12000I694165m371288m246486R65521L561848j21936l512236r25712K972111J248453
11991E264440l690445m162507N19467L548674J417260j772164j717002K14255
11983c78022Q99469P07279J270037J014951k545857o955017o001192J737728R253628
11974i96996R015135K237411l318001l442942j164816o00712j809107k971937
11966c051965l472245k821120k12018K792105K860584L05600m02816J908435K377616
11957B84176j318688l545451J84031M311039J675547l594516k042893M538177
11949D91422M573039m217999r567692l191715O343744O864765K41510k671862
11941a134788O86734K734603p00525m545081l382857J096938M096679M086790
$$ plain form
12000 9694165 5322877 1076391 2041912 5603760 5481824 1969588 1043876 4015987 5264440
11991 5264440 1573995 -2588512 -2069045 1479629 2896889 1124725 -592277 -378022
11983 -378022 521447 1228726 2498763 3513714 967857 -5987160 -11988352 -10250624 -996996
11974 -996996 8018139 10255550 6937549 3494607 2329791 1729079 -80028 -3051965
11966 -3051965 -6524210 -9345330 -9557348 -6765243 -3904659 -3599059 -4001875 -2093440 284176
11957 284176 -1034512 -4579963 -4395932 -84893 1590654 -2003862 -4046755 491422
11949 491422 5064461 846462 -8721230 -11912945 -5569201 1295564 1537074 -1134788
11941 -1134788 -448054 2286549 1586024 -2959057 -6341914 -5244976 -1148297 2938493
11933B938493K402031k807k484861l440754j742891J207181K603621J375105p61261
11924B093857j470837l53454J065460J461834R60307J70600q93104k260702l390786
11915b616825l909174l831348k349137J610557O176583O543613J149626m362829
11907a588934l410109K556217N793460K570521k875512n056491l442389q91718
11899f344955J99482j055364l436023l269539J748147P870973Q623834L538815
11891G875370j158631j764165j560492l752525n517320l069323J665435L921746
11883c359905K671363L83637j263632j870570q99411Q70768Q16026j425638j938424
11874f015786J837268O041301N127879k14915m113442l273944K77901L413911
$$ plain form
11933 2938493 5340524 5337717 2852856 -587898 -2330789 -1123608 1480013 2855118 2093857
11924 2093857 623020 269566 1335026 2796860 3757167 3927767 3034663 773961 -2616825
11915 -2616825 -6525999 -10357347 -12706484 -11095927 -4919344 1624269 2773895 -1588934
11907 -1588934 -4999043 -2442826 3350634 5921155 3045643 -2010848 -5453237 -6344955
11899 -6344955 -6145473 -7200837 -10636860 -13906399 -12158252 -4287279 4336555 7875370
11891 7875370 6716739 4952574 3392082 -360443 -5877763 -8947086 -7281651 -3359905
11883 -3359905 -688542 -304905 -1568537 -3439107 -4338518 -3467750 -2651724 -4077362 -6015786
11874 -6015786 -4178518 1862783 6990662 6775747 2662305 -611639 -333738 3080173
11866C080173M949798M520161J797455k308985n475194n565514k214719K163512
11858I46687L095251j483653o904199n805022J769225O880237L542183k650128
11850f09419k795838K364007M587562J144575k003884n01767K069072Q45572k733292
11841B366588l820832j271953J995764L907761M867222M965031K788784j895419
11833A3902946o208486o784585l907866j264865j162059j786136m84762J982689
11825e713124K769634J400183J11501J69700O19918N90696K01569o26550j626445
11816b102918j056021J836992M190301L100339N73309K28239N70656k127547n277722
11807f4372k549956M343893N845332n52351n183589j099631N034081M136145j101987
$$ plain form
11866 3080173 8029971 12550132 14347587 12038602 6563408 997894 -1216825 946687
11858 946687 4041938 2558285 -4345914 -10150936 -8381711 -1501474 2040709 -609419
11850 -609419 -3405257 -1041250 3546312 4690887 2687003 2185236 4254308 5099880 2366588
11841 2366588 -1454244 -2726197 -730433 3177328 8044550 13009581 15798365 13902946
11833 13902946 7694460 909875 -2997991 -4262856 -5424915 -7211051 -7695813 -5713124
11825 -5713124 -2943490 -1543307 -1431806 -1262106 -642188 -51492 150077 -476473 -2102918
11816 -2102918 -3158939 -1321947 2868354 5968693 6542002 6770241 7340897 5213350 -64372
11807 -64372 -2614328 1729565 7574897 7022546 1838957 739326 5773407 9909552 8807565
11798H807565k156466J161261K250875l11423j866353p21855M25925R20801K289842
11789A0800172K833477o29541n929663p080242k731919K433917M435925L199810
11781G331936N2126l090437l380991o40428O42883k273461m773826j365075N205203
11772b292070P800548N153467J437141j629628m744635n703858k347949J206396
11764a120588k90113l702841j967023L710493N716979K879794J213544K323005
11756H763250J727057r51160j052136R15524o49471m616951l182689L629125N765810
11747A0348359l72010n263083j712782M302436M895297J982248M31856r18217
11739A3694104l670301m164223j212244r26209n709063p264494J48207Q036003
$$ plain form
11798 8807565 6651099 7812360 10063235 9751812 7885459 7163604 7589529 8510330 10800172
11789 10800172 13633649 13004108 7074445 -5797 -2737716 -303799 4132126 7331936
11781 7331936 7384062 4293625 912634 272206 915089 -1358372 -6132198 -7497273 -2292070
11772 -2292070 5508478 10661945 12099086 10469458 5724823 20965 -2326984 -1120588
11764 -1120588 -1410701 -5113542 -7080565 -3370072 2346907 5226701 6440245 8763250
11756 8763250 10490307 9539147 8487011 9402535 8753064 4136113 953424 4582549 10348359
11747 10348359 9976349 4713266 3000484 7302920 12198217 14180465 14612321 13694104
11739 13694104 10023803 5859580 4647336 3721127 -1987936 -9252430 -9104223 -1068220
11731a068220O025825j495538l039615J480059K697353j419708l640078j017075
11723a476997J536871J554805K371255M827151M705707M63459l796944m798929
11715E386378l578014j768793K1458J72548j992586k850330Q84207N179782L352193
11706D806843k872669m804314P1283M360227K192469k901707m578554k013477
11698e739899J684460M274254M387035J172521l055517l800991o49072J490782
11690b36427l700j143443J804474N431657M132201r84284l711838k019668r6033
11681C172939q06122j520316L33184K095849K78456k705029j407093L801631O386238
11672I629737L373458k92790l00889k42831m679342r482001p126746N67330M096108
$$ plain form
11731 -1068220 4957605 3462067 422452 1902511 4599864 3180156 -459922 -1476997
11723 -1476997 59874 1614679 3985934 8813085 13518792 13982251 10185307 5386378
11715 5386378 1808364 39571 61029 233577 -1759009 -4609339 -3725132 1454650 4806843
11706 4806843 1934174 -2870140 -2798857 1561370 3753839 852132 -3726422 -5739899
11698 -5739899 -4055439 218815 4605850 5778371 2722854 -1078137 -1727209 -236427
11690 -236427 -240127 -1383570 420904 5852561 9984762 9000478 5288640 3268972 3172939
11681 3172939 2366817 846501 1179685 3275534 3553990 848961 -558132 3243499 9629737
11672 9629737 13003195 12710405 12409516 12166685 7487343 -1994658 -9121404 -8554074 -4457966
11663d457966Q17615j545747J787881N217793L213922k66437N57350K948786P95065
11654I068262m538230o442607l395084J77406J658179K377574K931883K007337
11646C844720l78469k546404l385687k231413J178262M056991J864654m204004
11638a801350o023909J73159O656113M877760j832313m277388j580599J10824
11630c697703k50313J499211M246721K186012l681452n410630j293138J155916
11622e245376j609464k987940K104022Q229561Q034730K879207j206455k533111
11614G665174k771265j728455Q23064J730246j285015m588544l261813J175018
11606b241590K844710K05409k290684j299545R63283Q18088j186256j120108K388061
$$ plain form
11663 -4457966 -3640351 -5186098 -3398217 1819576 5033498 4767061 5324411 8273197 9068262
11654 9068262 4530032 -1912575 -5307659 -5130253 -3472074 -1094500 1837383 3844720
11646 3844720 3466251 919847 -2465840 -4697253 -3518991 538000 2402654 -1801350
11638 -1801350 -7825259 -7652100 -995987 3881773 2049460 -2227928 -3808527 -3697703
11630 -3697703 -3948016 -2448805 1797916 3983928 302476 -5108154 -6401292 -5245376
11622 -5245376 -6854840 -9842780 -7738758 490803 8525533 11404740 10198285 7665174
11614 7665174 4893909 3165454 3988518 5718764 4433749 -154795 -3416608 -2241590
11606 -2241590 603120 808529 -1482155 -2781700 -1818417 -1000329 -2186585 -3306693 -918632
11597i18632N405589L585483j304088l063949l005K004809j674705o690231n855247
11588h513976r9050L207095J524783l27673P87026J862638K99925j374446n35768
11579c169446P38286m07397k346702j224017L410256P699721P326268J554168
11571A3581137n426863p807207m570952r50298r42760j424005J749075N275966
11563e15907L238181j909257k216629K230289K690042l444559p511786l498317
11555a0937943K477121K830037K73688R87021K782865l39453n838666m905949
11547a2671279L555833R908719O577247k279128o724351l023971L239928M707066
11539C290064O31875l167958k225483J012473J464721r37465j826526M53170L074367
$$ plain form
11597 -918632 4486957 8072440 6768352 3704403 3701398 5706207 4031502 -2658729 -8513976
11588 -8513976 -8613026 -5405931 -3881148 -4208821 -3421795 -1559157 -1259232 -2633678 -3169446
11579 -3169446 -2431160 -2838557 -5185259 -6409276 -2999020 4700701 12026969 13581137
11571 13581137 8154274 347067 -4223885 -5174183 -6116943 -7540948 -5791873 -515907
11563 -515907 2722274 813017 -1403612 826677 3516719 72160 -7439626 -10937943
11555 -10937943 -8460822 -5630785 -5357097 -4370076 -1587211 -1926664 -7765330 -12671279
11547 -12671279 -9115446 793273 7370520 5091392 -1632959 -4656930 -1417002 3290064
11539 3290064 3921939 753981 -1471502 -459029 1005692 68227 -1758299 -1305129 1769238
11530A769238L991372L908175K645728r57157m670045m296034q60616j63245l272314
11521a904898m230284r2021L711386K134936j727937k454228k80521J606137K663259
11512e74171L077932J191401k435578l341521k11115J698484r20228l280596o16187
11503e411579L391162K996438p2553o91356O88967N12845o43836n97963j123113
11494i50988l619464l790760J224757N038019O43050p040699p412584j53445N454834
11485a0607280N159837L069805J582176j122049l572220j515696L307816M560731
11477H63120J949249Q27359J236830j746714o135744l704795N023550Q809556
11469G122411K920105l478630k642706L67086j366820m614322l377832J87686
$$ plain form
11530 1769238 5760610 9668785 12314513 11357356 6687311 2391277 1530661 1367416 -1904898
11521 -1904898 -6135182 -6227203 -2515817 -380881 -2108818 -4563046 -4843567 -3237430 -574171
11512 -574171 2503761 3695162 1259584 -2081937 -2293052 -594568 -1514796 -4795392 -5411579
11503 -5411579 -2020417 976021 903468 212112 901079 1413924 770088 172125 -950988
11494 -950988 -4570452 -8361212 -7136455 -2098436 -1455386 -8496085 -15908669 -16062114 -10607280
11485 -10607280 -5447443 -2377638 -795462 -1917511 -5489731 -7005427 -3697611 863120
11477 863120 2812369 3639728 4876558 3129844 -3005900 -6710695 -1687145 7122411
11469 7122411 10042516 6563886 3921180 4288266 2921446 -1692876 -5070708 -4883022
11461d883022J003896L93618J801437L069321R64295j801414j502202k27065p46320
11452a927456k50231L196815M032678j990563p881808m625328L826566N873569
11444B54242Q785m216691k065508J056582J090445J101305K749920J896606k930284
11435a054598n882329k689460K289475L059780P64546K79812K180553L337535
11427B285314K742852J942682J327741L6797j420167j766352j589732k512574
11419A046561l877619k852248J322299M924046L506957j855487m284804N98062
11411a472233P445966O707701k020390p885435l304321N148791O311784J64494
11403A1096357m171862l246244k260258l586173k728084J758535L952901O55844
$$ plain form
11461 -4883022 -3879126 -3485508 -1684071 1385250 2349545 548131 -954071 -1181136 -1927456
11452 -1927456 -2177687 1019128 5051806 3061243 -4820565 -9445893 -5619327 254242
11444 254242 263027 -3953664 -6019172 -4962590 -3872145 -2770840 -20920 1875686 -1054598
11435 -1054598 -6936927 -9626387 -7336912 -4277132 -3512586 -3232774 -1052221 2285314
11427 2285314 5028166 6970848 8298589 8335386 6915219 5148867 3559135 1046561
11419 1046561 -2831058 -5683306 -4361007 563039 4069996 2214509 -2070295 -1472233
11411 -1472233 5973733 12681434 10661044 2775609 -528712 4620079 10931863 11096357
11403 11096357 6924495 3678251 1417993 -2168180 -4896264 -3137729 815172 1471016
11395A471016k524793o46738K409990J543391n68928N83048K239451l71309m203723
11386f8595k948057J629370K275101j513855l239782q95898O31155o72183q93617
11377e696361J326571J993494O5210J48123L433555M155069l93360m097427j875005
11368i40131J803805P76312k683457k939051r58231j259910k989414k201009J01528
11359a1289558L66314K43588L397184O762329M296167j736352l135081O28987
11351d66422J672752k080072l099262J791962M765123L46009m599875k352369
11343d022154K666699K156385j484510j84174M454123L302355l900394o835045
11335c846715j431620L155399m25844n493721k139042O470207Q526241J690176
$$ plain form
11395 1471016 -1053777 -1700515 709475 2252866 1683938 2266986 4506437 4135128 -68595
11386 -68595 -3016652 -1387282 887819 -626036 -3865818 -4761716 -4130561 -4802744 -5696361
11377 -5696361 -4369790 -2376296 -2311086 -2162963 1270592 5425661 5032301 934874 -940131
11368 -940131 863674 1639986 -1043471 -3982522 -4940753 -6200663 -9190077 -11391086 -11289558
11359 -11289558 -10923244 -10679656 -7282472 -520143 3776024 2039672 -1095409 -466422
11351 -466422 1206330 -873742 -3973004 -2181042 2584081 2930090 -1669785 -4022154
11343 -4022154 -1355455 800930 -683580 -867754 3586369 6888724 2988330 -3846715
11335 -3846715 -5278335 -2122936 -2548780 -8042501 -10181543 -3711336 4814905 6505081
11327F505081l418204N16895O446797L598076o262666j0890194m653012M238202
11319c919025O031706K235124N63476J809439k9576n726666p961272l010672K490810
11310g516656J458961k951607k987008J452649L548075P81074j862634l98804
11302h475950K533854K552789j48546j725772K35328M026824N353412J804004
11294F155943l446363m291490K86165L819447J131174l796178l633252J280082
11286b494472M042652J979278o15470n90728J29514m1532M71089J847833J479224
11277F207388o97574j276921M5458o93125l660003l118152K512943N760018J224021
11268F304053m891027l907483J840472L378515m51905k347510P93298L684699
$$ plain form
11327 6505081 3086877 3603772 10050569 13648645 7385979 -3504215 -8157227 -3919025
11319 -3919025 2112681 4347805 4911281 6720720 6691144 964478 -6996794 -10007466 -7516656
11310 -7516656 -6057695 -9009302 -11996310 -10543661 -6995586 -6214512 -8077146 -8475950
11302 -8475950 -5942096 -3389307 -3537853 -5263625 -5028297 -1001473 4351939 6155943
11294 6155943 2709580 -1581910 -1295745 2523702 3654876 -141302 -3774554 -2494472
11286 -2494472 1548180 3527458 2911988 2321260 2450774 2409242 2880331 4728164 6207388
11277 6207388 5509814 4232893 4278351 3585226 -74777 -3192929 -679986 5080032 6304053
11268 6304053 1413026 -2494457 -653985 2724530 2272625 -74885 718413 4403112
11260D403112K073238j406945k810786k162992j115047l18179n84496k091517
11252d013612j850870K751733P507780N054588l535332q098855l437394L125174
11244b496788K986296j516523k661983L401N08568k734770m930534l254537l49508
11235a4446378J288441K681632M681893N531584L914548J142882r64082j746271
11227B084249q77124J219726K114397r9020l017873k544943N37107J157807k012464
11218a438138m185425k134471P43685L26716j573897o80739K748244M902121M430606
11209C138702L257369K586194J796187N54054r43336k858666m346297l057968
11201A26239J049487L621709J450700j982242j270199K175511J908337l255429
$$ plain form
11260 4403112 6476350 5069405 2258619 95627 -1019420 -1337599 -1922095 -4013612
11252 -4013612 -5864482 -3112749 4395031 9449619 5914287 -2184568 -5621962 -2496788
11244 -2496788 489508 -1027015 -3688998 -3685597 -3177029 -5911799 -10842333 -14096870 -14446378
11235 -14446378 -13157937 -10476305 -5794412 -262828 3651720 4794602 3830520 2084249
11227 2084249 1207125 2426851 4541248 4442228 1424355 -1120588 -583481 574326 -1438138
11218 -1438138 -5623563 -7758034 -7014349 -6687633 -8261530 -8942269 -6194025 -1291904 3138702
11209 3138702 6396071 8982265 10778452 11332506 10389170 7530504 3184207 126239
11201 126239 1175726 4797435 6248135 4265893 2995694 5171205 7079542 3824113
11193C824113o792608l782455K563039O028948M918627J879507m94412j275892
11185F868867p35762k72505j095454k116197j304277P08340J460602J115967J946726
11176F576307K975654M16073m927716o499088j402393M402050M488284O01882
11168F631053k097434l659207o621029q219567l310063N906626J0578769O595825
11160E804973n85047l779169j792436J922034L729084J554038l639744o832310
11152c618577l603823K936808M607770n42908m649752j254476M823811M391862
11144C090715k492742o603596k819374L263989M066828J03415k535814j376032
11136e302611O33049J147038J146404J061187r78028m714193n656807j052306
$$ plain form
11193 3824113 -2968495 -6750950 -4187911 1841037 6759664 8639171 8144759 6868867
11185 6868867 6133105 5860600 4765146 2648949 1344672 2053012 3513614 4629581 6576307
11176 6576307 9551961 9968034 5040318 -1458770 -2861163 1540887 6029171 6631053
11168 6631053 4533619 874412 -5746617 -13966184 -17276247 -11369621 -790852 5804973
11160 5804973 5219926 1440757 -351679 1570355 5299439 6853477 3213733 -3618577
11152 -3618577 -7222400 -4285592 322178 -220730 -4870482 -6124958 -1301147 3090715
11144 3090715 597973 -6005623 -8824997 -5561008 -1494180 -1390765 -3926579 -5302611
11136 -5302611 -4669562 -3522524 -2376120 -1314933 -2292961 -7007154 -12663961 -13716267
11128a3716267M958600O445897L799214J829667J440199o35986m060805l889874
11120c829355Q84807M480631L195546R56327J750642K396104j319188o007168
11112B508346n166989N54328M467425L651298J288968Q8548n21195p70327K97208
11103F397610J646444R26245j384540k544572j996998j363919q92481n5420k60242
11094D72127k230284k598487J114871M208679Q11041n241173m463981L054598
11086d872609O356013J80354o802123n286496J492785M503304K346100M09064
11078a673608Q52969R91287k88631q68150K04340J085349j1203k715717m669427
11069g092791l001164K210132N784729K717354l905359n761301j377175J592150
$$ plain form
11128 -13716267 -8757667 -2311770 1487444 3317111 4757310 4121324 60519 -3829355
11120 -3829355 -2944548 1536083 4731629 5687956 7438598 9834702 8515514 2508346
11112 2508346 -2658643 -2104315 2363110 6014408 7303376 7391924 6870729 6100402 6397610
11103 6397610 8044054 8970299 7585759 5041187 3044189 1680270 787789 732369 472127
11094 472127 -1758157 -4356644 -3241773 966906 1777947 -3463226 -7927207 -4872609
11086 -4872609 1483404 1663758 -5138365 -10424861 -8932076 -4428772 -2082672 -1673608
11078 -1673608 -820639 170648 -117983 -986133 -781793 303556 292353 -2423364 -7092791
11069 -7092791 -10093955 -7883823 -2099094 618260 -3287099 -9048400 -10425575 -8833425
11061h833425j007365l034242P94296N037545K817737j779459n97987M086892
11053b516008L369851k327840l237521L211784P456466K744736m940033o902767
11045c141332l552584k79319J870913M483527N344778J186926n119696o698323
11037e905110j855596L881912N382165L420191J539128Q99648L15163o76540j242481
11028E758480j251059j791323l123696l573421j776860Q38335J674554P75578
11020b469412O70689K003545K070804q46185m227890m487852j377661K749115
11012e914847N793035N919427J773390m112982n361123L18599O121582M686214
11004I223295r05595j862951K119144K535475l076768o017205n97581N643080
$$ plain form
11061 -8833425 -9840790 -12875032 -12080736 -7043191 -4225454 -6004913 -6602900 -2516008
11053 -2516008 853843 -1473997 -4711518 -1499734 5956732 8701468 3761435 -3141332
11045 -3141332 -6693916 -6973235 -5102322 -618795 4725983 5912909 793213 -5905110
11037 -5905110 -7760706 -3878794 1503371 4923562 6462690 7362338 7677501 7000961 5758480
11028 5758480 4507421 2716098 -407598 -3981019 -5757879 -4919544 -3244990 -2469412
11020 -2469412 -1798723 204822 2275626 1429441 -2798449 -7286301 -8663962 -5914847
11012 -5914847 -121812 5797615 7571005 3458023 -1903100 -1584501 4537081 9223295
11004 9223295 8317700 6454749 8573893 11109368 8032600 2015395 1417814 7060894
10996G060894L276957m224505o084399n09369M194329L156667J94543r68456k003286
10987D093375m203214m951910l286525k504360l425577j314097N496992R713290
10979c82026M672151m189757n450478K348490Q848961O424501p77161m515149
10971F979532k873311M97456K668149K708324m0802m626931p176126m597861J153091
10962e308479M998006M158528Q8728l593366l710483k9264L437545K191868k225341
10953G742l171851J248770M100338q1342n647935l586870M197696P161337K056516
10944F284401k768084r42031L067446K985516P07292R11710J841098p95759m648304
10935F643285l798907P31493J875687j854097l685968J86608M063892J922501
$$ plain form
10996 7060894 10337851 6113346 28947 -480422 3713907 6870574 7065117 6096661 4093375
10987 4093375 -109839 -5061749 -8348274 -10852634 -14278211 -15592308 -10095316 -382026
10979 -382026 4290125 100368 -5350110 -3001620 5847341 12271842 11494681 6979532
10971 6979532 4106221 4603677 7271826 9980150 9939348 5312417 -1863709 -6461570 -5308479
10962 -5308479 -310473 3848055 3936783 343417 -3367066 -3396330 41215 2233083 7742
10953 7742 -3164109 -1915339 2184999 2103657 -3544278 -7131148 -2933452 4227885 6284401
10944 6284401 3516317 2574286 5641732 8627248 9334540 10246250 12087348 11291589 6643285
10935 6643285 2844378 3575871 5451558 3597461 -88507 98101 4161993 6084494
10927F084494k690681k368163K024637K589313k664018n927496j542367M682399
10919A88118L807329k617077m709859Q38385N814742K780358m298481o432317
10911d628802k106375K413148K923075J479505J065347J229708L27400j259705
10903A443301j684901K9508K542909K582102j587195o134976m531382K989848
10895d350786P194425J970175n463655l840347N260215R067580K283494n667730
10887F453371n127488Q05364L175090L20304k567945k723023j785212n34565K222886
10878B38782N551091N728908R82841n310503p385067l041562L203371M192703
10870D160564j268242n920510l229424L206316M518614n64209m426521k439940
$$ plain form
10927 6084494 3393813 1025650 3050287 5639600 2975582 -2951914 -4494281 188118
10919 188118 3995447 1378370 -3331489 -2493104 3321638 6101996 1803515 -4628802
10911 -4628802 -6735177 -4322029 -1398954 80551 1145898 2375606 2703006 1443301
10903 1443301 -241600 -212092 2330817 4912919 3325724 -2809252 -7340634 -4350786
10895 -4350786 2843639 4813814 -649841 -4490188 770027 9837607 12121101 6453371
10887 6453371 1325883 2131247 5306337 5626641 3058696 335673 -1449539 -1984104 238782
10878 238782 5789873 11518781 12501622 7191119 -193948 -3235510 -32139 4160564
10870 4160564 2892322 -3028188 -6257612 -3051296 1467318 903109 -3523412 -5963352
10862e963352J213497J777359R88469K163065L989510L562565J209113j487494
10854G452732m436034o527103m680034J075223N547020M810031J071453j543572
10846B769716k017974r99762R09169J271956k221853n819658k669590N399537
10838c378459P404759p00011q219654n022780L413080N183943l05381l872414
10830e496917j502014K198421L049346J150283k463363n672891m153256K788912
10822a0101479Q359223O991991K757458J662502R76324m171489q837923n064938
10814g428331K789798L079444l844847n420437K692691R760851P329780P45257
10806I704206k293256l345424o015751o565391o93934O620591O982472Q40434
$$ plain form
10862 -5963352 -4749855 -2972496 -1984027 179038 4168548 7731113 8940226 7452732
10854 7452732 3016698 -3510405 -8190439 -7115216 -1568196 3241835 4313288 2769716
10846 2769716 751742 -248020 661149 1933105 -288748 -6108406 -8777996 -3378459
10838 -3378459 4026300 3326289 -4893365 -9916145 -6503065 -1319122 -1624503 -5496917
10830 -5496917 -6998931 -4800510 -1751164 -600881 -3064244 -8737135 -12890391 -10101479
10822 -10101479 -1742256 5249735 8007193 9669695 10646019 6474530 -2363393 -7428331
10814 -7428331 -4638533 -1559089 -5403936 -10824373 -8131682 1629169 8958949 9704206
10806 9704206 7410950 4065526 -1950225 -8515616 -9209550 -2588959 4393513 5233947
10798E233947l699951k579483J67000k1511j687147k23712M903633Q199387M563529
10789A4855692l227295o643649k120560M277693N550577K626908K86860j049414
10781A4556812l319097m622193k399752J65537j357015m301632l176187K03768
10773d249759r2892k829373j652741K624055K734647j750901l068753J163797
10765g121920M084164K071918L61007K338327L395829K53996k710915j587279
10757A085127P01680Q84347N56276P30656r27613l453848j712739L543657M034947
10748E442490k405804o329871j540463M210668J949493l746967k926499L369239
10740a977714N823932J851730k384981k824389j522675q44749p64267j204975
$$ plain form
10798 5233947 1533996 -1045487 -878487 -899998 -2587145 -2810857 2092776 10292163 14855692
10789 14855692 11628397 4984748 2864188 7141881 12692458 15319366 15606226 14556812
10781 14556812 11237715 6615522 4215770 4381307 3024292 -1277340 -4453527 -4249759
10773 -4249759 -4342651 -7172024 -8824765 -6200710 -3466063 -5216964 -8285717 -7121920
10765 -7121920 -3037756 -965838 -604831 1733496 5129325 5383321 2672406 1085127
10757 1085127 1786807 2671154 3227430 3958086 3030473 -423375 -2136114 1407543 5442490
10748 5442490 3036686 -3293185 -4833648 -622980 1326513 -2420454 -5346953 -1977714
10740 -1977714 3846218 5697948 3312967 488578 -1034097 -1878846 -2643113 -3848088
10732c848088j667178o1294L563664M811194J085323l377464l615101j402596
10724d511540j081904j735263P1228K914756K798184N92670L99919J957196J302897
10715B708143j674184k655885j21961K302122J729017K6399N49825L421024N168280
10706A1452780K350790m066816q161357n183247J754753M838260J880290j518721
10698C346732j450840r45038k504411k233316K802308O894337K958520n594536
10690C273756q112635j270353O471139O384486L34531k845670N88153M452522
10682I275929J145297p050072r596401k073766O554706O091395m08626k358915
10674A579547J626555L281171q0180j807208Q48486J736367j851803l145904J916478
$$ plain form
10732 -3848088 -5515266 -5576560 -2012896 2798298 3883621 506157 -3108944 -4511540
10724 -4511540 -5593444 -7328707 -7257479 -4342723 -1544539 -951869 -551950 1405246 2708143
10715 2708143 1033959 -1621926 -1743887 558235 2287252 2313651 2863476 6284500 11452780
10706 11452780 13803570 9736754 1575397 -3607850 -1853097 2985163 4865453 3346732
10698 3346732 1895892 950854 -1553557 -3786873 -984565 5909772 8868292 3273756
10690 3273756 -4838879 -6109232 361907 6746393 7080924 4235254 4823407 9275929
10682 9275929 10421226 3371154 -6225247 -8299013 -1744307 4347088 3938462 1579547
10674 1579547 3206102 6487273 6407093 4599885 5448371 7184738 5332935 2187031 4103509
10665D103509O529416L897815k335584n262615m415881k115772J766487N263824
10657G431199L095121l673566n856796n78054K855816r21604l170557K837779
10649B019338P704578J389534p827094n919693L447753N552008o87219k851743
10641B827462K443708N098868L30930m356670l653100j655028j244626R78037
10633G69581N253445N606735N26390l294295j980099j28028j461127k394675N57025
10624C454952M208733M163399J380980m13742K22709K174384L054595L80303m851946
10615A3774367p015399l036956J469900m99527o127570o392388N20337P366699
10607E9463Q648623N448154J87388n300365o912753j962837M136077L141661l791009
$$ plain form
10665 4103509 10632925 14530740 12195156 6932541 2516660 400888 2167375 7431199
10657 7431199 10526320 6852754 995958 417904 3273720 2352116 -818441 2019338
10649 2019338 9723916 11113450 3286356 -2633337 814416 6366424 5679205 2827462
10641 2827462 5271170 10370038 10700968 6344298 2691198 1036170 -208456 769581
10633 769581 6023026 11629761 12156151 8861856 6881757 6753729 5292602 2897927 3454952
10624 3454952 7663685 11827084 13208064 12794322 13017031 15191415 18246010 18626313 13774367
10615 13774367 6758968 3722012 5191912 4692385 -1435185 -7827573 -7307236 59463
10607 59463 8708086 14156240 14343628 9043263 2130510 167673 4303750 7445411 3654402
10598C654402p427192m220567K9571J001446J041481J708858K86938l174607l549109
10589a0648779Q35293M321930K467026j443096k102406N81159L331440M441077
10581A783644L943472K120382M0290q80376r09145j400989k232323k205778j347876
10572a088699m77755L21326Q78162O76272Q67495L015528M574923J156360m787028
10563E136584n035769J308310M807203Q56200k345404J606662N566492J809382
10555A3709660l536744j496123L331506J390387m306761m208646L46111J056627
10547F286017j056978J096790N260990L365868k689078m100251j161356j204744
10539E797258l545207j678906K379822J258500l080600k786521J108555K180459
$$ plain form
10598 3654402 -3772790 -7993357 -7963786 -6962340 -5920859 -4212001 -3925063 -7099670 -10648779
10589 -10648779 -9813486 -5491556 -3024530 -4467626 -6570032 -5988873 -2657433 1783644
10581 1783644 5727116 7847498 7887788 7007412 6098267 4697278 2464955 259177 -1088699
10572 -1088699 -1566454 -1245128 -366966 309306 1176801 4192329 8767252 9923612 5136584
10563 5136584 100815 1409125 6216328 7072528 4727124 6333786 11900278 13709660
10555 13709660 10172916 8676793 12008299 13398686 9091925 4883279 5229390 6286017
10547 6286017 5229039 6325829 11586819 14952687 12263609 8163358 7002002 5797258
10539 5797258 2252051 573145 2952967 4211467 1130867 -1655654 -547099 1633360
10531A633360K167445N496129O459941q64762p060108j181909P549601L848579
10523A8048276n669830l693002N655088M187552n902395n812226M136374M964974
10515A5914811m705679o198071L242658N957685q39092m2019R802189R645485
10507C2777967k632722o497968J946009K918896o710081o628389M523677M173150
10499B3870539o679878m06206K0152606J7775661q318943j1771666J5538470K1076266
10491G1236849o990173o34335O2114321P8535916l2535358j71727116j70750566
10484a70750462l1253779P8068789O0601432j736790p400147K2780581K1793701
10477b7896675l393048o220656R058465P359900p198582o394540N330788M540399
$$ plain form
10531 1633360 3800805 9296934 15756875 14892113 7832005 6650096 14199697 18048276
10523 18048276 12378446 8685444 14340532 18528084 12625689 6813463 10949837 15914811
10515 15914811 11209132 5011061 8253719 14211404 13372312 13330293 23132482 32777967
10507 32777967 30145245 23647277 25593286 28512182 21802101 15173712 19697389 23870539
10499 23870539 17190661 16784455 36937061 54712722 46393779 34622113 50160583 71236849
10491 71236849 64246676 63612341 125726662 204262578 171727220 104 -170750462
10484 -170750462 -202004241 -123935452 -63334020 -65070810 -72470957 -49690376 -27896675
10477 -27896675 -31289723 -37510379 -28451914 -21092014 -28290596 -34685136 -29354348 -24813949
10469b4813949l497172Q50339R558869L415590p598116k077588J0793607P212249
10461f156171p089270p771064M100693O789796j575361l385715L052485K732344
10453i302263m569345l969706M630479N895730j796680m045104K042840L880016
10445g234033j538768l083211J640767K016502l713897m157171L336331O800662
10437e932818R34512m298621k195541M99777j613063k848339J354229N357307
10429h742557L591045n53464k188284k400150l191799k761844j87444J730543
10421a4703954J557861J533075K792624L491640K722053J550609J65232j551408
10413b442268j794113K79825J645822J47601j047359J043048L274505J908513
$$ plain form
10469 -24813949 -28311121 -27460782 -17901913 -14486323 -22084439 -24162027 -13368420 -6156171
10461 -6156171 -13245441 -21016505 -16915812 -10126016 -11701377 -15087092 -12034607 -9302263
10453 -9302263 -13871608 -17841314 -13210835 -7315105 -9111785 -13156889 -11114049 -7234033
10445 -7234033 -8772801 -11856012 -10215245 -8198743 -11912640 -16069811 -12733480 -5932818
10437 -5932818 -4998306 -9296927 -11492468 -10992691 -12605754 -15454093 -14099864 -8742557
10429 -8742557 -5151512 -5704976 -7893260 -10293410 -13485209 -16247053 -16434497 -14703954
10421 -14703954 -13146093 -11613018 -8820394 -5328754 -2606701 -1056092 -890860 -2442268
10413 -2442268 -4236381 -3956556 -2310734 -2163133 -3210492 -2167444 1107061 3015574
10405C015574m66042k63953j78813l426230n792585k276922K893839K473012j490224
10396e512344j553960K157317L238289P86264m82695j85207k074834m861468l184266
10387a1672904K355182N209486L140074M01122k20874q6206J15069Q88142O09345
10378G38436j818394k951829j13546K306106n30428m456824k375256L330131M371935
10369a499669L00846j792301o6500K47717k218723k500868J111187M027058L247357
10360H56104O61166j975639m128369l189011K170517O447586L482147l047800
10352A276701m330981l57874R24601k238199l174055M16679K555947L45647j083274
10343e664808J506011L701779J632732j824487k869234k223616j573884m87078
$$ plain form
10405 3015574 2549532 2285579 2106766 -1319464 -7112049 -9388971 -6495132 -4022120 -5512344
10396 -5512344 -7066304 -4908987 -1670698 -884434 -1367129 -1552336 -3627170 -8488638 -11672904
10387 -11672904 -9317722 -4108236 -968162 -567040 -787914 -874120 -759051 129091 738436
10378 738436 -1079958 -4031787 -4145333 -1839227 -2369655 -6826479 -9201735 -5871604 -1499669
10369 -1499669 -1198823 -2991124 -3057624 -2809907 -5028630 -7529498 -6418311 -2391253 856104
10360 856104 1517270 -458369 -4586738 -7775749 -5605232 842354 4324501 1276701
10352 1276701 -3054280 -3412154 -2487553 -4725752 -7899807 -7483128 -4927181 -4581534 -5664808
10343 -5664808 -4158797 -457018 1175714 -648773 -3518007 -5741623 -7315507 -7802585
10335g802585O44970Q2579j180814j82888K345062K642575L93989j286344j751868
10326f095324k357188j424325K973148O776487M776554j5540r69214L46301k222051
10317A788848n982233k752033M766190M827932l136027n754266K175103Q349391
10309D282905L188913n026895n091757m38920k47866l053860j650330K861969
10301e175841L884895J285424R2043J050840J459579J714573K913711J927897
10293I153121l181680o942980l862403J801512K106855k025699l043624Q33668
10285e161230M070152L459748J449869K67664m73518n14495R15581K101780Q97992
10276G013543j231896j737502j718032l299008m462351j986437K209193L267975
$$ plain form
10335 -7802585 -7157615 -7075036 -8255850 -8438738 -6093676 -3451101 -3057112 -4343456 -6095324
10326 -6095324 -8452512 -9876837 -6903689 -127202 4649352 4633812 3664598 4010899 1788848
10317 1788848 -4193385 -6945418 -2179228 2648704 -487323 -6241589 -4066486 4282905
10309 4282905 7471818 2444923 -2646834 -3085754 -3333620 -6387480 -8037810 -5175841
10301 -5175841 -1290946 -5522 86521 1137361 2596940 4311513 7225224 9153121
10293 9153121 5971441 -971539 -4833942 -3032430 -925575 -2951274 -5994898 -5161230
10285 -5161230 -1091078 2368670 3818539 4086203 3612685 3098190 4013771 6115551 7013543
10276 7013543 5781647 4044145 2326113 -972895 -5435246 -7421683 -5212490 -1944515
10268a944515P14054j605171j660690m30701J583873M034530M357806P74300l648310
10259B175176m704809l147116k154642r88552K778204O511495N017308o93680
10251D793384m047839k702565j023700j723779j760437J027580L195576J263705
10243i78075k318547k703375N39654L562845L669617J862564N56103N95267P62526
10234E548579k10488j499099j124906N64182M46961k650812n060558l021313J428549
10225e578905L045954R38424o29149R32344L044689K537272K23709j148392j070667
10216B295279r85447j153566k89702J664050K384501Q1679l237571l432717K33785
10207b439709L369783K173805j112699j690725L46091N77853k076835l592127
$$ plain form
10268 -1944515 -1230461 -2835632 -4496322 -4927023 -3343150 691380 5049186 5823486 2175176
10259 2175176 -2529633 -5676749 -7831391 -8819943 -6041739 469756 5487064 4793384
10251 4793384 745545 -1957020 -2980720 -4704499 -6464936 -5437356 -2241780 -978075
10243 -978075 -3296622 -5999997 -5460343 -1897498 1772119 3634683 4190786 4786053 5548579
10234 5548579 5338091 3838992 2714086 3278268 3725229 1074417 -3986141 -7007454 -5578905
10225 -5578905 -2532951 -1594527 -2223676 -1291332 1753357 4290629 4514338 3365946 2295279
10216 2295279 1309832 156266 -133436 1530614 3915115 3996794 759223 -2673494 -2439709
10207 -2439709 930074 3103879 1991180 300455 646546 1224399 -852436 -4444563
10199d444563j792413L33327L96134L38357J407921P60517k810250m717400j266688
10190a1795058L680148M330076J666188N26470J127788K12116j604991p60722
10182b617985K102153K825924J157626P73161J894036P35968k896924m264862
10174b90903j614983R01723N20727L2047J604686K039424j647542o190485o242582
10165a0887888j877214K237141L442033L169574L243752L251378J938726m43045
10157D074457j858154o43421J895791K189738r18291l699678k363817R99759J182232
10148H58616j957148k886894R41691M591113K518844l529335o934522m575691
10140a0973326L81132L258941K797804J051164j6050o75729j922051k655176m67403
$$ plain form
10199 -4444563 -6236976 -5903649 -5507515 -5169158 -3761237 -3000720 -5810970 -10528370 -11795058
10190 -11795058 -8114910 -3784834 -2118646 -1592176 -464388 -252272 -1857263 -2617985
10182 -2617985 -515832 2310092 3467718 4240879 6134915 6870883 3973959 -290903
10174 -290903 -1905886 -1004163 -483436 -451389 1153297 3192721 1545179 -4645306 -10887888
10165 -10887888 -12765102 -10527961 -7085928 -3916354 -672602 2578776 4517502 4074457
10157 4074457 2216303 1572882 3468673 5658411 4740120 1040442 -1323375 -323616 858616
10148 858616 -1098532 -3985426 -3043735 1547378 4066222 536887 -6397635 -10973326
10140 -10973326 -10592194 -7333253 -4535449 -3484285 -3500335 -4176064 -6098115 -8753291 -9220694
10131i220694M006928O179494L296400j127268j930042M76472J491945l69891
10123B803344k105607j633403j0082J699045L280753L104251k29283l732354k689189
10114D87475J844654L649745O71101j992639m68202K211265J762421j073317l251203
10105C841300m007266l523670j269636J205333K32473l889577n326967r66514
10097a3704524M363998N147742K991050K207202K076025m00959l486411l106590
10089c912467j70560Q63237m66671m31800K059627L848034K868445O37307r01874
10080D393278j492638j474361j272880j492302j629879l37747J432249O89563
10072a184717k063994k046267J804578L550854q8872k843294J228210O595483
$$ plain form
10131 -9220694 -5213766 965728 4262128 3134860 1204818 1681290 3173235 2803344
10123 2803344 697737 -935666 -945748 753297 4034050 7138301 6909018 3176664 487475
10114 487475 2332129 5981874 6652975 4660336 4192134 6403399 8165820 7092503 3841300
10105 3841300 -165966 -3689636 -4959272 -3753939 -3521466 -7411043 -12738010 -13704524
10097 -13704524 -9340526 -4192784 -1201734 1005468 3081493 2680534 -805877 -3912467
10089 -3912467 -4083027 -3219790 -3686461 -4118261 -2058634 1789400 4657845 5295152 4393278
10080 4393278 2900640 1426279 153399 -1338903 -2968782 -3306529 -1874280 -1184717
10072 -1184717 -3248711 -5294978 -3490400 60454 -28418 -2871712 -1643502 4951981
10064D951981M340201k846010m698381j61764J714679k361777n202217k559337
10056f822625L4837j941884m245528k167000J683822L323651L926650N108428
10048a099649M321062L38046k717156k078504j294580l307635m431536r02816
10040a1172768M003697N317896L851566K567093O10006k816581l757877K65073
10032a131895L929961J649901k571534j152470M299961N294396M8935m256579
10024F110676l063516l9574M66123m28145l3941J209718J675246J572798J836592
10015I305977K217823J700812l99078l531179n254356l298912M99125J420818
10007B661030j063676j728887J743913L705294o91474o509509n785500K60546
$$ plain form
10064 4951981 9292182 6446172 1747791 1586027 3300706 938929 -4263288 -6822625
10056 -6822625 -6787788 -8729672 -12975200 -15142200 -13458378 -10134727 -6208077 -1099649
10048 -1099649 3221413 3559459 842303 -1236201 -2530781 -5838416 -10269952 -11172768
10040 -11172768 -7169071 -1851175 2000391 4567484 5177490 2360909 -1396968 -1131895
10032 -1131895 2798066 4447967 1876433 723963 5023924 10318320 10367255 6110676
10024 6110676 3047160 3007586 3473709 3045564 3011623 4221341 5896587 7469385 9305977
10015 9305977 11523800 13224612 12825534 9294355 4039999 741087 1240212 2661030
10007 2661030 1597354 -131533 1612380 5317674 4626200 -1883309 -7668809 -7408263
9999g408263L542110J462488r93679n30996Q49023J540467K498338L076857J044234
9990E080579k456227l521222j526003M79164J137099J444107R37950j216329k538263
9981b179145o18944J397856o18681l754238k457652J026932J10758l493658j640945
9972a2227717N295248P375803J632917k491728R23867M536651R60996m555527
9964A450510l642501J041458J121773l386143n073145j377565K750540L355848
9956c759225J854120J018511J405051J880926R94937j457684l103655j558301
9948b725320J110774M94013k746810k969916J178367L820474J261941j947182
9940b523659p33974K360528K016916j337959l190147j916302N16306K302876K653181
$$ plain form
9999 -7408263 -3866153 -2403665 -3397344 -3928340 -3079317 -1538850 959488 4036345 5080579
9990 5080579 2624352 -896870 -2422873 -1943709 -806610 637497 1575447 359118 -2179145
9981 -2179145 -2798089 -1400233 -2018914 -5773152 -8230804 -7203872 -7093114 -10586772 -12227717
9972 -12227717 -6932469 443334 2076251 -415477 508390 5045041 6006037 1450510
9964 1450510 -2191991 -1150533 -28760 -3414903 -8488048 -9865613 -7115073 -3759225
9956 -3759225 -1905105 -886594 518457 2399383 3394320 1936636 -1167019 -2725320
9948 -2725320 -1614546 -1120533 -3867343 -6837259 -5658892 -1838418 -576477 -2523659
9940 -2523659 -3257633 -897105 1119811 -218148 -3408295 -5324597 -4808291 -2505415 147766
9931A47766J261989n09965n06657P22970O49839m32269N8981J375524K72907k133015
9921I08070j484586J062758m04268n448442o331902r37142L297304K214823J371548
9912e751837M499997N939861J213106m316279m505244j635604R0270J635471L316228
9903D85969J101739m600190n972150l83238M014124J958536o96913N61602O06086
9894b924435l258556m296747j91713N84222m332912m293486L754477O596360o35993
9885h998783l079704M710193M054623j1561828j5212199O275126J4294329k5292933
9877c4811176p0511183m8351977L4009196Q7023130N9538407J913060j6436511
9870A2372946J449128R169250m431991j3204536o633637J22800m10912l12929
$$ plain form
9931 147766 1409755 899790 393133 1116103 1765942 1333673 1392654 2768178 3041085 908070
9921 908070 -576516 486242 81974 -5366468 -11698370 -12635512 -9338208 -7123385 -5751837
9912 -5751837 -1251840 4688021 5901127 1584848 -2920396 -4556000 -4465730 -2830259 485969
9903 485969 1587708 -3012482 -8984632 -9367870 -5353746 -3395210 -4092123 -3530521 -2924435
9894 -2924435 -6182991 -10479738 -10671451 -10087229 -14420141 -18713627 -14959150 -8362790 -8998783
9885 -8998783 -12078487 -7368294 -3313671 -14875499 -30087698 -23812572 -9518243 -34811176
9877 -34811176 -105322359 -153674336 -119665140 -32642010 26896397 28809457 12372946
9870 12372946 13822074 22991324 18559333 5354797 -1278840 -1156040 -1566952 -1879881
9862a879881K148028O47916k648700m30042M151331L474142Q04487K739432M265867
9853A3272580j527807p479809l808111L087982J513107m188477k121248M957861
9845C706078N486406P01935O40874L779540M60363p129283p640807p74887L014887
9836B245106Q22395j274156k139705m665348m650917K677606R289015N036134
9828G340130k957127o74372P597686N779100n315156q904472j443039K783736
9820D206486j606515l337466J991180L561063k634841n090076J394228N450202
9812C934261K92172m041856k18615K895783j778662n173205Q59834P412409L924411
9803H106532l424659l457210J199608J793374R8631K471566N315153J299812n945655
$$ plain form
9862 -1879881 268147 916063 -1732637 -2162679 1988652 5462794 6267281 9006713 13272580
9853 13272580 11744773 4264964 456853 3544835 5057942 869465 -1251783 3706078
9845 3706078 9192484 9894419 10535293 14314833 14775196 7645913 5106 -769781 2245106
9836 2245106 3067501 1793345 -346360 -5011708 -9662625 -6985019 2303996 7340130
9828 7340130 4383003 3708631 11306317 17085417 11770261 2865789 1422750 4206486
9820 4206486 2599971 -737495 1253685 4814748 2179907 -2910169 -1515941 3934261
9812 3934261 4226433 184577 -34038 2861745 1083083 -4090122 -3230288 4182121 8106532
9803 8106532 4681873 1224663 2424271 4217645 4316276 6787842 12102995 13402807 7457152
9794G457152p240539l192170j265803j646733J345264O581260O933402J526064
9786A0497897l215936m073086l614301k986334l82844L398912M811268L073317
9778G508893P01145o35663o78522Q62654K407079L92625m742129o591939j791179
9769b567036L507189K199937k896767l721048P00862M001768K736810p3292j050427
9760B837996l04614P64554J165490J39353j636962j953007n87380l83609k247802
9751b205981k683957L03714K856538J123958k227146k224207Q40823K980952K873753
9742A638447J777387k89388l182782l580283J399534Q453112J0433050M427426
9734B1076503n057040j0409366p289541J338713O846620L611734l712548n867039
$$ plain form
9794 7457152 216613 -2975557 -4241360 -5888093 -4542829 2038431 8971833 10497897
9786 10497897 7281961 3208875 -405426 -3391760 -3774604 -375692 4435576 7508893
9778 7508893 8210038 7574375 6895853 7758507 10165586 10558211 5816082 -775857 -2567036
9769 -2567036 940153 3140090 243323 -3477725 -2776863 1224905 3961715 3888423 2837996
9760 2837996 2533382 3297936 4463426 4602779 2965817 1012810 425430 41821 -2205981
9751 -2205981 -4889938 -4586224 -1729686 -605728 -2832874 -5057081 -4216258 -1235306 1638447
9742 1638447 3415834 3126446 -56336 -3636619 -2237085 6216027 16649077 21076503
9734 21076503 16019463 5610097 -1679444 -340731 6505889 10117623 6405075 538036
9726E38036j658848J522862K71541n12575J638921J600180k742097m511121M51131
9717c401970N030141K535451j598876K17930L941980J663111l473166l016136
9709A898465J188131R05408k554593r12827M405898L488666l794666o197321m76602
9700b049441K751670k362758o658890j914672N333133N328385N11665q99549Q55589
9691H95132p2404l321309l721438j348065o46016j283175J256659O316264P384133
9682E459781K001311m095855m801878r94095K005022J173634j719297k616776
9674c588153M66350M544161M089729j911421p160974n380757J082710M176257
9666c682098J107191k523393j540957J819263K621194R65414O86032K466646L078020
$$ plain form
9726 538036 -1120812 402050 673591 161016 1799937 3400117 658020 -3853101 -3401970
9717 -3401970 1628171 4163622 2564746 2782676 6724656 8387767 4914601 1898465
9709 1898465 3086596 3992004 1437411 524584 4930482 8419148 4624482 -1572839 -2049441
9700 -2049441 702229 -1660529 -8319419 -10234091 -4900958 427427 939092 39543 895132
9691 895132 822728 -2498581 -6220019 -7568084 -8214100 -9497275 -8240616 -1924352 5459781
9682 5459781 7461092 3365237 -1436641 -2430736 -425714 747920 -971377 -3588153
9674 -3588153 -3121803 1422358 5512087 3600666 -3560308 -8941065 -7858355 -3682098
9666 -3682098 -2574907 -5098300 -6639257 -4819994 -2198800 -1233386 -547354 1919292 4997312
9657D997312J150811p91882j009655j236981k797224l569195j667806P24386P17395
9648c482839l57182M75218J990623N07623l093503l646207J10204L049952J536979
9639b909132j176992o49433J865261K297458M72421m32698O71657J856859J700031
9630C695432N67671p93663j427359p9665K677768L663447R99151k546759k831279
9621C924744J14184K368467J161685k487923n367705m720602n35199L540648L402156
9612A400455k26882k295505n67420J284883j3279k006599j109703J138258J076828
9603a318964n58573j82104K271743L343273J524409j298752l091682l027220p98369
9594c136239K361247L518486J631903q54193k330138m289722o305623l914417
$$ plain form
9657 4997312 6148123 5356241 4346586 3109605 312381 -3256814 -4924620 -4200234 -3482839
9648 -3482839 -3840021 -3364803 -1374180 -866557 -3960060 -7606267 -7496063 -4446111 -2909132
9639 -2909132 -4086124 -4735557 -2870296 -572838 -100417 -533115 138542 1995401 3695432
9630 3695432 4263103 3469440 2042081 1962416 4640184 8303631 9302782 6756023 3924744
9621 3924744 4038928 6407395 7569080 5081157 -286548 -5007150 -5542349 -2001701 1400455
9612 1400455 1173573 -1121932 -1689352 -404469 -417748 -2424347 -3534050 -2395792 -1318964
9603 -1318964 -1877537 -2059641 212102 3555375 5079784 3781032 689350 -2337870 -3136239
9594 -3136239 -774992 2743494 4375397 3521204 1191066 -3098656 -9404279 -13318696
9586a3318696L483069P972961L401483m176085m565454J576528N002626K568534
9578A944966m06628j199175k462014l769709j122966L623498L401381j627283
9570a617930k927334J738573L628022j729910n570661N3648Q550372Q601695R55161
9561A1681636m382887l197147r309J162221O03016q81097k547455j976628J328925
9552A781275K692729j473255o592022n616719L04395L849159K722432J417407
9544i14599K264284K314571J12122j391232p01253o04262k589606l577689j283087
9535f370751J301538L00839k944785l640237q2706M299496N263033K469756n80622
9526A5561r74974O8311o52018k991204l132949K87666L179934J852019j285262
$$ plain form
9586 -13318696 -9835627 -1862666 1538817 -2637268 -7202722 -5626194 -623568 1944966
9578 1944966 1538338 339163 -2122851 -5892560 -7015526 -3392028 9353 -1617930
9570 -1617930 -4545264 -2806691 821331 -908579 -6479240 -6425592 2124780 10726475 11681636
9561 11681636 7298749 4101602 4092293 5254514 5857530 4976433 2428978 452350 1781275
9552 1781275 4474004 3000749 -3591273 -9207992 -8903597 -5054438 -2332006 -914599
9544 -914599 1349685 3664256 3776378 2385146 1683893 1079631 -1509975 -5087664 -6370751
9535 -6370751 -5069213 -4768374 -7713159 -11353396 -11436102 -7136606 -1873573 596183 15561
9526 15561 -959413 -891102 -1543120 -4534324 -7667273 -7379607 -4199673 -2347654 -3632916
9517c632916j739193K8205M68609j00357J744497N419933O068112K195220j947701
9508H504409l053883k668537k583614j539413P49593J142889j674619l503993
9500d627168m15829M798074O276207K999822j079701l079668l232148k207609
9492e68020n72371j79746k131351l820059j915415K074920L474640J650706P41660
9483a245036K285742K362594j412107m792356k793145K669512N542492L943913
9475F561609J149595m75203j751612l017970k801390j183287o20083j841168k200835
9466f180344l4373K165845J337615j377392j997547J072744N066193N763995J647446
9457G464182m097483n754734j056997N030971N323115k86539m249991j688193
$$ plain form
9517 -3632916 -5372109 -5343904 -4875295 -4975652 -3231155 2188778 8256890 10452110 8504409
9508 8504409 5450526 2781989 198375 -1341038 -591445 551444 -1123175 -4627168
9500 -4627168 -5042997 -244923 6031284 9031106 7951405 4871737 1639589 -568020
9492 -568020 -1140391 -1320137 -3451488 -7271547 -9186962 -7112042 -3637402 -1986696 -1245036
9483 -1245036 1040706 3403300 1991193 -2801163 -5594308 -2924796 2617696 6561609
9475 6561609 7711204 7236001 5484389 2466419 -334971 -1518258 -2138341 -3979509 -6180344
9466 -6180344 -6214717 -4048872 -2711257 -4088649 -6086196 -5013452 52741 5816736 7464182
9457 7464182 3366699 -2388035 -3445032 1585939 6909054 6622515 2372524 684331
9449F84331K950131K789561j691545m435031k854104P1687J512567J537237N30926
9440A095760j395894k309133j83977K967379L023146J80804j086448Q24783K419375
9431E535795J327672k45653l96053r85114l325119m770345l068669l42570Q46017
9422e424039J735936L641296L630113q82195n850102m828471J543371N905289
9414e28802M107635k64422k095654r25554O30311R74737J17009j233625j625244
9405h43609n4780J772436P45271k978008n170056l081703N24889J134240j355904
9396i307224k764720l01980M113672O418573M881905J549084k57198L82648J068463
9387E783223n88337l238768l193240J62029K777056J370744j789289k320323l49479
$$ plain form
9449 684331 3634462 6424023 4732478 297447 -2556657 -2484970 -972403 564834 1095760
9440 1095760 -300134 -2609267 -2793244 174135 3197281 3378085 2291637 3116420 5535795
9431 5535795 6863467 6617814 6221761 5236647 1911528 -2858817 -5927486 -6270056 -5424039
9422 -5424039 -3688103 -46807 3583306 2701111 -3148991 -7977462 -6434091 -528802
9414 -528802 3578833 3314411 1218757 293203 923514 1898251 2015260 781635 -843609
9405 -843609 -898389 874047 1619318 -1358690 -6528746 -9610449 -9085560 -7951320 -9307224
9396 -9307224 -12071944 -12373924 -8260252 -1841679 3040226 4589310 4332112 4714760 5783223
9387 5783223 5194886 1956118 -1237122 -1075093 1701963 3072707 1283418 -1036905 -1386384
9378a386384J68285j606444j785904J411487L757348J367312k552168k115938
9370b742406K125474M065357J545168r48720j92836J054934m8639j188111L12617
9361C982838J871809M9606k693910j587655K077292K508687j240962l815424k181992
9352a029711K11452j56716j463647m47827K082551K791691M77037l152945n482715
9343f170830m310465O33607O112979P475451L578247k135556n816454o144848
9335f777869l366248J062346L641514J709227k166222k861217k91381O94848j213402
9326i568404j644850J274345L520310L052113L647283O272776M548380m254213
9318F847740j0993922o630414L197245O100146J550057j65527M120247O099495
$$ plain form
9378 -1386384 -1218099 -2824543 -4610447 -3198960 558388 1925700 -626468 -2742406
9370 -2742406 -616932 3448425 4993593 4044873 3852037 4906971 4858332 3670221 3982838
9361 3982838 5854647 5904253 3210343 1622688 3699980 6208667 4967705 1152281 -1029711
9352 -1029711 -818259 -974975 -2438622 -2886449 -803898 1987793 2464830 -688115 -6170830
9343 -6170830 -10481295 -9847688 -3734709 3740742 7318989 5183433 -633021 -6777869
9335 -6777869 -10144117 -9081771 -5440257 -3731030 -5897252 -8758469 -9049850 -8355002 -9568404
9326 -9568404 -11213254 -9938909 -6418599 -3366486 280797 6553573 11101953 6847740
9318 6847740 -4146182 -10776596 -7579351 -1479205 70852 -94675 4025572 10125067
9310A0125067R04232n281246o116829l690254j726259R94939N187959O714139
9302G111748L446995p401j8698p5426l279757n018430m60383N790541N697445
9293A3186634j64879m631442n199529m925478m119613k84777L996417K454397
9285C11730l881207n727347R87645Q167883O855853m45042m518856k411436N46486
9276a14291k45755l255480m337405j666918L170723O385327M558406j523222o170120
9267c198735m595003J095238M618676L677523J593309O57083j148988m521497
9259a822394m983447L74152N728276L041270n118699p167439R68545Q744130N655082
9250E419476l595455o596915j498453K339851N24664q92286J744991K614746k181229
$$ plain form
9310 10125067 11029299 5748053 -368776 -4059030 -5785289 -4790350 397609 7111748
9302 7111748 10558743 10551342 10532644 10457218 7177461 2159031 1698648 7489189 13186634
9293 13186634 13021755 8390313 3190784 -1734694 -5854307 -6139084 -2142667 311730
9285 311730 -3569477 -9296824 -8309179 -141296 6714557 6269515 1750659 -660777 -114291
9276 -114291 -360046 -3615526 -7952931 -9619849 -6449126 -63799 4494607 2971385 -3198735
9267 -3198735 -7793738 -6698500 -2079824 1597699 3191008 3848091 2699103 -1822394
9259 -1822394 -6805841 -6431689 -703413 2337857 -2780842 -9948281 -8979736 -235606 5419476
9250 5419476 1824021 -4772894 -6271347 -3931496 -3406832 -4299118 -2554127 60619 -2120610
9241b120610n933894k294823K983970J443302k974274k98015P429965Q068043
9233F303664o24909o611096k625681L157424J782640k451814j469171K065804
9225d73139M78386m575743m845694L98698L734847K221466P98418K313481L057590
9216C108310M57072k211432j769775j5883K02108q33327j780065k450919k185250
9207g479161J52212L235305M179309L128239K641252K207321j102964n651017
9199A310496n465410K10002M165528J614431k697533k219865J921167M200648
9191C039464K911408o842l238781n079100k285473M435019P722653K601555n203916
9182D895987o654447k021064J210176N39503K63406K179017K984775J443764L66783
$$ plain form
9241 -2120610 -8054504 -10349327 -7365357 -5922055 -8896329 -9194344 -1764379 6303664
9233 6303664 5678755 -932341 -3558022 -400598 1382042 -1069772 -2538943 -473139
9225 -473139 5247 -4570496 -9416190 -9017492 -5282645 -3061179 -2262761 50720 3108310
9216 3108310 3565382 1353950 -415825 -431708 -229600 -1062927 -2842992 -5293911 -7479161
9207 -7479161 -7326949 -4091644 87665 3215904 5857156 8064477 6961513 1310496
9199 1310496 -4154914 -3944912 220616 1835047 -862486 -3082351 -1161184 3039464
9191 3039464 5950872 5944030 2705249 -2373851 -4659324 -224305 7498348 10099903 4895987
9182 4895987 -1758460 -3779524 -2569348 -2029845 -1766439 412578 3397353 4841117 5207900
9173E207900K78122j657124m873838m695110m89362K297748R14756m68459J470215
9164b015152L511384J995924r23801j583761o96675o06572q73199p68992j991156
9155c952000m540767m193648R19264N281608L407841j069112m28274N065333P207104
9146G697349J750694o105972r190934o218515p30098L634802M999655L446958
9138g16061J095866J89793M44530m7508j440596j903036p32992O09663Q21508
9129a678833J85801l63580O031J741938L657708K959984j162226m981717m157425
9120c792319L80718L496535K420234r13237l811515n399223m839786r57746M720826
9111h695513P695354N445227P00774j955686j242831L78107J07972k363507m498551
$$ plain form
9173 5207900 5486022 3828898 -1044940 -5740050 -6229412 -3931664 -3016908 -3485367 -2015152
9164 -2015152 1496232 3492156 2568355 984594 287919 -318653 -1191852 -1960844 -3952000
9155 -3952000 -8492767 -12686415 -11767151 -6485543 -3077702 -4146814 -4575088 490245 7697349
9146 7697349 9448043 3342071 -5848863 -12067378 -12797476 -9162674 -4163019 -716061
9138 -716061 379805 569598 1014128 966620 -473976 -2377012 -3110004 -2500341 -1678833
9129 -1678833 -1493032 -1856612 -1850581 -108643 3549065 6509049 5346823 365106 -3792319
9120 -3792319 -3411601 84934 2505168 1591931 -2219584 -7618807 -12458593 -13416339 -8695513
9111 -8695513 -1000159 4445068 5145842 3190156 1947325 2325432 2433404 69897 -4428654
9102d428654l199824J317858M573281K995144o94112p56181L018534M538438L73943
9093G738427n268144p054534n482977l670011j341921K912294O382667N156931
9085f27268Q98928j042510K64208Q43371o04262q62547R02809Q40809k310954
9076a697416l653706R5710M363796L372057r60271k536048o11676M68043n78839
9067a738350o07587J344476K187596M96142j061807l50923J535886L263591M664877
9058I733901M326136M62052m660532o137855l700094k236644l357564k733215
9050h303815J220283K948917r73079m580076j312677M914238N354106j35739l611236
9041d479078j393423K188531L146831K395674J261717p50177k433441j236000
$$ plain form
9102 -4428654 -7628478 -6310620 -1737339 1257805 563693 -192488 2826046 7364484 7738427
9093 7738427 2470283 -4584251 -10067228 -13737239 -15079160 -12166866 -5784199 -627268
9085 -627268 271660 -770850 -506642 336729 -267533 -1130080 -227271 613538 -1697416
9076 -1697416 -5351122 -5255412 -891616 2480441 1520170 -1015878 -1627554 -1159511 -1738350
9067 -1738350 -2345937 -1001461 1186135 1682277 620470 269547 1805433 5069024 9733901
9058 9733901 14060037 14522089 9861557 3723702 23608 -2213036 -5570600 -8303815
9050 -8303815 -7083532 -4134615 -5107694 -9687770 -11000447 -6086209 -732103 -867842 -4479078
9041 -4479078 -5872501 -3683970 -537139 1858535 3120252 2370075 -63366 -1299366
9033a299366J418570R15362k844172m193356l22866M132209L907703J28724k354442
9024e11634j203308K222073M998958M271182l93820n130068n265851j360370J619683
9015g53155J401837N04489P67340O14115r35863k059358j490315j65863J356729
9006g60044L051601K956826l88562l338804j357193K334591M03986n542914n466463
8997h106976K589266P347688J640948n482196k890544M985448N840471q82924
8989E041181m333391p452M472852K273582l385789n590562k792521J347348L075477
8980A00725J517403j119435j710672K06796K179835K927352L515454L211839q13017
8971A0016280o958481q341279k766010K621366K100861J86023K558970M953648
$$ plain form
9033 -1299366 119204 1034566 -1809606 -6002962 -6325828 -2193619 1714084 1842808 -511634
9024 -511634 -1714942 507131 5506089 9777271 9383451 4253383 -1012468 -2372838 -753155
9015 -753155 648682 1153171 1920511 2534626 1598763 -460595 -1950910 -2116773 -760044
9006 -760044 2291557 5248383 4859821 1521017 163824 2498415 2902401 -2640513 -8106976
8997 -8106976 -5517710 1829978 3470926 -2011270 -4901814 83634 5924105 5041181
8989 5041181 707790 700338 5173190 7446772 4060983 -1529579 -4322100 -2974752 100725
8980 100725 1618128 498693 -1211979 -1005183 1174652 4102004 7617458 10829297 10016280
8971 10016280 3057799 -5283480 -8049490 -5428124 -3327263 -3141240 -582270 4371378
8963D371378O70093o084513n577882J668468N762467K861559j072604j654235
8955I44731p84839M74844L645036O345128L727303k261307m450314k428035k851943
8946B360604o183932m419802M342056J0245678O214977j626664m482928l061351
8938C388638k198131j300220J815290L975986J813726j097685q2619J983567k43297
8929H055255m411399l725261J637881M422284J277827l121675l763360j488671
8921a117119N8335l38002j118300o49701R86799K212360J894666J029781J252677
8912D211496J830275M37029k888878n360279n342505l537943k61249M327630O952858
8903C68434L487680l898309p219015k884591L485100N308786L129705J021459
$$ plain form
8963 4371378 5041471 -1043042 -6620924 -4952456 810011 3671570 2598966 944731
8955 944731 159892 634736 4279772 10624900 14352203 12090896 7640582 5212547 2360604
8946 2360604 -3823328 -8243130 -3901074 6344604 12559581 10932917 6449989 3388638
8938 3388638 1190507 -109713 1705577 5681563 7495289 6397604 6314985 8298552 8055255
8929 8055255 3643856 -81405 1556476 5978760 7256587 4134912 371552 -1117119
8921 -1117119 -1058784 -1396786 -2515086 -3164787 -2177988 34372 1929038 2958819 4211496
8912 4211496 6041771 6478800 3589922 -1770357 -7112862 -10650805 -10912054 -6584424 368434
8903 368434 3856114 -42195 -7261210 -10145801 -6660701 -1351915 1777790 2799249
8895B799249j50688j400318j489293J017255M011998M081324P62031l721707o579657
8886f69806n144497O21310N176287K376044m852812o522669j01075M903586J583320
8877b630312l682657k438681J944306J375816k165005o02126N008042N459700
8869B269083j073740n910969l563976J445333L671062L638627K829625N5710l579291
8860b18536l416076J035970L479029Q4561m348468l862975J25891K415110J785567
8851b919927M02070j014301k648836k931838p91874J593661K032038J906217K860178
8842a512612K776428l38179l057270q75579L607407L314813k305621n513524j583034
8833e487171M144183M365286J98179j823296j57434N07244k211224m540517k784998
$$ plain form
8895 2799249 2648561 1248243 -241050 776205 4788203 8869527 9631558 5909851 -669806
8886 -669806 -5814303 -5192993 -16706 2359338 -2493474 -9016143 -9117218 -4213632 -2630312
8877 -2630312 -6312969 -8751650 -6807344 -5431528 -7596533 -8198659 -3190617 2269083
8869 2269083 1195343 -4715626 -8279602 -6834269 -3163207 475420 3305045 3360755 -218536
8860 -218536 -3634612 -2598642 880387 964948 -3383520 -7246495 -7120604 -4705494 -2919927
8851 -2919927 -2517857 -3532158 -6180994 -9112832 -9904706 -8311045 -6279007 -4372790 -1512612
8842 -1512612 1263816 925637 -2131633 -3007212 600195 3915008 1609387 -3904137 -5487171
8833 -5487171 -1342988 3022298 3220477 1397181 1239747 1746991 -464233 -5004750 -7789748
8824g789748J105523K725343R78078j792432l221124k274814Q73946M205148M845025
8815c45055K671306J028883J890657K713269P23856k224247k593952q09512J44178
8806C199383J16716J207007K786684J994472r32606k472014j353598p9091m15412
8797D051541j289154j616868j572306r42325J75343l25491l325554m758201o53197
8788a0256212N109543M965428n22447k844879J283771N219089L429857r19951
8780E464199l103614l631866l399364J19533O122790P324817M41485o537582n024918
8771b224520J712587M566894K117830k91993r82896k398300l725075j943151J097795
8762b070829Q48745j533625p86096K883868L597974l77041l865708l008300R4249
$$ plain form
8824 -7789748 -6684225 -3958882 -2980804 -4773236 -7994360 -10269174 -9395228 -5190080 -345055
8815 -345055 2326251 3355134 5245791 7959060 8682916 6458669 3864717 3055205 3199383
8806 3199383 3316099 4523106 7309790 9304262 8371656 5899642 4546044 4466953 4051541
8797 4051541 2762387 1145519 -426787 -1369112 -1193769 -1519260 -4844814 -9603015 -10256212
8788 -10256212 -5146669 -181241 -703688 -3548567 -2264796 2954293 6384150 5464199
8780 5464199 2360585 -1271281 -4670645 -4551112 1571678 8896495 9337980 2800398 -2224520
8771 -2224520 -511933 4054961 6172791 5880798 4897902 2499602 -1225473 -3168624 -2070829
8762 -2070829 -1222084 -2755709 -3541805 -657937 2940037 2562996 -1302712 -4311012 -4216763
8753d216763K318415L409977L395308J121179k808678n426217m962886k226249
8745i395914J394114M254237L941706L00957k327724k82511L393142L090295m96701
8736C871601j496519J604643L775293J557731k294834l865903l038027j606008
8728a492023k16734J058430J833503K238561K710294K838784K093465Q50259q63511
8719A1051028l622303n778297l779132J789793M647783J433379k653552k085987
8711A002712R7129j388955l683910p41150M778585M861340k59818k435674O67347
8702B897606K725592O95519p91892P29085J122723j692154l541085k038444o55189
8693e48239j262907o89320J689303J216765k966877m378557K27527M525257K564734
$$ plain form
8753 -4216763 -1898348 1511629 4906937 6028116 3219438 -2206779 -7169665 -9395914
8745 -9395914 -8001800 -3747563 194143 495100 -1832624 -2115135 1278007 4368302 3871601
8736 3871601 2375082 3979725 7755018 9312749 7017915 3152012 113985 -1492023
8728 -1492023 -1708757 -650327 1183176 3421737 6132031 8970815 11064280 11914539 11051028
8719 11051028 7428725 1650428 -2128704 -338911 4308872 5742251 3088699 1002712
8711 1002712 1099841 -289114 -3973024 -4714174 64411 4925751 4665933 2230259 2897606
8702 2897606 5623198 6318717 5526825 6255910 7378633 5686479 2145394 106950 -548239
8693 -548239 -1811146 -2500466 -811163 405602 -2561275 -6939832 -6712305 -2187048 377686
8684C77686k052391k978457n97723J501763L436982N879805N525031N00983m405816
8675G187863m430221k251206k371967k790800N09431M772323M032301j060575
8667C597149m300613l174433o62535O58371N23691j250785l419358j976373M034170
8658e970716P999004L761800m070417n492429N15765N208105L628320L39215n9843
8649E858804K28167j551659k763504p15859J435086k41556l166580j896569K982917
8640A69247N297647K170421k543084m361753l368849j689523M71854L470936N344666
8631D961562L669919n65121l754114l993334k281819l2868J841045J919656k16345
8622A548581j694480L64508L239447J499356l637308m388991J455575N692513
$$ plain form
8684 377686 -1674705 -4653162 -5250885 -3749122 -312140 5567665 11092696 11593679 7187863
8675 7187863 2757642 506436 -1865531 -4656331 -4146900 625423 4657724 3597149
8667 3597149 -703464 -3877897 -4540432 -3882061 -3358370 -4609155 -8028513 -10004886 -5970716
8658 -5970716 2028288 5790088 1719671 -3772758 -3256993 1951112 5579432 5918647 5858804
8649 5858804 6086971 4535312 1771808 1055949 2491035 2249479 -917101 -2813670 169247
8640 169247 5466894 7637315 5094231 732478 -2636371 -4325894 -3854040 -383104 4961562
8631 4961562 8631481 8066360 4312246 318912 -1962907 -1995775 -154730 1764926 1548581
8622 1548581 -145899 218609 3458056 4957412 1320104 -3068887 -1613312 4079201
8614D079201J935963m258374m541434q70320m59147k445211l28714M906949N591329
8605C610242Q89927j697236M66911J326891k051863m316556k155401r201q90516
8596d826802o09644L467996O213965L274739j397513k480430j218589q04472k62823
8587A356427J335927Q48206k867683m894594k090803J192083J142809J520329
8579b457299N746448Q633424M269273l269770n681298k623190N0248L43523L33003
8570E344362j44787k030182k404396J043494M085394J973660k086659k229961
8562C550925O7717k77081j911039r4062L237174K381859j352894j881432L54485
8553D075652k53731k977472j681414K877822L200354j266127k154108L300561
$$ plain form
8614 4079201 6015164 1756790 -2784644 -3654964 -4114111 -6559322 -6888036 -1981087 3610242
8605 3610242 4500169 2802933 3269844 4596735 2544872 -1771684 -3927085 -3936286 -4826802
8596 -4826802 -5436446 -1968450 4245515 7520254 6122741 3642311 2423722 1619250 1356427
8587 1356427 2692354 3540560 672877 -4221717 -6312520 -5120437 -3977628 -2457299
8579 -2457299 3289149 11922573 16191846 12922076 7240778 4617588 4667836 5011359 5344362
8570 5344362 5199575 3169393 764997 1808491 5893885 7867545 5780886 3550925
8562 3550925 3618642 3341561 1430522 1336460 4573634 6955493 5602599 3721167 4075652
8553 4075652 3821921 844449 -836965 2040857 5241211 3975084 1820976 5121537
8545E121537O887234K918757k992467m103649k571018l019299l707524j175665
8537b642094K102914J802910n97135o71629J359283J687948l03492j346527M44579
8528A836757L282404M288562K142729k048220n103037m289513o64483J531953
8520I77152k67498m048594n656914k936086K432144O013534M467463l02888k653954
8511a975641n92671J358664m96944k844711j177592K249490K703109J715975L609511
8502D549190N837094K198614n164270p052536j485927L139255J446738j892156
8494A576002j882933p55950j284206j039862J359864J909988j217129k863723
8486d197949M10109L644022J957533q56095N11294L085990J066812l772521n435924
$$ plain form
8545 5121537 12008771 14927528 11935061 7831412 5260394 2241095 -1466429 -2642094
8537 -2642094 -539180 1263730 666595 -5034 1354249 3042197 2738705 1392178 1836757
8528 1836757 5119161 9407723 11550452 9502232 4399195 109682 -554801 977152
8520 977152 709654 -3338940 -8995854 -11931940 -9499796 -3486262 981201 678313 -1975641
8511 -1975641 -2568312 -1209648 -1706592 -4551303 -5728895 -3479405 -776296 939679 4549190
8502 4549190 10386284 12584898 7420628 368092 -1117835 2021420 3468158 1576002
8494 1576002 -306931 -1062881 -2347087 -3386949 -2027085 -117097 -1334226 -4197949
8486 -4197949 -3787840 -143818 1813715 957620 1468914 4554904 5621716 1849195 -3586729
8477c586729l489107j320585J545527O581591R103733L935369l840296m337911
8469D591592J592077L384908j725036m118315J455073O138613J331136o552834
8461F097214n616489L065127P377329K250806m622471n799149l442407k514870
8453c204910k309239J4656K688514K237553K56219J198730M396353M103274j636445
8444G744705p063261n957310L65696M938395L407775j642935m101722j136003
8436c444660L388337L196599j899992m482813L26361O302985L989934m455385
8428B921366p028898J60001O439897K765365m919673o100585j632105N86432j1449
8419f819649J865220M922382K644182l672931n276908m98083K521303L8360j705672
$$ plain form
8477 -3586729 -7075836 -8396421 -6850894 -269303 8834430 12769799 8929503 4591592
8469 4591592 6183669 9568577 7843541 3725226 5180299 11318912 12650048 6097214
8461 6097214 480725 3545852 10923181 13173987 8551516 2752367 -690040 -3204910
8453 -3204910 -5514149 -5499493 -2810979 -573426 -317207 881523 5277876 9381150 7744705
8444 7744705 681444 -5275866 -4910170 28225 3436000 1793065 -2308657 -3444660
8436 -3444660 -56323 3140276 1240284 -3242529 -2916168 3386817 7376751 2921366
8428 2921366 -4107532 -3947531 2492366 5257731 338058 -5762527 -7394632 -6808200 -6819649
8419 -6819649 -4954429 -32047 2612135 -1060796 -6337704 -6835787 -4314484 -4276124 -5981796
8410e981796R24044K028959k017886m128060J837176R242608Q112060M44054l821228
8401F639931k153889o85080k069432k035445J375662L667051J409902k344643
8393C804057l051657p16657J630911K363798J809831M08551j664263l747620m548705
8384c711754k869737Q78921L728931K554025j466836l041838N19776N038483M931343
8375F561314J113402o18870J541434K794333o98627n574901n681427o89485L362246
8366B109419K176943j397698j833989J442868L916145K722594l8850j486334j934334
8357E676764k736312l173480k173005o89727L60409K023015M247131M030724M69356
8348H034875j791446O65872L158724l66326o324449n744216J278727M854382M90125
$$ plain form
8410 -5981796 -5057752 -3028793 -5046679 -9174739 -7337563 1905045 10017105 10461159 6639931
8401 6639931 4486042 3800962 1731530 -303915 1071747 4738798 6148700 3804057
8393 3804057 752400 35743 1666654 4030452 5840283 6248834 4584571 836951 -3711754
8384 -3711754 -6581491 -5702570 -1973639 580386 -886450 -3928288 -3408512 1629971 6561314
8375 6561314 7674716 7055846 8597280 11391613 10692986 5118085 -563342 -1252827 2109419
8366 2109419 4286362 2888664 1054675 2497543 6413688 9136282 9097432 7611098 5676764
8357 5676764 2940452 -233028 -2406033 -3095760 -2735351 -712336 3534795 7565519 8034875
8348 8034875 6243429 6909301 10068025 9701699 3377250 -2366966 -1088239 3766143 4256268
8339D256268m376428k633185K192174L158366N20676j125261j189751k164948
8331a362089l649017k970462J41891L575059N601805M874086N70066m736429n838995
8322c794085j552960K903568L085844R44804J68820L43620l26475o81292N94522
8313A686366J513620M44135l25954J136767K347040R52840o72350j09874P3798
8304G046388k650979m971877l152407l31287j349880l564351p80237N624531P831699
8295C701600L504571j157463j198387R35147P00064k318676n239886n282747j651440
8286h007217L054042M163677R56026q25537K908282O739301K762729o317859r498891
8277d065447l258099L678609L906724J355087K717324N602306K592244n994523
$$ plain form
8339 4256268 -120160 -2753345 -561171 2597195 3117871 1992610 802859 -1362089
8331 -1362089 -5011106 -7981568 -7839677 -4264618 1337187 6211273 6781339 2044910 -3794085
8322 -3794085 -5347045 -2443477 642367 1587171 1755991 2099611 1773136 1091844 1686366
8313 1686366 3199986 3644121 3318167 4454934 6801974 7754814 7082464 6972590 7046388
8304 7046388 4395409 -576468 -3728875 -4060162 -5410042 -8974393 -9754630 -4130099 3701600
8295 3701600 7206171 6048708 4850321 5785468 6485532 4166856 -1073030 -6355777 -8007217
8286 -8007217 -4953175 -789498 166528 -659009 2249273 8988574 11751303 5433444 -4065447
8277 -4065447 -7323546 -3644937 261787 1616874 4334198 9936504 12528748 6534225
8269F534225j0841992n747454M121166Q493063M035866k719971m188125n94581
8261i07803J970132M23057k380623l522411l880761m095073j660089L904871P075397
8252c073303L022042m168297n836168l35590N197778M710185J10085k494990M9207
8243b819051N243244P229093K302996o074284r642973m919224K472842N788964
8235d18393N255922L892007M59924o260665j0366324n376221L986954O485585
8227b341211P75078k958054P58828N199963L899091P27806J425234L140921K13627
8218A0841283n058361n560836m78791L882079L290306j93751k937253l901990
8210a17314l512732j817877J008425L813210M747409K470234k036793n174936
$$ plain form
8269 6534225 -4307767 -10055221 -5934055 2559008 6594874 3874903 -313222 -907803
8261 -907803 1062329 1485386 -895237 -4417648 -8298409 -12393482 -14053571 -10148700 -3073303
8252 -3073303 -51261 -4219558 -10055726 -10391316 -5193538 -483353 -373268 -2868258 -2819051
8243 -2819051 2424193 9653286 11956282 5881998 -3760975 -8680199 -6207357 -418393
8235 -418393 4837529 8729536 9189460 2928795 -7437529 -12813750 -8826796 -2341211
8227 -2341211 -1566133 -4524187 -3765359 1434604 5333695 6061501 7486735 10627656 10841283
8218 10841283 5782922 222086 -256705 3625374 6915680 6721929 3784676 -117314
8210 -117314 -3630046 -5447923 -4439498 -626288 4121121 6591355 4554562 -620374
8202f20374m225993j010802N28369J59956J105344L649733L751857j22019l402888
8193a86817j825144K252891L591461J318198j320410k299091k106769j162863
8185a738544M07638J206093j935j681428j200176J052042J837470l36803k978634
8176c434277k759393L96984L212499K681454n69558k794401j330331K175320L803441
8167A381738K341535N50640J103561K996089L086167J36067l824157n789914m766443
8158b784717k500194j324115j434405j073596M67359J631313J332627J007331
8150d678397J990549K526180K14217l420774l938873K12743N378010O804813L490224
8141H578692j422922l996367l198615j666255k017056k674275J7592N102322O712687
$$ plain form
8202 -620374 -4846367 -5857169 -5328800 -5168844 -4063500 -413767 3338090 3216071 -186817
8193 -186817 -2011961 240930 3832391 5150589 3830179 1531088 -575681 -1738544
8185 -1738544 -1330906 -124813 -126748 -1808176 -3008352 -1956310 -118840 -455643 -3434277
8176 -3434277 -6193670 -5796686 -2584187 97267 -472291 -3266692 -4597023 -2421703 1381738
8167 1381738 3723273 4273913 5377474 8373563 11459730 11595797 7771640 1981726 -2784717
8158 -2784717 -5284911 -6609026 -8043431 -9117027 -8649668 -7018355 -5685728 -4678397
8150 -4678397 -2687848 -161668 52549 -3368225 -7307098 -7094355 -1716345 5088468 8578692
8141 8578692 7155770 3159403 -39212 -1705467 -3722523 -6396798 -6379206 -1276884 5435803
8132E435803K729856j049733L50121K745268n18541o880289p491080p09518N489849
8123A01736N444358K498177J446550J190866j168694m095230m054388j224234
8115A39141J008482O70310j128293k032832o88880J830373K711625Q32241j399396
8106A942771j598225j029082j676248j965671K19396K379980Q29348k255952j614828
8097d768511K107518L182355N54318p47715J165372K145817J80713j173063j46337
8088B500467j21693k393841k810890M59071K761135J003905p66973J152026L358454
8079E141661J705738j217163j062192O74400K69429j140654l73784J257576K89670
8070E544681k621273m191896l910635l147910j442289J687092L825630L040418
$$ plain form
8132 5435803 8165659 7115926 7466047 10211315 9692774 2812485 -4678595 -5388113 101736
8123 101736 5546094 8044271 9490821 10681687 9512993 5417763 1363375 139141
8115 139141 1147623 1817933 689640 -1343192 -2032072 -201699 2509926 3342167 1942771
8106 1942771 344546 -684536 -2360784 -4326455 -4107059 -1727079 -897731 -3153683 -4768511
8097 -4768511 -2660993 521362 1075680 327965 1493337 3639154 3819867 2646804 2500467
8088 2500467 2378774 -15067 -2825957 -2366886 394249 1398154 631181 1783207 5141661
8079 5141661 6847399 5630236 4568044 5242444 5511873 4371219 3997435 5255011 5544681
8070 5544681 2923408 -1268488 -5179123 -8327033 -9769322 -8082230 -4256600 -1216182
8062a216182J547434J824330K081575n7718k605923k605462j334498j351847j450123
8053e168414N64662L124191L807315L767979M302467K737466k479230o288590
8045D367846l409103K642999M020233p4039l550455l304468j653238O870K510916
8036A557561M083153J493996l189424l788523N24540L024542r48311o963863o974861
8027a1181190Q63041R798327J0953065K403078p499169q196025K28270O318691
8019C688088K328586n249227n617336R46405N326530L642649L00412j240351j875628
8010B250128j485444J423069M419971L309705k36520j048029k21262l406080q821164
8001c815626p495829J803500Q366837N023106j714389l091860r44460j340195
$$ plain form
8062 -1216182 331252 2155582 4237157 4179439 1573516 -1031946 -2366444 -3718291 -5168414
8053 -5168414 -4603752 -1479561 2327754 6095733 10398200 13135666 10656436 4367846
8045 4367846 958743 3601742 7621975 7547936 3997481 693013 -960225 -953355 1557561
8036 1557561 5640714 7134710 3945286 156763 681303 3705845 2757534 -4206329 -11181190
8027 -11181190 -10318149 -519822 10433243 12836321 5337152 -2858873 -2630603 3688088
8019 3688088 6016674 767447 -4849889 -3903484 1423046 5065695 5366107 4125756 2250128
8010 2250128 764684 2187753 6607724 9917429 9680909 8632880 8411618 5005538 -3815626
8001 -3815626 -11311455 -9507955 -1141118 3881988 2167599 -924261 -1868721 -3208916
7993c208916k725557K12060N466873O013344J190177k523023j623498N41253M09734
7984C752447j152327j908424j437419j42410J534964K195842O45499j631627j824088
7975C2457Q4477J143585j59897j806831j412530N58105J911563J630018L70213
7966B351160j112547k653435l793925l362343p86461K535943M207191L391495
7958G77078J549010L48403r2233m39407q77388j294845j498542o94605J614827
7949f07702L695678K858097m11307k420959j732222j185700k386093k278855J321018
7940c148045M821559M103550J106142k03252r96485m152925o591812l124407L369031
7931d816644M360196j293995n303987k676122J763028K491654J147613J121646
$$ plain form
7993 -3208916 -5934473 -5722413 -255540 5757804 6947981 4424958 2801460 3342713 3752447
7984 3752447 2600120 691696 -745723 -888133 646831 2842673 3488172 1856545 32457
7975 32457 116934 1260519 1100622 -706209 -2118739 -1560634 350929 1980947 2351160
7966 2351160 1238613 -1414822 -5208747 -8571090 -9357551 -6821608 -2614417 777078
7958 777078 2326088 2674491 2582258 2142851 1265463 -29382 -1527924 -2222529 -607702
7949 -607702 3087976 5946073 5534766 3113807 1381585 195885 -2190208 -4469063 -3148045
7940 -3148045 1673514 5777064 6883206 6679954 5683469 1530544 -5061268 -8185675 -4816644
7931 -4816644 -456448 -1750443 -7054430 -9730552 -7967524 -5475870 -4328257 -3206611
7923c206611J183086m36597j209261J075866L278995J657472j906888l145289
7915b709227j712644R6596J827304L596773L193174q31421n177457n224691j028589
7906g970182L467733N422891M325714P15444k924365k614753J877757M684060
7898F984299R90609n609729p618149l776938M40098J621044K199168M729595P108490
7889G068487N616695J39285n339436o402766k181445L325421M640959Q17223l212217
7880D472206k825422O68059K838617K245796M14442k141318n371214o485445k681461
$$ plain form
7923 -3206611 -2023525 -2460122 -3669383 -2593517 685478 2342950 436062 -2709227
7915 -2709227 -4421871 -4325275 -2497971 1098802 4291976 3460555 -1716902 -6941593 -7970182
7906 -7970182 -4502449 920442 5246156 5961600 3037235 422482 2300239 6984299
7898 6984299 7974908 2365179 -5252970 -9029908 -8589810 -6968766 -4769598 -40003 7068487
7889 7068487 12685182 12824467 7485031 1082265 -1099180 2226241 6867200 7684423 4472206
7880 4472206 1646784 2314843 5153460 7399256 7813698 5672380 301166 -6184279 -8865740
$$ [...]
##END NTUPLES=NMR SPECTRUM
##END=
