##TITLE=31Pdec_LR-618-R3-CR7
 CDCl3, 124 sc
 30.06.2021
##JCAMPDX= 6.0         $$ Bruker NMR JCAMP-DX V2.0
##DATA TYPE= NMR SPECTRUM
##DATA CLASS= NTUPLES
##ORIGIN= UXNMR, Bruker Analytische Messtechnik GmbH
##OWNER= root
$$ XWIN-NMR		Version 3.5
$$ Wed Jun 30 08:48:01 2021 Russian Standard Time (UT+4h)  she@DPX200
##.OBSERVE FREQUENCY= 81.013821
##.OBSERVE NUCLEUS= ^31P
##.ACQUISITION MODE= SIMULTANEOUS
##.ACQUISITION SCHEME= undefined
##.AVERAGES= 124
##.DIGITISER RES= 16
##SPECTROMETER/DATA SYSTEM= spect
##.PULSE SEQUENCE= zgpg30
##.SOLVENT NAME= DMSO
##.SHIFT REFERENCE= (INTERNAL, DMSO, 0, 248.564)
##AUDIT TRAIL= $$ (NUMBER, WHEN, WHO, WHERE, WHAT)
$$ ##TITLE= Audit trail, XWIN-NMR		Version 3.5
$$ ##JCAMPDX= 5.01
$$ ##ORIGIN= Bruker BioSpin GmbH
$$ ##OWNER= she
$$ F:/spectra/data/she/nmr/P31/1/pdata/1/auditp.txt
$$ ##AUDIT TRAIL=  $$ (NUMBER, WHEN, WHO, WHERE, WHAT)
(   1,<2021-06-30 08:44:47.84 +0400>,<she>,<DPX200>,
      <continue with go, POWCHK disabled, PULCHK disabled
       configuration hash MD5:
       00 E9 B6 7A A2 85 ED C7 34 08 36 98 17 FE 4E 26
       data hash MD5: 32K
       AB D8 0E 37 47 2D ED 8B A1 67 E0 A6 E3 B6 89 E6>)
(   2,<2021-06-30 08:45:48.07 +0400>,<she>,<DPX200>,
      <Start of raw data processing
       efp BC_mod = 2 LB = 1 FT_mod = 6 PKNL = 1 PHC0 = -6847.684 PHC1 = 541.6862 SI = 64K 
       data hash MD5: 64K
       6A 39 FA ED B7 35 9B 91 9A D8 E2 37 FC 09 08 91>)
(   3,<2021-06-30 08:46:26.40 +0400>,<she>,<DPX200>,
      <pk PHC0 = -585.0105 PHC1 = 573.6 
       data hash MD5: 64K
       9B 76 F7 DC 2A 9D 64 D1 C7 11 9C 52 28 93 35 78>)
$$ ##END=
$$ 
$$ hash MD5
$$ 66 40 0E 9C 66 77 E7 22 04 83 01 C7 56 9A AF 08
##$RELAX= 
##$RELAX= 
##$RELAX= 
##$RELAX= 
##$RELAX= 
##$RELAX= 
##$RELAX= 
##$RELAX= 
$$ Bruker specific parameters
$$ --------------------------
##$DU= <F:/spectra>
##$EXPNO= 1
##$NAME= <P31>
##$PROCNO= 1
##$TYPE= <nmr>
##$USER= <she>
##$AMP= (0..31)
100 100 100 100 100 100 100 100 100 100 100 100 100 100 100 100 100 100 
100 100 100 100 100 100 100 100 100 100 100 100 100 100 
##$AQSEQ= 0
##$AQ_mod= 1
##$AUNM= <au_zg>
##$AUTOPOS= <>
##$BF1= 81.014009
##$BF2= 200.13
##$BF3= 200.13
##$BF4= 200.13
##$BF5= 200.13
##$BF6= 200.13
##$BF7= 200.13
##$BF8= 200.13
##$BYTORDA= 1
##$CFDGTYP= 0
##$CFRGTYP= 5
##$CHEMSTR= <none>
##$CNST= (0..31)
1 1 145 1 1 1 1 1 1 1 1 1 1 1 1 1 1 1 1 1 1 1 1 1 1 1 1 1 1 1 1 1 
##$CPDPRG= <waltz16>
##$CPDPRG1= <>
##$CPDPRG2= <waltz16>
##$CPDPRG3= <>
##$CPDPRG4= <mlev>
##$CPDPRG5= <mlev>
##$CPDPRG6= <mlev>
##$CPDPRG7= <mlev>
##$CPDPRG8= <mlev>
##$CPDPRGB= <>
##$CPDPRGT= <>
##$D= (0..31)
0 1 0 0 0 0 0 0 0 0 0 0.03 2e-05 3e-06 0 0 0 0 0 0 0 0 0 0 0 0 0 0 0 0 
0 0 
##$DATE= 1625028126
##$DBL= (0..7)
120 120 120 11 120 120 24 19 
##$DBP= (0..7)
150 150 150 150 150 150 150 150 
##$DBP07= 0
##$DBPNAM0= <>
##$DBPNAM1= <>
##$DBPNAM2= <>
##$DBPNAM3= <>
##$DBPNAM4= <>
##$DBPNAM5= <>
##$DBPNAM6= <>
##$DBPNAM7= <>
##$DBPOAL= (0..7)
0.5 0.5 0.5 0.5 0.5 0.5 0.5 0.5 
##$DBPOFFS= (0..7)
$$ [...]
##$SUBNAM2= <"">
##$SUBNAM3= <"">
##$SUBNAM4= <"">
##$SUBNAM5= <"">
##$SUBNAM6= <"">
##$SUBNAM7= <"">
##$SUBNAM8= <"">
##$SUBNAM9= <"">
##$SW= 501.771253377433
##$SWIBOX= (0..15)
0 1 3 0 0 0 0 0 0 0 0 0 0 0 0 0 
##$SW_h= 40650.406504065
##$TD= 32768
##$TD0= 1
##$TE= 0
##$TE2= 300
##$TE3= 300
##$TEG= 300
##$TL= (0..7)
0 120 53 12 22 120 120 120 
##$TP= (0..7)
150 150 150 150 150 150 150 150 
##$TP07= 0
##$TPNAME0= <>
##$TPNAME1= <>
##$TPNAME2= <>
##$TPNAME3= <>
##$TPNAME4= <>
##$TPNAME5= <>
##$TPNAME6= <>
##$TPNAME7= <>
##$TPOAL= (0..7)
0.5 0.5 0.5 0.5 0.5 0.5 0.5 0.5 
##$TPOFFS= (0..7)
0 0 0 0 0 0 0 0 
##$TUNHIN= 0
##$TUNHOUT= 0
##$TUNXOUT= 0
##$USERA1= <user>
##$USERA2= <user>
##$USERA3= <user>
##$USERA4= <user>
##$USERA5= <user>
##$V9= 5
##$VALIST= <valist>
##$VCLIST= <CCCCCCCCCCCCCCC>
##$VD= 0
##$VDLIST= <DDDDDDDDDDDDDDD>
##$VPLIST= <PPPPPPPPPPPPPPP>
##$VTLIST= <TTTTTTTTTTTTTTT>
##$WBST= 1024
##$WBSW= 4
##$XGAIN= (0..3)
0 0 0 0 
##$XL= 0
##$YL= 0
##$YMAX_a= 3415
##$YMIN_a= -5659
##$ZGOPTNS= <>
##$ZL1= 120
##$ZL2= 120
##$ZL3= 120
##$ZL4= 120
##$ABSF1= 0
##$ABSF2= 0
##$ABSG= 0
##$ABSL= 0
##$ALPHA= 0
##$AQORDER= 0
##$ASSFAC= 0
##$ASSFACI= 0
##$ASSFACX= 0
##$ASSWID= 0
##$AUNMP= <proc_1d>
##$AZFE= 0.1
##$AZFW= 0.5
##$BCFW= 0
##$BC_mod= 2
##$BYTORDP= 0
##$COROFFS= 0
##$CY= -3
##$DATMOD= 1
##$DC= 0
##$DFILT= <>
##$DTYPP= 0
##$F1P= 0
##$F2P= 0
##$FCOR= 1
##$FTSIZE= 65536
##$FT_mod= 6
##$GAMMA= 0
##$GB= 0
##$INTBC= 1
##$INTSCL= 5.30512e-09
##$ISEN= 30
##$LB= 1
##$LEV0= 0
##$LPBIN= 0
##$MAXI= 10000
##$MC2= 0
##$MEAN= 0
##$ME_mod= 0
##$MI= 50
##$NCOEF= 0
##$NC_proc= -6
##$NLEV= 6
##$NOISF1= 182.463
##$NOISF2= 159.3651
##$NSP= 0
##$NTH_PI= 0
##$NZP= 0
##$OFFSET= 248.5645
##$PC= 4
##$PHC0= -7432.694
##$PHC1= 1115.286
##$PH_mod= 1
##$PKNL= yes
##$PPARMOD= 0
##$PSCAL= 0
##$PSIGN= 0
##$REVERSE= no
##$SF= 81.014009
##$SI= 65536
##$SIGF1= 159.3651
##$SIGF2= -187.1042
##$SINO= 113.3802
##$SIOLD= 16384
##$SREGLST= <1H.CDCl3>
##$SSB= 0
##$STSI= 65536
##$STSR= 0
##$SW_p= 40650.406504065
##$SYMM= 0
##$S_DEV= 0
##$TDeff= 32768
##$TDoff= 0
##$TI= <>
##$TILT= no
##$TM1= 0
##$TM2= 0
##$TOPLEV= 0
##$USERP1= <user>
##$USERP2= <user>
##$USERP3= <user>
##$USERP4= <user>
##$USERP5= <user>
##$WDW= 1
##$XDIM= 65536
##$YMAX_p= 307506440
##$YMIN_p= -12084504
$$ End of Bruker specific parameters
$$ ---------------------------------
##NTUPLES= NMR SPECTRUM
##VAR_NAME=  FREQUENCY,     SPECTRUM/REAL,   SPECTRUM/IMAG
##SYMBOL=    X,             R,               I
##VAR_TYPE=  INDEPENDENT,   DEPENDENT,       DEPENDENT
##VAR_FORM=  AFFN,          ASDF,            ASDF
##VAR_DIM=   65536,         65536,           65536
##UNITS=     HZ,            ARBITRARY UNITS, ARBITRARY UNITS
##FACTOR=    0.620285442955139, 1,           1
##FIRST=     20137.2065510759, 0,            0
##LAST=      -20513.1999529892, 0,           0
##MIN=       -20513.1999529892, -12084504,   0
##MAX=       20137.2065510759, 307506440,    0
$$ Real data points
##PAGE= N=1
##DATA TABLE= (X++(R..R)), XYDATA
$$ [...]
##PAGE= N=2
##DATA TABLE= (X++(I..I)), XYDATA
13115D58896J289597l83551q56457O5448N89675M67043R37559J403578r7743k758112
$$ 458896 1748493 1364942 508485 573933 1163608 1630651 2568210 3971788 3874045 1115933
13105A115933l179643o83990J261024M55853p33799L20374K079772J600489o13719
$$ 1115933 -2063710 -2747700 -1486676 -1030823 -1764622 -1444248 635524 2236013 1622294
13096A622294j675209p94741K62956L85601J24518q9162m52353p12126m98547
$$ 1622294 -52915 -847656 -584700 -199099 -74581 -163743 -616096 -1328222 -1826769
13087a826769m77826j357989k070102r27131J500748K723519J793138M68930L44870
$$ -1826769 -2304595 -3662584 -5732686 -6659817 -5159069 -2435550 -642412 -173482 171388
13078A71388O22889k25207j907200k663210j536097O32483K190150K158447R89256
$$ 171388 794277 569070 -1338130 -4001340 -5537437 -4904954 -2714804 -556357 432899
13069D32899Q2748L10543J077072J217399N02768m05450j063769j322348p38244
$$ 432899 515647 826190 1903262 3120661 3623429 3217979 2154210 831862 93618
13060I3618P18749J650323O30641j327850j626970J83441J557769O54997j165214
$$ 93618 812367 2462690 3093331 1765481 138511 321952 1879721 2534718 1369504
13051A369504j758269j122072l39503N10019J429068J221750n46566j786797o71889
$$ 1369504 -388765 -1510837 -1850340 -1340321 88747 1310497 763931 -1022866 -1694755
13042a694755J099892P32550j081121j386153o3251J93008j033047j003967J093341
$$ -1694755 -594863 137687 -943434 -2329587 -2392838 -2199830 -3232877 -4236844 -3143503
13033c143503K314026Q40028j074342j160904o30771j078365j232310J30230J049655
$$ -3143503 -829477 10551 -1063791 -2224695 -2855466 -3933831 -5166141 -5035911 -3986256
13024c986256k51154j471842K50512L013671K788065k6621j350137j6027J104616
$$ -3986256 -4237410 -5709252 -5458740 -2445069 342996 316375 -1033762 -1049789 54827
13015E4827N34482Q9768P17704Q05895k30308o61200l7389k20223j367033q77999
$$ 54827 589309 679077 1396781 2202676 1972368 1311168 1273779 1053556 -313477 -1191476
13005a191476J684173K635227j40628l171651k445811N43747J616577M03934j74104
$$ -1191476 492697 3127924 2987296 -184355 -2630166 -2086419 -469842 -65908 -240012
12996b40012N68834M72740r52340j433355Q4806J575156J024146r34081k366447
$$ -240012 328822 801562 -150778 -1584133 -1499327 75829 1099975 165894 -2200553
12987b200553k265080p88648J200462K315608J648902p180r94188r37115r05575
$$ -2200553 -4465633 -5254281 -4053819 -1738211 -89309 -96489 -1090677 -2027792 -2933367
12978b933367j387897j419811j08456J948673L184989K522113L26798j676743
$$ -2933367 -4321264 -5741075 -5849531 -3900858 -715869 1806244 2133042 456299
12970D56299j838356m49899M38243l00079j295187p80271P78491J615852J406589
$$ 456299 -1382057 -1831956 -1393713 -1693792 -2988979 -3769250 -2990759 -1374907 31682
12961C1682J266384J416865P64273j018192k547879k343502m43563J773496K723903
$$ 31682 1298066 2714931 3479204 2461012 -86867 -2430369 -2873932 -1100436 1623467
12952A623467J785271N3196m84407P06046J829423J119592q02218k041384j873627
$$ 1623467 3408738 3461934 2977527 3683573 5512996 6632588 5830370 3788986 1915359
12943A915359p11865J120785K724587K041149j441328m250470k379978K821098
$$ 1915359 1203494 2324279 5048866 7090015 5648687 1398217 -981761 1839337
12935A839337N422445K347284k855502m924869l016903k27580R24132M25931n85044
$$ 1839337 7261782 9609066 6753564 1828695 -1188208 -1415788 -491656 -65725 -650769
12926f50769j119732o99442K98016R09405Q26810P59209J067062R34910l68731
$$ -650769 -1770501 -2469943 -2171927 -1262522 -435712 323497 1390559 2325469 1956738
12917A956738k124817k786463j600293O70772K247302J738587k13530j116066
$$ 1956738 -168079 -2954542 -4554835 -3884063 -1636761 101826 -111704 -1227770
12909a227770M13984K426220K024586n25219k292600k061446j440064j267638
$$ -1227770 -813786 1612434 3637020 3111801 819201 -1242245 -2682309 -3949947
12901c949947j54177K087434K725256J22249l003990l035288l80659J733778J898944
$$ -3949947 -4104124 -2016690 708566 830815 -2173175 -5208463 -5589122 -3855344 -1956400
12892a956400J114101N051j360318j609129N59151L162095K527462j201211l394110
$$ -1956400 -842299 -837248 -2197566 -3806695 -3247544 -85449 2442013 1240802 -2153308
12883b153308j216690K270863K495226l00483j937535m49997J679142J647894
$$ -2153308 -3369998 -1099135 1396091 1095608 -841927 -1291924 387218 2035112
12875B035112Q8198o06077j1793J50582r52384j893680j102940Q74872K101151
$$ 2035112 2123310 1517233 1505440 1656022 703638 -1190042 -2292982 -1418110 683041
12866F83041J605624K35412n25921J5880J189481J349785n33204l064892l183974
$$ 683041 2288665 2524077 1998156 2014036 3203517 4553302 4020098 955206 -2228768
12857b228768M5832L316485K629924j433038m189790k770964O94120K495554J753029
$$ -2228768 -2182936 1133549 3763473 2330435 -1859355 -4630319 -3936199 -1440645 312384
12848C12384J59871q25348q79117j59518O75598O51921j21012j98377R42783J612155
$$ 312384 472255 -353093 -1232210 -1391728 -716130 -64209 -185221 -383598 559185 2171340
12838B171340K93175j807706k284895p88486R19861J532269J195225M77327p6130
$$ 2171340 2464515 656809 -1628086 -2416572 -1496711 35558 1230783 1708110 1631980
12829A631980J94063J117355J093678r44706l389343l523258j045132J651510
$$ 1631980 1826043 2943398 4037076 3092370 -296973 -3820231 -4865363 -3213853
12821c213853K613129K050189R37496k96823j273928j364101n12235N50666J150706
$$ -3213853 -600724 1449465 2386961 2090138 816210 -547891 -1060126 -509460 641246
12812F41246R80903j24286j636035k042364o07601J016960P86202m53985K0780
$$ 641246 1622149 1497863 -138172 -2180536 -2788137 -1771177 -984975 -1438960 -1418180
12803a418180K423926L751770K271082J9632p16674r15628k416241l904393k490177
$$ -1418180 1005746 4757516 7028598 7048230 6331556 5415928 2999687 -904706 -3394883
12794c394883J298274L259358R19626l145389m545799k061571J794734L999392
$$ -3394883 -2096609 1162749 2082375 -1063014 -5608813 -7670384 -5875650 -1876258
12786a876258L455379J017019j381408j814665M2865K192064K194597j173k094495
$$ -1876258 1579121 2596140 1214732 -599933 -557068 1634996 3829593 3828420 1733925
12777A733925k438342j699746j064129m22811N00521P93268n4726m45256J128270
$$ 1733925 -704417 -2404163 -3468292 -3891103 -3390582 -2597314 -2652040 -3097296 -1969026
12768a969026L027034K366276l97478j879886r32682K4384l85091l02817J241237
$$ -1969026 1058008 3424284 3026806 1146920 214238 238622 -146469 -449286 791951
12759G91951J777584l21699k371104j616807o561n82272j619296N23070M164968
$$ 791951 2569535 2247836 -123268 -1740075 -1746636 -2328908 -3948204 -3425134 739834
12750G39834L700017j634938n868892m575193l85047J777156J036327k49584m96083
$$ 739834 4439851 2804913 -3063979 -7639172 -8024219 -6247063 -5210736 -5460320 -5956403
12741e956403M18364K152876L519334K994037J030704j93821k44275q92950k207300
$$ -5956403 -5538039 -3385163 134171 3128208 4158912 3965091 3720816 2827866 620566
12732F20566j780070M88600R14659j985694m093958j979868J156068O01908j888709
$$ 620566 -1159504 -670904 243755 -1741939 -5835897 -7815765 -6659697 -6057789 -7946498
12723g946498j069545K697279L799908O44682j812579j53258K543247K283433
$$ -7946498 -9016043 -6318764 -2518856 -1874174 -3686753 -3840011 -1296764 986669
12715I86669N2077r78343n30362j82216O9409Q95490J229143r0423j681287j519539
$$ 986669 1038746 60403 -469959 -652175 -582766 312724 1541867 1451444 -229843 -1749382
12705a749382l30531k51012j043348o63932Q59450J271675L4063n91096O78475
$$ -1749382 -2079913 -2330925 -3374273 -4038205 -3178755 -1907080 -1873017 -2464113 -1785638
12696a785638J932791J177376m57950o52344L72221M07771j006701j813575p27871
$$ -1785638 147153 1324529 866579 214235 586456 994227 -12474 -1826049 -2553920
12687b553920Q20760J080730O11925Q71235J328393K61941j820985k099965L66313
$$ -2553920 -1733160 -652430 -40505 830730 2159123 2421064 600079 -1499886 -1133573
12678a133573K608584J666585j084655j882510R879J534900N36654j419808j840734
$$ -1133573 1475011 3141596 2056941 174431 184310 1719210 2255864 836056 -1004678
12669a004678p35474J87660K08325r8227k40517j16685L12391N91129p4449j230897
$$ -1004678 -1740152 -1552492 -1344167 -1442394 -1682911 -1799596 -1487205 -896076 -970525 -2201422
12659b201422j043284Q80569K040985M53436j874883j616374O57952J307754n07600
$$ -2201422 -3244706 -2364137 -323152 130284 -1744599 -3360973 -2703021 -1395267 -1902867
12650a902867j623342l82191N99737p79003k138655n67953K238085K623726R11493
$$ -1902867 -3526209 -3908400 -3308663 -4087666 -6226321 -6794274 -4556189 -1932463 -1020970
12641a020970M39307J529266R52694k192271m309081k529382J194723L119003
$$ -1020970 -581663 947603 1900297 -291974 -4601055 -7130437 -5935714 -2816711
12633b816711K314911M26480j028234j256199R3592J969745K152487O7014k031180
$$ -2816711 -501800 -75320 -1103554 -2359753 -2266161 -296416 1856071 1923085 -108095
12624a08095k068003p27302M01696J304643K305957K289179N01559j410433j570792
$$ -108095 -2176098 -2903400 -2501704 -1197061 1108896 3398075 3899634 2489201 918409
12615I18409o97075m15802l76817K38112J06076j862581l044197k95893M064551
$$ 918409 221334 -194468 -571285 -333173 -227097 -2089678 -5133875 -5429768 -1365217
12606a365217M262959n34658m551261l472967J90783J883187J121116N4180o83392
$$ -1365217 2897742 2363084 -2188177 -5661144 -5470361 -3587174 -2466058 -2411878 -3095270
12597c095270j309290o64724J735257L220224J202399k193772k405089R88058
$$ -3095270 -4404560 -5069284 -3334027 -113803 1088596 -1105176 -3510265 -2522207
12589b522207L456695J827628j634752k737667p52002J431413J372239l89546
$$ -2522207 934488 2762116 1127364 -1610303 -2362305 -930892 441347 51801
12581E1801j671858j277573J32042J150094R45333l47020j772483j971032l79240
$$ 51801 -1620057 -2897630 -2765588 -1615494 -670161 -1017181 -2789664 -4760696 -5139936
12572e139936J600298J801552L23285k20461J323998K404767O48602j981971k094787
$$ -5139936 -3539638 -1738086 -1414801 -1635262 -311264 2093503 2742105 760134 -1334653
12563a334653l74342j57304j461220j201471P77828J220290j98888K57176L320611
$$ -1334653 -1708995 -1866299 -3327519 -4528990 -3751162 -2530872 -2729760 -2472584 848027
12554H48027M379223J190653j811241r57108M95815j168557k798423k04065L067083
$$ 848027 5227250 6417903 4606662 3649554 4145369 2976812 178389 -25676 3041407
12545C041407Q86153m256411m087671K157740O139988L185988j560735k260709
$$ 3041407 3927560 -328851 -4416522 -2258782 3881206 7067194 5506459 3245750
12537C245750l55387J63028o29767q90005j131841j877673j068931K173753M484390
$$ 3245750 2890363 3053391 2423624 1533619 401778 -1475895 -2544826 -371073 4113317
12528D113317K822877o21900j756183m52329L76617m60802j879871k998270l215671
$$ 4113317 6936194 6314294 4558111 4105782 4482399 4021597 2141726 -856544 -4072215
12519d072215j487825J723497L443534J740897j392169l064976l254629k979205
$$ -4072215 -5560040 -3836543 -393009 1347888 -44281 -3109257 -6363886 -9343091
12511i343091j328285K199125M686116L289795J89949k56172J752621K108316
$$ -9343091 -10671376 -8472251 -3786135 -496340 -306391 -562563 1190058 3298374
12503C298374k53305j819733n59392R14172j41853k426692k987868j303363R27437
$$ 3298374 3045069 1225336 665944 1580116 1438263 -988429 -3976297 -5279660 -4352223
12494d352223K276417K284951J074570m05528p91559O4249P65666K94817o72307
$$ -4352223 -2075806 209145 1283715 878187 86628 150877 916543 1211360 539053
12485E39053q70894j002J188585J642393P55860q53890j536893m62607J103609
$$ 539053 -331841 -332843 855742 2498135 3253995 2400105 863212 400605 1504214
12476A504214J411215N15594l36403q56902j522030j863860j032995K70801N78641
$$ 1504214 2915429 3431023 3094620 2237718 715688 -1148172 -2181167 -1910366 -1331725
12467a331725J31060K87263O62179m30181k487421k781950o17956J337722J264529
$$ -1331725 -1200665 -913402 -251223 -681404 -3168825 -5950775 -6568731 -5231009 -3966480
12458c966480Q05497J619817K118099L42112k010964j719311Q67111K132800N00051
$$ -3966480 -3160983 -1541166 576933 919045 -1091919 -2811230 -1944119 188681 688732
12449F88732j483361j032491J177274K385181J380360n02759j355982o60647N69507
$$ 688732 -794629 -1827120 -649846 1735335 3115695 2612936 1256954 596307 1165814
12440A165814J009046K77290q38982j281069p27028K38604P15455K55046o42668
$$ 1165814 2174860 2452150 1613168 332099 -394929 -156325 559130 814176 171508
12431A71508q41924J54165J280032R47383q38286k171645j465160O62019K203285
$$ 171508 -670416 -516251 763781 1711164 872878 -1298767 -2763927 -2101908 101377
12422A01377J967891M77253r04153j204990m90004K87425K17714n58464j006234
$$ 101377 2069268 2546521 1642368 437378 -52626 234799 452513 -105951 -1112185
12413a112185m92663M31474P60907K27837m90932n91922j9776M57532J71282m35626
$$ -1112185 -1604848 -1173374 -412467 -184630 -675562 -1267484 -1287260 -829728 -658446 -1094072
12403a094072j93922J134594K249241J924621N42487p48530j612316k191535j994061
$$ -1094072 -1287994 -153400 2095841 4020462 4562949 3814419 2202103 10568 -1983493
12394a983493n91572J083271J706689J444986J278303R74307k86311j681918j547002
$$ -1983493 -2575065 -1491794 214895 1659881 2938184 3912491 3626180 1944262 397260
12385C97260l25630j02761r54154o80488J113660J807681J1479j983754j948770
$$ 397260 71630 -31131 -985285 -1665773 -552113 1255568 1267047 -716707 -2665477
12376b665477j166838j705067k577383j496457J159476K899858K573548J020936
$$ -2665477 -3832315 -5537382 -8114765 -9611222 -8451746 -5551888 -2978340 -1957404
12368a957404n73945j016105O81948L319668L593686N67583k101402j361623K67141
$$ -1957404 -2531349 -3547454 -2865506 454162 4047848 4615431 2514029 1152406 1419547
12359A419547j043355l448235k103033K244601L535266p5008l050425j046668
$$ 1419547 376192 -3072043 -5175076 -2930475 604791 529783 -2520642 -3567310
12351c567310K702364K959924K24816j240109l03355L76644p88150k453268k913117
$$ -3567310 -864946 2094978 2319794 1079685 776330 1152974 364824 -2088444 -5001561
12342e001561j881853O1733J907699K460690J596674P14050Q42012J248083R92798
$$ -5001561 -6883414 -6821681 -4913982 -2453292 -856618 -142568 699444 1947527 2940325
12333B940325N93038Q06528J015649L14201q58361j559150j795378j878393j435382
$$ 2940325 3533363 4339891 5355540 5669741 4811380 3252230 1456852 -421541 -1856923
12324a856923k98386P51898J213316J503192J445834J8392k109105k115840Q16467
$$ -1856923 -2155309 -1403411 -190095 1313097 2758931 2777323 668218 -1447622 -631155
12315f31155L118516J390933k373502l330684m76694K519169K717296R09848q84050
$$ -631155 2487361 3878294 1504792 -1825892 -2302586 216583 2933879 3843727 2959677
12306B959677j913318k011784r03933P96753J622707J113280L92479M21789Q15200
$$ 2959677 1046359 -965425 -1869358 -1072605 550102 1663382 2055861 2477650 3292850
12297C292850P44689O7480p31641j132279j128040j408524k382883k928197j499917
$$ 3292850 4037539 4105019 3373378 2241099 1113059 -295465 -2678348 -5606545 -7106462
12288g106462J125406K232459J179221N48787J767955K419815L69246k228455
$$ -7106462 -5981056 -3748597 -2569376 -2020589 -252634 2167181 2536427 307972
12280C07972k323042r01819o39289p95121R33813L087398K212640p85498j533282
$$ 307972 -2015070 -2916889 -3556178 -4351299 -3417486 -330088 1882552 1097054 -436228
12271d36228N29729J320611o17068j607264N76982K766881J658709j229803k645093
$$ -436228 93501 1414112 797044 -810220 -233238 2533643 4192352 2962549 317456
12262C17456k080145o10308J406687K955854J925840j352918l142065j406426
$$ 317456 -1762689 -2372997 -966310 1989544 3915384 2562466 -579599 -1986025
12254a986025J071393J202521R6588K06334R99531P43231L3812K39008O09543
$$ -1986025 -914632 287889 384477 590811 1590342 2333573 2367385 2606393 3215936
12245C215936L1916n00199j52273o20175k951090m334434j843764K440933L931439
$$ 3215936 3247852 2747653 2595380 1975205 -975885 -5310319 -7154083 -4713150 -781711
12236g81711J879150l90113n71704O42853J805813J874344N5038k730653l437881
$$ -781711 1097439 707326 135622 778475 2584288 4458632 4513670 1783017 -1654864
12227a654864p48130K150296J635996j103693k206730q98919N09304R37272R79203
$$ -1654864 -2402994 -252698 1383298 279605 -1927125 -2826044 -2316740 -1379468 -400265
12218d00265K72627j572406k469183m05684K396921K131184n50925j586151j7210
$$ -400265 -127638 -1700044 -4169227 -4574911 -2177990 -46806 -597731 -2183882 -2201092
12209b201092J250423R68225Q84905J318341L88682j525707j437944Q64497J713945
$$ -2201092 -950669 17556 902461 2220802 2609484 1083777 -354167 510330 2224275
12200B224275m69293k394822j158782J471841K256665Q46574j066638k297505
$$ 2224275 1754982 -639840 -1798622 -326781 1929884 2776458 1709820 -587685
12192e87685k231855p65962O93636N77459l5717J099039K968206K203009j068284
$$ -587685 -2819540 -3585502 -2891866 -2314407 -2350124 -1251085 1717121 3920130 2851846
12183B851846k656226p68443J452534J474524Q76753J169228P21299j319002k320674
$$ 2851846 195620 -572823 879711 2354235 3230988 4400216 5121515 3802513 1481839
12174A481839o80472P65629o44973k775190k327230j10378J021948Q70018Q71514
$$ 1481839 801367 1566996 922023 -1853167 -4180397 -4290775 -3268827 -2398809 -1527295
12165a527295P00308n51644j724921j324989j08598O96297J509578K262427J073390
$$ -1527295 -826987 -1378631 -3103552 -4428541 -4537139 -3840842 -2331264 -68837 1004553
12156A004553j998452l145685l67227K418377J037130k229407k436109K00816
$$ 1004553 -993899 -4139584 -4506811 -2088434 -1051304 -3280711 -5716820 -5516004
12148e516004J662083J232566J476878K429098J698653j66671j42288J453157
$$ -5516004 -3853921 -2621355 -1144477 1284621 2983274 2816603 2674315 4127472
12140D127472J108522j502500k666359j012290M10227k84473j047689l38650K78963
$$ 4127472 5235994 3733494 1067135 54845 465072 180599 -867090 -1205740 -926777
12131i26777p9243M00193K195014K477820j70233k739653k393026p87831n99843
$$ -926777 -1006020 -605827 1589187 4067007 3896774 1157121 -1235905 -2023736 -2623579
12122b623579p08967J288213L849545L076299j071109l987957k483710J169223
$$ -2623579 -3332546 -2044333 1805212 4881511 3810402 -177555 -2661265 -1492042
12114a492042K498700M31656j958609j806179J973N14015q57362j501357K67705
$$ -1492042 1006658 1438314 -520295 -2326474 -2324501 -1810486 -2667848 -4169205 -3901500
12105c901500K360590J983816n9055p00319O76563J718191J021776k55022q59197
$$ -3901500 -1540910 442906 383851 -316468 360095 2078286 3100062 2845040 1985843
12096A985843q84695m61088M68070P93102o83779k515755j869213R53433K393101
$$ 1985843 1101148 640060 1108130 1901232 1217453 -1298302 -3167515 -2214082 179019
12087A79019R35007p63561m10110O04305L76377j88814K39587M61283q97050k283105
$$ 179019 1114026 350465 -59645 544660 921037 732223 971810 1433093 536043 -1747062
12077a747062j597904O9024L06864l56676N11414K690464L264359J213979j043669
$$ -1747062 -3344966 -3275942 -2969078 -3325754 -2814340 -123876 3140483 4354462 3310793
12068C310793j358524n73817n93715j613419k324317j712176J4241J490593J150367
$$ 3310793 1952269 1378452 784737 -828682 -3152999 -4865175 -4850934 -3360341 -2209974
12059b209974q57981j992761j52426K900284L066161n00270l533471j989338K418368
$$ -2209974 -3067955 -5060716 -5213142 -2312858 753303 253033 -3280438 -5269776 -2851408
12050b851408M339568J776123j656390j949787K02286J205426r7566j382890q81255
$$ -2851408 1488160 3264283 1607893 -341894 -139608 1065818 968252 -414638 -1295893
12041a295893J34955r0019q01836j84572J371260J697866K80466r25769n62843
$$ -1295893 -1160938 -1250957 -2052793 -2237365 -866105 831761 1112227 186458 -376385
12032c76385J67176l47546j509391j576998n12944J5494n54464n94311J159209
$$ -376385 -209209 -556755 -2066146 -3643144 -4156088 -4140594 -4695058 -5289369 -4130160
12023d130160L195942K915229L56506j521067q00080Q51921Q82162m00360q81413
$$ -4130160 -934218 1981011 2337517 816450 16370 868291 1750453 1350093 468680
12014D68680m48868q93050k125877j749753O75322K123567O83704j217320o98506
$$ 468680 19812 -873238 -2999115 -4748868 -4073546 -1949979 -1266275 -2483595 -3182101
12005c182101R22111N63165j321260j571020M11778J930290J484468N77501M86895
$$ -3182101 -2259990 -1696825 -3018085 -4589105 -4177327 -2247037 -762569 -185068 301827
11996C01827K61706r81017k111403j615309L00179K055202K165420K69470k211441
$$ 301827 563533 -417484 -2528887 -4144196 -3844017 -1788815 376605 646075 -1565366
11987a565366k798638p02139J746762J952673M51064m28445j22029L60321R54545
$$ -1565366 -4364004 -5066143 -3319381 -1366708 -915644 -1344089 -1466118 -1105797 -151252
11978a51252J879670J581271j097486l551015k303603J231271K444054Q70350
$$ -151252 1728418 3309689 2212203 -1338812 -3642415 -2411144 32910 903260
11970I03260O26034K840910L414277K60636k823003k519089j036424j075571o58960
$$ 903260 1529294 4370204 7784481 8045117 5222114 2703025 1666601 591030 -67930
11961f7930K240859M116750Q19481m706890n699936j303478K714405K637531Q12555
$$ -67930 2172929 6289679 7109160 2402270 -3297666 -4601144 -1886739 750792 1563347
11952A563347L40236N97612j73579j349802j215658J83371J181844O28046q64706
$$ 1563347 1903583 2501195 2327616 977814 -237844 -54473 1127371 1755417 890711
11943H90711j421925M4441J898862J163763k211585m318606k316466J386544K471631
$$ 890711 -531214 -486773 1412089 2575852 364267 -3954339 -6270805 -4884261 -2412630
11934b412630O43056p81664j48389R23963Q60017P6941m88723m53336L75645J493460
$$ -2412630 -1769574 -2551238 -2699627 -1775664 -915647 -838706 -1327429 -1780765 -1405120 88340
11924H8340J355336m81664j839133q56312P92097M65855r55701o82263R30231
$$ 88340 1443676 962012 -877121 -1733433 -941336 -475481 -1431182 -2113445 -1183214
11915a183214J091452j23950J84078K082664K039877r00161k867490j289329R32635
$$ -1183214 -91762 -215712 -31634 2051030 4090907 3190746 323256 -966073 -33438
11906c3438K87776j787808j661346P32257K423302K102876J063790M11100N9362
$$ -33438 254338 -1533470 -3194816 -2462559 -39257 2063619 3127409 3538509 3597871
11897C597871j09198k51961j050572k359282k347222K6165K650068K586372R2477
$$ 3597871 3488673 3236712 2186140 -173142 -2520364 -2494199 155869 2742241 2834718
11888B834718j853861j599602k48775O97627R94294Q42117L21462o3632J84370
$$ 2834718 980857 -618745 -867520 -169893 824401 1666518 1987980 1924348 2108718
11879B108718M18167l67392j559082j461831n8111O81982r5076o73893L55354
$$ 2108718 2526885 2159493 600411 -861420 -919531 -237549 -332625 -1006518 -651164
11870f51164J549654Q22596j010472j238310N80405J875349Q85620j023473j897078
$$ -651164 898490 1721086 710614 -527696 52709 1928058 2813678 1790205 -106873
11861a06873k017265k488581k615301j067894J158454J598009J20505o44680P59739
$$ -106873 -2124138 -4612719 -7228020 -8295914 -7137460 -5539451 -5418946 -6063626 -5303887
11852e303887K603266K819115J698356N08004n11372j244955p92913O81049J053056
$$ -5303887 -2700621 118494 1816850 2324854 1813482 568527 -224386 456663 1509719
11843A509719o37798j938954m41388K116438K307915L54731n94933J28921N4550
$$ 1509719 871921 -1067033 -1508421 608017 2915932 3270663 2675730 2804651 2859201
11834B859201j483686j851648K29755K221093J787459J68413n53065p37825j322047
$$ 2859201 1375515 -476133 -246378 1974715 3762174 3930587 3377522 2639697 1317650
11825A317650j153890Q80262K862145K066731q35953k633660k028802o52482J8807
$$ 1317650 163760 1044022 3906167 5972898 5136945 2503285 474483 -177999 -159192
11816a59192K22607L16911q6456r17828j312091r38912l57994J18796O19115P62187
$$ -159192 63415 380326 293870 -623958 -1936049 -2874961 -3232955 -3114159 -2495044 -1732857
11806a732857J3597q78207l90941J412098K503322J486501o72203k123097k163054
$$ -1732857 -1719260 -2597467 -2988408 -1576310 927012 2413513 1741310 -381787 -2544841
11797b544841j135799M47290J730346J543336j31093j400755m80564J850504L020713
$$ -2544841 -3680640 -3233350 -1503004 40332 -90761 -1491516 -1972080 -121576 2899137
11788B899137J810663m02021j642067j468155p24215j63572l3482l60858q20947
$$ 2899137 4709800 4307779 2665712 1197557 473342 309770 276288 -84570 -905517
11779i05517o60390M75633J769416J940916P06290r66279j922149j642178l22025
$$ -905517 -1565907 -1090274 679142 2620058 3326348 2360069 437920 -1204258 -1526283
11770a526283J089412J221569k70841j708800j143641Q27681J636675N34920k25141
$$ -1526283 -436871 784698 513857 -1194943 -2338584 -1510903 125772 660692 435551
11761D35551Q59565J767112Q4277k737341l181708r36953Q54083O16752K49567
$$ 435551 1295116 3062228 3146505 409164 -2772544 -3709497 -2855414 -2238662 -1989095
11752a989095J136392J578244Q4415j568945j149180K60004K46360o83046j72264
$$ -1989095 -852703 725541 809956 -758989 -1908169 -1648165 -1401805 -2084851 -2257115
11743b257115J492545J623802p1489o94874Q01108J395215j047423l667862k560042
$$ -2257115 -764570 859232 787743 92869 893977 2289192 1241769 -2426093 -4986135
11734d986135J226365L184909J810700j18652n20288m92515j045673r04736P06826
$$ -4986135 -3759770 -574861 1235839 1117187 596899 104384 -941289 -1846025 -1139199
11725a139199K025201J640864R41793J242579Q73944j731489m027325k364325
$$ -1139199 886002 2526866 3468659 4711238 5585182 3853693 -173632 -2537957
11717b537957J967981L873226J552225j571394k517458k218585k114942j350127
$$ -2537957 -569976 3303250 4855475 3284081 766623 -1451962 -3566904 -4917031
11709d917031N54887J765477J308447J011985J757492J181600j727283l244634
$$ -4917031 -4362144 -2596667 -1288220 -276235 1481257 2662857 935574 -2309060
11701b309060m10304L082977J862795k258903k570772J978107N011210K544039
$$ -2309060 -2719364 363613 2226408 -32495 -2603267 -625160 4386050 6930089
11693F930089j617111k723456j836889k102074k692541j042375J751142K438164
$$ 6930089 5312978 2589522 752633 -1349441 -4041982 -5084357 -3333215 -895051
11685h95051J006620L08736J012123Q60072r55079k190864j199303N24881P42357
$$ -895051 111569 420305 1432428 2292500 1337421 -853443 -2052746 -1527865 -785508
11676g85508l79203q91942J04913J464215J634808N75235l49204k89700j9031
$$ -785508 -1164711 -2056653 -1951740 -487525 1147283 1722518 1373314 1083614 1064583
11667A064583m20558o64485M86618J960960J362747r93352j874605j53970J026213
$$ 1064583 644025 -20460 466158 2427118 3789865 2796513 921908 767938 1794151
11658A794151o49866k402833o72244K572803K342176j561073m104790k652386
$$ 1794151 1144285 -1258548 -1930792 642011 2984187 1423114 -2681676 -5334062
11650e334062j91757M06643O70756K426348L469390J198085k173379k378837L76240
$$ -5334062 -5525819 -5119176 -4448420 -2022072 1447318 2645403 472024 -1906813 -1530573
11641a530573J942131P10407o98405n49677n64742j943236k555820n11645K291023
$$ -1530573 411558 1121965 423560 -126117 -690859 -2634095 -5189915 -5701560 -3410537
11632c410537K965804J900293J281378J053879k58042j760272j083508J013373
$$ -3410537 -444733 1455560 2736938 3790817 3532775 1772503 688995 1702368
11624A702368R07955k056449l759227j257855K661298L566957J490151k34918
$$ 1702368 2610323 553874 -3205353 -4463208 -1801910 1765047 3255198 3020280
11616C020280m09176o27133j391440j272444l6058O38184J09532l79505m17250
$$ 3020280 2611104 1983971 592531 -679913 -715971 -77787 31745 -347760 -765010
11607g65010j144069k393797k052732L34852K124212J563302N60993J160283J830514
$$ -765010 -1909079 -4302876 -6355608 -6020756 -3896544 -2333242 -1772249 -611966 1218548
11598A218548L85971j502933o50588J909841J903046j384405l615972j982374
$$ 1218548 1604519 101586 -549002 1360839 3263885 1879480 -1736492 -3718866
11590c718866O94277P43723p78463n68008J150184J228720r00970k209388r04242
$$ -3718866 -3024589 -2280866 -3059329 -3627337 -2477153 -1248433 -2149403 -4358791 -5263033
11581e263033J052205J369871O06613L19863L13482k50042o87867o994Q95236
$$ -5263033 -4210828 -2840957 -2234344 -1914481 -1600999 -1851041 -2538908 -2545902 -1650666
11572a650666N97415q0838P48003K430765K150520o59365k961302k287970j4288
$$ -1650666 -1053251 -1134089 -386086 2044679 4195199 3535834 574532 -1713438 -1727726
11563a727726J032115L64711n10357p56221n63038J37745J334853J907507P92712
$$ -1727726 -695611 -330900 -841257 -1597478 -2160516 -2022771 -687918 1219589 2012301
11554B012301j088198j693857n45604Q19924R60173j07238j415405j778018m02876
$$ 2012301 924103 -769754 -1315358 -495434 464739 357501 -1057904 -2835922 -3238798
11545c238798J940203K817869P34491k450743l366641j312837J097044J575368
$$ -3238798 -1298595 1519274 2253765 -196978 -3563619 -4876456 -3779412 -2204044
11537b204044O41888l0271o2121j59809n36708o19648K3853J039087J490012P30029
$$ -2204044 -1562156 -1592427 -1654548 -1814357 -2351065 -2970713 -2946860 -1907773 -417761 312268
11527C12268p31532j571558j176580k39413N03150J093127J320828L76981j294989
$$ 312268 -419264 -1990822 -3167402 -3406815 -2903665 -1810538 -489710 -112729 -1407718
11518a407718j497512N50369K189133Q79748j675885j951781J2883J133073M91183
$$ -1407718 -2905230 -2354861 -165728 714020 -961865 -2913646 -2900763 -1767690 -1276507
11509a276507J05171O04200L76972m33950M34262K461727J724523k513266n006102
$$ -1276507 -1171336 -567136 -190164 -624114 -189852 2271875 3996398 1483132 -3522970
11500c522970j745549L631431M750867J225346j876299j648230p2187K99526m87180
$$ -3522970 -5268519 -1637088 3113779 4339125 2462826 814596 742409 1041935 554755
11491E54755j177176j013432J76701J568903J428617m42169j384262N10913K694783
$$ 554755 -622421 -1635853 -1459152 109751 1538368 1096199 -288063 222850 2917633
11482B917633J364751k379510l503996l72677K850990K299046o59127k413924
$$ 2917633 4282384 1902874 -1601122 -1973799 877191 3176237 2517110 103186
11474A03186k052594r74402M8101P72828J81981j897409k974106o73724L091707
$$ 103186 -1949408 -2923810 -2875709 -2102881 -1920900 -3818309 -6792415 -7466139 -4374432
11465d374432L835891P81691j668295k01074K468377J668317k036556l501772
$$ -4374432 -538541 243150 -1425145 -1626219 842158 2510475 473919 -3027853
11457c027853o89114K322258J585799r65468j072319J000859J262799j273980
$$ -3027853 -3716967 -1394709 191090 -774378 -1846697 -845838 416961 -857019
11449h57019l012701j533565R09066J275308R1298k21784P88569J609374J302198
$$ -857019 -3869720 -5403285 -4494219 -3218911 -3127613 -3349397 -2560828 -951454 350744
11440C50744L27332k50945N27272K358838K877093J41719l596900l655869L26549
$$ 350744 678076 427131 954403 3313241 6190334 6332053 2735153 -920716 -594167
11431e94167K916349M23868l622290l853425p61793J212610Q77535O53476J142353
$$ -594167 2322182 2746050 -876240 -4729665 -5491458 -4278848 -3401313 -2747837 -1605484
11422a605484M96140j099919j178917M21641J166785N54427Q02830J990538J226234
$$ -1605484 -1109344 -2209263 -3388180 -2966539 -1799754 -1245327 -442497 1548041 2774275
11413B774275j734297k768216J03007K707310P39597l518435m517823j260350
$$ 2774275 1039978 -1728238 -1625231 1082079 1821676 -1696759 -6214582 -7474932
11405g474932K277124L237211K455520J393670J73827q79703p03891N39479J071400
$$ -7474932 -5197808 -1960597 494923 1888593 2062420 1182717 478826 1018305 2089705
11396B089705K7244j185183r52845L37454J094851P10276J0318j49614L6316j50653
$$ 2089705 2116949 931766 -21079 316375 1411226 2121502 2131820 1982206 2018522 1867869
11386A867869o89874n99800O93832K150996K095733M41267r94269q02315K17910
$$ 1867869 1177995 578195 1272027 3423023 5518756 5960023 4965754 4163439 4381349
11377D381349K29426j257547k865402k900849r64805J652776K872083J623224
$$ 4381349 4610775 3353228 487826 -2413023 -3377828 -1725052 1147031 2770255
11369B770255q50738j997027o93002J500311K215974Q41268j259658k449752k112936
$$ 2770255 1919517 -77510 -770512 729799 2945773 3787041 2527383 77631 -2035305
11360b035305p66145M32407O55786M14431J039886K556828K908752N17907k925022
$$ -2035305 -2801450 -2369043 -1713257 -1298826 -258940 2297888 5206640 5724547 2799525
11351B799525l910445j527140J210081J248155o81121j510241k27254J044560
$$ 2799525 -1110920 -2638060 -1427979 -179824 -860945 -2371186 -2598440 -1553880
11343a553880L87357j263722j666550k91595J340413J721076O95054q93995j895497
$$ -1553880 -1166523 -2430245 -4096795 -4388390 -3047977 -1326901 -631847 -1525842 -3421339
11334c421339j414247L25557J739796J388434l19631j682001j702973o26659J055094
$$ -3421339 -4835586 -4510029 -2770233 -1381799 -1701430 -3383431 -5086404 -5713063 -4657969
11325d657969K710857K967748Q59607k158890l196242j536166M69207Q28538L27996
$$ -4657969 -1947112 1020636 1880243 -278647 -3474889 -5011055 -4541848 -3713310 -3385314
11316c385314M55363Q98286P44044M76276P99109Q16947m31371j632775p58693
$$ -3385314 -2929951 -2031665 -1287621 -811345 -12236 804711 373340 -1259435 -2018128
11307b018128J582482K695096J577427k4688n34668m98292j026181j871347j927426
$$ -2018128 -435646 2259450 3836877 3812189 3277521 2779229 1753048 -118299 -2045725
11298b045725q13425O10599J030265P0291r35426l55313J185458J141357j054993
$$ -2045725 -2859150 -2248551 -1218286 -1147995 -2083421 -2438734 -1253276 -111919 -1166912
11289a166912k359980m19444K300213J753159j410277k594720k75375J747959
$$ -1166912 -3526892 -3946336 -1646123 107036 -1303241 -3897961 -4173336 -2425377
11281b425377L66207k159790j861205J175939L457418K971560Q28029j178091
$$ -2425377 -2059170 -4218960 -6080165 -4904226 -1446808 1524752 2352781 1174690
11273A174690k251457k060473n74846J213085J811156R35957j72424m28253j49282
$$ 1174690 -1076767 -3137240 -3712086 -2499001 -687845 248112 75688 -352565 -501847
11264e01847k75842r16673j238348o71172L21364R77999J358752K010183K570947
$$ -501847 -777689 -1694362 -2932710 -3603882 -3282518 -2304519 -945767 1064416 3635363
11255C635363J810942l47723j909261j096819J056593J820179K81014j634774
$$ 3635363 5446305 5098582 3189321 2092502 3149095 4969274 5250288 3615514
11247C615514j788612k11373J531581K264844J819348M47753j484919l211671
$$ 3615514 1826902 1615529 3147110 5411954 7231302 7679055 6194136 2982465
11239B982465l523544j667640J384682L161742K204316R1096m63639N47951N36672
$$ 2982465 -541079 -2208719 -824037 2337705 4542021 4633117 4169478 4717429 5254101
11230E254101j309516k450975j262308p4659j347868l163497k059437J192535
$$ 5254101 3944585 1493610 231302 156643 -1191225 -4354722 -6414159 -5221624
11222e221624K658632J394592L46634J049164J640923R60894N13579R00798K11191
$$ -5221624 -2562992 -1168400 -821766 227398 1868321 2829215 3342794 4243592 4454783
11213D454783j969312k631174j74113K093552O86261k452436k983978r23237L7661
$$ 4454783 2485471 -145703 -319816 1773736 2459997 7561 -2976417 -3899654 -3861993
11204c861993r51442p86039J690836L155307J134211j617275j027497K099839
$$ -3861993 -4813435 -5599474 -3908638 -753331 380880 -1236395 -2263892 -164053
11196a64053L138519K53896l122651l050930L7625K607204K678152J404476N29445
$$ -164053 2974466 3228362 105711 -2945219 -2907594 -300390 2377762 3782238 4311683
11187D311683J47313m89467j208702j039967J97170J223267N64282j538690k820065
$$ 4311683 4458996 3969529 2760827 1720860 1918030 3141297 3705579 2166889 -653176
11178f53176j303800J883375L141096P88639k339770k423761J42644J562095K70594
$$ -653176 -1956976 -73601 3067495 3856134 1516364 -907397 -764753 797342 1067936
11169A067936j335088j288561p96070j110807q85208R90371K578190J773647q5109
$$ 1067936 -267152 -1555713 -2351783 -3462590 -4347798 -3357427 -779237 994410 909301
11160I09301m64233K60580Q2487p26019l48233R60415J344524P08224L56910p830
$$ 909301 445068 705648 788135 62116 -286117 674298 2018822 2727046 3083956 3076126
11150C076126j494069k783260j473140J416463K174568J23102j189261M39638
$$ 3076126 1582057 -1201203 -2674343 -1257880 916688 1039790 -149471 290167
11142B90167K622795K329154J78184j111886n23486P15918J056326n6448j856690
$$ 290167 2912962 5242116 5420300 4308414 3784928 4500846 5557172 5500724 3644034
11133C644034k791010k165916r82706k43833M52341J249038Q02376j039504j508263
$$ 3644034 853024 -1312892 -2295598 -2539431 -2087090 -838052 -35676 -1075180 -2583443
11124b583443R27387K922994R93867k182468j513856J964172K616717k70335j547490
$$ -2583443 -1656056 1266938 2260805 78337 -1435519 528653 3145370 2875035 1327545
11115A327545N44746J567405o52462k041292n1967J409718q12755l098097j378813
$$ 1327545 1872291 3439696 2787234 745942 693975 2103693 1290938 -1807159 -3185972
11106c185972J703763J600979n11108p36198M66219J50739r92596k89672J290428
$$ -3185972 -1482209 118770 -392338 -1128536 -662317 -511578 -1504174 -1793846 -503418
11097e03418Q37395q48221p42270O50862L44491j440291j839033p28157l94898
$$ -503418 333977 -514244 -1256514 -605652 -261161 -1701452 -3540485 -4268642 -4663540
11088d663540n22602J177649L594545K931565p20358k664661n43947K541594L163774
$$ -4663540 -5186142 -4008493 -413948 2517617 1797259 -867402 -1411349 1130245 4294019
11079D294019J718318L0394j417339k245868j482665K41313O29464p42096j527533
$$ 4294019 6012337 6042731 4625392 2379524 896859 1138172 1767636 1025540 -501993
11070e01993n08731M34948k35098j039945j65982J447000J820870J038204N22059
$$ -501993 -1010724 -575776 -810874 -1850819 -2016801 -569801 1251069 2289273 2811332
11061B811332M07198l26976j676799k346014j687615o87860o03494j219010j083151
$$ 2811332 3218530 2891554 1214755 -1131259 -2818874 -3506734 -4110228 -5329238 -6412389
11052f412389M25120J907644J663287K38833j79391R50006J696099Q33761j83694
$$ -6412389 -5987269 -4079625 -2416338 -2177505 -2356896 -1406890 289209 1122970 939276
11043I39276J71433Q08548r9426j939548k508673j162292P58138J911103J806514
$$ 939276 1110709 1919257 1819831 -119717 -2628390 -3790682 -3032544 -1121441 685073
11034F85073N71705o89543m27158J056995J319064o01188k076634n67512K358562
$$ 685073 1256778 567235 140077 1197072 2516136 1914948 -161686 -729198 1629364
11025A629364L293372J816418K27676l72730p67263j205408j217928j284032j976750
$$ 1629364 4922736 6739154 6966830 6594100 5826837 4621429 3403501 2119469 142719
11016A42719k032445l0640K500004K534065l3828k092383j531011N22729J788766
$$ 142719 -1889726 -1920366 579638 3113703 3079875 987492 -543519 -20790 1767976
11007A767976J288649k51255j092779j30794J194796J95255k664039l282315j9438
$$ 1767976 3056625 2805370 1712591 1581797 2776593 2971848 307809 -2974506 -2993944
10998b993944K867133J307699k100955k271487K83285J102608k31477j21179J609430
$$ -2993944 -126811 1180888 -920067 -3191554 -2908269 -1805661 -2037138 -2158317 -548887
10989e48887J050501k231657l496661o29336K303842J966069P83762J693656K719179
$$ -548887 501614 -1730043 -5226704 -5856040 -3552198 -1586129 -802367 891289 3610468
10980C610468R99650j574329j397373P50977J208725m80462j264277J55259J518074
$$ 3610468 4610118 3035789 1638416 2389393 3598118 3117656 1853379 2008638 3526712
10971C526712Q79257n80611o80782N14284Q46214r19040l104902k884449o0185
$$ 3526712 4405969 3825358 3144576 3658860 4505074 3586034 481132 -2403317 -2463502
10962b463502K188414J366050q93488j359453o719M48936p75278j531938o08655
$$ -2463502 -275088 1090962 197474 -1161979 -1168698 -719762 -1495040 -3026978 -3635633
10953c635633N79297Q74645R82446J187517L39535j517574k122936k77337K016773
$$ -3635633 -3056336 -2181691 -1199245 -11728 327807 -1189767 -3312703 -3590040 -1573267
10944a573267K363261J084994m7618n26944q77987r90778l02711R96812J977304
$$ -1573267 789994 1874988 1827370 1300426 422439 -568339 -871050 125762 2103066
10935B103066J815632L99578j300470j735519o09322M12001P4687m47598K61351
$$ 2103066 3918698 4318276 3017806 1282287 672965 1084966 1159653 712055 973406
10926I73406J026664P1117j412460r79885P24305J094261K63472L79360P38673
$$ 973406 2000070 2071187 658727 -321158 403147 1497408 1760880 2140240 2878913
10917B878913j215388l935610k719190K131012M280957R81241k408584j177165
$$ 2878913 1663525 -2272085 -4991275 -2860263 1420694 2401935 -6649 -1183814
10909a183814J335303J61927k557104j694015J584705J792674j389506k686955
$$ -1183814 151489 313416 -2243688 -3937703 -2352998 -560324 -1949830 -4636785
10901d636785j35985K126236J138495n31218P8286J458002Q49811r62034j247037
$$ -4636785 -4772770 -2646534 -1508039 -2039257 -1960971 -502969 346842 -615192 -1862229
10892a862229K71176J473515J250808M60267o4331m69829q08823n60728L42943
$$ -1862229 -1591053 -117538 1133270 1593537 1529206 1059377 250554 -310174 32769
10883C2769J075325J063637P82164O48365j29723k256709m201849l320023K27658
$$ 32769 1108094 2171731 2953895 3602260 3472537 1215828 -2986021 -6306044 -6078386
10874f078386K760028J849468j19507M18536K625468K674086j7758j929709j169047
$$ -6078386 -3318358 -1468890 -1588397 -1169861 1455607 4129693 4111935 2182226 1013179
10865A013179l6863n04679r24842M13782J646880L26490k182917k578085n61541
$$ 1013179 976316 471637 -453205 -39423 1607457 1933947 -248970 -2827055 -3388596
10856c388596J155525J057013K10946k57019n09698o44579j41874Q41223J214418
$$ -3388596 -2233071 -1176058 -965112 -1222131 -1731829 -2376408 -2518282 -1677059 -462641
10847d62641N06103m71172q52815o69718l12994O9258L17625J39624l04139j75913
$$ -462641 43462 -427710 -1280525 -1950243 -2263237 -2193979 -1876354 -1736730 -2040869 -2216782
10837b216782J088309K664170K738895M84741k560643l760268k194155M12211
$$ -2216782 -1128473 1535697 4274592 4759333 2198690 -1561578 -3755733 -3343522
10829c343522J781782J319239m0297j138494j139370J02036J412599J191589k67941
$$ -3343522 -1561740 -242501 -282798 -1421292 -2560662 -2458626 -1046027 145562 -122379
10820a22379p89374L89066J181685k6703j697626j800643j054863r06813l26077
$$ -122379 -911753 -522687 658998 632295 -1065331 -2865974 -3920837 -4827650 -5153727
10811e153727K050700M221132L135740k48816k163856j699934j293052j842136
$$ -5153727 -3103027 1118105 4253845 4005029 1841173 141239 -1151813 -2993949
10803b993949j560429K3263J008463P59925Q36103J514111J028684q38574j886736
$$ -2993949 -4554378 -4531115 -3522652 -2762727 -1926624 -412513 616171 -222403 -2109139
10794b109139j085061K60146J466459K991237L542348Q96388l415403m626463
$$ -2109139 -3194200 -2934054 -1467595 1523642 5065990 5962378 2546975 -2079488
10786b079488j497573J619153J291851n18136o38489N85153J252366J175822P58175
$$ -2079488 -3577061 -1957908 -666057 -1184193 -1822682 -1237529 14837 1190659 1948834
10777A948834l03954j149636J27755K583929K364365j230408l592389j520137
$$ 1948834 1644880 495244 622999 3206928 5571293 4340885 748496 -771641
10769g71641J802848J908094m13244j465045n71828L58739Q84412J696379J915398
$$ -771641 1031207 2939301 2526057 1061012 489184 847923 1732335 3428714 5344112
10760E344112L20084j903080k619775j869786j111903o69823j27442J69538J4298
$$ 5344112 5664196 3761116 1141341 -728445 -1840348 -2510171 -2637613 -2468075 -2453777
10751b453777K25527R40590Q36428l83902q75342L49140J601120J330813L56405
$$ -2453777 -2228250 -1287660 -451232 -835134 -1710476 -1361336 239784 1570597 1927002
10742A927002k20436o74424q55074J97707J448701L03807k514308k724448O87481
$$ 1927002 1706566 1032142 177068 374775 1823476 2127283 -387025 -3111473 -2423992
10733b423992K993651J049756j588371p08249J820070J946413K55035j74404L99060
$$ -2423992 569659 1619415 31044 -677205 1142865 3089278 3344313 3169909 3568969
10724C568969j45720r83683j14269J050267k35435k961769l863514k547597r77622
$$ 3568969 3423249 2439566 2325297 3375564 3140129 178360 -3685154 -6232751 -7210373
10715g210373N14629K538229L630358K181420o7001m26989L87674J33536o58275
$$ -7210373 -6695744 -4157515 -527157 1654263 1587262 1160273 1547947 1681483 1023208
10706A023208l11080J18750j019673j981996m57618J582945R14683q88242O3391
$$ 1023208 712128 830878 -188795 -2170791 -2628409 -1045464 -130781 -1019023 -955632
10697i55632K863318L119833O10936n16591P55672P49516j961443l693721j687552
$$ -955632 1907686 5027519 5638455 5121864 5877536 6627052 4665609 971888 -715664
10688g15664J594531K461212Q49851p79448q26174N67360J966659J359178j590205
$$ -715664 878867 3340079 4189930 3410482 2584308 3151668 5118327 6477505 4887300
10679D887300m032580l002208L08184K012526R88057j09761O69607K064871K103587
$$ 4887300 854720 -2147488 -1839304 173222 1161279 1051518 1721125 3785996 5889583
10670E889583O40402j212957k350520k079587p20765L02716R4294o61936j205692
$$ 5889583 6529985 5317028 2966508 886921 166156 468872 563166 -98770 -1304462
10661a304462j825354k316628j353544R49568K136324J075112J9651O83055J130296
$$ -1304462 -3129816 -5446444 -6799988 -5850420 -3714096 -2638984 -2619333 -1936278 -805982
10652h05982l99448j509573O05306L764311L530540q0562k767626k033443M58713
$$ -805982 -1205430 -2715003 -2109697 1654614 5185154 5104592 2336966 303523 762236
10643G62236K064771J761635J44351j009087k27062J109261j22762l580577m651977
$$ 762236 2827007 4588642 4732993 3723906 3496844 4606105 4483343 902766 -3749211
10634c749211j216530K536526K249136l88322j309654k95875O42893J543564K658051
$$ -3749211 -4965741 -2429215 -180079 -568401 -1878055 -2173930 -1531037 12527 2670578
10625B670578J819624j615766l617363j202900K187313K209446P06959J447043
$$ 2670578 4490202 2874436 -742927 -1945827 241486 2450932 3157891 4604934
10617D604934K647908O15802k430442j699118J386047J446394j401116k097608
$$ 4604934 7252842 7868644 5438202 3739084 5125131 6571525 5170409 3072801
10609C072801J52671Q38122j548821l111637j354247J377505K190716Q59753j464144
$$ 3072801 3225472 4063594 2514773 -596864 -1951111 -573606 1617110 2476863 1012719
10600A012719k972316j451165K555876M592894K055007j487195j767963j30554
$$ 1012719 -1959597 -3410762 -854886 3738008 5793015 4305820 2537857 2407303
10592B407303L38021O91802K411524K442590j212030l571516j72353M035087K117095
$$ 2407303 2745324 3437126 5848650 8291240 7079210 3507694 3335341 7370428 9487523
10583I487523k764530k669269J319441J645203j818928k138242J396985K108527
$$ 9487523 6722993 4053724 5373165 7018368 5199440 3061198 4458183 6566710
10575F566710j520176l291960o56650J665550J133453Q72209J940021J222013
$$ 6566710 5046534 1754574 1097924 2763474 3896927 4769136 6709157 7931170
10567G931170j156932j012476J628295J838797j146481k500821q18639k33877
$$ 7931170 6774238 5761762 7390057 9228854 8082373 5581552 4762913 4529036
10559D529036k012684k194666O00159K590069J737696M53276L49879M67831P56339
$$ 4529036 2516352 321686 921845 3511914 5249610 5702886 6052765 6520596 7276935
10550G276935J495734O47307k230855k554300J816849M339371k36717n210787
$$ 7276935 8772669 9419976 7189121 4634821 6451670 10791041 10554324 5343537
10542E343537k147438L940980K714842l265458l386522J869586K865048p59305
$$ 5343537 3196099 7137079 9851921 6586463 3199941 5069527 7934575 7175270
10534G175270o31853K875643J315534m146549l616310K519712L492644j920649
$$ 7175270 6543417 9419060 10734594 6588045 2971735 5491447 8984091 7063442
10526G063442l517646R24850K731214K68124J024612M404156J995916l748086
$$ 7063442 3545796 4470646 7201860 7469984 8494596 12898752 14894668 11146582
10518A1146582j848067N061374L354062n362768n142680M644812O924048j703277
$$ 11146582 9298515 14359889 17713951 12351183 7208503 11853315 18777363 17074086
10510A7074086m909171K353423N521674n1095j014155N000347L670836m840598
$$ 17074086 12164915 14518338 20040012 19988917 18974762 23975109 27645945 22805347
10502B2805347k921300P995613N840578p832163n479108J2486107J1931491r515651
$$ 22805347 19884047 27879660 33720238 25888075 20408967 32895074 44826565 35310914
10494C5310914r870215J8420251K4765990m406794l384973N5157546P6745716
$$ 35310914 25440699 43860950 68626940 64220146 60835173 115992719 192738435
10487A92738435k2719024j57126772j63954977l5489240P0163609N5597361l650186
$$ 192738435 170019411 12892639 -151062338 -186551578 -116387969 -60790608 -64440794
10480f4440794q151968K1977640J9351363p526702q172377J2319488J2494708
$$ -64440794 -72592762 -50615122 -31263759 -38790461 -46962838 -34643350 -22148642
10473b2148642m868989m843710J0360865R338319o657435q209811N630128P991712
$$ -22148642 -27017631 -31861341 -21500476 -12162157 -18819592 -27029403 -21399275 -13407563
10465a3407563m088635o680398M412034P906330j293773m514522L604990O463685
$$ -13407563 -17496198 -24176596 -19764562 -11858232 -13152005 -17666527 -14061537 -7597852
10457g597852j404869n030818J394849M754128p06490l509122J768853M801728
$$ -7597852 -9002721 -14033539 -12638690 -7884562 -8591052 -12100174 -10331321 -5529593
10449e529593J01845l540620q43380J346763q38151j456855J755153K587126n83599
$$ -5529593 -5427748 -8968368 -9811748 -8464985 -9303136 -10759991 -9004838 -6417712 -7001311
10440g001311j430258J174958P13699l439643l950486L43891J940563j042209
$$ -7001311 -8431569 -7256611 -6542912 -9982555 -13933041 -13589150 -11648587 -12690796
10432a2690796j568550K484020M307162J110536j322738j23063M27326j048255
$$ -12690796 -14259346 -11775326 -7468164 -6357628 -7680366 -7803429 -7376103 -8424358
10424h424358k84963K636267K014332k122163k834682Q60128J653207k325196
$$ -8424358 -8709321 -6073054 -4058722 -6180885 -9015567 -8155439 -6502232 -8827428
10416h827428l389742J746257N466634K283328k116606j293518J612483R73985
$$ -8827428 -12217170 -10470913 -5004279 -2720951 -4837557 -6131075 -4518592 -3544607
10408c544607j418622p36197K194652L147933J500397l58121j557190k472916
$$ -3544607 -4963229 -5699426 -3504774 -356841 1143556 785435 -771755 -3244671
10400c244671k407813q13015J035666J645083R97047j75102j051142p61437L75453
$$ -3244671 -5652484 -6465499 -5429833 -3784750 -2787703 -2962805 -4013947 -4775384 -4399931
10391d399931O10723l33474k45808J343274J245821j696278l117918J1345L363784
$$ -4399931 -3789208 -4122682 -4368490 -3025216 -1779395 -3475673 -6593591 -6582246 -3218462
10382c218462J936311j461761j284195J122823Q42908j020122J95217L105802
$$ -3218462 -1282151 -2743912 -4028107 -2905284 -2062376 -3082498 -2887281 218521
10374B18521K319875j392259k144850N80386J550279l54037r19899M40628m45983
$$ 218521 2538396 1146137 -998713 -418327 1131952 777915 -141984 298644 -147339
10365a47339l642469l863362O7044K640450Q43807j408295m70745J905771K951510
$$ -147339 -3789808 -7653170 -7586126 -4945676 -4101869 -5510164 -5980909 -4075138 -1123628
10356a123628K647973J330647j208675l091192j919425O14143Q80054l62333L19606
$$ -1123628 1524345 2854992 1646317 -1444875 -3364300 -2750157 -1870103 -2232436 -1912830
10347a912830J905294N09504k520140j943415J811003K634908q22726k969787
$$ -1912830 -7536 501968 -2018172 -3961587 -2150584 484324 -338402 -3308189
10339c308189j079390Q59698K58449j2443J588083J878664m90343j907587m47765
$$ -3308189 -4387579 -3527881 -3269432 -3281875 -1693792 184872 -305471 -2213058 -2660823
10330b660823O65166o46277j591242j85942J075871K95475m21950N33088J399144
$$ -2660823 -1995657 -2641934 -4233176 -4419118 -3343247 -3047772 -3469722 -2936634 -1537490
10321a537490J089863J127447J546331J28017k467901k429595M72703J721648
$$ -1537490 -447627 679820 2226151 2354168 -113733 -2543328 -2070625 -348977
10313c48977l92988k108937j227684n02010j451375j187599J512779L054003J252429
$$ -348977 -741965 -2850902 -4078586 -4580596 -6031971 -7219570 -5706791 -2652788 -1400359
10304a400359r33822j014198o74100r53885K85095K890403K668381j170299l032374
$$ -1400359 -2334181 -3348379 -4022479 -4976364 -4691269 -1800866 867515 -302784 -3335158
10295c335158L02991L922245K588613j218197k348583j181762j185830k239999
$$ -3335158 -3032167 890078 3478691 2260494 -88089 -1269851 -2455681 -4695680
10287d695680j874278k09481J039692J886203K550849J522152j308250k677938
$$ -4695680 -6569958 -6779439 -5739747 -3853544 -1302695 219457 -1088793 -3766731
10279c766731o35212J881650J499533o24449j483319p87674J73068J187876J908462
$$ -3766731 -4401943 -2520293 -1020760 -1645209 -3128528 -3916202 -3743134 -2555258 -646796
10270f46796J088313o61200q09793N17461J33604k167216k316760Q03609K586185
$$ -646796 441517 -219683 -1029476 -512015 -378411 -2545627 -4862387 -4058778 -1472593
10261a472593M72406j419395L61340K437474Q13025k120098k334017j062027j128560
$$ -1472593 -1000187 -2419582 -2058242 379232 1192257 -927841 -3261858 -4323885 -5452445
10252e452445r59225J525733L254884R38754k004171n28401L036660K494747j791722
$$ -5452445 -6411670 -4885937 -1631053 -692299 -2696470 -3224871 -188211 2306536 514814
10243E14814l527768o02919K520547K503337Q54670n16957j833910k674148j506491
$$ 514814 -3012954 -3615873 -1095326 1408011 2262681 1745724 -88186 -2762334 -4268825
10234d268825R54638J826789K91574j396176j393820L182J855186L151307K539125
$$ -4268825 -3314187 -1487398 -1195824 -2592000 -3985820 -3982638 -2127452 1023855 3562980
10225C562980N1203j883620j589574p48128j253375j645914j4057J752440O14104
$$ 3562980 3614183 1730563 140989 -607139 -1860514 -3506428 -3520485 -1768045 -1153941
10216a153941k413800l786636k763943j269569J36497K023899L136507J942301
$$ -1153941 -3567741 -7354377 -10118320 -11387889 -11251392 -9227493 -6090986 -4148685
10208d148685J39887N00829K168399K147691M26915n55790m76605p95517r23176
$$ -4148685 -4008798 -3507969 -1339570 808121 1235036 679246 202641 -592876 -1516052
10199a516052O08584K010935K77786l088663l552614p47135J015513r4392j011968
$$ -1516052 -907468 1103467 1381253 -1707410 -5260024 -6007159 -4991646 -5086038 -6098006
10190f098006L36019J749211J181902R7419K66989Q40240O58553L75003M37426
$$ -6098006 -5761987 -4012776 -2830874 -2733455 -2466466 -1626226 -967673 -592670 -155244
10181a55244j91004j615879j951401k14626K094761L445887L791723K774082m78308
$$ -155244 -346248 -1962127 -3913528 -4128154 -2033393 1412494 5204217 7978299 7499991
10172G499991m422627n248455j992485J363325J242610p00535q63514N18619L97016
$$ 7499991 3077364 -2171091 -4163576 -2800251 -1557641 -2258176 -3121690 -2603071 -2206055
10163b206055j572316k398013p35535R81026O16309k48414Q57754K909811K757855
$$ -2206055 -3778371 -6176384 -6911919 -5930893 -5314584 -5562998 -4705244 -1795433 962422
10154I62422K59982j241473k09440P07979n21942j489347L14693K232932M41245
$$ 962422 1222404 -19069 -228509 479470 -42472 -1531819 -1217126 1015806 1457051
10145A457051k681705j450031L235494M075235j004689m872479k357300J739461
$$ 1457051 -1224654 -2674685 560809 4636044 3631355 -1241124 -3598424 -1858963
10137a858963J200840j333614J71380M083401L782083j113092m340834k931774
$$ -1858963 -658123 -1991737 -1820357 2263044 6045127 4932035 591201 -2340573
10129b340573j87291J095678J581001J363057n85231k452788j196483J460419
$$ -2340573 -2527864 -1432186 148815 1511872 926641 -1526147 -2722630 -1262211
10121a262211Q64418k311703k482685J201067L014683M90588j486939L36337J904678
$$ -1262211 -397793 -2709496 -5192181 -3991114 -976431 -485843 -1972782 -1636445 268233
10112B68233k73422k323405R8117L660609K717441j330833k846553j222476n15328
$$ 268233 -5189 -2328594 -2230477 1430132 4147573 2816740 -29813 -1252289 -1767617
10103a767617j559684j167323J196970K031188j72887k434241k014505J22945
$$ -1767617 -3327301 -4494624 -3297654 -1266466 -1439353 -3873594 -5888099 -5765154
10095e765154J661788J735476O00345r42540j330236K75052K182469K126550P70042
$$ -5765154 -4103366 -2367890 -1767545 -2710085 -4040321 -3765269 -1582800 543750 1313792
10086A313792O01856J570416J015473j633205l390440k177922J08308P64418K18642
$$ 1313792 1915648 3486064 4501537 2868332 -522108 -2700030 -2591722 -1827304 -1608662
10077a608662N89128J819984J761002k77933k208409j933980o0396J107168N89563
$$ -1608662 -1019534 800450 2561452 2283519 75110 -1858870 -1919266 -812098 -222535
10068b22535m14725o57710m61292m67711j05783J079985J550938l58131k992482
$$ -222535 -637260 -1294970 -1756262 -2223973 -2329756 -1249771 301167 -56964 -3049446
10059c049446k762968M51418K492666R75000j125470l98422J531589J042291j251749
$$ -3049446 -5812414 -5360996 -2868330 -1893330 -3018800 -3417222 -1885633 -843342 -2095091
10050b095091j678914K05224J124865j70618j121095j42788Q77333L27660n14473
$$ -2095091 -3774005 -3568781 -2443916 -2614534 -3735629 -3878417 -3001084 -2673424 -3187897
10041c187897m32120n11401j289484q05409J833763L741041K296266l78665n95994
$$ -3187897 -3620017 -4131418 -5420902 -6226311 -4392548 -651507 1644759 1266094 670100
10032F70100R92910P72160j490511k187857o9881J509783J34390j633883l89789
$$ 670100 1663010 2435170 944659 -1243198 -1313079 196704 331094 -1302789 -1692578
10023a692578K597263L275499R22753r75978l3803J712321J032432j769212l303477
$$ -1692578 904685 4180184 5102937 4126959 4093156 5805477 6837909 5068697 1765220
10014A765220j802242N50866P66021q39098j376953J59991J385439K77572j570703
$$ 1765220 -37022 513844 1279865 440767 -936186 -776195 609244 886816 -683887
10005f83887j339264O90256J632122L67884j119360j061225j98608O9386j63987
$$ -683887 -2023151 -1332895 299227 667111 -452249 -1513474 -1712082 -1642696 -1806683
9996a806683j60925K4046J39805N15428J156825J198631K73041o39211o54330
$$ -1806683 -1967608 -1943562 -1803757 -1288329 -131504 1067127 1340168 700957 46627
9987D6627j95940R8292M56305J010812J039223K10728o66126j121317j762003
$$ 46627 -149313 -51021 405284 1416096 2455319 2666047 1999921 878604 -883399
9978h83399k464833j699983P46410K288560R61864j282148j257850P07248J537639
$$ -883399 -3348232 -5048215 -4301805 -2013245 -1051381 -2333529 -3591379 -2884131 -1346492
9969a346492K02619j164765q24651N09914J429469J514580R82802L45171M32447
$$ -1346492 -1143873 -2308638 -3133289 -2623375 -1193906 320674 1303476 1648647 2081094
9960B081094J284589J422212j62001j977849j895677k56691R49939J101439P97115
$$ 2081094 3365683 4787895 4625894 2648045 752368 495677 1445616 2547055 3344170
9951C344170j78107j892294k381088j74480K167065J060607k047707k268328Q86475
$$ 3344170 3166063 1273769 -1107319 -1281799 885266 1945873 -101834 -2370162 -1483687
9942a483687K352820m94870l780628l428174r54389J93472K10714J118053K326944
$$ -1483687 869133 374263 -3406365 -6834539 -7788928 -7595456 -7384742 -6266689 -3939745
9933c939745J903356K85271o94492r24325j151068o16493J402592L112141K349102
$$ -3939745 -2036389 -1751118 -2445610 -3369935 -4521003 -5137496 -3734904 -622763 1726339
9924A726339J49242p45570m7952K66415l65673m81286N14946J330065Q54065n26381
$$ 1726339 1875581 1130011 1082059 1348474 982801 501515 1016461 2346526 3200591 2674210
9914B674210j744433j924145p50930R84140J805203J336448O86997M07909l21671
$$ 2674210 929777 -994368 -1745298 -761158 1044045 2380493 3067490 3475399 3153728
9905C153728j589566j935758r97178o72566j852363k374150n15056J797845J974570
$$ 3153728 1564162 -371596 -1368774 -2041340 -3893703 -6267853 -6782909 -4985064 -3010494
9896c010494Q34316O68295J155821N70464n19215l01771P21276P15965j7140l5040
$$ -3010494 -2176178 -1507883 -352062 218402 -300813 -602584 118692 834657 817517 782477
9886G82477l4293j295623j982229M86840L953353L475094q80038l389592j192313
$$ 782477 748184 -547439 -2529668 -2042828 1910525 5385619 4505581 1115989 -76324
9877g6324J590393O98835j844055j802537J26112l14790l886225o299528l935921
$$ -76324 1514069 2212904 368849 -1433688 -1307576 -1622366 -5508591 -11808119 -15744040
9868a5744040J626043N554720M811288Q09347k188643j228591K343826M277158
$$ -15744040 -14117997 -8563277 -3751989 -2942642 -5131285 -6359876 -4016050 261108
9860B61108K136716j890679l510254j257114J894565K092088p45712k740182r57865
$$ 261108 2397824 507145 -3003109 -4260223 -2365658 -273570 -1019282 -3759464 -4717329
9851d717329K517269L091947o2840k733402j529328J568869K507465Q04387q94761
$$ -4717329 -2200060 891887 829047 -1904355 -3433683 -1864814 642651 1447038 552277
9842E52277j341294j419507j105640O86830K957325K711850o13968l485015k623242
$$ 552277 -789017 -2208524 -3314164 -2627334 329991 3041841 2427873 -1057142 -3680384
9833c680384P82938K810901J612419q95226j660953R4456K161735J979756j47928
$$ -3680384 -2897446 -86545 1525874 630648 -1030305 -935849 1225886 3205642 3057714
9824C057714j407918m30910P58323P7323j164734n63515J052840Q34661j123593
$$ 3057714 1649796 1218886 1977209 2054532 889798 326283 1379123 2213784 1090191
9815A090191j642443L10998J765840M03286j979694k538464j464167p52706o94076
$$ 1090191 -552252 -241254 1524586 1927872 -51822 -2590286 -4054453 -4807159 -5501235
9806e501235q8370J040651J410810R14461Q91441J587757J256709j041724l075187
$$ -5501235 -5589605 -4548954 -3138144 -2223683 -1332242 255515 1512224 470500 -2604687
9797b604687j854922J739368L076446j67694m034568l031858K124925N069294
$$ -2604687 -4459609 -2720241 356205 188511 -3846057 -6877915 -4752990 316304
9789C16304K438636j830180k530546L2437K053553K084180J317185Q7228j979056
$$ 316304 2754940 924760 -1605786 -1573349 480204 2564384 3881569 3968797 1989741
9780A989741l447731k482837k11009O97842K58506N50541J407228N96201j640254
$$ 1989741 -1457990 -3940827 -4151836 -3453994 -3195488 -2644947 -1237719 -641518 -2281772
9771b281772k193306j9270K100114J852703K78176q84294j731802k553808k321047
$$ -2281772 -4475078 -4494348 -2394234 -541531 -263355 -1147649 -2879451 -5433259 -7754306
9762g754306o36318Q48141O84912k35588k23881P95529J578524J323278L58083
$$ -7754306 -8390624 -7542483 -6857571 -7093159 -7317040 -6521511 -4942987 -3619709 -3261626
9753c261626k55119L32302J476486J256086q67706k598682j800940J99030P14755
$$ -3261626 -3516745 -3184443 -1707957 -451871 -1319577 -3918259 -5719199 -5520169 -4805414
9744d805414k6371J83890J131945M41039j824425k652302q31268J282960J651347
$$ -4805414 -4831785 -4647895 -3515950 -3074911 -4899336 -7551638 -8382906 -7099946 -5448599
9735e448599J005426N07892O3318r2242Q55855K061525J575145r3070k86520J101138
$$ -5448599 -4443173 -3935281 -3871963 -3964205 -3108350 -1046825 528320 435250 148730 1249868
9725A249868R95777j503993l064042j338039J370685J940627O82152n44267j382405
$$ 1249868 2245645 741652 -2322390 -3660429 -2289744 -349117 333035 -211232 -1593637
9716a593637j811309r00106Q87647J076650p53184j382372R45798L109357J962086
$$ -1593637 -3404946 -4305052 -3417405 -2340755 -3093939 -4476311 -3530513 -421156 1540930
9707A540930n34664p93822N04174K77432j199683r53941J293661K638783J603612
$$ 1540930 1006266 212444 716618 994050 -205633 -1159574 134087 2772870 4376482
9698D376482l70944j936179l098170l421437j981855M73521J766566J150937M9308
$$ 4376482 4005538 2069359 -1028811 -4450248 -6432103 -5958582 -4192016 -3041079 -2991771
9689b991771k60043J0714K37587K98066K53360J98880L77458P43059Q59119P04472
$$ -2991771 -3251814 -3241100 -3003513 -2705447 -2452087 -2253207 -1875749 -1132690 -273571 430901
9679D30901O69626L98617q45746k159438j473157R44514J929550L384k020059
$$ 430901 1100527 1499144 653398 -1506040 -2979197 -2034683 -105133 -101749 -2121808
9670b121808j272014P15894P22525q86041r97328J159503L089111K910716J363179
$$ -2121808 -3393822 -2677928 -1955403 -2841444 -3838772 -2679269 409842 3320558 4683737
9661D683737r2723q83605r17312l66627R5828J16677L17652J027830J207760q1531
$$ 4683737 4591014 3707409 2790097 2423470 2519298 2635975 2953627 3981457 5189217 5107686
9651E107686k042396l162760k842529j134046J482088L117711J659780j585213
$$ 5107686 3065290 -97470 -2939999 -4074045 -2591957 525754 2185534 600321
9643F00321k286740O90779K698069J57088l244707j828795L020497M687650J170424
$$ 600321 -1686419 -995640 1702429 1859517 -1385190 -3213985 -193488 4494162 5664586
9634E664586k778124l580389l088546l365017k590958Q36054M168572L885582
$$ 5664586 2886462 -693927 -3782473 -7147490 -9738448 -8902394 -4733822 -848240
9626h48240R07075j036650n86705O30523J395933J986116K260111J290278o62512
$$ -848240 58835 -977815 -1564520 -933997 461936 2448052 4708163 5998441 5335929
9617E335929j734085q80153M92952L42959j181887j879543m90858J523797J852065
$$ 5335929 3601844 2721691 3214643 3557602 2375715 496172 5314 1529111 3381176
9608C381176J94401j717255k415750j808979m30849R24574J104208j33852r57161
$$ 3381176 3575577 1858322 -557428 -2366407 -2797256 -1872682 -768474 -902326 -1859487
9599a859487L77003K359608J857959r40818k419110j124226J48073n61867j033983
$$ -1859487 -1482484 877124 2735083 1794265 -624845 -1749071 -1600998 -2162865 -3196848
9590c196848P93966K695200J834808l24783p21461N9649m89118j630946n78130
$$ -3196848 -2402882 292318 2127126 1802343 1080882 1140531 651413 -979533 -1557663
9581a557663K122609L000354J227919m70715o52866q78742j984361k305125p36280
$$ -1557663 564946 3565300 4793219 4322504 3669638 2790896 806535 -1498590 -2234870
9572b234870J303056K004323J110310p21746k466465k655371q76107R70241J065242
$$ -2234870 -931814 1072509 2182819 1461073 -1005392 -3660763 -4536870 -3566629 -2501387
9563b501387M62640Q90038J137847p05210k582847p58317L467194M533658J000046
$$ -2501387 -2038747 -1148709 -10862 -716072 -3298919 -4057236 -590042 3943616 4943662
9554D943662k042299q33121J650762J057586j677168k674050j199270L01691M40038
$$ 4943662 2901363 2068242 3719004 4776590 3099422 425372 -773898 -472207 -32169
9545c2169r1846n75898p28632L049J530940K363205J398263m48657j657873j900515
$$ -32169 -124015 -699913 -1428545 -1425496 105444 2468649 3866912 3418255 1760382 -140133
9535a40133j358402M8253J475698J143599q70284j793212n4950J915074J136326
$$ -140133 -1498535 -1450282 25416 1169015 298731 -1494481 -1549431 365643 1501969
9526A501969j384547k308600r20158N09290O08941K10218n0764n83669r82723
$$ 1501969 117422 -2191178 -3111336 -2602046 -1993105 -1782887 -1833651 -2417320 -3400043
9517c400043N2834K137259K801405Q74692j494172j608203K29791J432318O41390
$$ -3400043 -3347209 -1209950 1591455 2466147 971975 -636228 -406437 1025881 1667271
9508A667271r59707j617432r76269J34898Q93535R83827N21099j527l0774L67015
$$ 1667271 707564 -909868 -1886137 -1751239 -857704 126123 647222 645695 614921 981936
9498I81936M55623j28357o75247l68806L69597L57178o11431j406033j081537
$$ 981936 1437559 1309202 633955 265149 634746 991924 380493 -1025540 -2107077
9489b107077K5307Q76285P25252m49685j721446j630219J01915J584362R73627
$$ -2107077 -2081770 -1205485 -480233 -929918 -2651364 -4281583 -4179668 -2595306 -1621679
9480a621679o39919o37444Q99548J136899o75698j527959M36220K406589J124139
$$ -1621679 -2261598 -2899042 -1999494 -862595 -1538293 -3066252 -2630032 -223443 900696
9471I00696j805539k332976j92023J127639J21941q19643K16777J693283J413345
$$ 900696 -904843 -3237819 -3429842 -2302203 -2180262 -2999905 -2783128 -1089845 323500
9462C23500n3333n28543M15006R23877m41136k507661k636188o6893K720322K932593
$$ 323500 270167 -258376 156630 1080507 639371 -1868290 -4504478 -4571371 -1851049 1081544
9452A081544J014226m46428p70343j468527k466113j564971J196418K344005K66408
$$ 1081544 2095770 1649342 878999 -589528 -3055641 -4620612 -3424194 -1080189 -813781
9443h13781j747245n79283J816571J982921N12260O7417L16096p03770j978040
$$ -813781 -2561026 -3140309 -1323738 659183 1171443 1238860 1554956 851186 -1126854
9434a126854r79646J331907J565978m93312j564435r7353J888698K273806J040222
$$ -1126854 -2106500 -774593 791385 298073 -1266362 -1363715 524983 2798789 3839011
9425C839011q18681j971051j065784J214647J891805o2695j608810o98055o8140
$$ 3839011 3020330 1049279 -16505 1198142 3089947 3027252 1418442 720387 652247
9416F52247j905988k721756O98047M041072J553732l594086l650680Q04535J836129
$$ 652247 -1253741 -3975497 -3277450 763622 2317354 -1276732 -4927412 -4122877 -2286748
9407b286748k259294m330272p16348L454461L906259L045854K862181Q08030l164962
$$ -2286748 -4546042 -8876314 -9592662 -6138201 -2231942 813912 3676093 4484123 1319161
9398A319161l870495R2591K492210l08377l037653j027442J694020L73968j698303
$$ 1319161 -2551334 -2458743 33467 -274910 -3312563 -4340005 -2645985 -2272017 -3970320
9389c970320O1346K459613M64249l132166k568548O65475J092525o98318Q6889
$$ -3970320 -3908974 -1449361 -985112 -4117278 -6685826 -6020351 -4927826 -5626144 -5539255
9380e539255K993100L163648J74406j709764j136072n39491l81405R07664K192804
$$ -5539255 -2546155 617493 791899 -917865 -2053937 -2593428 -2974833 -2067169 125635
9371A25635J092842r03409p27737L83331o05369k082188n76832J949943J035389
$$ 125635 1218477 315068 -412669 -29338 -634707 -2716895 -3293727 -1343784 -308395
9362c08395j680911q42409K724688L138837J21728o25253J736273J562481k216504
$$ -308395 -1989306 -2831715 -107027 3031810 3153538 2528285 4264558 5827039 3610535
9353C610535l181163J014728L504162l80004m891919l316687J337444K175167
$$ 3610535 429372 1444100 4948262 4568258 -323661 -3640348 -2302904 -127737
9345a27737m51855j182636O49147J060161p11653j222269O88405K098033J193428
$$ -127737 -579592 -1762228 -1113081 -52920 -764573 -1986842 -1298437 799596 1993024
9336A993024j57161O6226J198792J585215Q47849l90688j565973k294594k235432
$$ 1993024 1835863 1902089 3100881 4686096 5533945 5143257 3577284 1282690 -952742
9327i52742j241642M19515J870376K003322P57734m72643o91547p33536j442894
$$ -952742 -2194384 -1774869 95507 2098829 2856563 2383920 1692373 958837 -484057
9318d84057j650745j75145J381650P98108p32125k67329J708770J811351m93194
$$ -484057 -2134802 -2309947 -928297 -130189 -862314 -1129643 579127 2390478 1897284
9309A897284j971175j159657m27329j144060j124825R71447K563461J200372j324135
$$ 1897284 -73891 -1233548 -1660877 -2804937 -3929762 -2958315 -394854 805518 -518617
9300e18617j708888J96878J888549J710509N5544j547839j497097K34502J270343
$$ -518617 -2227505 -2030627 -142078 1568431 1623975 76136 -1420961 -1186459 83884
9291H3884k48036k252962j386461J350441J828367k37366p53991J281194J643996
$$ 83884 -164152 -2417114 -3803575 -2453134 -624767 -862133 -1616124 -334930 1309066
9282A309066j443949l444480j004862K095771J242381j413648j124832J397705
$$ 1309066 -134883 -3579363 -4584225 -2488454 -1246073 -2659721 -3784553 -2386848
9274b386848K060199Q34227R68465K338765J615509j415678l130113j899125n6649
$$ -2386848 -326649 507578 1476043 3814808 5430317 4014639 884526 -1014599 -1071248
9265a071248M10408J57386j1747l89367o03519K91186J575713J489214K37471
$$ -1071248 -660840 -503454 -515201 -904568 -1508087 -1216901 358812 1848026 2085497
9256B085497k96449J57705J374j095044j468636k34478J421562J990377J042788
$$ 2085497 1789048 1946753 1948127 853083 -615553 -850031 571531 2561908 3604696
9247C604696p90273j789145k32736K676924K792275j411227n250792l529780J769533
$$ 3604696 2814423 1025278 792542 3469466 6261741 4850514 -400278 -3930058 -2160525
9238b160525L993215J197571j961081j858224k78361J25733N544O69785J063582
$$ -2160525 1832690 3030261 1069180 -789044 -1067405 -941672 -936128 -266343 797239
9229G97239N9215j030339o88661K53250M06007J67518L55998L87960k72102n62443
$$ 797239 856454 -173885 -862546 -609296 -203289 -35771 320227 708187 436085 -126358
9219a26358L73971J356352R98324J8611j57108P4583o25922j902591j974754m07134
$$ -126358 247613 1603965 2602289 2620900 2463792 2538375 1912453 9862 -1964892 -2372026
9209b372026J063161Q68407k35805p9267J947698L451349J542402l003606n599657
$$ -2372026 -1308865 -440458 -676263 -755530 1192168 4643517 6185919 3182313 -2417344
9200b417344l203207J461624L152123P58977j917446j811183l7582R34910P68830
$$ -2417344 -5620551 -4158927 -1006804 -247827 -2165273 -3976456 -4014038 -3079128 -2310298
9191b310298N26903N35487N43927O91673J115700J510268J660964J457743L81587
$$ -2310298 -1783395 -1247908 -703981 -12308 1103392 2613660 4274624 5732367 6113954
9182F113954j588836k803035j673735N63935J211526J44951l36798K55172n918
$$ 6113954 4525118 1722083 48348 612283 1823809 1968760 1631962 1887134 1881216
9173A881216j276901j114849Q50168J549900j68894j036609R58828K559811O89909
$$ 1881216 604315 -510534 339634 1889534 1720640 684031 1642859 4202670 4892579
9164D892579j914204j233007J052840O07891j803777j687836J168534K290857
$$ 4892579 2978375 1745368 2798208 3406099 1602322 -85514 1083020 3373877
9156C373877J64253j717208j360968j101028k194853k006639Q14816L105317K315446
$$ 3373877 3538130 1820922 459954 -641074 -2835927 -4842566 -4027750 -922433 1393013
9147A393013P94336J386819K303907N11289k497800k875749p68196L7173j677831
$$ 1393013 2187349 3574168 5878075 6389364 3891564 1015815 247619 284792 -1393039
9138a393039k836066j088338J728209K356647K58679k146121k283237R7260K644132
$$ -1393039 -4229105 -5317443 -3589234 -1232587 -973908 -3120029 -5403266 -5306006 -2661874
9129b661874K708249L84845j514277j188105j70823o32053j916541j884362n35814
$$ -2661874 46375 431220 -1083057 -2271162 -2441985 -3074038 -4990579 -6874941 -7410755
9120g410755K74406J48230M65014J461937J655032O10130r4281N94168J698836
$$ -7410755 -7136349 -6988119 -6523105 -5061168 -3406136 -2796006 -2890287 -2296119 -597283
9111e97283J934547J101045p10899l180413m425855k170190K484275M948027K730453
$$ -597283 1337264 2438309 1727410 -1453003 -5878858 -8049048 -5564773 -616746 2113707
9102B113707j029329j938939k97988L17801j011206j725747n89001M99297L11538
$$ 2113707 1084378 -854561 -1152549 -834748 -1845954 -3571701 -4160702 -3661405 -3349867
9093c349867M41293J921280K635562O00473k313289k827809j047182K49129K77410
$$ -3349867 -2908574 -987294 1648268 2248741 -64548 -2892357 -3939539 -3690410 -3413000
9084c413000Q36868K240964K216019n9630j966592j322985L06307L67650p73426
$$ -3413000 -2576132 -335168 1880851 1821221 -145371 -1468356 -1162049 -794399 -1567825
9075a567825j194254q39929o92089k5086K135141L819593K231593j192272j919123
$$ -1567825 -2762079 -3602008 -4294097 -4319183 -2184042 1635551 3867144 2674872 755749
9066G55749Q87632K804136Q14772k339845k740183q16624N43702O24792M25791
$$ 755749 1643381 4447517 5262289 2922444 182261 -634363 -90661 534131 959922
9057I59922k07697j612610k140937l99971J577157Q65560j505637j778429Q17091
$$ 959922 752225 -860385 -3001322 -3401293 -1824136 -958576 -2464213 -4242642 -3425551
9048c425551L007856K310151j09331j777170j525823M68787K822610L064083J24425
$$ -3425551 -417695 1892456 1783125 5955 -1519868 -1051081 1771529 4835612 4960037
9039D960037l303473l488559o38020J663813J779850J380507J318796Q9906k453075
$$ 4960037 1656564 -1831995 -2470015 -806202 973648 2354155 3672951 3762857 1309782
9030A309782l566312j685806R53298J677581P77414j96457r87374j637092j331264
$$ 1309782 -2256530 -3942336 -2989038 -1311457 -534043 -730500 -1717874 -3354966 -4686230
9021d686230j19813M28129j2623M73422K460901L279761J045845j865860k143591
$$ -4686230 -4806043 -4377914 -4390537 -3917115 -1456214 1823547 2869392 1003532 -1140059
9012a140059l48062M86253m46299j242235n44616J074218K235712J621210j075127
$$ -1140059 -1488121 -1001868 -1448167 -2690402 -3235018 -2160800 74912 1696122 620995
9003F20995l685316k935612J060658L932086K760740J77300N6451J616783J338085
$$ 620995 -3064321 -5999933 -4939275 -1007189 1753551 1930851 1987302 3604085 4942170
8994D942170j089133k652087j930382n37644k0872k75120p49500q78215N5408
$$ 4942170 3853037 1200950 -729432 -1267076 -1287948 -1563068 -2312568 -3190783 -3135375
8985c135375J539437J638867J29710l03021J529400K488020J10871k526722j513059
$$ -3135375 -1595938 42929 172639 -130382 1399018 3887038 3997909 1471187 -41872
8976d1872J048286N01518k123622j863900J274285K279601R3218p38416J339703
$$ -41872 1006414 1507932 -615690 -2479590 -1205305 1074296 1167514 429098 1768801
8967A768801J906216j322597m178854l268949j335027j315809q06402K554197
$$ 1768801 3675017 2352420 -1826434 -5095383 -6430410 -7746219 -8552621 -5998424
8959e998424N122571K546814k521177l943687r95772J766489J875834R62609M43815
$$ -5998424 -875853 1670961 -850216 -4793903 -5789675 -4023186 -2147352 -1184743 -740928
8950g40928Q4578L42237J785345K553478M87255k537627k522876M62735K157132
$$ -740928 -656350 -314113 1471232 4024710 4511965 1974338 -548538 -85803 2071329
8941B071329N68680j511876j436364l03006j8790o2625O50727J149897L4069j817215
$$ 2071329 2640009 1128133 -308231 -611237 -630027 -692652 -41925 1107972 1142041 -675174
8931f75174k294181r47100Q28302J826248J783338O15899j479487l088694k252844
$$ -675174 -2969355 -3916455 -3088153 -1261905 521433 1137332 -342155 -3430849 -5683693
8922e683693J036098L855132L169356m51271l300389l112821j511355p46464N982
$$ -5683693 -4647595 -792463 2376893 1925622 -1374767 -4487588 -5998943 -6745407 -6739425
8913f739425K511937N054700L983432k70670k831871j335843O86956l01029k238943
$$ -6739425 -4227488 827212 4810644 4539974 1708103 372260 1059216 758187 -1480756
8904a480756j244262J761894K482168q3344k562332k475375r37833J43455N13319
$$ -1480756 -2725018 -963124 1519044 1435700 -1126632 -3602007 -4539840 -4396385 -3883066
8895c883066O43956P34022J090892J710265J563609J08556j063310l34516Q64643
$$ -3883066 -3239110 -2505088 -1414196 296069 1859678 1968234 904924 570408 1435051
8886A435051j14092k643616l355869j245394J110211J947887K434106L269322
$$ 1435051 1320959 -1322657 -4678526 -5923920 -4813709 -2865822 -431716 2837606
8878B837606K715588N206k266778j661295M15676J029493r2432j170732j593806
$$ 2837606 5553194 5558400 3291622 1630327 2046003 3075496 2983064 1812332 218526
8869B18526j843685j389001M86997K369117K043021P0626o02552J000571K333833
$$ 218526 -1625159 -3014160 -2527163 -158046 1884975 1955601 1353049 2353620 4687453
8860D687453J014064j861678l287359j968212P10710K445493J876162n30037k637922
$$ 4687453 5701517 3839839 552480 -1415732 -705022 1740471 3616633 3086596 448674
8851D48674k333188J80199K302225J918296k24123j742543j575411o79216j71462
$$ 448674 -1884514 -1704315 597910 2516206 2292083 549540 -1025871 -1705087 -1876549
8842a876549l9511J67797M34078N50980O34162Q51107R93741P06972m5129r31199
$$ -1876549 -1916060 -1748263 -1314185 -763205 -129043 722064 1715805 2422777 2377648 1446449
8832A446449j506497j494684j050304o66307n31661k04040O20195J341620J213944
$$ 1446449 -60048 -1554732 -2605036 -3271343 -3803004 -4007044 -3386849 -2045229 -831285
8823h31285O03115N01603R02802Q37401J04917l36548l8M37636M70400L91378
$$ -831285 -228170 273433 1176235 2013636 2118553 1782005 1781967 2219603 2690003 3081381
8813C081381J29160r16267k177275j873162K49755J907702J367014j61536p14508
$$ 3081381 3210541 2294274 116999 -1756163 -1506408 401294 1768308 1606772 892264
8804H92264l72144r4529L88581J378566J643180M53570m89287K37152R32794l42838
$$ 892264 520120 425591 814172 2192738 3835918 4289488 3800201 4037353 4970147 4627309
8794D627309j914223j203538L92411k23169j917593q44208K474379L184727l8111
$$ 4627309 2713086 1509548 1901959 1678790 -238803 -1083011 1391368 4576095 4537984
8785D537984k711150j794589K5690k35926r83750J78976J807718J390325k53642
$$ 4537984 1826834 32245 57935 -177991 -1161741 -982765 824953 2215278 1961636
8776A961636p56384k5734O18590R73664J138326L61835j140452j582380o48605
$$ 1961636 1205252 1179518 1798108 2771772 3910098 4271933 3131481 1549101 900496
8767I00496l25967j013536l98140J722710J824223j165275k687830L48217L697422
$$ 900496 574529 -439007 -837147 885563 2709786 1544511 -1143319 -795102 2902320
8758B902320K118984k188474l335994r37404P33601N85588J103994K151321R74208
$$ 2902320 5021304 2832830 -503164 -1440568 -706967 -121379 982615 3133936 4108144
8749D108144j885310k804042j354475o74423j340649o11707J631127J974053l03014
$$ 4108144 2222834 -581208 -1935683 -2610106 -3950755 -4562462 -2931335 -957282 -1260296
8740a260296j553857O7509J807106J458066N42738M27623j43382j462937j183272
$$ -1260296 -2814153 -2746644 -939538 518528 1061266 1488889 1345507 -117430 -1300702
8731a300702J299840K741054R36354j744994k193353p50344O89519J651996J973337
$$ -1300702 -862 2740192 3676546 1931552 -261801 -1012145 -322626 1329370 3302707
8722C302707P88409j209547j488438L04002J133690n94255k335282j771369l94692
$$ 3302707 4091116 2881569 1393131 1697133 2830823 2236568 -98714 -1870083 -2264775
8713b264775j12627K20727J763748K469838M97161j965392k015270p23188o52708
$$ -2264775 -2377402 -2156675 -392927 2076911 2574072 608680 -1406590 -2129778 -2782486
8704b782486r55146P73784L390244L476233R17110j072580j246066j526586k552181
$$ -2782486 -3737632 -2963848 426396 3902629 4819739 3747159 2501093 974507 -1577674
8695a577674j993841J261714M314866L733790J82806k368174j562050O53724P21199
$$ -1577674 -3571515 -2309801 2005065 5738855 5921661 3553487 1991437 2645161 3366360
8686C366360j770909l326202j299595J997878K223099o32520k076356J27952K613271
$$ 3366360 1595451 -1730751 -3030346 -1032468 1190631 558111 -1518245 -1390293 1222978
8677A222978J651338j423819k735791j411669L99195J331503J607606J207052
$$ 1222978 2874316 1450497 -1285294 -2696963 -2297768 -966265 641341 1848393
8669A848393P1258o42438O993P80968k357j570070j815272n77866M64232N49650
$$ 1848393 1919651 1277213 1284206 2065174 2062817 492747 -1322525 -1900391 -1436159 -886509
8659h86509L00344M0597k43341J06748J382244K134867R92585q36819j140634
$$ -886509 -586165 -545568 -788909 -682161 700083 2834950 3827535 2990716 1850082
8650A850082j33475J33495o65763p87996L91495J340090Q74807l36659j142467
$$ 1850082 1716607 1850102 1184339 396343 787838 2127928 3002735 2666076 1523609
8641A523609j087886j17830J271359J649691J59589j671224j451109P26148K304643
$$ 1523609 435723 317893 1589252 3238943 3398532 1727308 276199 1002347 3306990
8632C306990J750128J29636j056291j689303k043392j692790m47570P12131O84344
$$ 3306990 5057118 5186754 4130463 2441160 397768 -1295022 -1742592 -1030461 -346117
8623c46117k15565m90190P03039K181802J701337j127226l460811k320202J106031
$$ -346117 -561682 -1051872 -348833 1832969 3534306 2407080 -1053731 -3373933 -2267902
8614b267902K597895R01907l61959J521781L761537K292500j747429l713919k360111
$$ -2267902 329993 1231900 869941 2391722 6153259 8445759 6698330 2984411 624300
8605F24300q45564j091133j254132L54540K323151K547234J065228q25999k305761
$$ 624300 -221264 -1312397 -2566529 -2211989 111162 2658396 3723624 2897625 591864
8596E91864k820928j899676j28687J098416J374127J434749J379136N28691o82434
$$ 591864 -2229064 -4128740 -4257427 -3159011 -1784884 -350135 1029001 1557692 875258
8587H75258p01727O82582J746261J354228L78261k397K39428P33540J235456R41476
$$ 875258 173531 856113 2602374 3956602 4334863 4332466 4571894 5305434 6540890 7482366
8577G482366q93032l129589l462503j596284K43375O30272N74411R21944N82106
$$ 7482366 6589334 3459745 -2758 -1599042 -1355667 -725395 -150984 770960 1353066
8568A353066j032949k021995o93450J337496J284958m52267p25555J557448L494756
$$ 1353066 320117 -1701878 -2395328 -1057832 227126 -225141 -950696 606752 4101508
8559D101508K091524j489080l257881j605525O15243J47361j909631j667042J412037
$$ 4101508 6193032 4703952 1446071 -159454 455789 603150 -1306481 -2973523 -1561486
8550a561486L041413L71056l199334k653997J174200L025145J366448K22670J977507
$$ -1561486 1479927 1850983 -1348351 -4002348 -2828148 196997 1563445 1786115 3763622
8541C763622L255601O55590l298015l761381p84891J151483j41792k102416j865813
$$ 3763622 7019223 7674813 4376798 615417 -169474 982009 840217 -1262199 -3128012
8532c128012n6530Q96315J54630j061854j279576q0412J771586K832138J979484
$$ -3128012 -3184542 -2288227 -2133597 -3195451 -4475027 -4555439 -2783853 48285 2027769
8523B027769m68573k613086k382182M34037L495668L858846J074417k182148l156073
$$ 2027769 1559196 -1053890 -3436072 -3002035 493633 4352479 5426896 3244748 88675
8514H8675j962324n99687J8226M47853P91190M42040l32839n32371k23381k80895
$$ 88675 -1873649 -2473336 -2455110 -2007257 -1216067 -774027 -1106866 -1639237 -1862618 -2143513
8504b143513l62755N78774J687600Q75606j360343j887381J16096J376467l49863
$$ -2143513 -2506268 -1927494 -239894 635712 -724631 -2612012 -2495916 -1119449 -1469312
8495a469312k407074j289604J841237K994869J188257q59063j078099q7347Q16568
$$ -1469312 -3876386 -5165990 -3324753 -329884 858373 -690 -1078789 -1166136 -349568
8486c49568J124320O44793l57313p57707k8774N35431j45619p17574M69046K030723
$$ -349568 774752 1419545 1062232 304525 275751 811182 665563 -52011 417035 2447758
8476B447758J300111j152858j990138j70640J640400J298472j65446j026794j238510
$$ 2447758 3747869 2595011 604873 434233 2074633 3373105 3207659 2180865 942355
8467I42355j140036l17932Q68071Q85330m04508r25660L22984J311563J85767
$$ 942355 -197681 -515613 352458 1237788 833280 -92380 230604 1542167 1727934
8458A727934j563804j423345K29339J064970N78933K77601O30696M97334l22828
$$ 1727934 164130 -1259215 -1029876 35094 614027 891628 1522324 2019658 1696830
8449A696830m18846O73138J246704r7084k088446k245912j38055J960777J755806
$$ 1696830 1277984 1951122 3197826 3100742 1012296 -1233616 -1371671 589106 2344912
8440B344912m29976k165435j861721m92681Q9530j88437J04003J259569J824828
$$ 2344912 1914936 -250499 -2112220 -2604901 -2515371 -2703808 -2599805 -1340236 484592
8431D84592J022818q5777p49022j801522l271595k850754O90877M182945L523757
$$ 484592 1507410 1421633 672611 -1128911 -4400506 -7251260 -6560383 -2377438 1146319
8422A146319k23650j933596J72442K162528P63085j718511j438484R81000J926512
$$ 1146319 922669 -1010927 -838485 1324043 2087128 368617 -1069867 -88867 1837645
8413A837645N21081p18292l01368M48429J68028p05899j378258j806289j823468
$$ 1837645 2358726 1640434 1339066 1787495 1955523 1249624 -128634 -1934923 -3758391
8404c758391r59971M03950J273068J613658K048869K036116M85909j612967j724418
$$ -3758391 -4718362 -4314412 -3041344 -1427686 621183 2657299 3143208 1530241 -194177
8395a94177K97184J359823m11574k710482k386379J63622K036986J810355L74139
$$ -194177 103007 1462830 1051256 -1659226 -4045605 -3881983 -1844997 -34642 339497
8386C39497j086941j884818j466360j42296O35742L84299P82012K808496M179303
$$ 339497 -747444 -2632262 -4098622 -4240918 -3605176 -3220877 -2438865 369631 4548934
8377D548934K380503q89407j682670K79079J347590j27270j477454n15444R84395
$$ 4548934 6929437 6040030 4357360 4636439 5984029 5856759 4379305 3863861 4848256
8368D848256O52659o82346j121602j122399j869675k163285k54184K375315K508465
$$ 4848256 5500915 4818569 3696967 2574568 704893 -1458392 -1712576 662739 3171204
8359C171204Q6981j679159j240440m83111q08166p34700P80783J478369q77103
$$ 3171204 3258185 1579026 338586 -144525 -952691 -1687391 -906608 571761 -305342
8350c05342m029745l526012Q59526M305176L380274M08896m42826Q08076P06556
$$ -305342 -4335087 -7861099 -7001573 -2696397 683877 1092773 649947 1458023 2164579
8341B164579j823076l639963k006102J493861L159068J764587o43554j683077
$$ 2164579 341503 -3298460 -5304562 -3810701 -651633 1112954 469400 -1213677
8333a213677r44890K43332L82230n98602r45731Q33391L205445K682376j266453
$$ -1213677 -2158567 -1915235 -1533005 -2131607 -3077338 -2243947 961498 3643874 2377421
8324B377421m395762k844412J545233L775967K362602J86328p27498j465606k725069
$$ 2377421 -2018341 -4862753 -3317520 458447 2821049 3007377 2279879 814273 -1910796
8315a910796k791661o74110J631360J962642Q71692o9867p15534j256629q26277
$$ -1910796 -4702457 -5376567 -3745207 -1782565 -910873 -980740 -1696274 -2952903 -3779180
8306c779180O40596J118179m46024j547289M29309L492776L227133p35321l904152
$$ -3779180 -3138584 -2020405 -2466429 -4013718 -3584409 -91633 3135500 2400179 -1503973
8297a503973l097987k97454R45581L94596L73770J575066J985613J06552k373830
$$ -1503973 -4601960 -4899414 -3953833 -3559237 -3185467 -1610401 375212 481764 -1892066
8288a892066k282625Q69817L666192K777479n32794j849269K99838K294300P28261
$$ -1892066 -4174691 -3304874 361318 3138797 2606003 756734 1056572 3350872 4079133
8279D079133k562366l320565j023514J012318R28115K46971L17477K40119n47946
$$ 4079133 1516767 -1803798 -2827312 -1814994 -886879 -639908 -322431 -82312 -630258
8270f30258n60743J076863K467400J512814q20765j849865q94409K31003M7724
$$ -630258 -1191001 -114138 2353262 3866076 3045311 1195446 301037 532040 579764
8261E79764q84209j159879l26948P80278J044119L06867m21784l27690o1130p18276
$$ 579764 -304445 -1464324 -1791272 -1010994 33125 339992 -81792 -409482 -470612 -1188888
8251a188888j761077j435438M75089J997104J793601R71806R73429J280432P30113
$$ -1188888 -2949965 -4385403 -3910314 -1913210 -119609 852197 1825626 3106058 3836171
8242C836171k78060o70187o53655q77609o82668O19021J600886M59043j607421
$$ 3836171 3558111 2887924 2234269 1356660 673992 1293013 2893899 3352942 1745521
8233A745521j671621K63249J023430p31553k530040k333552j434824j171891j07459
$$ 1745521 73900 337149 1360579 629026 -1901014 -4234566 -5669390 -6841281 -6948740
8224f948740K538892L648804M87118l821889l835557J91165K864007K071430J340666
$$ -6948740 -4409848 -761044 -273926 -4095815 -7931372 -7740207 -4876200 -2804770 -1464104
8215a464104K702846K982064k0002k827982j867575M82296K58088j128210L3458
$$ -1464104 1238742 4220806 4200804 1372822 -494753 -12457 245631 -882579 -849121
8206h49121K283800J176031k261093k305698J786170L889869P16768l114087k859241
$$ -849121 1434679 2610710 349617 -1956081 -169911 3719958 4436726 1322639 -1536602
8197a536602o20842l26834q70532N07064K020480M83621k065144j090415K546069
$$ -1536602 -2157444 -2484278 -3354810 -2847746 -827266 -343645 -2408789 -3499204 -953135
8188i53135L527130N29543k058127j333083N69256J217491J215179J155263j91977
$$ -953135 2573995 3103538 1045411 -287672 281584 1499075 2714254 3869517 3677540
8179C677540k527543k969066p94271N27726j171175k804517j008630J996017J729594
$$ 3677540 1149997 -1819069 -2613340 -2085614 -3256789 -6061306 -7069936 -5073919 -3344325
8170c344325j361646k593018k28178K312360J918389j10391p82082L05495J146956
$$ -3344325 -4705971 -7298989 -7527167 -5214807 -3296418 -3406809 -4188891 -3883396 -2736440
8161b736440M29801j105104j962314j543058m30506N40496J145946J537197J560208
$$ -2736440 -2306639 -3411743 -5374057 -6917115 -7347621 -6807125 -5661179 -4123982 -2563774
8152b563774J066037O62897R80292J197362j03247k243430k560142k54938J787411
$$ -2563774 -1497737 -834840 145452 1342814 1239567 -1003863 -3564005 -3818943 -2031532
8143b031532P54717k021951k874106p36099J919551K674356J634309K88958l79160
$$ -2031532 -1276815 -3298766 -6172872 -6908971 -4989420 -2315064 -680755 -391797 -770957
8134g70957l36464j78554n00886r43031l76434J184388J905208O95143o94660
$$ -770957 -1107421 -1285975 -1786861 -2729892 -3106326 -1921938 -16730 678413 -16247
8125a6247o2684J643154J533645p50984k375376j438943O11866J493458J009464
$$ -16247 -78931 1564223 3097868 2346884 -28492 -1467435 -855569 637889 1647353
8116A647353L95703K41880K04920p3584n09975n62351L09322J487172J171574
$$ 1647353 2043056 2284936 2489856 2416272 1906297 1343946 1653268 3140440 4312014
8107D312014j105403k805082j427164J384957J718777o78111j859676Q8627K058868
$$ 4312014 3206611 401529 -1025635 359322 2078099 1399988 -459688 -371061 1687807
8098A687807J102124r52358j026894R398n21964j834831r30295J746926K401479
$$ 1687807 2789931 1837573 810679 820077 298113 -1536718 -2467013 -720087 1681392
8089A681392k0202j975715q95363R77508N25085j207246q68300J723465L080910
$$ 1681392 1661190 -314525 -1209888 -232380 292705 -914541 -1782841 -59376 3021534
8080C021534J089694j952352k499010n02428P98761l27983j487987K52306L361445
$$ 3021534 4111228 2158876 -340134 -842562 -43801 -371784 -1859771 -1607465 1753980
8071A753980L136462j505945n389862l459601K122573M502754J191281k957147
$$ 1753980 4890442 3384497 -2005365 -5464966 -3342393 1160361 2351642 -605505
8063f05505k704205Q16771K575371Q61081j058551k45059J777401J568145j141329
$$ -605505 -3309710 -2492939 82432 943513 -115038 -360097 1417304 2985449 1844120
8054A844120l055299j929004N14279J392516O57121J28526k68891k035294l912553
$$ 1844120 -1211179 -3140183 -2625904 -1233388 -576267 -447741 -716632 -2751926 -6664479
8045f664479k230996K925021N871359K811063k133475k614311P90623K387702
$$ -6664479 -8895475 -5970454 -99095 2711968 578493 -2035818 -1245195 1142507
8037A142507P58327Q2820J999171K684874l5067k627335k043002q08174j917102
$$ 1142507 1900834 1983654 3982825 6667699 6632632 4005297 1962295 1154121 -762981
8028g62981l041834o93678L141428L811793J311459m12352j30402j82592j235870
$$ -762981 -3804815 -4498493 -1357065 2454728 3766187 3353835 3223433 3040841 1804971
8019A804971j198317L45639J107048K79425j83150N72607P87701l96409j261518
$$ 1804971 606654 952293 2059341 2338766 2155616 2728223 3515924 3119515 1857997
8010A857997p34893k57934q73334j153160K11444J977414K237798J027371l35271
$$ 1857997 1123104 865170 -8164 -1161324 -949880 1027534 3265332 4292703 3957432
8001C957432r97283o74771M20409J034975o190j627236j527851J60211Q08255
$$ 3957432 2960149 2285378 2705787 3740762 3734572 2107336 579485 739696 1547951
7992A547951m00100j097854M7159R57483J8844p64223P15548K593330J834438
$$ 1547951 1147851 49997 97156 1054639 1073483 309260 1024808 3618138 5452576
7983E452576p42706j798279o63849L17238L1846k73335m3931l23421j149700j005901
$$ 5452576 4709870 2911591 2247742 2564980 2596826 2323491 2279560 1956139 806439 -199462
7973a99462L02694Q83622j0297m49226Q76242J961189L55931k585917l031515
$$ -199462 103232 986854 976557 527331 1403573 3364762 3720693 1134776 -1896739
7964a896739j52483K271221Q93840k371977k731617Q62329M036631K852538r35280
$$ -1896739 -2049222 221999 1115839 -1256138 -3987755 -3125426 911205 3763743 2828463
7955B828463k606645r93716P09615L10118n62785K8145J009648N38681n74618
$$ 2828463 221818 -771898 -62283 247835 -314950 -286805 722843 1261524 686906
7946F86906j88113J574428K401320J032783j411708l082646k921576q96464J854951
$$ 686906 498793 2073221 4474541 5507324 4095616 1012970 -1908606 -2805070 -950119
7937i50119L346683K479086L32740j192273j602486j645268j455637k82840J906447
$$ -950119 2396564 4875650 5208390 4016117 2413631 768363 -687274 -970114 936333
7928I36333L693213L533397J463793p40031j283569m26872k91620j897549l312531
$$ 936333 4629546 8162943 9626736 8886705 7603136 7176264 6884644 4987095 1674564
7919A674564k312283K6323Q27770p1616l33378K70566m71858k163126j205083
$$ 1674564 -637719 -611396 216374 144758 -188620 81946 -389912 -2553038 -3758121
7910c758121K625999L988424m7013m430151l430029M23172P79431k020926k030909
$$ -3758121 -1132122 2856302 2809289 -1620862 -5050891 -4627719 -3848288 -5869214 -7900123
7901g900123J885216M173647J787439j560069k167340j371232j284535q06680
$$ -7900123 -6014907 -1841260 -53821 -1613890 -3781230 -5152462 -6436997 -7243677
7893g243677R93863J954546O45127n20489P08100K463405K078600N38782K48214
$$ -7243677 -6249814 -4295268 -3650141 -4170630 -3462530 -999125 1079475 1618257 1866471
7884A866471P35678M7942j353224j387914J38624J587539K014114J395260m17657
$$ 1866471 2602149 2650091 1296867 -91047 47577 1635116 3649230 5044490 4626833
7875D626833k820050l868008k675574j006748m79616R2744K213785M309700L708749
$$ 4626833 1806783 -2061225 -4736799 -5743547 -6223163 -6130419 -3916634 393066 4101815
7866D101815Q08572j605881k361951k469377k344149j238393P01784K127254K273625
$$ 4101815 4910387 3304506 942555 -1526822 -3870971 -5109364 -4407580 -2280326 -6701
7857f701J432720J05508q10802J8454K369178L554966J702748j170981j800949
$$ -6701 1426019 1531527 720725 739179 3108357 6663323 8366071 7195090 5394141
7848E394141l27125M69097l14103j095436j229847j667254k211561j511940j78720
$$ 5394141 5067016 5536113 5222010 4126574 2896727 1229473 -982088 -2494028 -2672748
7839b672748n01375k242582k152552Q96297L551522K829787N08568N7418J376583
$$ -2672748 -3174123 -5416705 -7569257 -6672960 -3121438 -291651 216917 274335 1650918
7830A650918J641132N0867j419346j551283j231549j053205k11816J357946J969277
$$ 1650918 3292050 3342917 1923571 372288 -859261 -1912466 -2124282 -766336 1202941
7821A202941O96296p59409m33144Q35927P41642p25191j264283j26761O45132
$$ 1202941 1899237 1139828 706684 1542611 2284253 1559062 294779 168018 813150
7812H13150j50351o24671Q19260K155782P40856j986147k445131o85781n3757
$$ 813150 662799 38128 857388 3013170 3754026 1767879 -677252 -1363033 -1416790
$$ [...]
##END NTUPLES=NMR SPECTRUM
##END=
