##TITLE=31Pdec_LR-618-R3-CR7-3
 CDCl3, 124 sc
 11.11.2021
##JCAMPDX= 6.0         $$ Bruker NMR JCAMP-DX V2.0
##DATA TYPE= NMR SPECTRUM
##DATA CLASS= NTUPLES
##ORIGIN= UXNMR, Bruker Analytische Messtechnik GmbH
##OWNER= root
$$ XWIN-NMR		Version 3.5
$$ Thu Nov 11 11:42:12 2021 Russian Standard Time (UT+4h)  she@DPX200
##.OBSERVE FREQUENCY= 81.013821
##.OBSERVE NUCLEUS= ^31P
##.ACQUISITION MODE= SIMULTANEOUS
##.ACQUISITION SCHEME= undefined
##.AVERAGES= 124
##.DIGITISER RES= 16
##SPECTROMETER/DATA SYSTEM= spect
##.PULSE SEQUENCE= zgpg30
##.SOLVENT NAME= CDCl3
##.SHIFT REFERENCE= (INTERNAL, CDCl3, 0, 248.564)
##AUDIT TRAIL= $$ (NUMBER, WHEN, WHO, WHERE, WHAT)
$$ ##TITLE= Audit trail, XWIN-NMR		Version 3.5
$$ ##JCAMPDX= 5.01
$$ ##ORIGIN= Bruker BioSpin GmbH
$$ ##OWNER= she
$$ F:/spectra/data/she/nmr/P31/1/pdata/1/auditp.txt
$$ ##AUDIT TRAIL=  $$ (NUMBER, WHEN, WHO, WHERE, WHAT)
(   1,<2021-11-11 11:40:56.18 +0400>,<she>,<DPX200>,
      <continue with go, POWCHK disabled, PULCHK disabled
       configuration hash MD5:
       00 E9 B6 7A A2 85 ED C7 34 08 36 98 17 FE 4E 26
       data hash MD5: 32K
       7D 84 45 72 A2 C1 06 6E E1 4A B9 86 25 CB 59 8F>)
(   2,<2021-11-11 11:40:58.90 +0400>,<she>,<DPX200>,
      <Start of raw data processing
       efp BC_mod = 2 LB = 1 FT_mod = 6 PKNL = 1 PHC0 = -8815.367 PHC1 = 73.66938 SI = 64K 
       data hash MD5: 64K
       A1 AE 58 B8 ED 1F 61 14 7B 37 31 EE C7 9E 0F D4>)
(   3,<2021-11-11 11:41:32.17 +0400>,<she>,<DPX200>,
      <pk PHC0 = 146.7273 PHC1 = -343.8 
       data hash MD5: 64K
       67 5A AF 5E B0 63 5B B6 73 44 86 E0 9A AC 3E 71>)
(   4,<2021-11-11 11:41:37.17 +0400>,<she>,<DPX200>,
      <abs ABSG = 5 
       data hash MD5: 64K
       A9 FA ED EF 86 FC 9F C3 3C 5C C7 A6 9A 7B 24 3F>)
$$ ##END=
$$ 
$$ hash MD5
$$ B6 64 A5 2D E8 9D 0B C5 5C 52 76 FF 99 0F 0A 20
##$RELAX= 
##$RELAX= 
##$RELAX= 
##$RELAX= 
##$RELAX= 
##$RELAX= 
##$RELAX= 
##$RELAX= 
$$ Bruker specific parameters
$$ --------------------------
##$DU= <F:/spectra>
##$EXPNO= 1
##$NAME= <P31>
##$PROCNO= 1
##$TYPE= <nmr>
##$USER= <she>
##$AMP= (0..31)
100 100 100 100 100 100 100 100 100 100 100 100 100 100 100 100 100 100 
100 100 100 100 100 100 100 100 100 100 100 100 100 100 
##$AQSEQ= 0
##$AQ_mod= 1
##$AUNM= <au_zg>
##$AUTOPOS= <>
##$BF1= 81.014009
##$BF2= 200.13
##$BF3= 200.13
##$BF4= 200.13
##$BF5= 200.13
##$BF6= 200.13
##$BF7= 200.13
##$BF8= 200.13
##$BYTORDA= 1
##$CFDGTYP= 0
##$CFRGTYP= 5
##$CHEMSTR= <none>
##$CNST= (0..31)
1 1 145 1 1 1 1 1 1 1 1 1 1 1 1 1 1 1 1 1 1 1 1 1 1 1 1 1 1 1 1 1 
##$CPDPRG= <waltz16>
##$CPDPRG1= <>
##$CPDPRG2= <waltz16>
##$CPDPRG3= <>
##$CPDPRG4= <mlev>
##$CPDPRG5= <mlev>
##$CPDPRG6= <mlev>
##$CPDPRG7= <mlev>
##$CPDPRG8= <mlev>
##$CPDPRGB= <>
##$CPDPRGT= <>
##$D= (0..31)
0 1 0 0 0 0 0 0 0 0 0 0.03 2e-05 3e-06 0 0 0 0 0 0 0 0 0 0 0 0 0 0 0 0 
0 0 
##$DATE= 1636616284
##$DBL= (0..7)
120 120 120 11 120 120 24 19 
##$DBP= (0..7)
150 150 150 150 150 150 150 150 
##$DBP07= 0
##$DBPNAM0= <>
##$DBPNAM1= <>
$$ [...]
##$SUBNAM3= <"">
##$SUBNAM4= <"">
##$SUBNAM5= <"">
##$SUBNAM6= <"">
##$SUBNAM7= <"">
##$SUBNAM8= <"">
##$SUBNAM9= <"">
##$SW= 501.771253377433
##$SWIBOX= (0..15)
0 1 3 0 0 0 0 0 0 0 0 0 0 0 0 0 
##$SW_h= 40650.406504065
##$TD= 32768
##$TD0= 1
##$TE= 0
##$TE2= 300
##$TE3= 300
##$TEG= 300
##$TL= (0..7)
0 120 53 12 22 120 120 120 
##$TP= (0..7)
150 150 150 150 150 150 150 150 
##$TP07= 0
##$TPNAME0= <>
##$TPNAME1= <>
##$TPNAME2= <>
##$TPNAME3= <>
##$TPNAME4= <>
##$TPNAME5= <>
##$TPNAME6= <>
##$TPNAME7= <>
##$TPOAL= (0..7)
0.5 0.5 0.5 0.5 0.5 0.5 0.5 0.5 
##$TPOFFS= (0..7)
0 0 0 0 0 0 0 0 
##$TUNHIN= 0
##$TUNHOUT= 0
##$TUNXOUT= 0
##$USERA1= <user>
##$USERA2= <user>
##$USERA3= <user>
##$USERA4= <user>
##$USERA5= <user>
##$V9= 5
##$VALIST= <valist>
##$VCLIST= <CCCCCCCCCCCCCCC>
##$VD= 0
##$VDLIST= <DDDDDDDDDDDDDDD>
##$VPLIST= <PPPPPPPPPPPPPPP>
##$VTLIST= <TTTTTTTTTTTTTTT>
##$WBST= 1024
##$WBSW= 4
##$XGAIN= (0..3)
0 0 0 0 
##$XL= 0
##$YL= 0
##$YMAX_a= 43571
##$YMIN_a= -53481
##$ZGOPTNS= <>
##$ZL1= 120
##$ZL2= 120
##$ZL3= 120
##$ZL4= 120
##$ABSF1= 248.5645
##$ABSF2= -253.2056
##$ABSG= 5
##$ABSL= 3
##$ALPHA= 0
##$AQORDER= 0
##$ASSFAC= 0
##$ASSFACI= 0
##$ASSFACX= 0
##$ASSWID= 0
##$AUNMP= <proc_1d>
##$AZFE= 0.1
##$AZFW= 0.5
##$BCFW= 0
##$BC_mod= 2
##$BYTORDP= 0
##$COROFFS= 0
##$CY= -3
##$DATMOD= 1
##$DC= 0
##$DFILT= <>
##$DTYPP= 0
##$F1P= 0
##$F2P= 0
##$FCOR= 1
##$FTSIZE= 65536
##$FT_mod= 6
##$GAMMA= 0
##$GB= 0
##$INTBC= 1
##$INTSCL= 5.30512e-09
##$ISEN= 30
##$LB= 1
##$LEV0= 0
##$LPBIN= 0
##$MAXI= 10000
##$MC2= 0
##$MEAN= 0
##$ME_mod= 0
##$MI= 50
##$NCOEF= 0
##$NC_proc= -7
##$NLEV= 6
##$NOISF1= 182.463
##$NOISF2= 159.3651
##$NSP= 0
##$NTH_PI= 0
##$NZP= 0
##$OFFSET= 248.5645
##$PC= 4
##$PHC0= -8668.64
##$PHC1= -270.1306
##$PH_mod= 1
##$PKNL= yes
##$PPARMOD= 0
##$PSCAL= 0
##$PSIGN= 0
##$REVERSE= no
##$SF= 81.014009
##$SI= 65536
##$SIGF1= 159.3651
##$SIGF2= -187.1042
##$SINO= 113.3802
##$SIOLD= 16384
##$SREGLST= <1H.CDCl3>
##$SSB= 0
##$STSI= 65536
##$STSR= 0
##$SW_p= 40650.406504065
##$SYMM= 0
##$S_DEV= 0
##$TDeff= 32768
##$TDoff= 0
##$TI= <>
##$TILT= no
##$TM1= 0
##$TM2= 0
##$TOPLEV= 0
##$USERP1= <user>
##$USERP2= <user>
##$USERP3= <user>
##$USERP4= <user>
##$USERP5= <user>
##$WDW= 1
##$XDIM= 65536
##$YMAX_p= 406947655
##$YMIN_p= -263572732
$$ End of Bruker specific parameters
$$ ---------------------------------
##NTUPLES= NMR SPECTRUM
##VAR_NAME=  FREQUENCY,     SPECTRUM/REAL,   SPECTRUM/IMAG
##SYMBOL=    X,             R,               I
##VAR_TYPE=  INDEPENDENT,   DEPENDENT,       DEPENDENT
##VAR_FORM=  AFFN,          ASDF,            ASDF
##VAR_DIM=   65536,         65536,           65536
##UNITS=     HZ,            ARBITRARY UNITS, ARBITRARY UNITS
##FACTOR=    0.620285442955139, 1,           1
##FIRST=     20137.2065510759, 0,            0
##LAST=      -20513.1999529892, 0,           0
##MIN=       -20513.1999529892, -263572732,  0
##MAX=       20137.2065510759, 406947655,    0
$$ Real data points
##PAGE= N=1
##DATA TABLE= (X++(R..R)), XYDATA
$$ [...]
42700G195606r190874q103868r52149L317876J864995j26906N73086J613752J813054
42691a995428L023173L685312o44304p493014p402800J725073R142233O317058
42683F357303q87027k653082J48289J066665O95071K953440M214540j182299p966494
42674B746406o011298K051381L501186l436762o040160J777568R223713O194926
42666A0006960j685281m326164k637891k688440l344701p86891J547973j080598
42658d995033m046146j31601O865593P035248N35205k945396j63568J983315k28080
42649C909537j675838R03700K577987p47306m892995m153629L64818L675762L679255
42640C641291J582755m44591K30601M279953P089402L128403n031647q388618
$$ plain form
42700 7195606 -1995268 -10099136 -11051285 -7733409 -5868414 -5995320 -5422234 -3808482 -1995428
42691 -1995428 1027745 4713057 4068753 -3424261 -10827061 -9101988 40245 6357303
42683 6357303 5470276 2817194 2965483 4032148 4727219 7680659 11895199 10712900 2746406
42674 2746406 -3264892 -1213511 2287675 -1149087 -7189247 -5411679 3812034 10006960
42666 10006960 8321679 3995515 1357624 -1330816 -4675517 -5462408 -3914435 -4995033
42658 -4995033 -9041179 -9172780 -2307187 4728061 5263266 2317870 2154302 4137617 3909537
42649 3909537 2233699 3137399 5715386 4968080 75085 -4078544 -3713726 -37964 3641291
42640 3641291 5224046 4779455 5010056 9290009 16379411 19507814 14476167 6087549
42632F087549m063537R78303J401680N20271J595440Q69105m022990o636164j432447
42623d702790N422053M811119o52392j492935K494103K951339j388022k429085
42615E013390K235156M284210r02019n755943l113244J886637Q88652l702791
42607H34048l560004J148255K553000j147436k853558J011472M210522R73379
42599C169678m256579l441948K614403N342183J077071l882021k919401J411730
42591h84884J961044j928183l770200k58948L768575L238299O15525J139717L764639
42582G645584K873225k260215n894613m252021r6960K470887K823558J512652
42574D822097j883330n711839n479210K2919N219354M499587j16007k241547l2810
$$ plain form
42632 6087549 2024012 3002315 4403995 4924266 6519706 7388811 3365821 -3270343 -4702790
42623 -4702790 719263 5530382 4877990 3385055 5879158 8830497 7442475 5013390
42615 5013390 7248546 11532756 10630737 4874794 1761550 3648187 4536839 834048
42607 834048 -2725956 -1577701 975299 -172137 -3025695 -2014223 2196299 3169678
42599 3169678 -1086901 -4528849 -1914446 3427737 4504808 622787 -2296614 -884884
42591 -884884 1076160 -852023 -4622223 -4881171 -1112596 2125703 2741228 3880945 7645584
42582 7645584 10518809 8258594 2363981 -1888040 -1985000 485887 3309445 4822097
42574 4822097 2938767 -2773072 -8252282 -8229363 -3010009 1489578 1373571 -867976 -900786
42565i00786K630509K700171J157679l06361j756174l178316l193319j080548
42557c927145J583324K536927J413306L5477J44359J047712M45982j651260j629974
42548a292K526570O472663M458634j707235m642995k791637k334212n322844m773307
42539h115655K709214Q073003K758070o224422n778813K775904N921174l15545
42531A802930m880117o88444M347937J634070m027679l469743J996682M523144
42523A238780K947032K195462K760889M91459m071892m988724n53775L608126
42515C627357L139485Q33397J136531L193200K866846p54566m196070m345679
42507E500501k081452n96197j191661k015266j210760K81427P49905J123288L257183
$$ plain form
42565 -900786 1729723 4429894 5587573 5281212 3525038 346722 -2846597 -3927145
42557 -3927145 -2343821 193106 1606412 1641889 1786248 2833960 3279942 1628682 -1292
42548 -1292 2525278 8997941 13456575 11749340 7106345 4314708 1980496 -3342348 -8115655
42539 -8115655 -5406441 2666562 5424632 -799790 -6578603 -3802699 2118475 1802930
42531 1802930 -3077187 -3765631 582306 2216376 -1811303 -5281046 -3284364 1238780
42523 1238780 4185812 6381274 9142163 9633622 5561730 573006 19231 3627357
42515 3627357 6766842 7600239 8736770 11929970 14796816 14042250 9846180 5500501
42507 5500501 3419049 2822852 1631191 -384075 -1594835 -1313408 -563503 559785 3816968
42498C816968N441334L824043j051010l849138k460200j443981m180984o527068
42490f430036l451716J937262K710238p23869j350585K594388M342203k54172
42482f26287n220911l178321L232753N206264R53157k072478J076883N530536
42474D901596M696380N21892l64539K002258J063703m494486p170470k339780
42466a183446L657550L153618q81105n96861K963194J804281m500836o970201
42458b553806j799871L345405K030664q98398J495806O002391M337516l569555
42450H390152r321282p626474j705097K633758L365073K225414J586687K003419
42442A551650J761271m56101k521037j128816K718728M387943K446170J67380
$$ plain form
42498 3816968 9258302 13082345 12031335 8182197 5721997 4278016 97032 -6430036
42490 -6430036 -9881752 -7944490 -5234252 -5958121 -7308706 -4714318 -372115 -626287
42482 -626287 -5847198 -9025519 -5792766 -586502 366655 -1705823 -628940 4901596
42474 4901596 9597976 10119868 9755329 11757587 12821290 8326804 1156334 -1183446
42466 -1183446 2474104 5627722 4746617 4149756 7112950 8917231 4416395 -2553806
42458 -2553806 -4353677 -1008272 1022392 123994 1619800 7622191 11959707 8390152
42450 8390152 -931130 -8557604 -10262701 -7628943 -4263870 -2038456 -451769 1551650
42442 1551650 3312921 2856820 335783 -793033 1925695 6313638 8759808 8927188
42434H927188o95311j911652l054428o59378M164359M735016o09074m567097k481538
42425C848085J85057j781123l950959j314425J426496j394568m602775p08336
42417h292548N652358M622862j791327l142361J560751L415791J48042j195066
42409I78502J110951K62431m966310o322692n04820M669987L531521Q80770J636279
42400A276619K608424O18895q04686P19251O89518l493703o087315k290179L186458
42391c576718L751057Q90987m9364J476334K696833K620524Q32286l409071o954180
42382a721312m241545L044088N547833J22814m530497j842551K344412Q84078
42374c92680k533633j471113J383948O41988q67194J536743L760248K92008l776166
$$ plain form
42434 8927188 8231877 6320225 3265797 2606419 6770778 11505794 10896720 6329623 3848085
42425 3848085 4033142 2252019 -1698940 -3013365 -1586869 -2981437 -7584212 -8292548
42417 -8292548 -2640190 1982672 191345 -2951016 -1390265 2025526 2173568 978502
42409 978502 2089453 2351884 -2614426 -8937118 -9441938 -4771951 -1240430 -359660 1276619
42400 1276619 3885043 4503938 3699252 4418503 5108021 1614318 -4472997 -6763176 -3576718
42391 -3576718 174339 1065326 1015962 2492296 5189129 7809653 8641939 5232868 -1721312
42382 -1721312 -5962857 -2918769 2629064 2751878 -1778619 -3621170 -1276758 -392680
42374 -392680 -2926313 -4397426 -3013478 -2371490 -3238684 -1701941 2058307 2350315 -1425851
42365a425851o20328N408490M216216k376610l684179J167751K433284k382992
42357B735781m642115p19942J996745p58756k838067J67958K916628O52529k440324
42348b929563j772390l01464j166573o16528M255945P924737M614630j688847
42340H319947l410958q98799J13546j298949j647718r54224k287071m675401l876269
42331a0615896K4117K349361J518740J007831K712030L903773K575063J015637
42323D490656J493421K056414k41668m187845n594509k849119J113924K497728
42315a220998P53005j533325j948077m53800J633596L552812M841578M105074
42307I729865L08553m430463n864236k870871M89490M13482j020795R81193O031300
$$ plain form
42365 -1425851 -2046179 3362311 7578527 5201917 1517738 2685489 5118773 2735781
42357 2735781 -1906334 -2626276 -629531 -1388287 -4226354 -4058396 -1141768 -489239 -2929563
42348 -2929563 -4701953 -5003417 -6169990 -6786518 -2530573 5394164 10008794 8319947
42340 8319947 4908989 4010190 4123736 2824787 1177069 222845 -2064226 -6739627 -10615896
42331 -10615896 -10591779 -8242418 -6723678 -5715847 -3003817 899956 3475019 4490656
42323 4490656 5984077 8040491 7798823 3610978 -1983531 -4832650 -3718726 -1220998
42315 -1220998 -467993 -2001318 -3949395 -4403195 -2769599 783213 5624791 9729865
42307 9729865 10038418 5607955 -256281 -3127152 -2637662 -2224180 -3244975 -2263782 3767518
42298C767518Q115855L981281k186373m927281m702462n029920n351835k419123
42290h752340K290688L162706m28038k199615R32545L378215L02120l627796j889714
42281f831229K501368K104802j762623j294235L568671M497315m17647k897797
42273e31375Q11332K966334j747068o025280k324922L695028K699010k365394
42265b822335j762196M068683N497161j40724n210919m840697k599158j632694
42257i442879J92507L716116N331108L379830R31636p1554j023971j464327J219223
42248B767689M980597L627741k945622o542259k561586K933716K800981r67790
42240D093467k295578r01313o68838j826501j187713J672624L777085L322438
$$ plain form
42298 3767518 11883373 15864654 13678281 8751000 4048538 -981382 -6333217 -8752340
42290 -8752340 -6461652 -3298946 -3726984 -5926599 -4994054 -1615839 -1313719 -4941515 -6831229
42281 -6831229 -4329861 -2225059 -3987682 -5281917 -1713246 2784069 2366422 -531375
42273 -531375 279957 3246291 1499223 -4526057 -6850979 -3155951 -456941 -2822335
42265 -2822335 -4584531 -515848 4981313 4840589 -370330 -5211027 -7810185 -9442879
42257 -9442879 -9250372 -5534256 -203148 3176682 4108318 4036764 3012793 1548466 2767689
42248 2767689 7748286 11376027 8430405 1888146 -673440 2260276 5061257 4093467
42240 4093467 1797889 896576 227738 -1598763 -2786476 -1113852 2663233 5985671
42232E985671J045348j890778m275028m457556k338892m17952n95789j498666
42224h443642r27249R00362K409547K973951K486128Q17293p89476k92844J693039
42215H27109J816972j063531l858446l828220k043089o17811J16725R0881j024062
42206i583472j254597K134535O630591N647915j270751n667940k076883L612232
42198a828370L736114O61304R69881K968224J06903n885334o318034K9704M427765
42189a131843K211493o48667J142468L408327Q61361l131757k450021J190340
42181A451701J275435k739890n068827k862406P17888K648895L412494L456807
42173B292097J589215j485845k505505n77929J028796J86247p46202L61207J022746
$$ plain form
42232 5985671 7031019 5140241 865213 -3592343 -5931235 -6349187 -6944976 -8443642
42224 -8443642 -9370891 -8470529 -6060982 -3087031 -600903 216390 -573086 -865930 827109
42215 827109 2644081 1580550 -2277896 -6106116 -8149205 -8767016 -8650291 -8559410 -9583472
42206 -9583472 -10838069 -8703534 -2072943 3574972 2304221 -3363719 -5440602 -1828370
42198 -1828370 1907744 2569048 3538929 6507153 6614056 728722 -5589312 -5559608 -1131843
42189 -1131843 1079650 430983 1573451 4981778 5843139 2711382 261361 1451701
42181 1451701 2727136 -12754 -5081581 -7943987 -7226099 -4577204 -1164710 2292097
42173 2292097 3881312 2395467 -110038 -687967 340829 527076 -219126 142081 1164827
42164A164827j565250m729909l790890L61976K697607K454999L794031O964243
42156G351634N810831k056581q701933n815305K605479N080730j232822p135135
42148d093102n127440R45984L484143K220519K187197M230450L943570n10403
42140G280918m836577m339352N5429L411477K716394m41632k402985j353623J275613
42131A365662K577887J050006j965801l425307j481683K285898L998081J777696
42123F182439j598171k060788P6553N77070k078026m094352k328891Q33971J781624
42114b708571J408813K157897K344787p97070m325470k563738L473822O417377
42106E407847L181952j238205k243014j435393j438931j137333M40319R97390
$$ plain form
42164 1164827 -400423 -5130332 -8921222 -8559246 -5861639 -3406640 387391 7351634
42156 7351634 13162465 11105884 2403951 -3411354 -805875 4274855 3042033 -4093102
42148 -4093102 -9220542 -8274558 -4790415 -2569896 -382699 3847751 7791321 7280918
42140 7280918 2444341 -1895011 -1839582 1571895 4288289 3846657 1443672 90049 1365662
42131 1365662 3943549 4993555 3027754 -397553 -1879236 406662 4404743 6182439
42123 6182439 4584268 2523480 2600033 3177103 1099077 -2995275 -5324166 -4490195 -2708571
42114 -2708571 -1299758 858139 3202926 2405856 -1919614 -4483352 -1009530 5407847
42106 5407847 8589799 7351594 5108580 3673187 2234256 1096923 1537242 2534632
42098B534632m59916r61135P39044J042769j674651k720298R94778M011871J67864
42089C674958o760900p873087j898386M354109O365272N253699K254512k192189
42081C177988m381080n51317N293606M789437k264658o858070m366247p59770
42073e920111j611292l330506j023910K344212K028200Q56201L868280P637334
42065D848408M581679l720494p382388l068874J439387L12655j674703J143923
42057c520407M608433J641662m933995n714203O70840N303431K566785k149009
42049a526463j777842K079989L256199P02002j696618j982480j132199Q08216
42041a269196L980767N432242K309676k368860l035635l54941j71581l313458
$$ plain form
42098 2534632 2074716 1113581 1852625 2895394 1220743 -1499555 -504777 3507094 3674958
42089 3674958 -3085942 -10959029 -12857415 -8503306 -2138034 3115665 5370177 3177988
42081 3177988 -1203092 -1754409 3539197 8328634 6063976 -794094 -5160341 -5920111
42073 -5920111 -7531403 -10861909 -11885819 -9541607 -7513407 -6657206 -2788926 4848408
42065 4848408 9430087 5709593 -1672795 -4741669 -3302282 -2989627 -4664330 -3520407
42057 -3520407 1088026 2729688 -2204307 -7918510 -7247670 -1944239 622546 -1526463
42049 -1526463 -3304305 -1224316 2031883 2733885 1037267 -945213 -2077412 -1269196
42041 -1269196 2711571 8143813 10453489 8084629 5048994 4694053 4522472 1209014
42033A209014l989308l75149J289091k554629n600005j727908M147525L652419
42025c948950j090493q67449N096099P333117J156753n871257n352177L64027
42017c180330L193372P97326k564331l471405k175807M33415L790916N886590
42009B709746M589023J175462o85881j50465l68390l137988n301872l191182J113900
42000c247647J822342k041363m214175J78197O737389P060622O60849l993774
41992B962440j567075K642241J045226m734728o437655j331029M382181M752624
41984A714225J215406j524813k325375k941968l307540j525142K064538M205281
41976b425388K896774P6070j053122N3971J489895K055133K170749J855608L63531
$$ plain form
42033 1209014 -2780294 -3155443 -1866352 -4420981 -10020986 -11748894 -7601369 -3948950
42025 -3948950 -5039443 -5906892 -810793 6522324 7679077 1807820 -3544357 -3180330
42017 -3180330 13042 810368 -1753963 -5225368 -7401175 -6967760 -3176844 2709746
42009 2709746 7298769 8474231 7788350 7637885 7269495 4131507 -1170365 -4361547 -3247647
42000 -3247647 -1425305 -3466668 -7680843 -7502646 -765257 6295365 6956214 2962440
41992 2962440 1395365 4037606 5082832 348104 -6089551 -7420580 -3038399 1714225
41984 1714225 2929631 1404818 -920557 -3862525 -7170065 -8695207 -6630669 -2425388
41976 -2425388 471386 547456 -505666 -451695 1038200 3093333 5264082 7119690 7483221
41967G483221j333173n71410K408260K787976k312630p977061p142754q78008
41959g535579K944782J208079r82865K02704J699170O81067J12615K234653L139349
41950C703975K6830k261718O18714L509013j94088o230505n682981q8601J419897
41941e179464j694965j098610M049822M438132k314725n826975n26807L953334
41933d200258j010052p839451n197485L427074O532933L498273K796254N280233
41925C287521L630562k589201n241918k285839j231070m960124o214743r35115
41917a6539927L984064K522999o24903N78862K865079R38476j753768O89226M830460
41908b509432K923552l365104m930215O9843L777536J786549q68673M93340K825983
$$ plain form
41967 7483221 6150048 5578638 7986898 10774874 8462244 485183 -6657571 -7535579
41959 -7535579 -4590797 -3382718 -4365583 -4162879 -2463709 -1782642 -1670027 564626 3703975
41950 3703975 3730805 1469087 2087801 5596814 5402726 -827779 -6510760 -6599361 -5179464
41941 -5179464 -6874429 -7973039 -3923217 514915 -1799810 -7626785 -8153592 -4200258
41933 -4200258 -5210310 -13049761 -18247246 -14820172 -8287239 -4788966 -1992712 3287521
41925 3287521 6918083 4328882 -913036 -3198875 -4429945 -9390069 -15604812 -16539927
41917 -16539927 -12555863 -10032864 -10657767 -10078905 -7213826 -6275350 -8029118 -7339892 -2509432
41908 -2509432 414120 -2950984 -7881199 -7811356 -4033820 -2247271 -3115944 -2622604 203379
41899B03379J776269j229333k749385k880446k805394j372153J698136L277864
41891d081063J677363K43872J921477L962916K675574j64501q47714l81240j690269
41882C316415k950470m93242L374352K765772k025750m457132j989891P71153
41874a688793O43854L81699K005509K497248J8441j627352M76779K423674m82428
41865D648631n539765o172270j292732L921099N092542K299980j896272m370212
41857c308999k833126J334732L263726O01514k811331k396944P15440K422327
41849c012661J986981J267013L23300j236953j055763K275936M580436J429114
41841F557403l693617l660514Q48104K053645k367590n657164l037785J278600
$$ plain form
41899 203379 1979648 750315 -1999070 -4879516 -7684910 -9057063 -7358927 -4081063
41891 -4081063 -2403700 -2159828 -238351 3724565 6400139 6235638 5387924 5006684 3316415
41882 3316415 365945 -127297 3247055 6012827 3987077 -470055 -2459946 -1688793
41874 -1688793 -1044939 -663240 1342269 3839517 3857958 2230606 2707385 5131059 4648631
41865 4648631 -891134 -7063404 -8356136 -4435037 657505 2957485 1061213 -3308999
41857 -3308999 -6142125 -4807393 -1543667 -942153 -3753484 -6150428 -5434988 -3012661
41849 -3012661 -1025680 241333 564633 -672320 -1728083 547853 5128289 6557403
41841 6557403 2863786 -796728 51376 2105021 -262569 -5919733 -8957518 -7678918
41833g678918J752202k96378n10598J596367L773790M779464L346344k033654
41825D728619q385920q293347J56187P869829N566802l088348o345879p56243
41817h548300N023005L443068k205662m306852j607383J172617J286855O15007
41809e127645J129759J891964J535845Q61971J177260J823427J425126M85285
41801E202992L40100K34816j470987l263965j704744K090091J982552l951972
41793e41117q350477m059655M727333P678425K900975j398211Q2798L104560K405745
41784F550376n59252k168764k706069l355021k334379J004922K652762j30592
41776a046017l060139p95205M176468M865318M28754k778497p94873K789574K533077
$$ plain form
41833 -7678918 -5926716 -6223094 -6733692 -5137325 -1363535 3415929 6762273 4728619
41825 4728619 -3657301 -11950648 -11794461 -3924632 1642170 -1446178 -7792057 -8548300
41817 -8548300 -3525295 -82227 -2287889 -6594741 -8202124 -7029507 -5742652 -5127645
41809 -5127645 -3997886 -2105922 -570077 291894 1469154 3292581 4717707 5202992
41801 5202992 5543092 5777908 4306921 1042956 -661788 1428303 3410855 -541117
41793 -541117 -8891594 -12951249 -8223916 -545491 2355484 957273 1040071 4144631 6550376
41784 6550376 5991124 3822360 1116291 -2238730 -4573109 -3568187 -915425 -1046017
41776 -1046017 -4106156 -4901361 -724893 4140425 4569179 1790682 995809 3785383 6318460
41767F318460j850113n673180m343604K190571Q570669Q385254J249521n813601
41759I033977o341071k006832P60332k12908j506814q67023l31401j689393k992847
41750f153980j727307J138214K488710J200032p25860p76713J284256L411308
41742A38660L751783K428033K99923k781369o424902p500333l228104L321221
41734i995088N279877J073795l113085k403644J93416R8491q78209J409592N119313
41725c215542M971435J205103q82093K37713N46733j904361l648203j742682J712208
41716b719689K995626J336979j317801k578517j232343J216867J458930o91196
41708a531144n60432M203565P662490L022379n965779q793708l012419L025726
$$ plain form
41767 6318460 4468347 -1204833 -5548437 -3357866 5212803 13598057 14847578 9033977
41759 9033977 2692906 686074 1446406 1233498 -273316 -1140339 -1471740 -3161133 -6153980
41750 -6153980 -7881287 -6743073 -4254363 -3054331 -3780191 -4556904 -3272648 138660
41742 138660 3890443 6318476 6618399 3837030 -2587872 -10088205 -13316309 -9995088
41734 -9995088 -4715211 -3641416 -6754501 -9158145 -8964729 -8866238 -9744447 -8334855 -3215542
41725 -3215542 1755893 2960996 2078903 2316616 2863349 958988 -2689215 -4431897 -2719689
41716 -2719689 275937 1612916 295115 -2283402 -3515745 -2298878 -839948 -1531144
41708 -1531144 -2091576 2111989 9774479 12796858 6831079 -1962629 -4975048 -1949322
41700a949322L235802R01851P8661j304888m912737o150763j252588N169269O018457
41691a66258J415280k889334l487832r97194K823477N185800L060196j925969
41683C018166l468446K40141K458245j561646n832449k958903L121100L296458
41675a687334j561131k536597J978508M526036K516857J967216M723293L837192
41667A3764040l159805p372431k495087L689137J290960n418429m910085K751428
41659a860272N977370j83787p153746o336948l52290L216087K360904K68994p05498
41650d769186r2926K308736N076014M760089M45378l512963k855308L94592R63264
41641B717690j742465l063512n13290K368626J339799k159217k739647J434567
$$ plain form
41700 -1949322 1286480 2188331 2266992 962104 -3950633 -10101396 -11353984 -6184715 -166258
41691 -166258 1249022 -1640312 -5128144 -6125338 -3301861 1883939 4944135 3018166
41683 3018166 -450280 -210139 2248106 686460 -5145989 -8104892 -4983792 -1687334
41675 -1687334 -3248465 -5785062 -3806554 719482 3236339 5203555 9926848 13764040
41667 13764040 10604235 3231804 736717 4425854 5716814 298385 -4611700 -1860272
41659 -1860272 4117098 3933311 -3220435 -9557383 -9909673 -6693586 -4332682 -4063688 -4769186
41650 -4769186 -4862112 -2553376 2522638 7282727 7728105 4215142 1359834 1754426 2717690
41641 2717690 975225 -2088287 -2601577 -232951 1106848 -1052369 -3792016 -2357449
41633b357449N427222L388078l220613o098237n77706O931086O339764k038868
41625G793277o942145j751909N907113N389734j605118m854604j653384O98516
41617B981480j615003l116230J85134L400547J607915j477263m65117K159587
41609C661050J125751j777979j365372R34933k44265l666664l109662J169752
41601c272456K280636j202084k644634Q75278L566742J361832j428222p52514
41593a215422k4612k726616m959166k162191K702447M523286M062047L704754
41585C904527J127524m669286o879502m63266O604811L359716o041744p425032
41577a0482252J094490O301601J563793l391156k27860M137089Q78012m605817
$$ plain form
41633 -2357449 3069773 6457851 3237238 -2860999 -3438705 3492381 9832145 7793277
41625 7793277 851132 -900777 5006336 10396070 8790952 3936348 2282964 2981480
41617 2981480 1366477 -1749753 -1564619 1835928 3443843 1966580 1501463 3661050
41609 3661050 4786801 3008822 1643450 2578383 2334118 -1332546 -4442208 -3272456
41601 -3272456 -991820 -2193904 -4838538 -3963260 -396518 965314 -462908 -1215422
41593 -1215422 -1240034 -3966650 -8925816 -11088007 -8385560 -3862274 199773 3904527
41585 3904527 5032051 362765 -6516737 -6980003 -375192 2984524 -3057220 -10482252
41577 -10482252 -9387762 -3086161 -1522368 -4913524 -5141384 -1004295 -126283 -4732100
41569d732100j980218N930636P315317O6120n942310m438286K76709K873133L811071
41560C180072M142205J765097l319516o157462l227794K534060O066403N851609
41552A0834674L001194j315870m828685m222023N24765M469194L261669j591455
41544A0133463n187551m887957j627376K134663L730958J751323j804442k951411
41536A291670r78345L76715j126840k533926q57483J618503J422107K33138J664036
41527A109575L687374R29211n488817p367153j082108O111447N633593p50610
41519B782512m049562p06858L421241K003407l556771p006201n400465j368239
41511a3880936J680579L418613M847475N169907K827401j188476l736613l515904
$$ plain form
41569 -4732100 -6712318 -781682 6533635 6599755 657445 -3780841 -3504132 -630999 3180072
41560 3180072 7322277 9087374 5767858 -389604 -3617398 -1083338 4983065 10834674
41552 10834674 13835868 12519998 7691313 3469290 3994055 8463249 11724918 10133463
41544 10133463 4945912 57955 -1569421 565242 4296200 6047523 4243081 1291670
41536 1291670 313325 690040 -436800 -2970726 -3828209 -2209706 -787599 -554461 1109575
41527 1109575 4796949 5726160 237343 -7129810 -8211918 -2100471 3533122 2782512
41519 2782512 -1267050 -1973908 1447333 3450740 -106031 -7112232 -12512697 -13880936
41511 -13880936 -12200357 -8781744 -3934269 1235638 4063039 2874563 -862050 -4377954
41503d377954k172583q09301J544054M398794M304720R0216l536977k181967R23271
41494a817727l31756m404698l756321K498175N893492J661742l459168j901126
41486e617387L052987L585169J76207n83407K066960K639624j9424r11626J521651
41477E910754K583399J61751j633528o56062q41841m065772n175786o04197M360089
41468C8807L350996j076082k195141P6367N36845j735587k647811p00084J436938
41459b914752K372180K969944K494316l22230l020668k220707J19378k94083j820693
41450b637315O30617N133024L906428l477817p604887l427912K261847K585835
41442b630180Q08094J984773K742163j548192n896935k572438N097510O592315
$$ plain form
41503 -4377954 -6550537 -7359838 -5815784 -1416990 2887730 2977946 -559031 -2740998 -1817727
41494 -1817727 -2149483 -6554181 -10310502 -7812327 -1918835 -257093 -3716261 -5617387
41486 -5617387 -2564400 1020769 1196976 613569 2680529 5320153 5300729 4389103 5910754
41477 5910754 8494153 8655904 7022376 6366314 5524473 1458701 -3717085 -4321282 38807
41468 38807 3389803 2313721 118580 194947 731792 -1003795 -3651606 -4351690 -2914752
41459 -2914752 -542572 2427372 4921688 4599458 1578790 -641917 -522539 -816622 -2637315
41450 -2637315 -2006698 3126326 7032754 3554937 -4049950 -7477862 -5216015 -2630180
41442 -2630180 -1822086 162687 2904850 1356658 -4540277 -7112715 -2015205 4577110
41434D577110J70941n219516l805726P61198L833549N359785N135110R71483n286951
41425F496983p248194l031755J378771J176886q18076k63454J881979K635098
41417B208238K064192J140856q76035l253618k715833P98520K403854J99892q32566
41408A137500K213183L553430k089581r077529q132728m36300M531664L238270
41400e062091J132442K044975L451030L147997K528686J611736j652819n185725
41392B016231l462915K800171N157865k29050n668369k967778M178571N717286
41384G542012j84351n269869l226166K467895M178708j16568m941445m154521
41376c704305J782144O261019M436610j086822m327788l650301j813367l123K769953
$$ plain form
41434 4577110 4748051 -471465 -4277191 -3515993 317556 5677341 10812451 11783934 6496983
41425 6496983 -751211 -3782966 -2404195 -1227309 -2045385 -2308839 -426860 2208238
41417 2208238 4272430 5413286 4537251 1283633 -1432200 -633680 1770174 1970066 1137500
41408 1137500 3350683 6904113 4814532 -4262997 -12395725 -12832025 -8300361 -5062091
41400 -5062091 -3929649 -1884674 1566356 4714353 7243039 8854775 7201956 2016231
41392 2016231 -1446684 1353487 6511352 6282302 613933 -2353845 1824726 7542012
41384 7542012 7357661 2087792 -1138374 1329521 5508229 5391661 450216 -3704305
41376 -3704305 -1922161 4338858 8775468 7688646 3360858 -289443 -2102810 -2105933 664020
41367F64020M701276K171589k892231l377531K307443O377208K878731l212518
41359I617987l796154M26553K555344N09021j650866j439916l22622O73290J784181
41350H356818J595135j225415l830328k153585K443846M687561L167572J287481
41342A4329085P20965l42771k063944j910050M4595J58324k726044n010001l939954
41333g39795j255874M69532J241977J811380J968984J894498J937600P33987k629758
41324E432531m918909k341408K292605K323383k197170l957994j60286L178322
41316c48926J979054P51818L222080M391720o00163o353434m864489J418295L644080
41307C240035N93841j032167J123321K301143M44614m13884J544170K392618N0735
$$ plain form
41367 664020 5365296 7536885 4644654 1267123 3574566 9951774 12830505 9617987
41359 9617987 5821833 6248386 8803730 9312751 7661885 6221969 5899347 6572637 8356818
41350 8356818 9951953 8726538 4896210 2742625 5186471 9874032 13041604 14329085
41342 14329085 15050050 14707279 12643335 10733285 10777880 10936204 8210160 3200159 -739795
41333 -739795 -1995669 -1526137 -284160 1527220 3496204 5390702 7328302 8062289 5432531
41324 5432531 513622 -1827786 464819 2788202 591032 -3366962 -3527248 -348926
41316 -348926 1630128 2381946 5604026 9995746 9395583 3042149 -1822340 -404045 3240035
41307 3240035 3833876 2801709 3925030 6226173 6670787 6256903 7801073 10193691 10244426
41298A0244426j751363n31759K84333k120784m291848k274405J134267L72212
41290A065079m037512n863578j836065M131377N968628K210734l067061m858697
41282f287095k117255J753907K916627Q39837k161608l579296j927659K580622
41274g981920O654768N634429m77389n141856l329811J121586J403376j418025
41266c534842o05179M171425N530593N70582m171672l279550j07334O90038R13243
41257A77304L229106M348404Q18895l572366l558302j166325j129844j639637
41249b492765J726378O078544M816174n74664k194642J232600K968081N59733
41241A2119439p17634J217207J216820k565830m140305q04856Q25488l316079
$$ plain form
41298 10244426 8493063 7961304 8245637 6124853 1833005 -441400 692867 1065079
41290 1065079 -2972433 -8836011 -10672076 -6540699 -572071 1638663 -1428398 -6287095
41282 -6287095 -8404350 -6650443 -3733816 -2893979 -5055587 -8634883 -10562542 -7981920
41274 -7981920 -1327152 4307277 3829888 -1311968 -4641779 -3520193 -2116817 -3534842
41266 -3534842 -4140021 31404 5561997 6132579 1960907 -1318643 -1425977 -735939 177304
41257 177304 3406410 7754814 8573709 5001343 1443041 276716 -853128 -2492765
41249 -2492765 -766387 5312157 10128331 9553667 7359025 8591625 11559706 12119439
41241 12119439 11401805 12619012 13835832 11270002 7129697 6324841 7150329 3834250
41233C834250n900574k4633P688004O366481j965254n824878j883058K266286
41225D556624J986847R68477J598835N76675k875699l788702n63124R21484k747596
41216F33821n826446k583177L097034M087930J196544N89978L190207M092634
41208H478525J241293j988748k718184j582187K16016K053790K148308o63522
41200G185291l422500k068001J914234K926889j03032k020823J62518K833128
41192G407704K385918Q98881J326000J705319q27423l785079k847480N57818J258511
41183H080169j023326j312509J902821L897863J731693p79990J89772J663685
41175A4350178r04502m916217l798646K050694M533672j79339n248777k893422
$$ plain form
41233 3834250 -2066324 -2090957 5597047 11963528 9998274 4173396 2290338 4556624
41225 4556624 6543471 7511948 9110783 9687458 6811759 3023057 2459933 3381417 633821
41216 633821 -5192625 -7775802 -4678768 -590838 605706 1195684 4385891 8478525
41208 8478525 9719818 7731070 5012886 3430699 3646715 5700505 7848813 7185291
41200 7185291 3762791 1694790 3609024 6535913 6432881 4412058 4574576 7407704
41192 7407704 9793622 10692503 12018503 13723822 12896399 9111320 6263840 6821658 8080169
41183 8080169 7056843 5744334 7647155 11545018 13276711 12496721 12686493 14350178
41175 14350178 13445676 8529459 4730813 6781507 11315179 11135840 5887063 2993641
41167B993641M062364O239362J182140l638347j765174M010041O689881M043709
41159B3817617o24476l652637l628094r28888K198946K747041Q04711J80027K246261
41150B3160508K326338k987254p861538l834279O400855J0327284K816745o252770
41142B4095889o205873j06390J895424j645745l248857J61198K885093M69312
41134A8300051l434344l182613J077429M919045N439569K914117p10487k848224
41126B2474543j930915M50438J072607m02293j037575L89282J285278k34981k023932
41117B0042452j562178j51931m70090k022632k249594q42537J93604J88310O36344
41108A3761748K260317L443835K181504j481748n089583n427592j340358M323457
$$ plain form
41167 2993641 7056005 13295367 14477507 10839160 9073986 13084027 19773908 23817617
41159 23817617 23193141 19540504 15912410 14983522 17182468 19929509 20734220 20914247 23160508
41150 23160508 25486846 22499592 14638054 10803775 17204630 27531914 30348659 24095889
41142 24095889 17890016 17783626 19679050 18033305 14784448 14945646 17830739 18300051
41134 18300051 14865707 11683094 12760523 17679568 23119137 26033254 25322767 22474543
41126 22474543 20543628 20994066 22066673 21664380 20626805 21016087 22301365 22066384 20042452
41117 20042452 18480274 18328343 17858253 15835621 13586027 12743490 12937094 13125404 13761748
41108 13761748 16022065 19465900 21647404 20165656 15076073 9648481 8308123 12631580
41100A2631580O592123L304848k518881n913069m557932K37259N218043O761899
41092B1755870K974927l698474p485478n171029N990K344670N33268j740852j290243
41083H228649R59679J983231M73643j805303j824600J246225M229548L111710
41075A6602782j402955l913939j401915K497682K876464M18165r50836j004843
41067A3720605k615426m991617l422718K814061P425829N009516j500666m760693
41059A1678891k334785J345415J575682j104474k544434k78098L942130O400972
41051A8681299N276389J841414j583442l686698m149288l185751j820095j116414
41043A0257414m38096J547950L404729J698420k804206l709863K218870Q394345
$$ plain form
41100 12631580 19223703 22528551 20009670 14096601 9538669 9775928 14993971 21755870
41092 21755870 24730797 21032323 13546845 8375816 8381806 10726476 11259744 9518892 8228649
41083 8228649 9188328 11171559 11645202 9839899 8015299 9261524 13491072 16602782
41075 16602782 15199827 11285888 9883973 12381655 15258119 15676284 14725448 13720605
41067 13720605 11105179 6113562 2690844 5504905 12930734 17940250 16439584 11678891
41059 11678891 9344106 10689521 12265203 11160729 8616295 8338197 12280327 18681299
41051 18681299 23957688 25799102 24215660 20528962 16379674 13193923 11373828 10257414
41043 10257414 9819318 11367268 14771997 16470417 13666211 9956348 12175218 20569563
41035B0569563O396893j519040n019789n11844M255090K309445k970052m328597
41027A9181669j051604K076579K411411R85777j219963l833637n075694l137250
41019A0337288P07838L125394K696132J078419N55070J506994J918243m74780
41011B1450598m315105m305607J892356P815189N018089m048203p306093J76444
41003A6377668Q383121O498151k134337o597250m449941k015871j832359K3779
40995A4252961M228626N297924P74132m021454l726510r6651J692949o5940l021062
40986A5314975m083857j689336K701499M808663K185246j577306j180759K283799
40978A8762924K742963j042361l222727l68176K849180J122400l247052m187581
$$ plain form
41035 20569563 26966456 25447416 20427627 19915783 24170873 26480318 23510266 19181669
41027 19181669 18130065 20206644 22618055 23603832 22383869 18550232 13474538 10337288
41019 10337288 11045126 14170520 16866652 17945071 18500141 20007135 21925378 21450598
41011 21450598 17135493 12829886 14722242 22537431 27555520 23507317 16201224 16377668
41003 16377668 24760789 31258940 29124603 22527353 18077412 16061541 14229182 14252961
40995 14252961 18481587 23779511 24553643 20532189 16805679 16709028 18401977 18336037 15314975
40986 15314975 11231118 9541782 12243281 17051944 19237190 17659884 16479125 18762924
40978 18762924 21505887 20463526 17240799 16872623 19721803 20844203 17597151 13409570
40970A3409570p52189K380852J715766j341661k951521r46886K898343M108847
40962A8521121O45633l385696k325789K716000M687763Q08280l398934k763066
40954A5505312L16372J190863L99124N86058K42519l174744o737510n407491m48838
40945B471665K103649Q55319L55230K548793L579722J052268j556298r52572M84932
40936A0942708o34131k386413p39887L155194M018965L54608l265789k741988
40928H703267M17288K284489J981579J362876R93017m22712k906723m373598l614240
40919D425243j877685m68646J177377L541229M918766L267498q31836m660638
40911I491308n917673l759728R04608M657195L556752j634714m713371j757174
$$ plain form
40970 13409570 12657381 15038233 16753999 15412338 12460817 11513931 14412274 18521121
40962 18521121 19166754 15781058 13455269 16171269 20859032 21667312 18268378 15505312
40954 15505312 15821684 17012547 17411671 17997729 18240248 15065504 8327994 2920503 2471665
40945 2471665 4575314 5430633 5785863 8334656 11914378 12966646 11410348 10457776 10942708
40936 10942708 10308577 7922164 7182277 10337471 14356436 14711044 11445255 8703267
40928 8703267 9120555 11405044 13386623 14749499 15742516 15319804 12413081 8039483 4425243
40919 4425243 2547558 2078912 3256289 6797518 11716284 14983782 14151946 9491308
40911 9491308 3573635 -186093 718515 5375710 8932462 7297748 2584377 827203
40903H27203L063053L635800J098371R71359L139234K293054j828684l033089
40895A0166301N96469K795811l81295l795871k126464J178579K93790l017057
40887E710263l051432J772J189110n63754j627424p8162K762068N742872P709171
40878A7794484N897377r8330m911293l748247J3227j75344l677558m521672j841209
40869D731435k66859n44044J454039N545354N821153O37971l952578l692110j676152
40860H058209j174760j66513K807521M046120R32045k806682l040299j488099
40852G167542j235741q97133J535511L493227K084104k65618j8859J100484k89686
40843A2673831k423759j391916J504310J801497l31510o56811J581755K658709
$$ plain form
40903 827203 3890256 7526056 8624427 9595786 12735020 15028074 13199390 10166301
40895 10166301 10762770 13558581 13177286 9381415 7254951 8433530 8727320 5710263
40887 5710263 2658831 2660603 3849713 3285959 1658535 1580373 4342441 10085313 17794484
40878 17794484 23691861 23593531 18682238 14933991 14947218 14771874 11094316 6572644 4731435
40869 4731435 4464576 3920532 5374571 10919925 16741078 17379049 13426471 9734361 8058209
40860 8058209 6883449 6716936 9524457 13570577 14502622 11695940 8655641 7167542
40852 7167542 5931801 5034668 6570179 10063406 12147510 11881892 11863033 12963517 12673831
40843 12673831 10250072 8858156 10362466 12163963 11832453 11175642 12757397 15416106
40835A5416106Q68335j261212j556700n43146Q69574K036299J318453j765342
40827A5382367l838619j463737L133686M751543K751718Q29854J64237j215471
40819B0495578k567752p59417K765926K359056k627484n904088m176719k018831
40811G566269l095006l590112K14152M124469K667551j351936j567375J206985
40803F174997J144695j823611k085213J191867K303780q27059k716333L89196
40795C752319M082557K860072j651831m096936l072614r82402P02986J769003
40787C363154J273890p43911j586190L75552K301106R68402j813349k084445j57890
40778A896319O62915M56486K261878N467620N306342K76485m693365m510157J73459
$$ plain form
40835 15416106 16284441 15023229 13466529 12923383 13792957 15829256 17147709 15382367
40827 15382367 11543748 10080011 13213697 17965240 20716958 21546812 21711049 20495578
40819 20495578 17927826 17168409 19934335 22293391 19665907 13761819 9585100 7566269
40811 7566269 4471263 881151 1095303 5219772 7887323 6535387 4968012 6174997
40803 6174997 7319692 5496081 3410868 4602735 6906515 6079456 3363123 3752319
40795 3752319 7834876 10694948 9043117 4946181 1873567 891165 1594151 3363154
40787 3363154 4637044 3893133 2306943 2682495 4983601 5952003 4138654 2054209 1896319
40778 1896319 2559234 3015720 5277598 10745218 16051560 16328045 11634680 7124523 7297982
40769G297982M879925O026078K735502k673854n211377k002289K794848K416929
40761A6263744k408665l786325R04762M004656m76557o651835n454253J465380
40753C860907M852250J931685j373413j280238m84321q51129J11398L063327M042025
40744A3872491J199161j303311J74785K875384K136292j685558m369769l461702
40736I437773j8849L106098K898404j283450n351216l998925J781318M688530
40728A1259683R67310m068892l808042M75649K796860J615251M12403Q58692Q72524
40719A1381438o70479j923879j572352r32197j441337k320547j778830N71485
40711A313302K982696L108320Q97936l80521J929366N056866L482876k604692
$$ plain form
40769 7297982 12177907 18203985 20939487 18265633 13054256 11051967 13846815 16263744
40761 16263744 13855079 10068754 10973516 14978172 14501615 7849780 2395527 3860907
40753 3860907 8713157 10644842 9271429 7991191 7506870 6655741 6767139 9830466 13872491
40744 13872491 15071652 13768341 13943126 16818510 18954802 17269244 12899475 9437773
40736 9437773 9418924 12525022 15423426 14139976 8788760 4789835 6571153 11259683
40728 11259683 12226993 8158101 4350059 4825708 7622568 9237819 9650222 10508914 11381438
40719 11381438 10710959 8787080 7214728 6282531 4841194 2520647 741817 1313302
40711 1313302 4295998 7404318 8302254 7921733 9851099 14907965 18390841 15786149
40703A5786149o074995k718572K262033J919039k253982l484738l64109K197838
40695G268663J622980P36094J627448K253137Q66611p34671m71839Q67780J530157
40686A5566360J257541N48559m19135j296630j677124j738791j254790R04814
40678A1890804M106931M788405J341773k036883r91124J614397p887m342322m205332
40669A2158762J209904M252213R78024k775900j488053J348695J91025l077658
40661A2797012l206941n37218Q56271O78048J507130K778243J989153K53217O82779
40652A7797694K444005K123937J39117J72895K587370L637066J285671k678967
40644B7508788n972367p038666m116053K002831N614483K306190l518993l838516
$$ plain form
40703 15786149 9711154 6992582 9254615 11173654 8919672 5434934 5070825 7268663
40695 7268663 8891643 9627737 11255185 13508322 14374933 13640262 13168423 14036203 15566360
40686 15566360 16823901 17372460 16953325 15656695 13979571 12240780 10985990 11890804
40678 11890804 15997735 20786140 22127913 20091030 19099906 20714303 20706416 16364094 12158762
40669 12158762 13368666 17620879 18598903 15823003 14334950 15683645 15874670 12797012
40661 12797012 9590071 9052853 9909124 10587172 12094302 14872545 16861698 17114915 17797694
40652 17797694 20241699 22365636 22504753 22677648 25265018 28902084 30187755 27508788
40644 27508788 21536421 14497755 10381702 12384533 17999016 20305206 16786213 12947697
40636A2947697R83086K993747l44526k692028l85737J608179n90586k561540Q8818
40627A2047110L499700K593909J51085J104915L010542Q69204k608122j126612
40619A9541731L392010L341154j145809j963101K692571M588509n33509n320437
40611B4593119k998211J480472L11271l786271k555732L228626M397872j787199
40603B2883947o847639l715678L187507M943205L87335l840526l252729m65492
40595A3279930L4694j679694j771888J639216N695817O138349K359424j849054
40587B3846794k417411R79012N107611O532412M420662P36506j783077k106824
40579C5315685j526030j625183k229501k291899k068382k571010l144601k031468
$$ plain form
40636 12947697 13930783 16924530 16580004 13887976 13502239 15110418 14519832 11958292 12047110
40627 12047110 15546810 18140719 18291804 19396719 22407261 23276465 20668343 19541731
40619 19541731 22933741 26274895 25129086 23165985 25858556 30447065 29913556 24593119
40611 24593119 21594908 23075380 23386651 19600380 17044648 20273274 24671146 22883947
40603 22883947 16036308 12320630 15508137 20451342 20838677 16998151 13745422 13279930
40595 13279930 13314624 11634930 9863042 11502258 17198075 23336424 25695848 23846794
40587 23846794 21429383 22408395 27516006 34048418 38469080 39205586 37422509 35315685
40579 35315685 33789655 32164472 29934971 27643072 25574690 23003680 19859079 17827611
40571A7827611K19875O54426j484529k745011l04446L339621L493608j25160l133686
40562A7742309k684276q52569p94035j745363L8155N604907J0314777Q279535
40554C5903440P2660o202761l978266L049565N218626j22746n062141k636655
40546B6241722L310121M274973o85168m758740l663886j70006J594247J081699
40538B7224962l69135j896173k524798j528790k22463m89748j429526q03030M94861
40529A8456160k51306j793878J69847N192308P077565L275920n16246P88148L487550
40520C5886068J448876l341588l648390J341554M590389K087131j509763p69233
40512C6085044K263178K029024j502764k942480o1427K597595N42518l735974
$$ plain form
40571 17827611 18047486 18701912 17217383 14472372 14167926 17507547 21001155 20875995 17742309
40562 17742309 15058033 14205464 13411429 11666066 11704221 17309128 27623905 35903440
40554 35903440 35976100 29773339 25795073 28844638 34063264 33940518 28878377 26241722
40546 26241722 29551843 33826816 33141648 28382908 24719022 24549016 26143263 27224962
40538 27224962 26855827 24959654 22434856 20906066 20683603 20193855 18764329 17961299 18456160
40529 18456160 18204854 16410976 16580823 21773131 28850696 32126616 31610370 32398518 35886068
40520 35886068 37334944 33993356 30344966 31686520 36276909 38364040 36854277 36085044
40512 36085044 38348222 40377246 38874482 35932002 35870575 38468170 39010688 35274714
40504C5274714m191945j8949L297245K138441m36751l16289J192115M91796j589070
40495C5841307j401351O80908P47927j501664k053607L3925O54326j669896k162189
40486B9169686K278735O659644M582849k107323n781847l182756J731905L979598
40478C7330491K377111j169458l674756k892913J31089J348328j018025l342363
40470B9089504j739791J891639K911823J094840j797L65320n01734k740609k647421
40461B7721774J132444M551710L629298r1254j931947l7807L029466L655080Q24271
40452D2483035l195433n301071m582071k337708N91946M299585P105599N835091
40444D4898973R46333k262005j049080j59280m278986q793274n214443N289710
$$ plain form
40504 35274714 31082769 31063820 34361065 36499506 36062755 35746466 36938581 37430377 35841307
40495 35841307 34439956 35120864 35868791 34367127 32313520 32347445 33001771 31331875 29169686
40486 29169686 31448421 38108065 42690914 40583591 34801744 31618988 33350893 37330491
40478 37330491 39707602 38538144 34863388 31970475 32101564 33449892 32431867 29089504
40470 29089504 27349713 29241352 32153175 33248015 33246218 33611538 33109804 30369195 27721774
40461 27721774 28854218 33405928 37035226 36943972 35012025 34974218 38003684 41658764 42483035
40452 42483035 39287602 33986531 29404460 27066752 27658698 31958283 39063882 44898973
40444 44898973 45845306 43583301 42534221 42374941 38095955 29302681 24088238 29377948
40436B9377948J1648406P476577j122834n076539l522860j515962j371599j251376
40428C4641761J37630J718629K119150J166232L3480P24837L670147N605277K860237
40419E2677380k688661m863335j690928J695747Q63238j750969j746927L52524
40411D2848069J318466Q68389M86297n41151k945232l712789K8630M972873N244427
40402D8567979J240869j065950L85330J253308j025619k837648r45864J897414
40394D7469819J688095n51035j302774k61820N40827P96484J056253M1989k864414
40385D6613424m351284j162218M040597N893140M312293L433563L261544k67534
40377F1773525n843403n762771J843966P543932L397153n228387q011517m391544
$$ plain form
40436 29377948 41026354 48502931 47380097 42303558 38780698 37264736 35893137 34641761
40428 34641761 34779391 36498020 38617170 39783402 39816882 40541719 44211866 49817143 52677380
40419 52677380 49988719 45125384 43434456 45130203 45993441 44242472 42495545 42848069
40411 42848069 44166535 45034924 45521221 44980070 42034838 38322049 38350679 43323552 48567979
40402 48567979 49808848 48742898 49128228 50381536 49355917 46518269 45572405 47469819
40394 47469819 49157914 48606879 47304105 47042285 47583112 48379596 49435849 49477838 46613424
40385 46613424 42262140 41099922 45140519 51033659 55345952 58779515 62041059 61773525
40377 61773525 55930122 50167351 52011317 59555249 62952402 57724015 49712498 45320954
40369D5320954j091821P27228N080821R934096Q129477L27339m326040k906694
40361F1195360k780320o975012p393440M23511O909981K801635n089915m276996
40353D4814804L588986O273811Q41721l230821l76628L729832L033243p15258
40345E7959690l356930l889151k236764J646385M717435L291585n26419j400974
40337E6204857J79477q85792l936146k606948L273920N644399J159814l255410
40329E5778171j995999J014130O70132j174025j491388k093726l878822k694691
40321D4133782K576775N193771Q85728m052544k624632J759742K420496J022128
40313E1315246K496634M226671J065629l282281j335735M520778M997627p63331
$$ plain form
40369 45320954 44229133 44956361 50037182 59971278 68100755 68428094 64102054 61195360
40361 61195360 58415040 51440028 44046588 44470099 51380080 54181715 49091800 44814804
40353 44814804 48403790 54677601 55519322 52288501 51911873 55641705 58674948 57959690
40345 57959690 54602760 50713609 48476845 50123230 54840665 58132250 57605831 56204857
40337 56204857 56384334 55498542 51562396 48955448 52229368 57873767 59033581 55778171
40329 55778171 53782172 54796302 55466434 54292409 52801021 50707295 46828473 44133782
40321 44133782 46710557 51904328 52790056 48737512 46112880 47872622 50293118 51315246
40313 51315246 53811880 58038551 59104180 55821899 54486164 59006942 64004569 63241238
40305F3241238m036084p98986L364724L778380K435162J549726J00025j346683
40297F8287502l81363J205325q83685m611072l218416K733259M482381r02440
40289F6711491n275489k478627K594102L490835K098025K281038J381125l771269
40281F7031231q285022n421734K372883O729794N119544K052683N04259p13514
40273F9390124j932106j480629L94768J591848K025607L094821L879574K230219
40265G9194226q40953j956634j13518K961307O115181Q607419Q155537L743183
40257A05865748q25579j137063J129023J188107j52886K427804Q762242J1895793
40249A29153189Q976256N991993P777239J0318323Q748390O923249J1215607J8712125
$$ plain form
40305 63241238 59205154 58406168 61770892 65549272 67984434 69534160 69634185 68287502
40297 68287502 67906139 69111464 68227779 63616707 60398291 63131550 67613931 66711491
40289 66711491 61436002 58957375 61551477 65042312 67140337 69421375 70802500 67031231
40281 67031231 58746209 53324475 55697358 62427152 67546696 69599379 70103638 69390124
40273 69390124 67458018 65977389 66372157 67964005 69989612 73084433 76964007 79194226
40265 79194226 78353273 76396639 76283121 79244428 85359609 93967028 102122565 105865748
40257 105865748 105040169 103903106 105032129 106220236 106067350 108495154 117257396 129153189
40249 129153189 138129445 144121438 151898677 162217000 170965390 177888639 189104246 207816371
40241B07816371K0680305J6570119J5220354K0550552K4754494K0037234J0263986
40234C35893415M853839N636109O588559M242006J411913R52787K099693M010609
40226C65688930P408260J0849908J0371275N561160J652334K172922L242866o49298
40218D06298357p977152j1994177r779810n054126k527156l338142n997467q423214
40210C51207113q850807p413203o589258p745453q438815o194846l254588l304484
40202B99415659m978534m120901j829869l609343r617968j2729708q883063k918370
40194B50727903n69231p81624m67128q23023k896552k137171N080849J3124103
40186B61258126J3448221P202505L174158M096320L926647l04998k918353Q43610
$$ plain form
40241 207816371 228496676 245066795 260287149 280837701 305592195 325629429 335893415
40234 335893415 340747254 346383363 352971922 357213928 358625841 359578628 361678321 365688930
40226 365688930 373097190 383947098 394318373 399879533 401531867 403704789 406947655 406298357
40218 406298357 398321205 386327028 376547218 371493092 368965936 365627794 359630327 351207113
40210 351207113 342356306 334943103 328353845 320608392 312169577 305974731 302720143 299415659
40202 299415659 294437125 290316224 288486355 284877012 275259044 262529336 253646273 250727903
40194 250727903 250158672 249377048 248909920 248086897 245190345 243053174 248134023 261258126
40186 261258126 274706347 281908852 285083010 289179330 293105977 292800979 289882626 290726236
40178B90726236P190432J0294697J0443454J0644782J0097571O930024M015109
40171C50342305N824146J0956285J3200277R738605M089739Q97149J160544K640105
40163C98849155K283790j463620o471387p952518m209017j045r43853n806185
40155C74285320q446806o786119n146516p109406j0697916j2387867j1956557
40148C11754133j1019553r969143q941065r181610j0736095j0905023p780442
40141B43221202l671028k263921l657313m971736n002920n364291p043464q265467
40133B02981062o577016k021239K196430K346236j624376m810194k499214L172721
40125A93164410N175740J537804j202716K024030O019555K691732n725649q881647
$$ plain form
40178 290726236 297916668 308211365 318654819 329299601 339397172 346327196 350342305
40171 350342305 356166451 367122736 380323013 390061618 394151357 395048506 396209050 398849155
40163 398849155 401132945 399669325 393197938 385245420 381036403 381035358 380091505 374285320
40155 374285320 365838514 359052395 353905879 346796473 336098557 323710690 311754133
40148 311754133 300734580 290765437 281824372 272642762 261906667 251001644 243221202
40141 243221202 239550174 237286253 233628940 228657204 223654284 218289993 211246529 202981062
40133 202981062 196404046 194382807 196579237 198925473 197301097 192490903 189991689 193164410
40125 193164410 198340150 199877954 198675238 200699268 206718823 209410555 203684906 194803259
40117A94803259l492261K118718R77400l031509l310518j360115k488290n302229
40109A78914455l761334J993155N017939K431731l80431J209850M107952L397548
40101A92930865L13795o62179M89431L7650k464404l309628j028403J234054J055027
40092A88596208J52613L60494J52748j706232k564938k84930J373231k650008
40084A83429186r710012j1253700m583097L029308M317496P38842k148423k893380
40076A60926220k928222j440148K368286M631341J094332n189478o877995k713489
40068A49870847J366638J646022O93314J036770J307596O74457J002998K090514
40060A59689156O50103l086163l817577J55516K800849m81107n263060n108256
$$ plain form
40117 194803259 191310998 193429716 194407116 191375607 188065089 186704974 184216684 178914455
40109 178914455 175153121 177146276 182164215 184595946 184215515 185425365 189533317 192930865
40101 192930865 193244660 192582481 193071912 193109562 190645158 187335530 186307127 187541181 188596208
40092 188596208 188748821 189109315 189262063 187555831 184990893 184705963 186079194 183429186
40084 183429186 173719174 162465474 157882377 160911685 165229181 165968023 163819600 160926220
40076 160926220 157997998 156557850 158926136 163557477 164651809 159462331 152584336 149870847
40068 149870847 151237485 152883507 153576821 154613591 155921187 156595644 157598642 159689156
40060 159689156 160339259 157253096 153435519 153591035 156391884 155910777 150647717 145539461
40052A45539461r86917K338450M347464O256498N190136q00167n496725j701679
40044A54686521O469006Q429652L371463Q73447M391646N808990L73738m088642
40036A80315821m7701O487931M772720m300969j0120071p641391j883144J692508
40028A69275704L005029L002240P52067l004739m847775l616810k235393k558352
40020A59771971k228624R34248M722646N582016L514477J204196M6110k98364
40012A73248676J15393J099993R13722j667165m285586l348678J96001R84250
40004A67256606l266962p635644o238730k40430M142694M334678L534564L930182
39996A65816958K754800k374314q020189q798469m792050j137057q32008j662039
$$ plain form
40052 145539461 144552544 146890994 151238458 157494956 162685092 161884925 156388200 154686521
40044 154686521 161155527 169585179 172956642 173830089 178221735 184030725 184404463 180315821
40036 180315821 180268120 186756051 191528771 187227802 177107731 169466340 167583196 169275704
40028 169275704 172280733 175282973 176035040 173030301 168182526 164565716 162330323 159771971
40020 159771971 157543347 158477595 163200241 168782257 172296734 173500930 173547040 173248676
40012 173248676 173364069 174464062 175377784 173710619 169425033 166076355 166272356 167256606
40004 167256606 163989644 156354000 150115270 149874840 154017534 158352212 161886776 165816958
39996 165816958 168571758 166197444 158177255 149378786 144586736 143449679 142617671 140955632
39988A40955632p01787J368493J939203M58892r61219k37524K383116M567353
39980A49772159M226293J657546j021885k605076l782137m949503m867984k894361
39972A35535052p92855l78783r73177j391030k474133m570651m598297j82874
39964A20173252M468281K539867n074956r373402n244076J702455L670788R55524
39956A13817733j064900j039466j632943k784915j587639J494548K288676l92714
39948A09098380k862535k564461j157897j14127J742744L940053K687486k830158
39940A07939485o929955m813623J91920K001475J067078J869530L613519J448313
39932A06387742l530136m250754N95832L427589J49621k619432J327103O682962
$$ plain form
39988 140955632 140253845 141622338 143561541 144020433 143059214 142821690 145204806 149772159
39980 149772159 153998452 155655998 154634113 152029037 148246900 143297397 138429413 135535052
39972 135535052 134742197 134363414 133390237 131999207 129525074 124954423 120356126 120173252
39964 120173252 124641533 127181400 122106444 112733042 107488966 109191421 112862209 113817733
39956 113817733 112752833 111713367 110080424 107295509 105707870 107202418 109491094 109098380
39948 109098380 106235845 103671384 102513487 102399360 104142104 108082157 110769643 107939485
39940 107939485 101009530 96195907 96387827 98389302 99456380 101325910 104939429 106387742
39932 106387742 102857606 98606852 99202684 102630273 102779894 100160462 101487565 108170527
39924A08170527M773409k386720n429459k054865J370894J449476J471453K920076
39916A10284791K332750j120040k848968o11829J757184J258005j63047j168912
39908A09719934l698892o676474m489851L431073Q532285M614223k730361m758069
39900A03943868k111968j204556k642661j783539J731278L249417J103345j480198
39892A00804986k126220j433232n2056J476891J199835j358493k721524n95995
39884I5194192J241153j289426m954242l996023J68928J625366L13652J342343
39876H9645943M865114N386816J655870j106761l30228K51910j803654l324734
39868I5240276j442237J838160L327265K340463m64404l487611l454984O40006
$$ plain form
39924 108170527 112943936 110557216 105127757 103072892 104443786 105893262 107364715 110284791
39916 110284791 112617541 111497501 108648533 108036704 109793888 111051893 110888846 109719934
39908 109719934 106021042 99344568 94854717 98285790 106818075 111432298 108701937 103943868
39900 103943868 101831900 100627344 97984683 96201144 97932422 101181839 102285184 100804986
39892 100804986 98678766 97245534 97193478 98670369 99870204 98511711 95790187 95194192
39884 95194192 96435345 95145919 90191677 86195654 86364582 87989948 88303600 89645943
39876 89645943 94511057 99897873 101553743 100446982 100116754 100368664 98565010 95240276
39868 95240276 93798039 95636199 98963464 101303927 100839523 97351912 93896928 94536934
39860I4536934L725123R17706l761484k663767K656315L477500j052414j944196
39852I5891717M059298Q140890L650342l261246l809410P57114L642326L073455
39844A12144486J586485N9164j481163j654808j164112l449344p776864p759135
39836I0504709j382195M213045L427853P42553K098261M593589K593165j704423
39828A05086557k353684J22245R75607J24368P41757J982177R32105p20019N29541
39819A07420654K814525J809534j171565j173227J879507L494279K198053N06840
39811A17778600m81441j638458k244802j165455M9141q6279K31818J926370J601769
39802A15971263k105103l520348J517022O848378M509862j995206l039798J353033
$$ plain form
39860 94536934 98262057 99179763 95418279 92754512 95410827 98888327 97835913 95891717
39852 95891717 99951015 108091905 111742247 108481001 104671591 105428705 109071031 112144486
39844 112144486 113730971 113790135 112308972 110654164 109490052 106040708 98263844 90504709
39836 90504709 89122514 93335559 96763412 97505965 99604226 104197815 106790980 105086557
39828 105086557 102732873 102855118 103830725 103955093 104696850 106679027 107611132 106891113 107420654
39819 107420654 110235179 112044713 110873148 109699921 111579428 115073707 117271760 117778600
39811 117778600 117297159 115658701 113413899 112248444 112297585 112211306 112443124 114369494 115971263
39802 115971263 113866160 110345812 111862834 118711212 123221074 121225868 118186070 119539103
39794A19539103K206921k955733o675537m489179q01077L20205P36328J717494
39786A09598525K60123m515758q097337o893792k403280K636065O756529P696876
39778A05037951M036576n30737r96569Q95895l59668l486729j989303L282886
39770A05890302L737122k292231n393289k30197N483724L669085j536422j823869
39762A07504225J923025L056849Q60115J39694K069787L015037J096514j807959
39754A17857287l520410k904141N07456M864058O324461L925579J143403J13408
39746A28311101j435323m365154m550308J28279M205489K138832k614809k847182
39738A18970925J032108K298027q97122l175498j063081K342170L492538L474974
$$ plain form
39794 119539103 121746024 118790291 112114754 107625575 106824498 107144703 107881031 109598525
39786 109598525 109858648 105342890 97245553 90351761 87948481 90584546 97341075 105037951
39778 105037951 109074527 108543790 107547221 108443116 108083448 104596719 102607416 105890302
39770 105890302 109627424 107335193 101941904 101711707 107195431 110864516 109328094 107504225
39762 107504225 109427250 112484099 113344214 113483908 115553695 118568732 119665246 117857287
39754 117857287 114336877 111432736 111940192 116804250 123128711 127054290 128197693 128311101
39746 128311101 126875778 122510624 117960316 118088595 122294084 124432916 121818107 118970925
39738 118970925 120003033 122301060 121403938 118228440 117165359 119507529 123000067 126475041
39730A26475041M242379M105098O89470l823756m211011Q43626N855623M493736
39722A38670206k162036n891933j349991O519302Q353384K344494m068686m463904
39714A37950836m12455L246300N139426O290883O148871L616639N2050j938672
39706A60093878j595192J730J595347K080138R72348l97422k25433O38102l25151
39697A62838345k592634k384943J630842N868557O432545L056982k239460o671392
39689A65938842o672901j395505L400441J290682m059250k159508P724848J2799222
39681A76866871N106814n751084o885679j112718m00687n778482p004620p23759
39673A54316656M227734J778698k511803k057414M92330k51527k337515j10314
$$ plain form
39730 126475041 130717420 134822518 135511988 131688232 127477221 128320847 134176470 138670206
39722 138670206 136508170 130616237 129266246 135785548 144138932 146483426 142414740 137950836
39714 137950836 137538381 140784681 145924107 152214990 158363861 161980500 162032550 160093878
39706 160093878 158498686 158500416 160095763 162175901 163148249 162750827 162525394 163163496 162838345
39697 162838345 160245711 157860768 159491610 165360167 171792712 174849694 172610234 165938842
39689 165938842 159265941 157870436 161270877 162561559 158502309 156342801 164067649 176866871
39681 176866871 181973685 176222601 169336922 168224204 167823517 162045035 155040415 154316656
39673 154316656 158544390 160323088 157811285 155753871 156246201 155994674 153657159 153546845
39665A53546845N523921P352326K107852m476623m635739J679660O546525M063211
39657A71707978j657545j845671M138342O960006Q59825o933618o336643M84954
39649A67377628K559347l102682p620530m536289R33841J149269k485108l290698
39641A50984778k11234J430871j507372n859937o772680l264533J312020K796801
39633A38908714K58335k917579k906411m89319r40k680658m350543j767671J875168
39624A25929096J277656l185126o094504m592945j243474Q45045J597340J466128
39616A15999216o22594m248101n678588k649946J310595J521972m61672O98004
39608A05868886M660977M762989j231102o146756l574725K282409L103986j015524
$$ plain form
39665 153546845 159070766 166423092 168530944 164054321 159418582 161098242 167644767 171707978
39657 171707978 170050433 168204762 172343104 179303110 180162935 173229317 166892674 167377628
39649 167377628 169936975 166834293 159213763 154677474 155611315 156760584 154275476 150984778
39641 150984778 150773544 152204415 150697043 144837106 138064426 134799893 136111913 138908714
39633 138908714 139167049 136249470 133343059 132853740 132852800 130172142 125821599 124053928 125929096
39624 125929096 127206752 124021626 117927122 113334177 112090703 112935748 114533088 115999216
39616 115999216 115376622 111128521 105449933 102799987 104110582 105632554 105170882 105868886
39608 105868886 110529863 115292852 114061750 107914994 104340269 106622678 109726664 108711140
39600A08711140k930580l16766J854681N42266j589883k733295m453323n533610
39592I3550630j433505O379851Q580015J135034o721535m870579L029751N639258
39584A05288920N90380m329146m668674m167024n411888m714658M05199N448231
39576H8441340N077622P02788k232910j793813n79504o32109p88270N65158K294874
39567I1055176J664783j504586l527437j386714K423509K574277j506276m436575
39559H5356157k502287J498843L267402K872316K411593J493023q99926k931926
39551I0565195k472475p70798J56959J090510K712085K471277r60301l460497
39543H9331955j287814J880498J33088m894614o444792l185302K7580J019921
$$ plain form
39600 108711140 105780560 105463794 107318475 107860741 106270858 103537563 99084240 93550630
39592 93550630 92117125 98496976 107076991 108212025 101490490 96619911 99649662 105288920
39584 105288920 105879300 101550154 96881480 92714456 87302568 82587910 82993109 88441340
39576 88441340 93518962 94221750 91988840 90195027 89615523 88983414 88195144 88760302 91055176
39567 91055176 92719959 91215373 87687936 86301222 88724731 91299008 89792732 85356157
39559 85356157 82853870 84352713 87620115 90492431 92904024 94397047 93497121 90565195
39551 90565195 88092720 87321922 87478881 88569391 91281476 93752753 92792452 89331955
39543 89331955 88044141 89924639 90057727 85163113 78718321 75533019 75560599 76580520
39535G6580520K276830M028652L053545m72863j999253k01600P49317j631023
39527H2384125m427343m517055k238592J273467N071085O099690J968258l322460
39519H2291175l065438J880269L825379M70565j905068K53322K205793M40652
39511H6396649j076649O43998J307179k161716m570306j399366K141668m70793
39503H0810664n373959m382723J560791M719558L432061K767335L779276K028077
39495H9341080k792131m902686j995650J026476M04681j010984L89045L234943
39487H3694774M516812M193869L369692J584467j043312k032977Q3766K886936
39479I7254027L332342K137673K200493L742915L828689Q49630k697108l170368
$$ plain form
39535 76580520 78857350 82886002 85939547 85466684 83467431 83265831 84015148 82384125
39527 82384125 77956782 73439727 71201135 72474602 77545687 83645377 85613635 82291175
39519 82291175 79225737 81106006 84931385 85401950 83496882 83750204 85955997 86396649
39511 86396649 85320000 85963998 87271177 85109461 80539155 79139789 81281457 80810664
39503 80810664 75436705 71053982 72614773 77334331 80766392 83533727 87313003 89341080
39495 89341080 86548949 81646263 79650613 80677089 81081770 80070786 80459831 83694774
39487 83694774 88211586 92405455 95775147 97359614 96316302 94283325 94367091 97254027
39479 97254027 100586369 102724042 104924535 108667450 112496139 113345769 110648661 107478293
39471A07478293n53148J548709R82128M4534J667608M557722N429567M810038
39463A25965451N911272P806225N626714o41799l860837j11957M384760K353417
39455A47433246l171993l542374K383617P308645O514179K655701m58407k199732
39447A56922882k279525M04257M357275N829635M165642K542019K305540J222511
39439A75470236j247008j804033J243718M501753M099348O52332k559740l581033
39431A76775573k160735J105625M348106N503916M809982L770729J752542k508762
39423A93396976o026029l702747L182168O598678K788620k184269k003300O05221
39415A92655318q367k070577j9379M439042L790930k886825p396421m444809R32359
$$ plain form
39471 107478293 106925145 108473854 109455982 109500516 111168124 115725846 121155413 125965451
39463 125965451 131876723 139682948 145309662 144667863 140807026 140695069 145079829 147433246
39455 147433246 144261253 140718879 143102496 150411141 156925320 159581021 159122614 156922882
39447 156922882 154643357 155047614 159404889 165234524 169400166 171942185 174247725 175470236
39439 175470236 174223228 172419195 173662913 178164666 182264014 182916346 180356606 176775573
39431 176775573 174614838 175720463 180068569 185572485 190382467 194153196 195905738 193396976
39423 193396976 187370947 183668200 186850368 193449046 196237666 194053397 192050097 192655318
39415 192655318 192646951 190576374 190556995 194996037 198786967 195900142 188503721 184058912 184991271
39406A84991271J591799j874568m274648m433155m887417n369214k823880K128548
39398A65048736M325249J346557k710637l372439k135736k984974n135273m249516
39390A50131967l07499J133092k811533p459035p172585l497093k430805n403273
39382A22183236p571485m972830M72235L849926K497011k091223n506292l847049
39374A05013529J801005N126939J846337l872890m402338N46531L450147m7211
39366A09462049n503856p141935n287500l055311q88742J137876J97022m590744
39358H4328859p868010m570134J645845K870579j541840m533797k251689J195657
39350F9275470J220754q05710j123524P30293K510717K586573O78754k251045
$$ plain form
39406 184991271 186583070 184708502 180433854 176000699 171113282 165744068 162920188 165048736
39398 165048736 169373985 170720542 168009905 164637466 162501730 159516756 154381483 150131967
39390 150131967 149824468 150957560 148146027 140686992 133514407 130017314 127586509 122183236
39382 122183236 114611751 109638921 110111156 113961082 116458093 114366870 108860578 105013529
39374 105013529 106814534 111941473 113787810 109914920 105512582 106059113 109509260 109462049
39366 109462049 103958193 96816258 91528758 88473447 87584705 88722581 88919603 84328859
39358 84328859 76460849 71890715 73536560 76407139 74865299 70331502 68079813 69275470
39350 69275470 70496224 69690514 68566990 69297283 71808000 74394573 75073327 72822282
39342G2822282l596491j297418K525559L166160k30321l083320j857363J120368
39334F9569456J531617j010534l409247l398954j181713J584301K674973R05464
39326F7265363j701974j398925K162904M646631K687980j580445l873831l351084
39318F4856619k235369j636645o00657J573846M224356N907147M974648R48563
39310G8012508l788776n692459m346358k518863j237276J392915N018626N500556
39302G2340873J444050k539908k937623k750344m971368n930498j772088L174620
39294E6057714K737241j51037J565772N762071L970242l139078n367729K3191
39286F1458387L415100n84415l790132J006445O866323L921291m396904p348128
$$ plain form
39342 72822282 69225791 67928373 70453932 73620092 73389771 70306451 68449088 69569456
39334 69569456 71101073 70090539 66681292 63282338 62100625 63684926 66359899 67265363
39326 67265363 65563389 64164464 66327368 70973999 73661979 72081534 68207703 64856619
39318 64856619 62621250 60984605 60383948 61957794 66182150 72089297 77063945 78012508
39310 78012508 74223732 68531273 64184915 61666052 60428776 61821691 66840317 72340873
39302 72340873 73784923 71245015 68307392 65557048 60585680 54655182 52883094 56057714
39294 56057714 58794955 58643918 60209690 65971761 69942003 66802925 61435196 61458387
39286 61458387 64873487 64289072 60498940 61505385 68371708 72292999 67896095 60547967
39278F0547967l575403p26966j860552k971693k292789j959006j097029L199493
39270D9264022P885879O170234j279800n982359m112419j061290j373609k325925
39262D7184733q28021P48274j84882j546642j043029j09468J92394J705495M004907
39253E0123761K640348l092392o571046l328489J477996J225873j775294j424655
39245C9276102R95537l61023m292673l312334L714752Q525769N433425r48803
39237D9030752l538393k511614k561061m343638l964878J63445M267869L979542
39229D0522024l3254k887360j764703L38243j022833m596254m444509R45977N230224
39220C2287555L112952j726849k715891o02872o93277k528899j045539K596229
$$ plain form
39278 60547967 56972564 56245598 54385046 51413353 49120564 47161558 46064529 49264022
39270 49264022 57149901 63320135 62040335 56057976 51945557 50884267 49510658 47184733
39262 47184733 46356712 47104986 46920104 45373462 44330433 44220965 44413359 46118854 50123761
39253 50123761 52764109 49671717 43100671 39772182 41250178 42476051 40700757 39276102
39245 39276102 40271639 39910616 35617943 32305609 36020361 44546130 49979555 49030752
39237 49030752 45492359 42980745 40419684 36076046 32111168 32274613 36542482 40522024
39229 40522024 40488770 37601410 35836707 36174950 35152117 30555863 26111354 27057331 32287555
39220 32287555 35400507 33673658 30957767 30354895 29661618 27132719 26087180 28683409
39212B8683409J308376m764103n771835K037720P853750K012136p694555o601560
39204A7063338M508748J0382841L986764m421735m173733J016761J709976k139977
39196B7932983l327319N2079K911173K358379R39689N31936n30806k792724l421270
39187B4654120r41031J724073J542865k34861o66289J78514J14968q70911m60514
39178B5040934J847952L202653J276500j989576k473351N93044L195073J712017
39170C2405246k039893l216669p85866J214116J7647j808547j033108P26698L3378
39161B5513002k091229j802855P06974J424219l04221n86033J648982K035220
39153B6544059j623624m703106k920616O16684P35618j289169n96158K622608
$$ plain form
39212 28683409 29991785 25227682 19455847 21493567 29347317 31359453 23664898 17063338
39204 17063338 21572086 31954927 35941691 31519956 27346223 28362984 30072960 27932983
39196 27932983 24605664 24657743 27568916 29927295 30866984 31398920 30868114 28075390 24654120
39187 24654120 23713089 25437162 26980027 26745166 26078877 26257391 26372359 25501448 25040934
39178 25040934 26888886 30091539 31368039 29378463 26905112 27498156 30693229 32405246
39170 32405246 30365353 27148684 26362818 27576934 27594581 25786034 24752926 25479624 25513002
39161 25513002 23421773 21618918 22325892 23750111 23445890 22859857 24508839 26544059
39153 26544059 24920435 20217329 17296713 17913397 18649015 17359846 16763688 19386296
39145A9386296L954785K765668K554815L620447K236033j837302l523303l07843
39137B8849596L695356M227868K314555K03607k988903p452252q980824m406317
39129A5462686K185638M126304J345707m28859J256802K898433J858038L94003
39121B9098752O87522L63504l284886p315580n943327J025789O656112N310257
39113B6598143k85523l035224q12312J736773N83014k405794l304929j974110
39105A7100038r72698p27965N09656K662555L301441J346618j316455k125454
39097A9777736J01196M629589Q157609O279619j043456o979838n170146J454921
39089B7207230M352882J278389j744261q86297K36085j655757l306649q60290
$$ plain form
39145 19386296 23341081 26106749 28661564 32282011 34518044 32680742 29157439 28849596
39137 28849596 32544952 36772820 39087375 39290982 36302079 28849827 19869003 15462686
39129 15462686 17648324 21774628 23120335 22691476 23948278 26846711 28704749 29098752
39121 29098752 29786274 30149778 26864892 19549312 13605985 14631774 21287886 26598143
39113 26598143 26312620 23277396 22465084 24201857 24784871 22379077 19074148 17100038
39105 17100038 16127340 15399375 15909031 18571586 21873027 23219645 21903190 19777736
39097 19777736 19878932 24508521 32666130 38945749 37902293 30922455 25752309 27207230
39089 27207230 31560112 32838501 31094240 30207943 30444028 28788271 25481622 24621332
39081B4621332L386655M961663L750716K094058K44065j924551k516223j274780
39073C3342935j582152m291268m301733J114416N517682K060485n080093o456316
39065B0323956j627630J563277M74983N17142M038865O032273L410802L00332
39057C5034000O86232K574863K826294J899629P64756j363713l477487k532964
39049C6411610O07275Q15151k876809m632008j012719L409330L779986K211240
39041C8713056K440770K947695R07689j964813l054620l579045m295050j849284
39033C0266398M297209P002858J362438n680507m843194Q72395J909305q88739
39025C4298163J801570R444493R794385q52034r238499m594136M718106M322864
$$ plain form
39081 24621332 28007987 32969650 36720366 38814424 39058489 37133938 34617715 33342935
39073 33342935 31760783 27469515 23167782 24282198 29799880 31860365 26780272 20323956
39065 20323956 18696326 20259603 20734586 21251728 25290593 31322866 34733668 35034000
39057 35034000 35720232 38295095 41121389 43021018 43785774 42422061 38944574 36411610
39049 36411610 37018885 37834036 34957227 30325219 29312500 32721830 36501816 38713056
39041 38713056 41153826 44101521 45009210 43044397 39989777 36410732 32115682 30266398
39033 30266398 34563607 41566465 42928903 37248396 32405202 33277597 35186902 34298163
39025 34298163 36099733 45544226 55338611 54486577 45248078 40653942 45372048 49694912
39017D9694912m379638p658890q34092O033739M290713j771109l132203J279456
39009D3522888N106158M092127L83606j924160k233883l126827n528920o289381
39001C4001608k452152L130635M199045l3371k764234P77171N740976M486368
38993D7086046j965862n487462k727724J156882J358140l75005p56226o11055
38985C7677734j757251k452944l92798K483562K549463J72424j213948o14145
38977C6452097p6637k97585L81702K147505K505908K60576k040193j483325J057764
38968C8907812K021714k40003l437796m128717j796664O43518P06960l74564Q9334
38959C2391594J381005l9345m277903o205246k599878K381572L004681M88674
$$ plain form
39017 49694912 45315274 37656384 36822292 42856031 47146744 45375635 42243432 43522888
39009 43522888 48629046 52721173 53104779 51180619 48946736 45819909 40290989 34001608
39001 34001608 31549456 34680091 38879136 38845765 36081531 36858702 42599678 47086046
38993 47086046 45120184 39632722 36904998 38061880 39420020 39045015 38288789 37677734
38985 37677734 35920483 33467539 33074741 35558303 38107766 38280190 37066242 36452097
38977 36452097 36375460 36077875 36459577 38607082 41112990 41373566 39333373 37850048 38907812
38968 38907812 40929526 40689523 37251727 33123010 31326346 31969864 32676824 32302260 32391594
38959 32391594 33772599 33733254 29455351 23250105 20650227 23031799 26036480 26525154
38951B6525154L65474K948511K957143j059968l596248p38084L818714M556856
38943C5777552J395209k243767m513579m627228j230764M308955O372845J841278
38935C7080501m132764m273258P37351L685575J208792k781946l899429k184517
38927B5440305N25758L368205N139920M065782N56755k557026l544648l075449
38919B9919602j838113P4755J255161O0528j822186p33804K950246M145658L12014
38910C4323861m198029l736066J220030M980942L528283j610735n504787m639425
38902B4364074l19560K587910J421981o74247O74914M093910M111899m01424m361788
38893C1497669m081789j728199j58251J571450M265171M847280J103576l222366
$$ plain form
38951 26525154 26890628 29839139 32796282 31736314 28140066 27401982 31220696 35777552
38943 35777552 37172761 34928994 30415415 25788187 24557423 28866378 35239223 37080501
38935 37080501 32947737 28674479 29411830 33097405 34306197 31524251 27624822 25440305
38927 25440305 25966063 29334268 34474188 38539970 39096725 36539699 32995051 29919602
38919 29919602 28081489 28156244 29411405 29471933 27649747 26915943 29866189 34011847 34323861
38910 34323861 30125832 26389766 27609796 32590738 36119021 34508286 29003499 24364074
38902 24364074 24044514 26632424 28054405 27380158 28055072 32148982 36260881 35859457 31497669
38893 31497669 27415880 25687681 25529430 27100880 31366051 36213331 37316907 34094541
38885C4094541k988537Q22316K788515R14344j537751j461116O24710K399141
38877C5656163K145726m16287l455142l950836j379853Q40306q0844j994150j026386
38868B6338697K447142M566361L728139J844707K36125j960424m712602n631212
38860B6856933l011324J396240L824638K270347j248238k321817Q82950M574481
38852C3224210L656017r13090k965449l86963J566145q98862l439764q44936L673958
38843C2671266L257705j534810l907137j671638N15269l41065j775031j359624
38835B5854935Q1500J685619L516374L838974R59388k126018j009499K278787
38827C5080060J777753j830808j557669L528668N567800Q65124l694452k234321
$$ plain form
38885 34094541 31106004 31928320 34716835 35631179 34093428 32632312 33257022 35656163
38877 35656163 37801889 37385602 33930460 29979624 28599771 29440077 29359233 27365083 26338697
38868 26338697 28785839 33352200 37080339 38925046 39161171 37200747 32488145 26856933
38860 26856933 23845609 25241849 29066487 31336834 30088596 27766779 28649729 33224210
38852 33224210 36880227 35967137 33001688 32614725 34180870 33282008 29842244 28997308 32671266
38843 32671266 35928971 34394161 30487024 28815386 29330655 28989590 27214559 25854935
38835 25854935 25936435 27622054 31138428 34977402 35936790 33810772 32801273 35080060
38827 35080060 36857813 35027005 33469336 36998004 42565804 43430928 39736476 37502155
38819C7502155Q87159k4332j886757L62174L548722J897698k069979j549608L060846
38810D1728078N562761M289685K535603P96029k862414o190577m999235j118307
38802C9741623l5883j523474q44919J765627J915499O36723L004631O867415M133808
38793E5661050m602473q276648k243180M279894L384724K10181J832439M512572
38785E4758559J950047j955151p6419M043269J490304o159801q479414k704532
38777D2866862K852497K742355J172181K390850L603607J480818j493532j583757
38769E4031881M04126J513780R88108j76005o46372J293029N307284O520382Q03879
38760G0040092p287846q519855j955708L536678K783672Q78117K468674L434321
$$ plain form
38819 37502155 38389314 38364982 36478225 36840399 40389121 42286819 40216840 38667232 41728078
38810 41728078 47290839 51580524 54116127 54912156 52049742 45859165 40859930 39741623
38802 39741623 39705740 38182266 37337347 39102974 41018473 41655196 44659827 51527242 55661050
38793 55661050 51058577 42781929 40538749 44818643 48203367 48413548 50245987 54758559
38785 54758559 56708606 54753455 54677036 58720305 60210609 54050808 45571394 42866862
38777 42866862 45719359 48461714 49633895 52024745 55628352 57109170 55615638 54031881
38769 54031881 54436007 55949787 56937895 56761890 56115518 57408547 62715831 69236213 70040092
38760 70040092 62752246 54232391 52276683 55813361 58597033 59475150 61943824 65378145
38752F5378145k95213l560390k73819N003411L559181l118235n567267j217799
38744E9908014K811488J835957n94837m64189J126247K262931L244436L244033
38736G3374080L66412l093574k066329K593574L991797M79400q47860L779022
38728G8576522P311237L002074l976475m439310L96660J932537j311533k347415
38720G9144297J428918L723495j6165n303039n588118q15541M562788P553514
38712H4690149P165070K947576l185125o453732m148231O59338L086734K428599
38704H7190378J538675J745274J370983r88783l927662m499346j488204K573981
38696H3515296L275854n38990m457626l847479o70207q54273m682894n281896
$$ plain form
38752 65378145 65082932 61522542 61248723 66252134 69811315 66693080 61125813 59908014
38744 59908014 62719502 64555459 63960622 63496433 64622680 66885611 70130047 73374080
38736 73374080 73740492 70646918 68580589 71174163 75165960 75645360 74797500 78576522
38728 78576522 85887759 88889833 84913358 80474048 80870708 82803245 81491712 79144297
38720 79144297 80573215 84296710 84280545 78977506 73389388 72573847 77136635 84690149
38712 84690149 91855219 94802795 91617670 85163938 81015707 81675045 84761779 87190378
38704 87190378 88729053 90474327 91845310 90856527 86928865 82429519 80941315 83515296
38696 83515296 86791150 86252160 81794534 77947055 77276848 76422575 71739681 66457785
38688F6457785Q56637P267876O115161o88394m929141m087413l019560m384041
38680F3588910m686581j558683J424611O41424j674726j561895J98450L14393
38672E6685903p84231l5164K011425J326408k647626n055749k717589Q40244P34758
38663E0358379j699805j017656L724152P144895N243139P94059j405347j516024
38655F1625792l136195o436309p243196l378247J853285M069537K933237R82161
38647E1270065l93053j488708k381075k931094l825655n459042o413877n066737
38639B3310824k173977J12745J297138K465581L512776K891625M66411j530696
38631C0352427j174816R20389K470716J483132k460841p243113q715296m328124
$$ plain form
38688 66457785 67314422 74582298 80697459 80009065 75079924 70992511 67972951 63588910
38680 63588910 58902329 57343646 58768257 59409681 57734955 56173060 56371510 56685903
38672 56685903 55901672 55866508 57877933 59204341 56556715 51500966 48783377 49623621 50358379
38663 50358379 48658574 47640918 51365070 58509965 63753104 64547163 63141816 61625792
38655 61625792 58489597 52053288 44810092 41431845 43285130 47354667 50287904 51270065
38647 51270065 50877012 49388304 47007229 44076135 40250480 34791438 28377561 23310824
38639 23310824 21136847 21249592 22546730 25012311 28525087 31416712 31883123 30352427
38631 30352427 29177611 30098000 32568716 34051848 31591007 24347894 15632598 11304474
38623A1304474L282822Q162415P022203J950797k717399m220353k250334J188108
38615B3722733K357877q27685n174749n113379m13235K668133J09293l776995
38607A3551993k511423L200734O670053M198591j372240n289431n206661j445084
38599A1796532L236382M444035N75329l703760k513224K620953L995823j284916
38591A9167154o580635m660111K743215P889966O651981J480345l237457n064091
38583A8390367l732288p09865J594506K157017K268533K783695K137095p77573
38575B4111487l563168l064127K3195K214649K013626P22283o47474k102668k898967
38566A6808836k288621j597911k246009k332026P34638M529373L636698j682372
$$ plain form
38623 11304474 14587296 22749711 29771914 31722711 29005312 24784959 22534625 23722733
38615 23722733 26080610 25252925 20078176 14964797 14551562 17219695 17328988 13551993
38607 13551993 11040570 14241304 20911357 25109948 23737708 18448277 13241616 11796532
38599 11796532 15032914 19476949 20052278 16348518 13835294 16456247 20452070 19167154
38591 19167154 12586519 7926408 10669623 18559589 25211570 26691915 23454458 18390367
38583 18390367 14658079 13948214 15542720 17699737 19968270 22751965 24889060 24111487
38575 24111487 20548319 17484192 17507387 19722036 21735662 22457945 21810471 19707803 16808836
38566 16808836 14520215 12922304 10676295 8344269 9078907 13608280 17244978 15562606
38558A5562606m285226j14090N587493N758822J101479k514080l159531l823408
38550A4114065n620618n611416k040681K422315M048798K102869j252080l175207
38542D988045k109471P26815K163789J100848M81736K759899N072075K910609
38534A8094345k295176m177145m70491L822761L789401N58373k254989l695242
38526A3371837m101619k529220O92873J897084j269683n266867m826096k16802
38518b248493L528656L561987J656178M45740P62344K206121L162808R99106m343984
38509I730463p795938m237955M048401R076813O598159M6032n123965o692853
38501E649157m576650O44005N941109O678128K074336l031842m147355k071389
$$ plain form
38558 15562606 11277380 11163290 16750783 22509605 23611084 21097004 17937473 14114065
38550 14114065 8493447 2882031 841350 3263665 7312463 9415332 8163252 4988045
38542 4988045 2878574 3605389 5769178 6870026 7351762 10111661 15183736 18094345
38534 18094345 15799169 11622024 11151533 14974294 18763695 19322068 17067079 13371837
38526 13371837 9270218 6740998 7433871 9330955 8061272 2794405 -2031691 -2248493
38518 -2248493 1280163 4842150 6498328 6944068 7706412 9912533 13075341 14074447 9730463
38509 9730463 1934525 -2303430 1744971 10821784 17419943 17465975 12342010 5649157
38501 5649157 1072507 1716512 7657621 14335749 16410085 13378243 9230888 7159499
38493G159499Q4093J459849K305682J474064j386655l480418k385629k13884o22490
38484D394111k999052l418591p43207J984100K369458J535529J339368J443849
38476E905565O33699n60746k56633J881079L171959M90796n261454q729673o043013
38467h768421n6123L227617K611746K029478L181736L254867J141984j16696K83331
38458F789519j518169o009902o490167O35294P774826O166482r43917m020658
38450B383308j977635q52085q03052L279469Q785855O316727l912049r418424
38442C802114m105767K315572L42841m849804l839622J436632L063580J217983
38434f16471J674223L906577K722647j069147k045805m74254j304929l865155
$$ plain form
38493 7159499 7243592 8703441 11009123 12483187 11096532 7616114 5230485 5016601 4394111
38484 4394111 1395059 -2023532 -2766739 -782639 1586819 3122348 4461716 5905565
38476 5905565 6539264 5978518 5721885 7602964 10774923 11265719 6004265 -2725408 -8768421
38467 -8768421 -8824544 -5596927 -2985181 -955703 2226033 5480900 6622884 6506188 6789519
38458 6789519 5271350 -738552 -7228719 -6593425 1181401 7347883 6403966 2383308
38450 2383308 405673 -446412 -1249464 2030005 10815860 17132587 13220538 3802114
38442 3802114 -303653 2011919 2354760 -2495044 -6334666 -4898034 -1834454 -616471
38434 -616471 1057752 4964329 7686976 6617829 4572024 4097770 2792841 -1072314
38426a072314k392797L038366N522447K315088j713150k900374k876109k413906
38418b492749M13636L908790L010190j385024j827428L423950O239804J644256
38410A2935425l529433j776849K799982J877681l060230l786913O55587K846815
38402H962065n42045m000720k543733J247968K337675K62912k001374k752825
38394I69923k311023j160153L76741J578324J753041Q66705m41332j079958l75510
38385A76758O66216K44077j163902o31915K538449M365398J416482l455605m564095
38376d08137j511221O93257k68067o84519K546087O068649M390036j960729o311577
38367B553779m023299J807101M198517P59924l620935l215525J155648L589975
$$ plain form
38426 -1072314 -3465111 -426745 5095702 7410790 5697640 2797266 -78843 -2492749
38418 -2492749 -2079113 1829677 4839867 3454843 1627415 5051365 11291169 12935425
38410 12935425 9405992 7629143 10429125 12306806 9246576 5459663 6115250 8962065
38402 8962065 8420020 4419300 1875567 3123535 5461210 5724122 3722748 969923
38394 969923 -1341100 -2501253 -2124512 -546188 1206853 2073558 1632226 552268 176758
38385 176758 842974 1087051 -76851 -708766 1829683 6195081 7611563 4155958 -408137
38376 -408137 -1919358 -1226101 -1494168 -2178687 367400 6436049 10826085 8865356 2553779
38367 2553779 -1469520 337581 4536098 5296022 1675087 -1540438 -384790 3205185
38359C205185J398531j633037j487115L79853O12416O9142J783867M574217M029671
38350A2932730j54180k964530j459547J079590M52949k592439m213764k516964
38342E63845J332771M722648M721225K87830m966840n300531k38187L835886K160328
38333G118975j872761k358636L39448J413608k45663j516226j424584j998097
38325e43936k875587j188967K314649L095596N00177m15822K584233M603290J756247
38316I829880k061172j806797K65114p24295l088517j650168K444936L214586
38308F423567K19394j027572N80545j31120m067679m536718J242132N706475K320230
38299F729254l689640l713640P10835J784504q94369o34255L640460N159304J131651
$$ plain form
38359 3205185 4603716 2970679 1483564 1863417 2475833 2544975 4328842 8903059 12932730
38350 12932730 12778550 9814020 8354473 9434063 9887012 7294573 3080809 563845
38342 563845 1896616 6619264 11340489 11628319 6661479 1360948 1122761 4958647 7118975
38333 7118975 5246214 2887578 3227026 4640634 4394971 2878745 1454161 -543936
38325 -543936 -3419523 -4608490 -2293841 801755 1301932 886110 3470343 8073633 9829880
38316 9829880 7768708 5961911 6227025 5502730 2414213 764045 3208981 6423567
38308 6423567 6642961 5615389 6195934 6064814 1997135 -2539583 -1297451 4409024 6729254
38299 6729254 3039614 -674026 36809 1821313 926944 292689 3933149 9092453 10224104
38290A0224104k325955l29358L231742K551923j552187m442845m435971k578063
38282C43390M24782L042763K318427j527722l352680k21959L156148J120808l860695
38273A443262m787768q96226J773704K87388j276172O78931L485714K786213j017963
38264B477083l922009l479311m16807L023474M473546K863291j4471j044062k1698
38255C939036m0269k180398k850344O81680M762015L712579j537936m227112j529117
38246G30134J662519P88048j561532q87899J294332O94371j111423J175958N843281
38237H627789M132251n704492j2266323n584203P779456J2678120N401563l434521
38229A1629640n206500k727388j453755o73406J649700K675288j73846k926596
$$ plain form
38290 10224104 7898149 7568791 10800533 13352456 11800269 7357424 2921453 343390
38282 343390 768172 3810935 6129362 4601640 1248960 1027001 4183149 5303957 1443262
38273 1443262 -3344506 -4240732 -2467028 -2179640 -3455812 -2776881 708833 3495046 2477083
38264 2477083 -1444926 -4924237 -5341044 -2317570 2155976 5019267 5004796 3960734 3939036
38255 3939036 3898767 1718369 -1131975 -450295 4311720 8024299 6486363 2259251 730134
38246 730134 2392653 3180701 1619169 731270 2025602 2719973 1608550 2784508 8627789
38237 8627789 12760040 7055548 -5210775 -10794978 -3015522 9662598 15064161 11629640
38229 11629640 6423140 3695752 2241997 1568591 3218291 5893579 5719733 2793137
38221B793137o51471L941887M016226j149838n476679m888286j510897R54097
38213a971824J677368J929820K776618L766228K540309k543964p925659o714263
38205f465367J635937P846369M322505l740683n715626r34744J948442l99743
38197a502910j957862Q43073L242586J739842N35314K864172L703198j609112
38189G858301p443654n114946L374397P500069L133455k676841k837273P04187
38181D497695J826364o56737k649618j303691J662579L115209K644834K175627
38173A1312262K184660O14138l081590n018604j484400M519312O067531K187588
38165A7300897n36360J498413K716684k489373r422160r036432j709718K942392
$$ plain form
38221 2793137 2141666 6083553 10099779 8949941 3473262 -1415024 -2925921 -1971824
38213 -1971824 -294456 1635364 4411982 8178210 10718519 8174555 248896 -6465367
38205 -6465367 -4829430 3016939 7339444 3598761 -2116865 -3051609 -1103167 -1502910
38197 -1502910 -3460772 -2617699 624887 2364729 2900043 5764215 9467413 7858301
38189 7858301 414647 -4700299 -1325902 6174167 9307622 6630781 3793508 4497695
38181 4497695 6324059 5667322 3017704 1714013 3376592 6491801 9136635 11312262
38173 11312262 13496922 14111060 11029470 6010866 4526466 9045778 15113309 17300897
38165 17300897 16764537 18262950 20979634 18490261 9068101 31669 -1678049 1264343
38157A264343J82990l561955j142302M910016O965789L310273o61716p65323J144730
38148A1646845J122540j397928l585334l045703k57014K294112K507457L96392
38140I681367j942066k182992j88210J572121Q55942j234063j472284Q39777K651500
38131H581092J859093N75157J117307J428935j263652m257867k620502K034867
38123G454430K801072j513323l971837q80075J957174q20450m891244l640886
38115c505139R79128K851270K275446L238391L709124j123349p738947p353903
38107f667979k98743L553509M09664k378876n6233K039530J05754l8651N518961
38098B186936Q927433K563888o662000o788893N02712L241382j491464m612062
$$ plain form
38157 1264343 1447333 -2114622 -3256924 1653092 8618881 11929154 11267438 10502115 11646845
38148 11646845 12769385 11371457 7786123 4740420 4483406 6777518 9284975 9681367
38140 9681367 7739301 5556309 5368099 6940220 7796162 6562099 5089815 5929592 8581092
38131 8581092 10440185 11015342 12132649 13561584 12297932 8040065 5419563 7454430
38123 7454430 10255502 8742179 4770342 3890267 5847441 5026991 135747 -3505139
38115 -3505139 -2526011 325259 2600705 5839096 9548220 8424871 685924 -6667979
38107 -6667979 -6966722 -3413213 -3003549 -5382425 -5438658 -3399128 -3293374 -3332025 2186936
38098 2186936 11114369 13678257 7016257 227364 730076 3971458 2479994 -2132068
38090b132068j458590J628697J7561j416902J702066M976209L338784r3274j36461
38081F426022J491708M95120j462000j49181K592873J444293k837223m075552
38073C926060p42769J702299k44155l050631k393461M42470J486758K4781j430882
38064b79530j099281M81750J607881Q34730j531496k879893j024344K298601L144053
38055A552471R17818r29904n53814k15235j409327j696389N77700K373291R41465
38046A558076q11157P42046K584127n44847n915405n138398K425728P052957K888251
38037D841378k978384j472772M670484N814280K65558m409231l690977j347299
38029A693037j366998k073487r71906L86145k21908j729952k245912j907994q14067
$$ plain form
38090 -2132068 -3590658 -1961961 -1944400 -3361302 -1659236 3316973 6655757 6562483 6426022
38081 6426022 7917730 8412850 6950850 6801669 9394542 10838835 8001612 3926060
38073 3926060 3183291 4885590 4641435 1590804 -802657 -360187 1126571 1151352 -279530
38064 -279530 -1378811 -897061 710820 1545550 14054 -2865839 -3890183 -1591582 1552471
38055 1552471 2470289 1540385 986571 771336 -637991 -2334380 -1756680 616611 1558076
38046 1558076 746919 1488965 4073092 3528245 -2387160 -7525558 -5099830 1953127 4841378
38037 4841378 1862994 390222 5060706 10874986 11140544 6731313 3040336 1693037
38029 1693037 326039 -1747448 -2719354 -2333209 -2555117 -4285069 -6530981 -8438975 -9253042
38020i253042K086009N504018N494020J782356j34803K661813M810297R62674
38012A3913342m536795l814151J498818K344314l195141o873183l696522P81724
38004c577594O75665j023824M27457K112406r41555n595083m911883O1930K061591
37995a0710890K87282J601760P451020R263914J746032p051190o138562K758910
37987g91724P849125L532184l610328n425198k050034J245546J967326J312666
37979D029563Q8404k084715m124163l429088N83248M702233M984733J077453l368219
37970B459449m537482k096941J156086K612871K081637R79781L80181K91465K11327
37961C538374j41789m05975J69912J590450K455920J388052r97356k772408l271328
$$ plain form
38020 -9253042 -7167033 -1663015 3831005 5613361 5478558 8140371 12950668 13913342
38012 13913342 9376547 5562396 7061214 9405528 6210387 -662796 -4359318 -3577594
38004 -3577594 -2901929 -3925753 -3498296 -1385890 -2327445 -7922528 -12834411 -12772481 -10710890
37995 -10710890 -10423608 -8821848 -1370828 7893086 9639118 2587928 -3550634 -791724
37987 -791724 7057401 10589585 6979257 1554059 -495975 749571 2716897 4029563
37979 4029563 4117967 2033252 -2090911 -5519999 -4936751 -234518 4750215 5827668 2459449
37970 2459449 -2078033 -4174974 -3018888 -406017 1675620 2655401 3035582 3327047 3538374
37961 3538374 3396585 2990610 3160522 4750972 7206892 8594944 7597588 4825180 1553852
37952A553852l357421l138857j729695K06499M77229q59913q04981J606752L066613
37943b979922J593975O22874L123129N187701J676002m210220m684877J03276
37935D31938K015865j478969l073333J376143M935687J115650m674411l709118
37927c060548K049128M215619J977935J240777K306493j40037n068390m891272
37919a370295P98516K725092k767340o755239k198813M481356M375861L15705
37911c95157L85569L531168K615425j947731k871006J048455L267190J162223
37903F796136m91265O34706L30100l351045n438845k431430J473667J277328j156147
37894b356795j133058J511434L602809L681391K023640j065434l671927k698154
$$ plain form
37952 1553852 -1803569 -4942426 -6672121 -6465622 -5988393 -6848306 -7653287 -6046535 -2979922
37943 -2979922 -1385947 -763073 2360056 7547757 9223759 5013539 328662 431938
37935 431938 2447803 968834 -2104499 -728356 4207331 5322981 648570 -3060548
37927 -3060548 -1011420 3204199 5182134 6422911 8729404 8589367 3520977 -1370295
37919 -1370295 -571779 2153313 -614027 -7369266 -9568079 -5086723 -710862 -395157
37911 -395157 -9588 3521580 6137005 4189274 1318268 2366723 5633913 6796136
37903 6796136 6304871 6939577 7269677 3918632 -1520213 -3951643 -2477976 -1200648 -2356795
37894 -2356795 -3489853 -1978419 1624390 5305781 7329421 6263987 2592060 -106094
37886a06094Q60356J359481l015370o104750k985599J801407J754815n74090J420139
37877e589705N649457L880431l597480o795267j836242K559596n48814m898206
37869a1176230j822036M762123M341968l005226o424278j152396M848270M176723
37861e451082Q75937K163760N994282M892109j198069m541818j910309Q06872
37853A631682j298573m311977k344162K770869M556129J845739o20233n06081
37845A723393n10168k099440k478326J34256L040434L537060K781844K307316
37837H436369N48997l536554o654037n162248o11918K700584L725014M132345
37829C578552L741151J250380j598979j664000l701r13775m803154o739296l504579
$$ plain form
37886 -106094 754262 2113743 -901627 -7006377 -9991976 -8190569 -6435754 -7009844 -5589705
37877 -5589705 59752 3940183 342703 -6452564 -8288806 -5729210 -6278024 -11176230
37869 -11176230 -12998266 -8236143 -3894175 -6899401 -13323679 -14476075 -9627805 -5451082
37861 -5451082 -4575145 -2411385 3582897 8475006 7276937 2735119 824810 1631682
37853 1631682 333109 -3978868 -6323030 -3552161 1003968 2849707 2229474 1723393
37845 1723393 1213225 -886215 -3364541 -3230285 -189851 3347209 6129053 8436369
37837 8436369 8985366 5448812 -1205225 -6367473 -6979391 -4278807 -553793 3578552
37829 3578552 7319703 8570083 6971104 5307104 5303403 4389628 -413526 -7152822 -10657401
37820a0657401J909668M666986L718520J346166j75358J50849J811924K629519
37812E400873J010148j072967j72023K936444L272317j067175n346007m552635
37804D08975k95991J978014O00093j136588n86023Q85836P39946q12913j165207
37795F16142R09510L000428J664791k699671n421660l333974R52743K973657K682652
37786A344618L100243M080968K382268k059415n104792m684013l108293j737079
37778e785495J205267N160558N306268j41625n692766o067860l422315k211621
37770a1649589j320760K512364O970320O984742L234806O99853j0920k397565
37762E023251n505020l880049K287588N049759M48557m573568k398588L519385
$$ plain form
37820 -10657401 -8747733 -4080747 -362227 983939 808581 959430 2771354 5400873
37812 5400873 6411021 5338054 5166031 8102475 11374792 10307617 4961610 408975
37804 408975 112984 2090998 2691091 1554503 968480 1854316 2594262 1781349 616142
37795 616142 1525652 4526080 6190871 3491200 -1930460 -5264434 -4311691 -1338034 1344618
37786 1344618 4444861 8525829 10908097 8848682 3743890 -940123 -4048416 -5785495
37778 -5785495 -4580228 580330 5886598 5744973 52207 -6015653 -9437968 -11649589
37770 -11649589 -12970349 -10457985 -3487665 3497077 6731883 7431736 7420816 5023251
37762 5023251 -481769 -4361818 -2074230 2975529 3424086 -1149482 -3548070 -28685
$$ [...]
##END NTUPLES=NMR SPECTRUM
##END=
