##TITLE=31Pdec_LR-618-R3-CR7-2
 CDCl3, 124 sc
 30.06.2021
##JCAMPDX= 6.0         $$ Bruker NMR JCAMP-DX V2.0
##DATA TYPE= NMR SPECTRUM
##DATA CLASS= NTUPLES
##ORIGIN= UXNMR, Bruker Analytische Messtechnik GmbH
##OWNER= root
$$ XWIN-NMR		Version 3.5
$$ Wed Jun 30 11:43:04 2021 Russian Standard Time (UT+4h)  she@DPX200
##.OBSERVE FREQUENCY= 81.013821
##.OBSERVE NUCLEUS= ^31P
##.ACQUISITION MODE= SIMULTANEOUS
##.ACQUISITION SCHEME= undefined
##.AVERAGES= 124
##.DIGITISER RES= 17
##SPECTROMETER/DATA SYSTEM= spect
##.PULSE SEQUENCE= zgpg30
##.SOLVENT NAME= DMSO
##.SHIFT REFERENCE= (INTERNAL, DMSO, 0, 157.57)
##AUDIT TRAIL= $$ (NUMBER, WHEN, WHO, WHERE, WHAT)
$$ ##TITLE= Audit trail, XWIN-NMR		Version 3.5
$$ ##JCAMPDX= 5.01
$$ ##ORIGIN= Bruker BioSpin GmbH
$$ ##OWNER= she
$$ F:/spectra/data/she/nmr/P31/1/pdata/1/auditp.txt
$$ ##AUDIT TRAIL=  $$ (NUMBER, WHEN, WHO, WHERE, WHAT)
(   1,<2021-06-30 11:41:11.20 +0400>,<she>,<DPX200>,
      <continue with go, POWCHK disabled, PULCHK disabled
       configuration hash MD5:
       00 E9 B6 7A A2 85 ED C7 34 08 36 98 17 FE 4E 26
       data hash MD5: 32K
       7C 26 CB 71 CC 83 E9 86 A5 FD 4F B5 FC 79 AE 38>)
(   2,<2021-06-30 11:42:12.92 +0400>,<she>,<DPX200>,
      <Start of raw data processing
       efp BC_mod = 2 LB = 1 FT_mod = 6 PKNL = 1 PHC0 = -6855.743 PHC1 = 66.48596 SI = 64K 
       data hash MD5: 64K
       10 C8 0A B5 17 18 D8 CA 83 85 1B 6B 1D BB B5 A5>)
(   3,<2021-06-30 11:42:25.54 +0400>,<she>,<DPX200>,
      <pk PHC0 = 1.598055 PHC1 = 0 
       data hash MD5: 64K
       10 24 F0 7C 6D E4 F9 77 01 C7 43 CC 0F 22 80 29>)
(   4,<2021-06-30 11:42:28.79 +0400>,<she>,<DPX200>,
      <abs ABSG = 5 
       data hash MD5: 64K
       2F 9E 8F 83 18 8B 80 50 67 38 BF F5 E3 A6 2F 63>)
$$ ##END=
$$ 
$$ hash MD5
$$ F1 74 F8 FC E3 92 C2 DC 7D 5D 4A F6 D3 3F B5 28
##$RELAX= 
##$RELAX= 
##$RELAX= 
##$RELAX= 
##$RELAX= 
##$RELAX= 
##$RELAX= 
##$RELAX= 
$$ Bruker specific parameters
$$ --------------------------
##$DU= <F:/spectra>
##$EXPNO= 1
##$NAME= <P31>
##$PROCNO= 1
##$TYPE= <nmr>
##$USER= <she>
##$AMP= (0..31)
100 100 100 100 100 100 100 100 100 100 100 100 100 100 100 100 100 100 
100 100 100 100 100 100 100 100 100 100 100 100 100 100 
##$AQSEQ= 0
##$AQ_mod= 1
##$AUNM= <au_zg>
##$AUTOPOS= <>
##$BF1= 81.014009
##$BF2= 200.13
##$BF3= 200.13
##$BF4= 200.13
##$BF5= 200.13
##$BF6= 200.13
##$BF7= 200.13
##$BF8= 200.13
##$BYTORDA= 1
##$CFDGTYP= 0
##$CFRGTYP= 5
##$CHEMSTR= <none>
##$CNST= (0..31)
1 1 145 1 1 1 1 1 1 1 1 1 1 1 1 1 1 1 1 1 1 1 1 1 1 1 1 1 1 1 1 1 
##$CPDPRG= <waltz16>
##$CPDPRG1= <>
##$CPDPRG2= <waltz16>
##$CPDPRG3= <>
##$CPDPRG4= <mlev>
##$CPDPRG5= <mlev>
##$CPDPRG6= <mlev>
##$CPDPRG7= <mlev>
##$CPDPRG8= <mlev>
##$CPDPRGB= <>
##$CPDPRGT= <>
##$D= (0..31)
0 1 0 0 0 0 0 0 0 0 0 0.03 2e-05 3e-06 0 0 0 0 0 0 0 0 0 0 0 0 0 0 0 0 
0 0 
##$DATE= 1625038655
##$DBL= (0..7)
120 120 120 11 120 120 24 19 
##$DBP= (0..7)
150 150 150 150 150 150 150 150 
##$DBP07= 0
##$DBPNAM0= <>
##$DBPNAM1= <>
$$ [...]
##$SUBNAM3= <"">
##$SUBNAM4= <"">
##$SUBNAM5= <"">
##$SUBNAM6= <"">
##$SUBNAM7= <"">
##$SUBNAM8= <"">
##$SUBNAM9= <"">
##$SW= 319.781679613598
##$SWIBOX= (0..15)
0 1 3 0 0 0 0 0 0 0 0 0 0 0 0 0 
##$SW_h= 25906.7357512953
##$TD= 32768
##$TD0= 1
##$TE= 0
##$TE2= 300
##$TE3= 300
##$TEG= 300
##$TL= (0..7)
0 120 53 12 22 120 120 120 
##$TP= (0..7)
150 150 150 150 150 150 150 150 
##$TP07= 0
##$TPNAME0= <>
##$TPNAME1= <>
##$TPNAME2= <>
##$TPNAME3= <>
##$TPNAME4= <>
##$TPNAME5= <>
##$TPNAME6= <>
##$TPNAME7= <>
##$TPOAL= (0..7)
0.5 0.5 0.5 0.5 0.5 0.5 0.5 0.5 
##$TPOFFS= (0..7)
0 0 0 0 0 0 0 0 
##$TUNHIN= 0
##$TUNHOUT= 0
##$TUNXOUT= 0
##$USERA1= <user>
##$USERA2= <user>
##$USERA3= <user>
##$USERA4= <user>
##$USERA5= <user>
##$V9= 5
##$VALIST= <valist>
##$VCLIST= <CCCCCCCCCCCCCCC>
##$VD= 0
##$VDLIST= <DDDDDDDDDDDDDDD>
##$VPLIST= <PPPPPPPPPPPPPPP>
##$VTLIST= <TTTTTTTTTTTTTTT>
##$WBST= 1024
##$WBSW= 4
##$XGAIN= (0..3)
0 0 0 0 
##$XL= 0
##$YL= 0
##$YMAX_a= 76814
##$YMIN_a= -89218
##$ZGOPTNS= <>
##$ZL1= 120
##$ZL2= 120
##$ZL3= 120
##$ZL4= 120
##$ABSF1= 157.5699
##$ABSF2= -162.211
##$ABSG= 5
##$ABSL= 3
##$ALPHA= 0
##$AQORDER= 0
##$ASSFAC= 0
##$ASSFACI= 0
##$ASSFACX= 0
##$ASSWID= 0
##$AUNMP= <proc_1d>
##$AZFE= 0.1
##$AZFW= 0.5
##$BCFW= 0
##$BC_mod= 2
##$BYTORDP= 0
##$COROFFS= 0
##$CY= -3
##$DATMOD= 1
##$DC= 0
##$DFILT= <>
##$DTYPP= 0
##$F1P= 0
##$F2P= 0
##$FCOR= 1
##$FTSIZE= 65536
##$FT_mod= 6
##$GAMMA= 0
##$GB= 0
##$INTBC= 1
##$INTSCL= 5.30512e-09
##$ISEN= 30
##$LB= 1
##$LEV0= 0
##$LPBIN= 0
##$MAXI= 10000
##$MC2= 0
##$MEAN= 0
##$ME_mod= 0
##$MI= 50
##$NCOEF= 0
##$NC_proc= -7
##$NLEV= 6
##$NOISF1= 182.463
##$NOISF2= 159.3651
##$NSP= 0
##$NTH_PI= 0
##$NZP= 0
##$OFFSET= 157.5699
##$PC= 4
##$PHC0= -6854.145
##$PHC1= 66.48596
##$PH_mod= 1
##$PKNL= yes
##$PPARMOD= 0
##$PSCAL= 0
##$PSIGN= 0
##$REVERSE= no
##$SF= 81.014009
##$SI= 65536
##$SIGF1= 159.3651
##$SIGF2= -187.1042
##$SINO= 113.3802
##$SIOLD= 16384
##$SREGLST= <1H.CDCl3>
##$SSB= 0
##$STSI= 65536
##$STSR= 0
##$SW_p= 25906.7357512954
##$SYMM= 0
##$S_DEV= 0
##$TDeff= 32768
##$TDoff= 0
##$TI= <>
##$TILT= no
##$TM1= 0
##$TM2= 0
##$TOPLEV= 0
##$USERP1= <user>
##$USERP2= <user>
##$USERP3= <user>
##$USERP4= <user>
##$USERP5= <user>
##$WDW= 1
##$XDIM= 65536
##$YMAX_p= 486382035
##$YMIN_p= -14351141
$$ End of Bruker specific parameters
$$ ---------------------------------
##NTUPLES= NMR SPECTRUM
##VAR_NAME=  FREQUENCY,     SPECTRUM/REAL,   SPECTRUM/IMAG
##SYMBOL=    X,             R,               I
##VAR_TYPE=  INDEPENDENT,   DEPENDENT,       DEPENDENT
##VAR_FORM=  AFFN,          ASDF,            ASDF
##VAR_DIM=   65536,         65536,           65536
##UNITS=     HZ,            ARBITRARY UNITS, ARBITRARY UNITS
##FACTOR=    0.395311448100945, 1,           1
##FIRST=     12765.3693382646, 0,            0
##LAST=      -13141.3664130308, 0,           0
##MIN=       -13141.3664130308, -14351141,   0
##MAX=       12765.3693382646, 486382035,    0
$$ Real data points
##PAGE= N=1
##DATA TABLE= (X++(R..R)), XYDATA
$$ [...]
$$ plain form
47083 3181812 1864502 1641723 1080451 927839 2812997 5935245 7537203 6444592 4353062
47074 4353062 3618111 4911936 6836914 7070152 4496860 909479 -430971 1213377
47066 1213377 2883914 2008349 32403 -49545 1560327 1905793 -84961 -2266570 -2814787
47057 -2814787 -2432849 -2152644 -1223059 1322179 4449092 6002937 5127565 2820867 664265
47048 664265 -228525 426425 1950372 3166023 3492347 3437021 3864736 5074552 6565429
47039 6565429 7249664 6042846 2935469 -596651 -2975992 -4131434 -4831366 -4786060 -2925135
47030 -2925135 352784 2936033 3628474 3461039 3546731 3271105 1967470 946439 1912503
47021 1912503 4054620 4630253 2363156 -1187976 -3580239 -3561832 -1429163 1277707 2522990
$$ packed form
47083C181812j317310k22779n61272j52612J885158L122248J601958j092611k091530
47074D353062p34951J293825J924978K33238k573292l587381j340450J644348
47066A213377J670537q75565j975946q1948J609872L45466j990754k181609n48217
47057b814787L81938K80205R29585K545238L126913J553845q75372k306698k156602
47048F64265q92790O54950J523947J215651L26324n5326M27715J209816J490877
47039F565429O84235j206818l107377l532120k379341j155442o99932M5306J860925
47030b925135L277919K583249O92441j67435Q5692k75626j303635j021031R66064
47021A912503K142117N75633k267097l551132k392263J8407K132669K706870J245283
$$ plain form
47012 2522990 1660348 590710 1598753 4083070 5222786 4079802 2851451 3220630
47004 3220630 3746203 2542562 644357 363527 1486269 1765182 793890 676181 2397555
46995 2397555 3924328 3041362 358160 -1839080 -2520368 -2295514 -1646334 -306877 1603312
46986 1603312 2934938 2537050 733307 -549338 463836 3282243 5360604 5083460
46978 5083460 3860546 4028330 5285604 5176689 3058966 1164577 973490 1066351 175006
46969 175006 -6375 2417055 5637995 6090213 3606976 1597484 2102578 3616503 4360483
46960 4360483 4809613 5586711 5253238 2318667 -1850912 -4190792 -3629936 -2178665 -2352459
46951 -2352459 -4411847 -6256411 -5675812 -2701827 372085 1638105 1791900 2768893 4575337
$$ packed form
47012B522990q62642j069638J008043K484317J139716j142984j228351L69179
47004C220630N25573j203641j898205k80830J122742K78913r71292j17709J721374
46995B397555J526773q82966k683202k197240o81288K24854O49180J339457J910189
46986A603312J331626l97888j803743j282645J013174K818407K078361k77144
46978E083460j222914J67784J257274j08915k117723j894389j91087R2861q91345
46969A75006j81381K423430L220940M52218k483237k009492N05094J513925P43980
46960D360483M49130P77098l33473k934571m169579k339880N60856J451271j73794
46951b352459k059388j844564N80599K973985L073912J266020J53795R76993J806444
$$ plain form
46942 4575337 5078253 3133413 205114 -1792468 -2642574 -2838455 -2064015 -231792 1065767
46933 1065767 40710 -2586626 -3840218 -1651009 3014085 7199863 8642403 7572930
46925 7572930 6198798 6167653 6654067 5808912 3983952 3812714 6365076 9027815 8779330
46916 8779330 6261647 4641438 5166931 5917331 4814211 2052432 -671191 -1917500
46908 -1917500 -1259676 523147 1804595 1654081 1034473 1489365 2887521 3802783 3967317
46899 3967317 4576275 5745152 5469801 2287186 -2177464 -4671666 -3843603 -1243275 944089
46890 944089 2145393 3255249 5057487 7339130 9326204 10449401 10520797 9591872 8100739
46881 8100739 6897751 6463816 6198740 5278076 4205769 4458223 6306452 8140543 8499492
$$ packed form
46942D575337N02916j944840k928299j997582q50106j95881P74440J832223J297559
46933A065767j025057k627336j253592K189209M665094M185778J442540j069473
46925G572930j374132l1145M86414q45155j824960j71238K552362K662739k48485
46916H779330k517683j620209N25493P50400j103120k761779k723623j246309
46908a917500O57824J782823J281448j50514o19608M54892J398156R15262J64534
46899C967317O08958J168877k75351l182615m464650k494202Q28063K600328K187364
46890I44089J201304J109856J802238K281643J987074J123197P1396r28925j491133
46881H100739j202988m33935k65076r20664j072307K52454J848229J834091L58949
$$ plain form
46872 8499492 7628983 6367514 4830673 3240625 2696322 3601430 4380847 3461270 1731347
46863 1731347 1273178 2315373 3322257 3581771 3692003 3834668 3721254 4118972 6131994
46854 6131994 8750752 9385531 7368304 4841931 3569972 2986313 2227983 1927034 2702352
46845 2702352 3704618 4125329 4668581 6040805 7230441 6872576 5500078 4985345 6074480
46836 6074480 7344640 6385017 1946569 -4221993 -7865847 -6193268 -1498764 1183546
46828 1183546 379926 -434465 1407001 3778355 3611648 1864973 1558863 2850250 3516908
46819 3516908 3138790 3275625 4042410 3926322 2940207 2698819 3090253 2074077 -533295
46810 -533295 -2176229 -1605416 -970640 -2309230 -4377361 -4833925 -3630630 -2294905 -1393811
$$ packed form
46872H499492q70509j261469j536841j590048n44303R05108P79417r19577j729923
46863A731347m58169J042195J006884K59514J10232J42665j13414L97718K013022
46854F131994K618758O34779k017227k526373j271959n83659p58330l00949P75318
46845B702352J002266M20711N43252J372224J189636l57865j372498n14733J089135
46836F074480J270160r59623m438448o168562l643854J672579M694504K682310
46828A183546q03620q14391J841466K371354j66707j746675l06110J291387O66658
46819C516908l78118J36835P66785j16088r86115k41388L91434j016176k607372
46810e33295j642934N70813O34776j338590k068131m56564J203295J335725R01094
$$ plain form
46801 -1393811 -630311 -199047 -140957 647418 2885514 5151341 5442868 3915392 2388191
46792 2388191 1702609 1367500 1378246 2341445 3765897 4148743 3096086 1670802 265288
46783 265288 -2071340 -5450021 -7965234 -7809279 -5304819 -1848838 1770505 4752087
46775 4752087 5551042 3855434 2348134 4037836 8013893 10244805 8852817 6143521
46767 6143521 4642061 3711120 1759873 -408175 -872963 171637 1027824 1491511 2611490
46758 2611490 3927241 3831316 2813921 3341155 5632193 6441295 3720643 142093 -243954
46749 -243954 2725717 5678863 6293355 5307109 4508289 4787607 6032590 7233870 6770717
46740 6770717 4122501 1199335 441563 1642078 2302023 1355324 835346 3091635 7612416
$$ packed form
46801a393811P63500M31264N8090P88375K238096K265827K91527j527476j527201
46792B388191o85582l35109J0746R63199J424452L82846j052657j425284j405514
46783B65288k336628l378681k515213J55955K504460L455981L619343K981582
46775D752087P98955j695608j507300J689702L976057K230912j391988k709296
46767F143521j501460r30941j951247k168048m64788J044600Q56187M63687J119979
46758B611490J315751r5925j017395N27234K291038Q09102k720652l578550l86047
46749b43954K969671K953146O14492r86246p98820K79318J244983J201280m63153
46740F770717k648216k923166p57772J200515O59945r46699n19978K256289M520781
$$ plain form
46731 7612416 11561243 12724237 11088011 7968281 4505525 1256189 -1149150 -1657714
46723 -1657714 256178 3471235 5993907 7048760 7339948 6975709 4834510 1080388
46715 1080388 -1477557 -598352 1958058 2626615 1071085 390772 2325672 4996742 6094791
46706 6094791 5782501 5176250 4100977 2099957 197993 -192031 658877 1303647 1169505
46697 1169505 894951 1072077 1726803 2712834 3726109 4271083 4430579 5269513 7488743
46688 7488743 9802216 9652436 5960573 767383 -2288186 -1253069 2428571 5593017
46680 5593017 6519169 5848313 4590394 2761999 809439 633981 3155327 5893770 5572104
46671 5572104 2816587 1455621 2840502 3923958 2213275 -213664 231916 3600633
$$ packed form
46731G612416L948827J162994j636226l119730l462756l249336k405339n08564
46723a657714J913892L215057K522672J054853K91188l64239k141199l754122
46715A080388k557945Q79205K556410O68557j555530o80313J934900K671070J098049
46706F094791l12290o06251j075273k001020j901964l90024Q50908O44770j34142
46697A169505k74554J77126O54726R86031J013275N44974J59496Q38934K219230
46688G488743K313473j49780l691863n193190l055569J035117L681640L164446
46680E593017R26152o70856j257919j828395j952560j75458K521346K738443l21666
46671E572104k755517j360966J384881J083456j710683k426939M45580L368717
$$ plain form
46663 3600633 6795185 7706448 6668142 4653077 2351523 882130 1516836 4320738
46655 4320738 7963066 10800684 11645765 10197748 7526512 5363183 4137875 2661007
46647 2661007 462649 -973743 -468720 878399 1577905 2267610 4447964 7756761 10430650
46638 10430650 11577394 11170227 8943566 5494145 3343888 4240000 6190673 6056536
46630 6056536 4492233 5007015 8163343 10314283 8984425 6235239 5164836 5739896
46622 5739896 5905850 4771790 2886890 885294 -571090 -674828 538550 2152561
46614 2152561 3917146 6277793 8334653 7956055 5062692 2625482 2791650 3923121
46606 3923121 3280549 926933 -1016358 -1493523 -822609 741777 2493268 2491892 -158834
$$ packed form
46663C600633L194552R11263j038306k015065k301554j469393O34706K803902
46655D320738L642328K837618Q45081j448017k671236k163329j225308j476868
46647B661007k198358j436392N05023J347119O99506O89705K180354L308797K673889
46638A0430650J146744m07167k226661l449421k150257Q96112J950673j34137
46630F056536j564303N14782L156328K150940j329858k749186j070403N75060
46622E739896J65954j134060j884900k001596j456384j03738J213378J614011
46614B152561J764585K360647K056860l78598k893363k437210J66168J131471
46606C923121o42572k353616j943291m77165O70914J564386J751491j376k650726
$$ plain form
46597 -158834 -2916886 -2231872 1753333 5164094 5199157 3026017 1536669 1893164 2956883
46588 2956883 3121303 2138126 1383897 2135811 3536194 3364854 1314740 -159848 597199
46579 597199 1942841 1879331 1585924 3206269 5510219 5279659 2593611 1149318 2925570
46570 2925570 5796154 7262276 7493672 7485233 7077101 6423533 6947446 8977843 10448265
46561 10448265 9741013 8054957 7258233 7176059 6819932 6530871 6808769 6591394 5015179
46552 5015179 3601200 4267316 6204615 7222819 7284724 7892017 8504674 6764314 2619685
46543 2619685 -701888 -827847 1002266 2418317 2992418 3335971 2957166 1075327 -1303486
46534 -1303486 -2048731 -558070 1554754 2522555 2273217 2081430 3042286 5099545 7163319
$$ packed form
46597a58834k758052O85014L985205L410761L5063k173140j489348L56495J063719
46588B956883J64420r83177p54229P51914J400383j71340k050114j474588P57047
46579E97199J345642o3510k93407J620345K303950k30560k686048j444293J776252
46570B925570K870584J466122K31396q439m08132o53568N23913K030397J470422
46561A0448265p07252j686056p96724q2174l56127k89061K77898k17375j576215
46552E015179j413979O66116J937299J018204O1905O07293O12657j740360m144629
46543B619685l321573j25959J830113J416051N74101L43553l78805j881839k378813
46534a303486p45245J490661K112824R67801k49338j91787R60856K057259K063774
$$ plain form
46525 7163319 7957652 6979050 4904114 3121245 2679469 3400937 3987405 3309485 1695796
46516 1695796 605663 952416 2275524 3696196 4866498 5506685 4911884 2842475 351678
46507 351678 -1204678 -1661540 -1877835 -2577413 -3977301 -5771027 -6648843 -4855271 -463428
46498 -463428 3856200 5752191 5831651 5733193 4987321 2417421 -402697 -581521 1334087
46489 1334087 1738879 -273341 -1344314 570817 2896289 3008440 2557879 4012110 5823395
46480 5823395 5007551 2566177 2104480 4108032 5755816 5987835 6604476 8120480 8629308
46471 8629308 7750381 7878733 9816300 10471228 7260759 2410951 341038 2220055 5342278
46462 5342278 7033491 7268006 7660281 9070974 10346389 9455331 6388729 4163604 5260342
$$ packed form
46525G163319P94333r78602k074936j782869m41776P21468N86468o77920j613689
46516A695796j090133L46753J323108J420672J170302O40187n94801k069409k490797
46507C51678j556356m56862k16295o99578j399888j793726q77816J793572M391843
46498d63428M319628J895991P9460r8458p45872k569900k820118j78824J915608
46489A334087M04792k012220j070973J915131K325472J12151m50561J454231J811285
46480E823395q15844k441374m61697K003552J647784K32019O16641J516004N08828
46471H629308q78927J28352J937567O54928l210469m849808k069913J879017L122223
46462E342278J691213K34515L92275J410693J275415q91058l066602k225125J096738
$$ plain form
46453 5260342 7747490 7622782 4770427 3019405 3664202 3235576 -249718 -3199150 -2154133
46444 -2154133 143591 -852050 -3740623 -3441361 223307 2339795 1335343 1392062 4806003
46435 4806003 7613835 5893463 1915238 270891 1242046 1962640 1623077 1370364 754159
46426 754159 -1497080 -3979616 -3878946 -1602283 -565271 -2066639 -3663971 -3279002 -1811597
46417 -1811597 -595071 927085 3396136 5603372 6119270 5381483 4745640 4712577 5206166
46408 5206166 6186644 6773944 5247316 1448497 -2021420 -2599890 -792693 1061109 1965388
46399 1965388 2466571 2681264 2297684 2072515 3116383 4696909 4783019 3014176 1257837
46390 1257837 867750 1265628 1783265 2924861 4758831 5814763 5065603 3790584 3931369
$$ packed form
46453E260342K487148j24708k852355j751022O44797m28626l485294k949432J045017
46444b154133K297724r95641k888573K99262L664668K116488j004452N6719L413941
46435D806003K807832j720372l978225j644347R71155P20594l39563k52713o16205
46426G54159k251239k482536J00670K276663J037012j501368j597332L84969J467405
46417a811597J216526J522156K469051K207236N15898p37787o35843l3063M93589
46408E206166R80478N87300j526628l798819l469917n78470J807197J853802R04279
46399A965388N01183K14693l83580k25169J043868J580526Q6110j768843j756339
46390A257837l90087L97878N17637J141596J833970J055932p49160j275019J40785
$$ plain form
46381 3931369 5411542 6569828 6735697 6927018 8102473 9852293 10902383 10234399 7856283
46372 7856283 5066064 3656094 4201097 5403705 5675312 4933720 4256371 4340684 5064346
46363 5064346 5963138 6230178 4827419 1697067 -1553593 -3239458 -3433978 -3156931 -2434019
46354 -2434019 -752842 1035234 1318888 383696 482683 2659624 5273731 6523086 6770374
46345 6770374 7186331 7517679 6770134 5271970 4514231 5202463 6541097 7242564 6466728
46336 6466728 4127026 1096298 -1138559 -1742070 -1302604 -938938 -1056928 -1408207 -1719890
46327 -1719890 -1566273 -197643 2611378 5832857 8053970 8877076 8880705 8494665 7605358
46318 7605358 6219047 5044781 5269020 7503098 10464436 11106211 7403866 1288764
$$ packed form
46381C931369J480173J158286J65869J91321J175455J749820J050090o67984k378116
46372G856283k790219j409970N45003J202608K71607p41592o77349Q4313P23662
46363E064346Q98792K67040j402759l130352l250660j685865j94520K77047P22912
46354b434019J681177J788076K83654r35192R8987K176941K614107J249355K47288
46345F770374M15957L31348p47545j498164p57739O88232J338634P01467p75836
46336F466728k339702l030728k234857o03511M39466L63666j17990l51279l11683
46327a719890J53617J368630K809021L221479K221113Q23106L629l86040q89307
46318G605358j386311j174266K24239K234078K961338O41775l702345o115102
$$ plain form
46310 1288764 -2597143 -1740139 1916725 5097629 6915410 8224508 9024755 8592983 7173818
46301 7173818 5442139 2972967 -676788 -3938631 -4618936 -3211277 -2592331 -4196457
46293 -4196457 -6500301 -7584023 -7181405 -5710841 -3224210 -84727 2846885 5236443
46285 5236443 7036543 7127416 4277432 -102668 -2553943 -1908532 -740027 -1192947 -1768446
46276 -1768446 -216944 2464746 3478879 2333002 945875 463739 385887 370307 594647
46267 594647 544986 -338712 -827807 1069950 4873460 7392741 6448097 3376228 1242515
46258 1242515 1766744 4366660 6936056 7222731 4856386 2475362 3338837 7167626 9941313
46249 9941313 8798158 5518935 3649259 3603371 2899224 704333 -429636 1916784 6664361
$$ packed form
46310A288764l885907Q57004L656864L180904J817781J309098Q00247m31772j419165
46301G173818j731679k469172l649755l261843o80305J407659O18946j604126
46293d196457k303844j083722M02618J470564K486631L139483K931612K389558
46285E236443J800100R0873k849984m380100k451275O45411J168505m52920n75499
46276a768446J551502K681690J014133j145877j387127m82136p7852j5580K24340
46267E94647m9661q83698m89095J897757L803510K519281r44644l071869k133713
46258A242515N24229K599916K569396K86675k366345k381024Q63475L828789K773687
46249I941313j143155l279223j869676m5888p04147k194891j133969K346420M747577
$$ plain form
46240 6664361 10656139 12272983 12177687 11170955 9174731 6608708 5117717 5816211 7677036
46231 7677036 8831195 8931965 8948097 8941534 7732847 5168592 3175050 3556425 5721042
46222 5721042 7585542 7995189 7339426 6557761 6604626 8138958 10447156 11327784 9598727
46213 9598727 7234594 7118387 8780264 8597615 4833057 275224 -1499867 -702334 -228399
46204 -228399 -1202474 -2024975 -1574487 -927522 -1249662 -1953140 -2127708 -2260281 -2918797 -2817712
46194 -2817712 -309683 3497091 5396218 4390331 3173181 4040456 5322011 4096836
46186 4096836 1087612 -138749 1469324 3151221 3111363 3268164 5276912 6715805 4480200
46177 4480200 309185 -846628 2321400 5805538 6077901 4328511 3495082 3855059 3824756
$$ packed form
46240F664361L991778J616844r5296j006732j996224k566023j490991O98494J860825
46231G677036J154159J00770J6132o563j208687k564255j993542L81375K164617
46222E721042J864500M09647o55763p81665M6865J534332K308198Q80628j729057
46213I598727k364133j16207J661877j82649l764558m557833j775091P97533M73935
46204b28399r74075q22501M50488O46965l22140p03478j74568j32573o58516J01085
46194b817712K508029L806774J899127j005887j217150Q67275J281555j225175
46186D096836l009224j226361J608073J681897l9858J56801K008748J438893k235605
46177D480200m171015j155813L168028L484138K72363j749390q33429L59977l0303
$$ plain form
46168 3824756 3258775 3333448 4001068 3990902 3224451 3210147 4720545 6632414 7533059 7222085
46158 7222085 6087823 4135339 1486403 -856884 -1675557 -791019 880442 2349717
46150 2349717 3175426 3303986 2968178 2813965 3460368 4561493 4874354 3947262 3357774
46141 3357774 5152560 8838968 11102970 9431230 5318322 2755714 3822565 6855726
46133 6855726 8862750 8565092 6907282 5739399 6438514 8831962 10964361 10847527 8960800
46124 8960800 7980946 9326410 11145976 10916289 9022692 8075797 9147177 10584407 10762917
46115 10762917 10252129 10464980 11493863 12376705 12644802 12452194 11707983 10330827 9243191
46106 9243191 9899441 12491951 15529444 17668145 19152318 20685548 21544491 20125884
$$ packed form
46168C824756n65981P4673O67620j0166p66451j4304J510398J911869R00645l10974
46158G222085j134262j952484k648936k343287q18673Q84538J671461J469275
46150B349717Q25709J28560l35808j54213O46403J101125L12861r27092n89488
46141C357774J794786L686408K264002j671740m112908k562608J066851L033161
46133F855726K007024k97658j657810j167883O99115K393448K132399j16834j886727
46124H960800r79854J345464J819566k29687j893597r46895J071380J437230J78510
46115A0762917n10788K12851J028883Q82842K68097j92608p44211j377156j087636
46106I243191O56250K592510L037493K138701J484173J533230Q58943j418607
$$ plain form
46098 20125884 16522483 13394854 13442709 16438996 19455632 19783698 17022083 12580072
46090 12580072 8102632 4649059 2631183 1867285 1813252 2062282 2594446 3504808 4676126
46081 4676126 5741712 6213365 5851233 5294372 5997495 8693491 11929770 13152131 11597563
46072 11597563 9165581 7927690 7834304 7710646 7403655 7531584 7839648 7577141 7331420
46063 7331420 8618714 11257909 12893258 12025849 10116102 9523216 10509123 11678704 12441990
46054 12441990 13206064 13497762 11954016 8660718 5832602 5217441 5993782 6318046 6036934
46045 6036934 6496367 8087904 9492606 9662545 9451361 10550857 13198492 15466556 14853941
46036 14853941 10587212 4546580 -131604 -1633408 -612241 1351362 3859559 7421269
$$ packed form
46098B0125884l603401l127629M7855K996287L016636L28066k761615m442011
46090A2580072m477440l453573k017876p63898n4033K49030N32164R10362J171318
46081D676126J065586M71653l62132n56861P03123K695996L236279J222361j554568
46072A1597563k431982j237891r3386j23658l06991J27929L08064k62507k45721
46063G331420J287294K639195J635349q67409j909747n92886R85907J169581P63286
46054A2441990P64074K91698j543746l293298k828116o15161P76341L24264k81112
46045F036934M59433J591537J404702J69939k11184J099496K647635K268064o12615
46036A4853941m266729o040632m678184j501804J021167J963603K508197L561710
$$ plain form
46028 7421269 11345725 13347456 12040592 8974011 7084435 7384334 8192734 7711413 6333376
46019 6333376 5749560 6376455 6743563 5671201 4194095 4397853 6529995 8343248 7742706
46010 7742706 5199290 2783559 1587085 1217584 1263223 1743662 2239938 2193992 2306736
46001 2306736 4005569 7007654 9092840 9130935 8636828 9156768 9879874 9556924 9154474
45992 9154474 10206893 11594462 10760419 7834896 5730026 5781322 5980659 4497820 2553848
45983 2553848 2242584 3290319 3789703 3026300 1865169 1021789 520516 547397 1491016
45974 1491016 3137574 4736768 5805993 6177375 5503865 3598961 1266823 9350
45966 9350 637005 2575930 4697179 6432711 7770850 8470929 8066190 7068179 7409574
$$ packed form
46028G421269L924456K001731j306864l066581j889576K99899Q08400m81321j378037
46019F333376n83816O26895L67108j072362j477106K03758K132142J813253o00542
46010G742706k543416k415731j196474l69501M5639M80439M96276m5946J12744
46001B306736J698833L002085K085186L8095m94107N19940P23106l22950m02450
45992I154474J052419J387569q34043k925523k104870N1296J99337j482839j943972
45983B553848l11264J047735M99384p63403j161131q43380n01273K6881R43619
45974A491016J646558J599194J069225L71382o73510j904904k332138j257473
45966I350O27655J938925K121249J735532J338139P00079m04739r98011L41395
$$ plain form
45957 7409574 10357058 14033446 14784870 11828077 8742104 8772746 10374903 9878055 7279651
45948 7279651 6014575 7256600 8218364 7020234 5708216 6603464 8638128 9658525
45940 9658525 9870388 10273904 9750546 6932004 3698600 3495139 6595710 9970001 11746658
45931 11746658 13032735 15005761 16768837 16931713 15461544 13191667 10904515 9415346
45923 9415346 9282625 10009999 10582602 10887474 11474426 12032132 11522949 9880367 8192896
45914 8192896 7135435 6517647 6272011 6427963 6315454 5531030 5492758 7869185 11333413
45905 11333413 12352720 9920673 7076412 6533431 7137056 6446907 4858889 4759373 6666115
45896 6666115 8608467 9046156 8420887 7739541 7302216 7286573 8333371 10753906 13636923
$$ packed form
45957G409574K947484L676388P51424k956793l085973L0642J602157m96848k598404
45948G279651j265076J242025R61764j198130j312018Q95248K034664J020397
45940I658525K11863M03516n23358k818542l233404k03461L100571L374291J776657
45931A1746658J286077J973026J763076J62876j470169k269877k287152j489169
45923I415346j32721P27374N72603L04872N86952N57706n09183j642582j687471
45914H192896j057461o17788k45636J55952j12509p84424l8272K376427L464228
45905A1333413J019307k432047k844261n42981O03625o90149j588018r9516J906742
45896F666115J942352M37689o25269o81346m37325j5643J046798K420535K883017
$$ plain form
45887 13636923 15325695 14841927 12770347 10654364 9425945 8698604 7964402 7980661 9940411
45878 9940411 13366910 16114163 16872608 16560907 16615787 16933253 16419517 14893803 13450635
45869 13450635 13151239 13980886 14961513 14971351 13695423 11965511 10924033 10915759 11577581
45860 11577581 12630175 13736285 13966264 12723823 11127513 10976088 12171330 12776672
45852 12776672 11967723 11061486 10919075 10411965 8835507 7916784 9354194 11654123 11808629
45843 11808629 9636063 8193945 9677106 12706609 14308202 13414040 11710962 11564462
45835 11564462 13572006 16102507 17192473 16623176 15556910 14454388 12722078 10604032
45827 10604032 9619226 10215257 10765766 10301522 10461100 12668941 14900504 14067316 10902596
$$ packed form
45887A3636923J688772m83768k071580k115983j228419p27341p34202J6259J959750
45878I940411L426499K747253P58445l11701N4880L17466n13736j525714j443168
45869A3450635k99396Q29647R80627R838j275928j729912j041478q274O61822
45860A1577581J052594J106110K29979j242441j596310j51425J195242O05342
45852A2776672q08949r06237j42411n07110j576458r18723J437410K299929J54506
45843A1808629k172566j442118J483161L029503J601593q94162j703078j46500
45835A1564462K007544K530501J089966n69297j066266j102522j732310k118046
45827A0604032r84806N96031N50509m64244J59578K207841K231563q33188l164720
$$ plain form
45818 10902596 9388466 11138079 13271756 12799959 10550971 9156204 9048878 8511449
45810 8511449 6782825 5219178 5404715 7302610 9505910 10773231 11194192 11954906 13816634
45801 13816634 15961926 16889521 16418049 16024789 16974211 18853967 20315237 20563824 19662083
45792 19662083 18037944 16417104 15855898 17000777 19181692 20721269 20443322 18772841
45784 18772841 17173659 16567105 16616124 16678123 16914669 17802298 18928570 19379094 19336720
45775 19336720 19991582 21485069 22418794 22232302 22487769 24308532 25863464 24463220 20488032
45766 20488032 17099558 16272603 17195830 18633237 20589130 22927129 24305874 23717590
45758 23717590 21909606 20320127 19517583 19396235 19988190 21369064 23448138 26183768
$$ packed form
45818A0902596j514130J749613K133677m71797k248988j394767j07326n37429
45810H511449j728624j563647J85537J897895K203300J267321M20961P60714J861728
45801A3816634K145292R27595m71472l93260R49422J879756J461270K48587r01741
45792A9662083j624139j620840n61206J144879K180915J539577k77947j670481
45784A8772841j599182o06554M9019O1999K36546Q87629J126272M50524m2374
45775A9336720O54862J493487R33725j86492K55467J820763J554932j400244l975188
45766B0488032l388474q26955R23227J437407J955893K337999J378745n88284
45758B3717590j807984j589479q02544j21348N91955J380874K079074K735630
$$ plain form
45750 26183768 29122856 30659699 29269892 26033165 24294339 25756894 28325601 29123832
45742 29123832 28318905 28188010 29320320 29939591 28920713 27418880 26800475 26474166 24970530
45733 24970530 22400779 20491567 20171423 20335671 19724776 19120484 20142988 21953140 21215295
45724 21215295 16593472 11597462 10717603 13610610 15840561 15255235 14462577 15979463
45716 15979463 18039425 17552053 15099460 14069051 15763738 18130595 19178461 19245758
45708 19245758 19506410 20201289 21098838 22295386 23672364 24353705 23412735 20864917 17822899
45699 17822899 15888625 16061822 17706370 18932006 18573292 17332328 16389882 15731479 14874612
45690 14874612 14343317 14838203 15506114 14874968 13324771 12705552 13372204 13602564 12479883
$$ packed form
45750B6183768K939088J536843j389807l236727j738826J462555K568707P98231
45742B9123832q04927j30895J132310O19271j018878j501833o18405l26309j503636
45733B4970530k569751j909212l20144J64248o10895o04292J022504J810152p37845
45724B1215295m621823m996010q79859K893007K229951n85326p92658J516886
45716A5979463K059962m87372k452593j030409J694687K366857J047866O7297
45708A9245758K60652O94879Q97549J196548J376978O81341r40970k547818l042018
45699A7822899j934274J73197J644548J225636l58714j240964r42446o58403q56867
45690A4874612n31295M94886O67911o31146j550197o19219O66652K30360j122681
$$ plain form
45681 12479883 11402952 11831947 13280926 14669569 16031591 17460926 17836600 16429353
45673 16429353 14755700 14810311 15961541 15604170 12822317 9544284 7847264 7893318 9038356
45664 9038356 11192693 13990033 16011623 16366313 16318471 17829995 20720552 22668990 22155754
45655 22155754 20140644 18389483 17300123 16244111 15171821 14558001 14009611 12363603
45647 12363603 9646714 7835560 8706224 11437502 13312161 12642234 10160678 7609169
45639 7609169 5987254 5489515 6113784 7457204 8443190 8209404 7214129 6809607 7757147
45630 7757147 9731507 12169173 14795998 17123791 18199501 17400830 15134353 12391211
45622 12391211 9955192 8348934 8069192 9272284 11407355 13631746 15479914 16855353
$$ packed form
45681A2479883j076931M28995J448979J388643J362022J429335L75674j407247
45673A6429353j673653N4611J151230l57371k781853l278033j697020M6054J145038
45664I038356K154337K797340K021590L54690m7842J511524K890557J948438n13236
45655B2155754k015110j751161j089360j056012j072290o13820n48390j646008
45647A2363603k716889j811154Q70664K731278J874659o69927k481556k551509
45639G609169j621915m97739O24269J343420R85986k33786r95275m04522R47540
45630G757147J974360K437666K626825K327793J075710p98671k266477k743142
45622A2391211k436019j606258k79742J203092K135071K224391J848168J375439
$$ plain form
45614 16855353 17737585 18314013 18868977 18861798 16792096 12251695 7729934 6589025 8917005
45605 8917005 11238645 11239085 10846791 12886712 16344005 17755467 16704489 16631493 19343102
45596 19343102 21682774 19733815 14400618 10286392 10005861 12144349 14439157 16210531
45588 16210531 17170334 16522479 14740762 14226665 16215705 18407294 17917830 15654610 15029921
45579 15029921 16520768 16666995 13550282 10336340 11044084 14803570 17317881 17049729
45571 17049729 16648942 18133935 19924143 19882337 18638981 18001405 17991939 17618166 17233837
45562 17233837 17843552 18870015 18887366 18198162 18499459 20060005 21352341 21667760 21944049
45553 21944049 22482492 22069810 20500651 20005918 22387613 25924506 27041862 24656167
$$ packed form
45614A6855353Q82232N76428N54964p179k069702m540401m521761j140909K327980
45605H917005K321640M40l92294K039921L457293J411462j050978p2996K711609
45596A9343102K339672j948959n333197m114226k80531K138488K294808J771374
45588A6210531R59803o47855j781717n14097J989040K191589m89464k263220o24689
45579A5029921J490847J46227l116713l213942P07744L759486K514311k68152
45571A7049729m00787J484993J790208m1806j243356o37576r466l73773l84329
45562A7233837O09715J026463J7351o89204L01297J560546J292336L15419K76289
45553B1944049N38443m12682j569159m94733K381695L536893J117356k385695
$$ plain form
45545 24656167 21331324 20214641 22054053 25253854 27682464 28040388 26339928 23748454
45537 23748454 21726472 20900457 20805883 20836110 21131986 22067479 22988217 22420225 20258748
45528 20258748 18952518 20916534 24777588 26132878 22916304 18182748 16071436 16756568
45520 16756568 17632422 17992034 19292841 21287396 21536048 19466079 17616578 17470310 17044249
45511 17044249 14629846 12367480 13477957 17606416 21462275 22937203 22271379 20179094
45503 20179094 17338966 15249153 15307389 17131563 19369523 21539540 23346741 23212569
45495 23212569 19995857 15664812 13544925 13937666 14164578 13156402 12942550 14545209
45487 14545209 15357750 12776306 8586472 7327787 11003265 17229724 22230815 24087038
$$ packed form
45545B4656167l324843j116683J839412L199801K428610L57924j700460k591474
45537B3748454k021982q26015r4574L0227K95876R35493R20738n67992k161477
45528B0258748j306230J964016L861054J355290l216574m733556k111312O85132
45520A6756568Q75854L59612J300807J994555K48652k069969j849501j46268m26061
45511A7044249k414403k262366J110477M128459L855859J474928o65824k092285
45503B0179094k840128k089813N8236J824174K237960K170017J807201j34172
45495B3212569l216712m331045k119887L92741K26912j008176k13852J602659
45487A4545209Q12541k581444m189834j258685L675478O226459N001091J856223
$$ plain form
45479 24087038 23174250 20990748 19227394 19187819 21148222 23992997 25791737 25275256 22900007
45470 22900007 20064248 17316332 14321686 11900034 12396848 16437806 20549747 20473320
45462 20473320 16655474 13983880 15547382 18970128 20054192 18024311 15416657 14185783
45454 14185783 14088082 14463157 15563709 17614021 19816531 21115826 21461525 21635157 21904688
45445 21904688 21498508 19843301 17874446 17150066 17576679 17194898 14874582 12106219 11071689
45436 11071689 11939654 13409763 14967593 16800762 18158681 17958618 16866490 16650906
45428 16650906 17347183 17147653 15395234 13550438 12691262 12234933 11874502 12551759 14405605
45419 14405605 15799878 15659779 14887226 14199663 12674954 10169868 9168670 11879148
$$ packed form
45479B4087038r12788k183502j763354l9575J960403K844775J798740n16481k375249
45470B2900007k835759k747916k994646k421652M96814M040958M111941p6427
45462B0473320l817846k671594J563502L422746J084064k029881k607654j230874
45454A4185783r7701L75075J100552K050312K202510J299295L45699J73632K69531
45445B1904688m06180j655207j968855p24380M26613l81781k320316k768363j034530
45436A1071689Q67965J470109J557830J833169J357919k00063j092128k15584
45428A6650906O96277j99530j752419j844796q59176m56329l60431O77257J853846
45419A4405605J394273j40099p72553o87563j524709k505086j001198K710478
$$ plain form
45411 11879148 16766017 20207420 20718333 19565904 18085705 16483169 14750795 12890290
45403 12890290 10610664 8291513 7484644 8836008 10480726 10478852 9906020 11161432 13915495
45394 13915495 15476552 14987284 14443362 15254139 16501194 17256924 18015913 18809906 18374699
45385 18374699 16597298 15565422 16419028 17076661 15243662 12236612 11327018 13005104
45377 13005104 14436547 13668562 12005620 11371438 11210018 9647029 6910892 5769479
45369 5769479 8136394 12415013 15274640 15689382 15959331 18355702 21938578 23838588
45361 23838588 23053256 21444450 20884896 20882958 19762067 17176898 14454199 12925419 12858871
45352 12858871 13875656 15511028 17062964 17472309 16052919 13524033 11897049 12704643
$$ packed form
45411A1879148M886869L441403N10913j152429j480199j602536j732374j860505
45403A2890290k279626k319151q06869J351364J644718j874n72832J255412K754063
45394A3915495J561057m89268n43922Q10777J247055P55730P58989P93993m35207
45385A8374699j777401j031876Q53606O57633j832999l007050r09594J678086
45377A3005104J431443p67985j662942o34182j61420j562989k736137j141413
45369E769479K366915M278619K859627M14742K69949K396371L582876J900010
45361B3838588p85332j608806n59554j938j120891k585169k722699j528780o6548
45352A2858871J016785J635372J551936M09345j419390k528886j626984Q07594
$$ plain form
45344 12704643 15250402 17276047 17745862 18184543 20345654 23176987 23624081 20575762
45336 20575762 16510718 14520258 14936611 15965594 16568480 17029050 17071480 15449278 12121097
45327 12121097 9356589 9376349 11566981 13257048 12901002 11274358 9721646 8751125 8680661
45318 8680661 10062371 12473970 14136264 14037596 13527602 14380238 16075420 16728789 16147829
45309 16147829 15873943 16283223 15917023 14211315 12765297 12890718 13647382 13515107 12647952
45300 12647952 12321363 13273758 15510486 18540766 20985186 21331853 19939712 18775221
45292 18775221 18374845 17047659 14188282 12009823 12275547 13718885 14873474 16863491
45284 16863491 20404556 22517849 20229273 15871547 14287744 15707766 16048755 13941542
$$ packed form
45344A2704643K545759K025645M69815M38681K161111K831333M47094l048319
45336B0575762m065044j990460M16353J028983O02886M60570M2430j622202l328181
45327A2121097k764508J9760K190632J690067l56046j626644j552712r70521p0464
45318H680661J381710K411599J662294r8668n09994Q52636J695182O53369n80960
45309A6147829k73886M09280l66200j705708j446018J25421P56664j32275q67155
45300A2647952l26589R52395K236728L030280K444420L46667j392141j164491
45292A8775221m00376j327186k859377k178459K65724J443338J154589J990017
45284A6863491L541065K113293k288576m357726j583803J420022L40989k107213
$$ plain form
45276 13941542 12498160 13601270 15372584 16498180 18179417 19946785 18483510 13496207
45268 13496207 10277400 12673327 17156449 18043850 15575692 14211205 15195388 15844982
45260 15844982 15041278 14563604 15246668 16180476 17815939 21681095 26434075 28126249 25506633
45251 25506633 21728957 19664552 18716345 17571188 16864221 17199887 17296898 16328930 15906570
45242 15906570 17513379 19876101 21138338 21888866 23500439 24921295 24042984 21489446
45234 21489446 20110575 20854879 21882937 22023516 22404787 23841341 25117277 25304158 25718108
45225 25718108 27671331 29808625 29918549 28435630 27635188 27698110 26430772 23529581 22220484
45216 22220484 24696561 28057233 27662060 23603432 20734669 22103886 25387020 26977420
$$ packed form
45276A3941542j443382J103110J771314J125596J681237J767368j463275m987303
45268A3496207l218807K395927M483122Q87401k468158j364487R84183O49594
45260A5844982q03704m77674O83064R33808J635463L865156M752980J692174k619616
45251B5506633l777676k064405r48207j145157p06967L35666R7011r67968m22360
45242A5906570J606809K362722J262237P50528J611573J420856q78311k553538
45234B1489446j378871P44304J028058J40579L81271J436554J275936J86881M13950
45225B5718108J953223K137294J09924j482919q00442O2922j267338k901191j309097
45216B2220484K476077L360672l95173m058628k868763J369217L283134J590400
$$ plain form
45208 26977420 26871266 27322120 28610666 29063531 28521447 28821561 30460551 31253921 29431207
45199 29431207 26355307 24796772 25523248 26887425 27207486 26333988 25005641 23688418
45191 23688418 22385429 21109351 20096311 19445126 18731764 17456461 16063805 15810472
45183 15810472 16905449 17519750 16024733 13847244 14192254 17604844 20884029 21432546
45175 21432546 20582717 20748616 21166640 19374695 15938856 14146472 14699670 14315742 11164091
45166 11164091 8530352 10394659 15566635 19444432 20364456 20762776 22433234 24224350
45158 24224350 25058949 25934157 27472062 28174732 26942577 25146359 24232277 23222966 20853197
45149 20853197 18488882 18264213 19510032 19863221 19179882 19380366 20663167 20896015 19089025
$$ packed form
45208B6977420j06154M50854J288546M52865n42084L00114J638990P93370j822714
45199B9431207l075900j558535P26476J364177L20061q73498j328347j317223
45191B3688418j302989j276078j013040o51185p13362j275303j392656k53333
45183A5810472J094977O14301j495017k177489L45010L412590L279185N48517
45175B1432546q49829J65899M18024j791945l435839j792384N53198l83928l151651
45166A1164091k633739J864307N171976L877797R20024L98320J670458J791116
45158B4224350Q34599Q75208J537905P02670j232155j796218r14082j009311k369769
45149B0853197k364315k24669J245819L53189o83339K00484J282801K32848j806990
$$ plain form
45140 19089025 16693119 14875961 13232192 12054837 13070283 16396731 19200960 19312530
45132 19312530 18297078 18954223 21322349 23232538 23543193 22645152 20750629 18075847
45124 18075847 16312577 17562223 21434968 24836746 25161053 22776711 20218552 19651873
45116 19651873 21033495 22148502 20805464 17576165 15681111 17359155 21177778 23984712
45108 23984712 24606703 24198464 23723144 22921411 21547708 19938603 18279664 16669535 15870665
45099 15870665 16589497 17969957 18219003 16940563 15599015 15485881 16447144 17784369 19105894
45090 19105894 19977799 20026739 19877556 20836856 23063325 25018665 25281975 24022307 22172159
45081 22172159 20132248 18082140 16789929 17045320 18446065 19515397 19209121 18019652
$$ packed form
45140A9089025k395906j817158j643769j177355J015446L326448K804229J11570
45132A9312530j015452O57145K368126J910189L10655q98041j894523k674782
45124A8075847j763270J249646L872745L401778L24307k384342k558159n66679
45116A9651873J381622J115007j343038l229299j895054J678044L818623K806934
45108B3984712O21991m08239m75320q01733j373703j609105j658939j610129p98870
45099A5870665P18832J380460K49046j278440j341548j13134R61263J337225J321525
45090A9105894Q71905M8940j49183R59300K226469J955340K63310j259668j850148
45081B2172159k039911k050108j292211K55391J400745J069332l06276j189469
$$ plain form
45073 18019652 17441234 18373943 20156287 21299339 21014402 19631813 17744844 15827318
45065 15827318 14728477 15219250 16400007 15876456 12681034 9023088 7866922 9665055
45057 9665055 12829398 16355308 20036571 22765293 22938031 20694006 17955940 16082793
45049 16082793 15034404 14793357 15769995 17569361 19116090 20396127 22520613 25743433
45041 25743433 28894605 30913028 31334735 29366061 24689276 19494784 17209241 18269110
45033 18269110 19459400 18617364 17607112 18892193 21375212 22143278 20956391 20253414
45025 20253414 21115178 21699454 20117262 17126143 15118036 15250222 16347780 16618264 16052648
45016 16052648 16469885 18811310 21328511 21765176 20671310 20566037 22000745 22942357 22550159
$$ packed form
45073A8019652n78418R32709J782344J143052k84937j382589j886969j917526
45065A5827318j098841M90773J180757n23551l195422l657946j156166J798133
45057I665055L164343L525910L681263K728722J72738k244025k738066j873147
45049A6082793j048389k41047R76638J799366J546729J280037K124486L222820
45041B5743433L151172K018423M21707j968674m676785n194492k285543J059869
45033A8269110J190290q42036j010252J285081K483019P68066j186887p02977
45025B0253414Q61764N84276j582192k991119k008107J32186J097558K70484n65616
45016A6052648M17237K341425K517201M36665j093866j05273J434708R41612l92198
$$ plain form
45007 22550159 22786177 24859295 26595484 25498015 22535744 20500728 20020438 19745031
44999 19745031 19498886 20494554 22679408 24339446 24580569 24283166 24328759 24521852 24526264
44990 24526264 24384297 23826189 22441446 20904641 20776326 22491487 24358400 24066502 20824083
44981 20824083 15982494 12019132 10810569 12391985 15392795 18721795 22206789 25385081
44973 25385081 26834662 25660106 22851084 20159072 18276169 17045450 16607815 17019929
44965 17019929 17329325 16506166 15132353 14903936 16382746 18180882 18544618 17242116 15860705
44956 15860705 16329381 18781646 21043857 21125039 19928374 19904483 21136196 21184034 19435274
44947 19435274 18751254 21203426 24857820 26988708 27968333 29231275 29714385 27706903
$$ packed form
45007B2550159K36018K073118J736189j097469k962271k035016m80290k75407
44999A9745031k46145R95668K184854J660038K41123k97403M5593J93093M412
44990B4526264j41967n58108j384743j536805j28315J715161J866913k91898l242419
44981B0824083m841589l963362j208563J581416L000810L329000L484994L178292
44973B5385081J449581j174556k809022k692012j882903j230719m37635M12114
44965A7019929L09396q23159j373813k28417J478810J798136L63736j302502j381411
44956A5860705M68676K452265K262211Q1182j196665k3891J231713M7838j748760
44947A9435274o84020K452172L654394K130888R79625J262942M83110k007482
$$ plain form
44939 27706903 24439122 22213578 20513993 17956599 16730875 20227395 26578860 29654416
44931 29654416 27279617 23813346 23248766 24307238 24453820 24542527 26402660 28886111 29522636
44922 29522636 28156729 26411369 25211375 24852791 25694850 26839288 26016025 22746025
44914 22746025 19735356 19216270 20004385 20336549 21301512 24546909 28402557 29612271 27975710
44905 27975710 26262588 26098060 26687365 27253660 28094629 29149466 29623922 29163792 27927685
44896 27927685 25924637 23738220 23031622 24522024 26397405 26790870 26777842 28440598 30911041
44887 30911041 31397976 29820348 29246638 31451886 34991644 38237675 41377699 44358174
44879 44358174 45564573 44144708 41661924 39983327 39171907 38705240 39083899 40806009
$$ packed form
44939B7706903l267781k225544j699585k557394j225724L496520O351465L075556
44931B9654416k374799l466271n64580J058472J46582Q8707J860133K483451O36525
44922B9522636j365907j745360j199994l58584Q42059J144438q23263l270000
44914B2746025l010669n19086P88115L32164R64963L245397L855648J209714j636561
44905B7975710j713122j64528N89305N66295Q40969J054837M74456m60130j236107
44896B7927685k003048k186417p06598J490402J875381L93465j3028J662756K470443
44887C0911041M86935j577628n73710K205248L539758L246031L140024K980475
44879D4358174J206399j419865k482784j678597q11420m66667L78659J722110
$$ plain form
44871 40806009 43158738 45342849 47424435 48900334 47928576 43828467 39187191 37418824
44863 37418824 38766942 40511650 40733611 40041867 39663373 39686777 39678318 39568650 39172579
44854 39172579 37870196 35621559 33658671 33354103 34712579 36600305 38157649 39218238
44846 39218238 39416891 37858262 34245307 29817775 26449967 24980056 25037834 26289818
44838 26289818 28867043 32355107 35374647 36837035 37002001 36733229 36413017 36312593 37221669
44829 37221669 39459851 41584877 41421587 38624516 35315090 33841180 34425867 35138677
44821 35138677 33772837 29905491 25658369 24166967 26543698 30512932 32791962 32551818
44813 32551818 31586368 31398155 31583706 31340913 31083796 31657481 32843101 33625018 33587071
$$ packed form
44871D0806009K352729K184111K081586J475899r71758m100109m641276j768367
44863C7418824J348118J744708K21961o91744l78494K3404q459j09668l96071
44854C9172579j302383k248637j962888l04568J358476J887726J557344J060589
44846C9218238J98653j558629l612955m427532l367808j469911N7778J251984
44838B6289818K577225L488064L019540J462388J64966k68772l20212j00424R09076
44829C7221669K238182K125026j63290k797071l309426j473910N84687P12810
44821C5138677j365840l867346m247122j491402K376731L969234K279030k40144
44813C2551818r65450j88213J85551k42793k57117N73685J185620P81917l7947
$$ plain form
44804 33587071 33364453 33874256 35468208 37638832 39316391 39670001 38780370 37422574 36370253
44795 36370253 36222372 37466576 39857132 41882887 41905348 40069259 38226859 37697167 37963014
44786 37963014 37939593 37586038 37573693 38039758 38496209 38695780 38942607 39573871 40453015 40995094
44776 40995094 40747097 40126020 40268569 41556760 42570361 41482800 38553188 36175104
44768 36175104 36115458 37685175 39103367 39658204 39793450 39947810 40308615 41197361 42698545
44759 42698545 44064252 44255109 43101465 41492882 40437754 40150807 39951777 39029731 37532192
44750 37532192 36637982 36934097 37115141 35548354 33048976 32339260 34186929 36028456 35760232
44741 35760232 35090086 36964607 40838868 43167244 42355042 40630003 40544150 41970969 43571899
$$ packed form
44804C3587071k22618N09803J593952K170624J677559L53610q89631j357796j052321
44795C6370253j47881J244204K390556K025755K2461j836089j842400n29692K65847
44786C7963014k3421l53555j2345M66065M56451J99571K46827O31264Q79144N42079
44776D0995094k47997o21077J42549J288191J013601j087561k929612k378084
44768C6175104n9646J569717J418192N54837J35246J54360L60805Q88746J501184
44759D2698545J365707J90857j153644j608583j055128k86947j99030r22046j497539
44750C7532192q94210K96115J81044j566787k499378p09716J847669J841527k68224
44741C5760232o70146J874521L874261K328376q12202j725039q5853J426819J600930
$$ plain form
44732 43571899 45192764 47222009 48922759 49114566 47827746 45896964 43488147 40415925
44724 40415925 37533787 36334508 37131582 38808684 40447558 42124301 44001335 45758535
44716 45758535 47159831 48110397 47951469 46036924 43493347 42843015 44794905 46826493
44708 46826493 46551858 45362104 46568722 50457025 53616351 53376598 50536106 47027623
44700 47027623 43402829 40139197 39132083 41355675 44326889 44669088 42813906 42503038
44692 42503038 45341335 48370934 48169338 45459639 44006078 45851876 49180212 50753592
44684 50753592 49441731 47052113 46068618 46960466 48004561 47628462 46133643 44749857
44676 44749857 44053560 44261257 45952304 48862587 50784596 49818227 47432630 46966440 48952334
$$ packed form
44732D3571899J620865K029245J700750J91807j286820j930782k408817l072222
44724D0415925k882138j199279P97074J677102J638874J676743J877034J757200
44716D5758535J401296R50566j58928j914545k543577o50332J951890K031588
44708D6826493k74635j189754J206618L888303L159326k39753k840492l508483
44700D7027623l624794l263632j007114K223592K971214L42199j855182l10868
44692D2503038K838297L029599k01596k709699j453561J845798L328336J573380
44684E0753592j311861k389618r83495Q91848J044095l76099j494819j383786
44676D4749857o96297K07697J691047K910283J922009r66369k385597m66190J985894
$$ plain form
44667 48952334 50401730 49310426 47304829 46686994 47334700 48199541 49660461 52235061
44659 52235061 54635152 55357772 54958506 54692863 54229840 52969160 52292981 53774727 56081166
44650 56081166 56629285 55830600 56577205 59535642 62121749 62650592 62445538 62883128 63236364
44641 63236364 62781370 62321057 61893067 59552299 54801115 51189709 52636098 58243546
44633 58243546 63462600 65837441 67024408 69199662 72002915 73765842 73919642 73174080
44625 73174080 72438912 72416028 73515340 75499959 77664075 79701146 81884896 84177500
44617 84177500 85899232 86811886 87939783 90493315 94097409 96874188 97622823 97441632
44609 97441632 98618195 102057032 106476398 110287838 113475788 117033481 121233496 125484627
$$ packed form
44667D8952334J449396j091304k005597o17835O47706Q64841J460920K574600
44659E2235061K400091P22620l99266k65643m63023j260680o76179J481746K306439
44650E6081166N48119p98685P46605K958437K586107N28843k05054M37590L53236
44641F3236364m54994m60313m27990k340768m751184l611406J446389N607448
44633E8243546N219054K374841J186967K175254K803253J762927J53800p45562
44625G3174080p35168k2884J099312J984619K164116K037071K183750K292604
44617H4177500J721732R12654J127897K553532L604094K776779P48635j81191
44609I7441632J176563L438837M419366L811440L187950L557693M200015M251131
$$ plain form
44601 125484627 129597013 134023845 138821660 143561925 148587403 155162074 163642194 172358490
44593 172358490 179236490 184223637 189583566 197985460 210347010 224941806 238568506
44586 238568506 249491571 259421256 271559519 286516523 301641083 314920278 327623563
44579 327623563 341635110 355819247 367297515 375611486 383328810 392480468 402250527
44572 402250527 410520005 416254632 420022576 423316294 427611111 433120410 438465120 442539798
44564 442539798 446394019 451903299 458847188 465071598 469638546 473891629 478863776 483447510
44556 483447510 486020611 486382035 485171296 482745292 479512194 475954466 471295481 463527123
44548 463527123 451929857 438328481 424787907 411527424 398342294 386258006 375780115
$$ packed form
44601A25484627M112386M426832M797815M740265N025478O574671Q480120Q716296
44593A72358490O878000M987147N359929Q401894J2361550J4594796J3626700
44586B38568506J0923065R929685J2138263J4957004J5124560J3279195J2703285
44579C27623563J4011547J4184137J1478268Q313971P717324R151658R770059
44572D02250527Q269478N734627L767944L293718M294817N509299N344710M074678
44564D42539798L854221N509280O943889O224410M566948M253083M972147M583734
44556D83447510K573101L61424j210739k426004l233098l557728m658985p768358
44548D63527123j1597266j3601376j3540574j3260483j3185130j2084288j0477891
$$ plain form
44541 375780115 365032199 352150496 338560948 327212728 318158669 308815124 298563795
44534 298563795 290002408 284820023 281106379 276028435 269026036 261013349 252394447 243534408
44526 243534408 235661891 229553443 224342722 218981607 213694812 208580693 202182331 193466112
44518 193466112 184283629 177628036 173785241 170286693 165652720 161213640 158900345 158954029
44510 158954029 160342791 161947307 162684443 161794005 159894239 158829064 159624826 161194550
44502 161194550 161674476 160492186 158554158 156826801 155262909 152979875 149323580 144855054
44494 144855054 140970472 138094347 134844342 130030384 124956969 122013641 120874699 118078918
44486 118078918 111323480 102604066 95834565 92574548 91478092 90854972 90031323 88819965
$$ packed form
44541C75780115j0747916j2881703j3589548j1348220r054059r343545j0251329
44534B98563795q561387n182385l713644n077944p002399q012687q618902q860039
44526B43534408p872517o108448n210721n361115n286795n114119o398362q716219
44518A93466112r182483o655593l842795l498548m633973m439080k313295N3684
44510A58954029J388762J604516P37136q90438j899766j065175P95762J569724
44502A61194550M79926j182290j938028j727357j563892k283034l656295m468526
44494A44855054l884582k876125l250005m813958n073415k943328j138942k795781
44486A18078918o755438q719414o769501l260017j096456o23120q23649j211358
$$ plain form
44478 88819965 87463912 86915055 87559173 87798831 85656658 81923294 79769043 80499703 81513250
44469 81513250 79813625 76146555 73761928 73735229 73631255 71068671 66761422 63062427
44461 63062427 60876232 59520070 58879366 59749371 61785593 62863882 61528920 58974713
44453 58974713 57393378 57197736 57297700 57460390 58507577 60256890 61296788 61328155 61843633
44444 61843633 63558887 64893496 64223992 62048518 59468203 56235097 52426750 50586686
44436 50586686 53189323 58308513 60754665 58074902 53084617 49787780 49056626 49340697
44428 49340697 49486462 49322975 49008824 49286616 51154624 53997857 55354829 53961710 51728627
44419 51728627 51055944 51455451 50866724 49310919 48743322 49608726 50051474 48846006 46916068
$$ packed form
44478H8819965j356053n48857O44118K39658k142173l733364k154251P30660J013547
44469H1513250j699625l667070k384627k6699j03974k562584m307249l698995
44461F3062427k186195j356162o40704Q70005K036222J078289j334962k554207
44453E8974713j581335j95642R9964J62690J047187J749313J039898L1367N15478
44444F1843633J715254J334609o69504k175474k580315l233106l808347j840064
44436E0586686K602637N119190K446152k679763m990285l296837p31154K84071
44428D9340697J45765j63487l14151K77792J868008K843233J356972j393119k233083
44419E1728627o72683L99507n88727j555805n67597Q65404M42748j205468j929938
$$ plain form
44410 46916068 45362993 44013335 42804767 42751873 44265683 45979951 46661324 47092231 48462177
44401 48462177 49827306 49143829 46595843 44962366 46187095 49040967 50988810 51296014
44393 51296014 51208999 51656789 52028667 51343400 49726340 48278426 47941596 48864952 50502855
44384 50502855 51904287 52300354 52105803 53109925 56646357 61308850 63554838 61448492
44376 61448492 57160211 54685675 55385501 56940668 56710970 54810648 53324019 53611870
44368 53611870 55409921 57907161 60421196 62036501 61772114 59746228 57634130 57308234
44360 57308234 59098344 61777054 64172174 66273777 68524359 70511935 71136573 70245053
44352 70245053 69440613 70582952 73620071 76567529 77789698 77748431 78179712 80041177 82827028
$$ packed form
44410D6916068j553075j349658j208568n2894J513810J714268O81373M30907J369946
44401D8462177J365129o83477k547986j633477J224729K853872J947843L07204
44393E1296014q7015M47790L71878o85267j617060j447914l36830R23356J637903
44384E0502855J401432L96067j94551J004122L536432M662493K245988k106346
44376F1448492m288281k474536O99826J555167k29698j900322j486629K87851
44368E3611870J798051K497240K514035J615305k64387k025886k112098l25896
44360E7308234J790110K678710K395120K101603K250582J987576O24638q91520
44352G0245053q04440J142339L037119K947458J222169m1267M31281J861465K785851
$$ plain form
44343 82827028 85590119 87847505 89386961 89962942 89737400 89628499 90597898 92683257 95172166
44334 95172166 97484109 99175774 99278573 96866468 92762493 89494097 88494554 88192308
44326 88192308 86193166 82675750 79869106 78489723 76969123 74713411 73744462 75565762
44318 75565762 78150228 78091624 74844893 70982224 68861366 68777314 69845676 70803208 70220610
44309 70220610 67825140 65491011 65070094 65475377 64157012 61438798 60598755 62865931
44301 62865931 65107552 64027621 60323153 56767190 54242505 52088613 50831243 51722713
44293 51722713 54131877 55853879 55935848 55267506 54504266 53257264 51395646 49588496 48513972
44284 48513972 48714176 50695315 53600471 54512986 51339560 46182560 43458019 44444365
$$ packed form
44343H2827028K763091K257386J539456N75981k25542j08901R69399K085359K488909
44334I5172166K311943J691665J02799k412105m103975l268396r99543l02246
44326H8192308j999142l517416k806644j379383j520600k255712r68949J821300
44318G5565762K584466n8604l246731l862669k120858q4052J068362R57532n82598
44309G0220610k395470k334129m20917M05283j318365k718214q40043K267176
44301F2865931K241621j079931l704468l555963k524685k153892j257370Q91470
44293E1722713K409164J722002Q1969o68342p63240j247002j861618j807150j074524
44284D8513972K00204J981139K905156R12515l173426n157000k724541R86346
$$ plain form
44276 44444365 46031846 45322515 43011750 41275972 40631028 40340193 40166611 40211020 40296405
44267 40296405 40669981 42017637 43822846 44259359 42793216 41223578 40948706 41107883 40952996
44258 40952996 41877580 44771310 47227042 46330973 43057642 40806083 40300653 39267307
44250 39267307 37035339 35956219 37451111 39713527 40717239 41054475 42201022 43916573
44242 43916573 45025822 45289548 44979287 43870517 42127264 41098195 41800182 43464090
44234 43464090 44774864 45575151 46095787 45611019 43507015 40903992 39434279 38826705 37472444
44225 37472444 35287434 34267992 35841155 39042893 41874017 43448139 44245476 45027403
44217 45027403 46121773 47379940 48399498 48907396 48977559 48724751 48039453 47021818 46359897
$$ packed form
44276D4444365J587481p09331k310765j735778o44944k90835j73582M4409Q5385
44267D0296405L73576J347656J805209M36513j466143j569638k74872J59177j54887
44258D0952996R24584K893730K455732q96069l273331k251559n05430j033346
44250C9267307k231968j079120J494892K262416J003712L37236J146547J715551
44242D3916573J109249K63726l10261j108770j743253j029069P01987J663908
44234D3464090J310774Q00287N20636m84768k104004k603023j469713o07574j354261
44225C7472444k185010j019442J573163L201738K831124J574122P97337P81927
44217D5027403J094370J258167J019558N07898P0163k52808o85298j017635o61921
$$ plain form
44208 46359897 46644812 47503360 48097565 48338966 48819649 49573350 49783662 48937191 47550360
44199 47550360 46502753 46242684 46770573 47668368 47977845 46990987 45605471 45907557 48598019
44190 48598019 51650231 52595755 51534973 50583288 50742742 51016306 50734600 50794069 51611427
44181 51611427 51589186 49382541 46638602 46376915 48988111 51886336 53142712 53323934 53372911
44172 53372911 53068199 52626034 53463533 55622821 56503402 54464733 52033157 52766734 56088887
44163 56088887 58294260 57980556 57108108 56841409 56055869 54624921 54466389 55837188 55975864
44154 55975864 53486041 51072195 51460449 53241053 53538645 52462539 51789221 51304384 50044720
44145 50044720 49567397 51944473 55368797 55932136 53610260 52315274 53554279 54257567
$$ packed form
44208D6359897K84915Q58548N94205K41401M80683P53701K10312q46471j386831
44199D7550360j047607k60069N27889Q97795L09477r86858j385516L02086K690462
44190D8598019L052212R45524j060782r51685J59454K73564k81706N9469Q17358
44181E1611427k2241k206645k743939k61687K611196K898225J256376J81222M8977
44172E3372911l04712m42165Q37499K159288Q80581k038669k431576P33577L322153
44163E6088887K205373l13704q72448k66699p85540j430948j58532J370799J38676
44154E5975864k489823k413846L88254J780604K97592j076106o73318m84837j259664
44145E0044720m77323K377076L424324N63339k321876j294986J239005P03288
$$ plain form
44137 54257567 52219130 49736373 49600852 50649908 50073342 47932199 46583707 47024828
44129 47024828 48359295 49997292 52044372 53880487 54278573 52952993 50776921 48656432
44121 48656432 47093985 46367612 46148276 45428556 43847538 42701911 43660767 46642025 49668716
44112 49668716 50751014 49658572 48215058 48894470 52347184 56194090 57298228 55433856
44104 55433856 53442695 53461570 54636504 55275688 55413503 55851921 56194512 55663523 54948699
44095 54948699 55452423 57136945 58556761 58682697 57529980 55464568 53113505 51601583
44087 51601583 51720380 53004934 54354973 55203171 55609902 56010947 57361558 60277806 63277647
44078 63277647 63514373 60597310 58033301 59002096 62151695 63861830 63438883 63244899 64331544
$$ packed form
44137E4257567k038437k482757j35521J049056n76566k141143j348492M41121
44129D7024828J334467J637997K047080J836115L98086j325580k176072k120489
44121D8656432j562447p26373k19336p19720j581018j145627R58856K981258L026691
44112D9668716J082298j092442j443514O79412L452714L846906J104138j864372
44104E5433856j991161J8875J174934O39184J37815M38418L42591n30989p14824
44095E4948699N03724J684522J419816J25936j152717k065412k351063j511922
44087E1601583J18797J284554J350039Q48198M06731M01045J350611K916248K999841
44078F3277647K36726k917063k564009R68795L149599J710135m22947j93984J086645
$$ plain form
44069 64331544 65132064 64793234 64875109 66589767 68454628 68095595 65215840 61796356 60075510
44060 60075510 60769632 62625148 63638758 63284662 63028529 63803251 64107190 62345706 59998604
44051 59998604 59843875 61388568 60995447 56980555 51858253 48683955 47701986 47739032 48484056
44042 48484056 49812018 50793341 50954862 50908882 50464911 48074850 43778175 40686111 41308988
44033 41308988 43925511 45000550 44035183 43409826 44207355 45141708 45622062 46891065 49109173
44024 49109173 49795152 47124410 43445710 43238422 47554038 52296400 52918846 49665099
44016 49665099 46671911 46418836 47245862 46991670 46670673 48376830 51200096 52379820 52033100
44007 52033100 53288420 57106551 60279732 60116684 58312854 58107208 59870851 61830035
$$ packed form
44069F4331544Q00520l38830Q1875J714658J864861l59033k879755l419484j720846
44060F0075510O94122J855516J013610l54096k56133P74722L03939j761484k347102
44051E9998604j54729J544693l93121m014892n122302l174298r81969L7046P45024
44042D8484056J327962R81323J61521m5980m43971k390061m296675l092064O22877
44033D1308988K616523J075039r65367o25357P97529R34353M80354J269003K218108
44024D9109173O85979k670742l678700k07288M315616M742362O22446l253747
44016D9665099k993188k53075Q27026k54192l20997J706157K823266J179724l46720
44007E2033100J255320L818131L173181j63048j803830k05646J763643J959184
$$ plain form
43999 61830035 63294026 64630497 65435099 65262470 65134818 65951407 66422593 65048428 63128611
43990 63128611 62989771 63972419 63324136 60790323 58930420 58515642 57074849 53257299 49617812
43981 49617812 49146111 51237295 53148570 53849817 54401959 55608127 57195014 58677060
43973 58677060 59414573 58305695 55000398 51288308 49885116 51518691 53986781 54325474
43965 54325474 51521485 47173925 43962629 43492103 45295853 47730045 49580175 50500131
43957 50500131 50255864 48552734 45975869 44273634 44869308 47246026 49373448 49814700
43949 49814700 49104703 48862608 49678925 50345351 49591562 48165988 48113851 49863642 51398762
43940 51398762 51079345 49925904 49789738 50471729 50524835 50073172 50520708 51688091 51655101
$$ packed form
43999F1830035J463991J336471Q04602j72629j27652Q16589M71186j374165j919817
43990F3128611j38840R82648o48283k533813j859903m14778j440793l817550l639487
43981D9617812m71701K091184J911275P01247N52142J206168J586887J482046
43973E8677060P37513j108878l305297l712090j403192J633575K468090L38693
43965E4325474k803989m347560l211296m70526J803750K434192J850130R19956
43957E0500131k44267j703130k576865j702235N95674K376718K127422M41252
43949D9814700p09997k42095Q16317O66426p53789j425574n2137J749791J535120
43940E1398762l19417j153441j36166O81991N3106m51663M47536J167383l2990
$$ plain form
43931 51655101 49799687 47768176 46798963 46216707 45429027 45252165 46024926 46446731 45845742
43922 45845742 45709628 47061636 48015587 46284104 42880508 40762326 40587447 40547723 40079642
43913 40079642 40750810 42938577 44384247 43381847 41413046 41061176 42631065 44265123
43905 44265123 44467789 43275069 41721046 41293670 43149037 46630813 49220225 49288834 48399395
43896 48399395 49413333 52619210 55369504 55581900 53881064 51888653 50235291 49244884
43888 49244884 49846233 52056787 53623788 52208444 48595142 45889335 45592167 46343700
43880 46343700 46746946 47295354 48605258 49717338 49720861 49656377 51009167 53249733 54710197
43871 54710197 55251086 56091689 57322139 57717304 57210246 57458954 59190108 60704066 60137618
$$ packed form
43931E1655101j855414k031511r69213n82256p87680j76862P72761M21805o00989
43922D5845742j36114J352008R53951j731483l403596k118182j74879l9724m68081
43913D0079642O71168K187767J445670j002400j968801l51870J569889J634058
43905D4265123K02666j192720j554023m27376J855367L481776K589412O8609q89439
43896D8399395J013938L205877K750294K12396j700836j992411j653362r90407
43888D9244884O01349K210554J567001j415344l613302k705807k97168P51533
43880D6343700M03246N48408J309904J112080L523o4484J352790K240566J460464
43871E4710197N40889Q40603J230450L95165n07058K48708J731154J513958n66448
$$ plain form
43862 60137618 58012382 56431764 56627642 58316579 60729580 63157223 64893740 65689369
43854 65689369 66212799 67396800 69340206 71257633 72408174 72786039 73026088 73792293 75135296
43845 75135296 76536780 77854214 79851998 83079704 86537855 88578270 89139466 89863100
43837 89863100 91772690 94156395 96160087 98005180 99862487 101046179 101563234 103141711
43829 103141711 107050187 111704018 114174729 113730996 112372042 112103768 113198763 115040383
43821 115040383 117047164 118429762 118454669 117597198 117448026 118877197 121040305 122678728
43813 122678728 123646167 124545231 125483813 126008796 126075422 126354990 127361706 128646541 129262714
43804 129262714 129050150 129024469 130081039 131624888 132253293 131802941 131817534 133665152 137001208
$$ packed form
43862F0137618k125236j580618J95878J688937K413001K427643J736517P95629
43854F5689369N23430J184001J943406J917427J150541L77865K40049P66205J343003
43845G5135296J401484J317434J997784L227706L458151K040415N61196P23634
43837H9863100J909590K383705K003692J845093J857307J183692N17055J578477
43829A03141711L908476M653831K470711m43733j358954k68274J094995J841620
43821A15040383K006781J382598K4907q57471j49172J429171K163108J638423
43813A22678728R67439Q99064R38582N24983O6626K79568J006716J284835O16173
43804A29262714k12564k5681J056570J543849O28405m50352J4593J847618L336056
$$ plain form
43795 137001208 140413639 142597986 142488271 139660638 135686188 133757864 135355374 138185753
43787 138185753 139142113 138425630 138595626 140203431 141144862 140430056 139566579 139211992 137378467
43778 137378467 132881231 128175129 126156671 125773002 123783554 120041389 117802462 118626170
43770 118626170 119993156 119049601 116263806 113774166 112005706 109963049 107683452 106087543
43762 106087543 104692807 101633030 96476228 91484874 89211408 89730218 91010958 91419519
43754 91419519 91079831 91011298 91503467 91397280 88921078 83504955 76781564 71331389 68342767
43745 68342767 66978782 65962154 64869302 63653432 62032846 60071290 58489628 57637042
43737 57637042 56985027 56372559 56619663 57798420 58162034 56478073 54353234 54074542 54897637
$$ packed form
43795A37001208L412431K184347j09715k827633l974450j928324J597510K830379
43787A38185753R56360p16483J69996J607805R41431p14806q63477l54587j833525
43778A37378467m497236m706102k018458l83669j989448l742165k238927Q23708
43770A18626170J366986r43555k785795k489640j768460k042657k279597j595909
43762A06087543j394736l059777n156802m991354k273466N18810J280740M08561
43754I1419519l39688o8533M92169j06187k476202n416123o723391n450175k988622
43745F8342767j363985j016628j092852j215870j620586j961556j581662q52586
43737E7637042o52015o12468K47104J178757L63614j683961k124839k78692Q23095
$$ plain form
43728 54897637 54095159 51421260 49554139 49683838 49761513 48310550 47029012 47713204 49081822
43719 49081822 48957654 47605651 46466238 45343619 43584393 42580273 44003045 46482233
43711 46482233 47262124 46704672 47805391 51136562 53636784 53203652 51395745 50274669
43703 50274669 49329742 47369107 45260674 44583579 44937213 44706659 43745829 43430187 44282337
43694 44282337 45022619 44175348 41829004 39601096 39038095 39958218 40589381 39849276 39022814
43685 39022814 40045807 42408376 43373636 41492207 38291397 36019792 35372044 36145348
43677 36145348 38371649 41504646 43756912 43632084 41419986 38381157 35459527 33549505
43669 33549505 33644630 35463858 37054032 37128182 36913549 38369977 41400210 44168707 45467762
$$ packed form
43728E4897637q02478k673899j867121J29699P7675j450963j281538O84192J368618
43719D9081822j24168j352003j139413j122619j759226j004120J422772K479188
43711D6482233P79891n57452J100719L331171K500222m33132j807907j121076
43703E0274669r44927j960635k108433o77095L53634k30554r60830l15642Q52150
43694D4282337P40282q47271k346344k227908n63001R20123O31163p40105q26462
43685C9022814J022993K362569R65260j881429l200810k271605o47748P73304
43677C6145348K226301L132997K252266j24828k212098l038829k921630j910022
43669C3549505R5125J819228J590174P4150k14633J456428L030233K768497J299055
$$ plain form
43660 45467762 45431453 44533746 43217844 42057297 41146289 39851573 38154613 37430154 38700449
43651 38700449 40964384 42593700 43486692 44289880 44433262 42954061 40748028 39912192 40992400
43642 40992400 42759956 44534410 46646697 48513029 48465878 46169302 43486625 42307659
43634 42307659 42957230 45078220 48275278 51237862 52099399 50766011 49370429 49279650 49109593
43625 49109593 47088295 44088509 42537543 43079850 44213740 45078934 46760218 50183184
43617 50183184 53982386 55666964 54675498 53228759 53619204 55296222 55734404 54087669
43609 54087669 52407142 52499697 53294968 53044905 52700119 54405106 57235007 57710210 55141331
43600 55141331 53274422 55037917 58361492 59453381 58074484 56799553 56504214 55715336
$$ packed form
43660D5467762l6309q97707j315902j160547r11008j294716j696960p24459J270295
43651C8700449K263935J629316Q92992Q03188J43382j479201k206033q35836J080208
43642D0992400J767556J774454K112287J866332m7151k296576k682677j178966
43634D2307659O49571K120990L197058K962584Q61537j333388j395582r0779j70057
43625D9109593k021298k999786j550966N42307J133890Q65194J681284L422966
43617E0183184L799202J684578r91466j446739L90445J677018M38182j646735
43609E4087669j680527R2555P95271k50063l44786J704987K829901M75203k568879
43600E5141331j866909J763495L323575J091889j378897j274931k95339p88878
$$ plain form
43592 55715336 53947146 52685427 52701056 52808720 52038426 51197100 51464158 52847343 54724359
43583 54724359 56686953 58187548 58436998 57351286 55809759 54556333 53694606 53545661
43575 53545661 54848944 57446662 59689811 59960355 58291701 56026882 54420522 53884820
43567 53884820 53948545 53656858 52667159 52045253 53024530 54878704 55402220 53990427 52709120
43558 52709120 53328856 54722005 54606651 52774345 50981524 50403877 50818205 51705582 52470929
43549 52470929 52038118 50077983 48392677 49105718 51449806 52396150 50765110 48587816
43541 48587816 47810017 47946107 48131283 49181625 51647644 53522568 52304186 48548832
43533 48548832 45260618 44233984 44968804 46825230 50024713 54216210 57897014 59916974
$$ packed form
43592E5715336j768190j261719J5629J07664p70294q41326K67058J383185J877016
43583E4724359J962594J500595K49450j085712j541527j253426q61727j48945
43575E3545661J303283K597718K243149K70544j668654k264819j606360n35702
43567E3884820O3725k91687r89699o21906R79277J854174N23516j411793j281307
43558E2709120O19736J393149j15354j832306j792821n77647M14328Q87377P65347
43549E2470929m32811j960135j685306P13041K344088R46344j631040k177294
43541D8587816p77799J36090J85176J050342K466019J874924j218382l755354
43533D8548832l288214j026634P34820J856426L199483M191497L680804K019960
$$ plain form
43525 59916974 60401283 59947334 59118744 58812976 59638902 60609265 59971644 57894800 56864009
43516 56864009 58569232 61595812 63139896 62173927 60233924 59905018 62979668 68965308
43508 68965308 74762934 77038494 75762248 74268516 75002984 76606298 76341634 73861548
43500 73861548 70783936 67712813 63924347 59584245 56170844 54561668 54226301 54298186
43492 54298186 54073237 52734755 50241744 48267309 48347979 49178743 48008522 45042822 43853250
43483 43853250 46281162 49443142 49784881 48106359 47850342 49530883 50049293 47743641
43475 47743641 45220917 45769705 48848136 51031216 50597202 49250282 49180771 50020620 49701199
43466 49701199 47606511 45632199 45863749 47963719 49520968 48846524 46868260 46002123
$$ packed form
43525E9916974M84309m53949q28590l05768Q25926R70363o37621k076844j030791
43516E6864009J705223L026580J544084r65969j940003l28906L074650N985640
43508F8965308N797626K275560j276246j493732P34468J603314k64664k480086
43500G3861548l077612l071123l788466m340102l413401j609176l35367P1885
43492E4298186k24949j338482k493011j974435Q0670Q30764j170221k965700j189572
43483D3853250K427912L161980L41739j678522k56017J680541N18410k305652
43475D7743641k522724N48788L078431K183080m34014j346920o9511Q39849l19421
43466D9701199k094688j974312K31550K099970J557249o74444j978264q66137
$$ plain form
43458 46002123 47340407 49318703 49457601 47376010 45501210 46235076 48824736 50108650
43450 50108650 48445616 45600366 44037211 43615128 42379008 39896692 38040153 38395219
43442 38395219 40370376 42279013 43163941 43075273 42474600 41914545 41701690 41576876 41262967
43433 41262967 41244431 42062732 42896382 42216111 40210911 39068647 40000218 41310396 40629617
43424 40629617 38054743 35704124 34886907 35236364 36273481 38206463 40973868 43713502
43416 43713502 45529105 45932984 44446661 40905641 36606863 34035818 34462024 36327104
43408 36327104 36974682 35740175 34316099 34009480 33875866 32373335 29907493 28247855
43400 28247855 27701476 26737579 24992860 24675695 27325198 30623675 30904068 28328066 26847309
$$ packed form
43458D6002123J338284J978296J38898k081591j874800P33866K589660J283914
43450E0108650j663034k845250j563155m22083j236120k482316j856539L55066
43442C8395219J975157J908637Q84928q8668o00673n60055k12855j24814l13909
43433D1262967j8536Q18301Q33650o80271k005200j142264R31571J310178o80779
43424D0629617k574874k350619q17217L49457J037117J932982K767405K739634
43416D3713502J815603M03879j486323l541020m298778k571045M26206J865080
43408C6327104O47578j234507j424076l06619j33614j502531k465842j659638
43400B8247855n46379r63897j744719l17165K649503L298477K80393k576002j480757
$$ plain form
43391 26847309 28615074 31090864 30920341 28405180 26288884 25850851 26352700 27075941 27504189
43382 27504189 26291375 22695264 18861968 18013483 19926365 20809180 18752345 16839655
43374 16839655 18842764 23561588 26109560 24264365 20891852 19614906 20427746 20997587
43366 20997587 20612678 20672376 21856110 23100567 23749717 24621701 25869489 25711662 23234122
43357 23234122 21081431 22686145 27248246 30378974 30155523 29539753 31448567 34302455
43349 34302455 34885270 33422567 32635874 32982954 32397726 30623010 30269407 32586155 35148090
43340 35148090 35470519 34709770 35643816 38387555 40373706 40015091 38380610 37229256 37011740
43331 37011740 37213655 37450424 37527822 37088803 35908340 34385442 33324809 33189061 33736246
$$ packed form
43391B6847309J767765K475790j70523k515161k116296m38033N01849P23241M28248
43382B7504189j212814l596111l833296q48485J912882Q82815k056835j912690
43374A6839655K003109M718824K547972j845195l372513j276946Q12840N69841
43366B0997587l84909N9698J183734J244457O49150Q71984J247788j57827k477540
43357B3234122k152691J604714M562101L130728k23451o15770J908814K853888
43349C4302455N82815j462703p86693L47080n85228j774716l53603K316748K561935
43340C5148090L22429p60749R34046K743739J986151l58615j634481j151354k17516
43331C7011740K01915K36769P7398m39019j180463j522898j060633j35748N47185
$$ plain form
43322 33736246 34429335 35047374 35710495 36376686 36710010 36668988 36842874 37716576 38780877
43313 38780877 38921547 37702744 35816668 34234088 33344005 33013565 33095977 33669256 34878798
43304 34878798 36507098 37649840 37198782 35030986 32449179 31022785 31210778 32395325
43296 32395325 33714485 34330654 33606427 32008397 31313543 32693126 34874871 35519528 34258511
43287 34258511 32864084 32396361 32033959 31311026 31581024 33867390 36626612 37402742 36019689
43278 36019689 34428417 33666187 32730182 30798571 29005159 28993510 30554129 31883937 32010578
43269 32010578 31872053 32649986 33945654 34505815 34278828 34450214 35262692 35195158 33185926
43260 33185926 30560545 29407862 29749851 29927529 29472300 29730897 31305379 32577301 31688805
$$ packed form
43322C3736246O93089O18039O63121O66191L33324m1022J73886Q73702J064301
43313C8780877J40670j218803j886076j582580q90083l30440Q2412N73279J209542
43304C4878798J628300J142742m51058k167796k581807j426394J87993J184547
43296C2395325J319160O16169p24227j598030o94854J379583K181745O44657j261017
43287C4258511j394427m67723l62402p22933K69998K286366K759222P76130j383053
43278C6019689j591272p62230r36005j931611j793412j1649J560619J329808J26641
43269C2010578j38525P77933J295668N60161k26987J71386Q12478o7534k009232
43260C3185926k625381j152683L41989J77678m55229K58597J574482J271922q88496
$$ plain form
43251 31688805 28908414 26170043 25015906 25653881 27319605 28865984 29492551 29416452 29470840
43242 29470840 29930645 30398022 30869291 31891634 33419270 34625979 35248754 35979581 37049409
43233 37049409 37642417 37295238 36549711 35502420 33266045 30039483 28188937 29535920
43225 29535920 32569023 34182672 33599628 32803171 33398092 34795043 35598982 35359223 34638938
43216 34638938 34320925 34981155 36222850 36765393 35896207 34499453 33916326 34361575 35373324
43207 35373324 37023140 39311087 41032691 41003439 40157072 40599892 42457933 43429150 41957368
43198 41957368 39338825 37955548 38560742 40049623 41084384 41272358 41205243 41684361 42654152
43189 42654152 43128295 42680511 42382619 43179301 43916970 42595001 39409141 36816375 36419286
$$ packed form
43251C1688805k780391k738371j154137O37975J665724J546379O26567p6099N4388
43242B9470840M59805M67377M71269J022343J527636J206709O22775P30827J069828
43233C7049409N93008l47179p45527j047291k236375l226562j850546J346983
43225B9535920L033103J613649n83044p96457N94921J396951Q03939k39759p20285
43216C4638938l18013O60230J241695N42543q69186j396754n83127M45249J011749
43207C5373324J649816K287947J721604k9252q46367M42820J858041R71217j471782
43198D1957368k618543j383277O05194J488881J034761J87974o7115M79118R69791
43189D2654152M74143m47784k97892P96682P37669j321969l185860k592766l97089
$$ plain form
43180 36419286 37532213 39201350 41719702 45167753 48037362 48716785 47617626 46883169
43172 46883169 48433696 52605140 57864920 61608236 62335735 61421334 61608862 63518986
43164 63518986 65081215 64750889 63452276 62586995 62135974 62061273 63671321 67621168 71866924
43155 71866924 73747239 73417020 73366819 75030414 77567378 79638037 80777832 81195934 81549955
43146 81549955 82701926 84594556 85851722 85613591 85013047 85459122 86345004 86242175 85621151
43137 85621151 86266484 88399428 90584626 92298397 94297895 96489223 97971856 99496930
43129 99496930 103102019 108370671 111715107 110911748 108166092 106974381 107891710 109307996
43121 109307996 110593263 112101028 113359441 113858022 114946089 118399465 123224915 126157917
$$ packed form
43180C6419286J112927J669137K518352L448051K869609O79423j099159p34457
43172D6883169J550527M171444N259780L743316P27499r14401J87528J910124
43164F3518986J562229l30326j298613q65281m51021p4701J610048L949847M245756
43155G1866924J880315l30219n0201J663595K536964K070659J139795M18102L54021
43146H1549955J151971J892630J257166k38131o00544M46075Q85882j02829o21024
43137H5621151O45333K132944K185198J713771J999498K191328J482633J525074
43129I9496930L605089N268652L344436q03359k745656j191711R17329J416286
43121A09307996J285267J507765J258413M98581J088067L453376M825450K933002
$$ plain form
43113 126157917 125551441 122866673 120121268 117861684 116182703 115748157 116618217 117421903
43105 117421903 116977791 115933924 115706574 116350765 116537868 115452483 113856208 113099530 113444111
43096 113444111 113568904 111882845 108455517 105293183 104174531 104514851 104175260 102187542
43088 102187542 99610450 97688053 96487782 95753863 95703173 96119497 95897182 94658704 93789473
43079 93789473 94415578 95176537 93837023 90786289 88940256 89883501 91974525 93036329
43071 93036329 93251692 94127995 95824544 97094170 97260163 96729724 95797798 94439089 93426044
43062 93426044 94223539 97066140 100010559 100718364 98894330 96531049 95970613 97903485
43054 97903485 100887104 102632814 102178491 100931807 101004737 102383174 102702876 100465341 97488297
$$ packed form
43113A26157917o06476k684768k745405k259584j678981m34546Q70060Q03686
43105A17421903m44112j043867k27350O44191J87103j085385j596275p56678L44581
43096A13444111J24793j686059l427328l162334j118652L40320l39591j987718
43088A02187542k577092j922397j200271p33919n0690M16324k22315j238478q69231
43079I3789473O26105P60959j339514l050734j846033R43245K091024J061804
43071I3036329K15363Q76303J696549J269626J65993n30439r31926j358709j013045
43062I3426044P97495K842601K944419P07805j824034k363281n60436J932872
43054I7903485K983619J745710m54323j246684P2930J378437L19702k237535k977044
$$ plain form
43045 97488297 96858389 98893107 100690224 99858165 97178507 94828052 93252645 91148483
43037 91148483 87933256 84758411 82950910 82501653 82377583 81518320 79247771 75577970
43029 75577970 71698164 69463491 69507803 70137256 69007954 66006900 63646457 64073284 66162636
43020 66162636 66407638 62851022 57466231 53984833 53639877 54056666 52676679 50139928
43012 50139928 49048181 49990197 50637963 49136523 46565687 44848435 43697465 41557156
43004 41557156 38804444 37675371 38806556 40014802 39450649 38228116 38516216 40232632
42996 40232632 41289382 40484722 38546759 36600225 35195065 34879960 36062013 37686227
42988 37686227 37456894 34494626 31004930 30102099 32165799 34353605 33886370 31049911
$$ packed form
43045I7488297o29908K034718J797117q32059k679658k350455j575407k104162
43037I1148483l215227l174845j807501m49257j24070q59263k270549l669801
43029G5577970l879806k234673M4312O29453j129302l001054k360443M26827K089352
43020F6162636K45002l556616n384791l481398l44956M16789j379987k536751
43012E0139928j091747R42016O47766j501440k570836j717252j150970k140309
43004D1557156k752712j129073J131185J208246n64153j222533K88100J716416
42996D0232632J056750q04660j937963j946534j405160l15105J182053J624214
42988C7686227k29333k962268l489696r02831K063700K187806m67235k836459
$$ plain form
42980 31049911 28492515 28014835 28779921 28783790 27377027 25588216 24197810 22648463 20482266
42971 20482266 18952108 19881782 22955460 25319229 24419116 20647895 16821385 15566671
42963 15566671 17495108 21188945 24280391 24956181 23203845 20667986 19012553 18574147
42955 18574147 18729113 18965834 19046724 18698358 18059306 18120751 19630262 21583013 22008196
42946 22008196 20598055 19380953 20104856 22028647 23282257 23396263 23048226 22106026 20003464
42937 20003464 18007160 18736648 22401492 25416031 24399511 20329736 17019849 16451886
42929 16451886 17566550 18935415 20195246 20827506 19952372 18025344 16727600 16359648
42921 16359648 15278863 12905960 11257419 12062524 14235351 15949001 17399408 19288489
$$ packed form
42980C1049911k557396m77680P65086L869j406763j788811j390406j549347k166197
42971B0482266j530158R29674L073678K363769r00113l771221l826510j254714
42963A5566671J928437L693837L091446O75790j752336k535859j655433m38406
42955A8574147J54966K36721Q0890l48366o39052O1445J509511J952751M25183
42946B2008196j410141j217102P23903J923791J253610J14006l48037r42200k102562
42937B0003464j996304P29488L664844L014539j016520m069775l309887n67963
42929A6451886J114664J368865J259831O32260q75134j927028j297744l67952
42921A6359648j080785k372903j648541Q05105K172827J713650J450407J889081
$$ plain form
42913 19288489 20218238 18557116 16046791 16374495 20135641 24035476 25434591 25009831
42905 25009831 24310376 23410993 22183546 21521609 21717826 21413585 19660709 17522757 16297592
42896 16297592 15688346 15165489 15608873 17869798 20868461 22793172 23274090 22974368 22129913
42887 22129913 20969799 20382035 20508523 19907294 17942732 16665071 18029725 20453799
42879 20453799 20902640 19546612 19136032 20048784 19585199 16876315 14967789 16288417 18832544
42870 18832544 19115292 17016969 15390117 16109276 18662989 21815465 24552102 25703807
42862 25703807 24524156 21875219 19637584 18744418 18548530 18043679 16997537 15981194
42854 15981194 15801659 16644983 17415892 16588292 14335415 12967046 14167803 16479158 16995354
$$ packed form
42913A9288489R29749j661122k510325L27704L761146L899835J399115m24760
42905B5009831o99455q99383j227447o61937J96217l04241j752876k137952j225165
42896A6297592o09246n22857M43384K260925K998663J924711M80918k99722q44455
42887B2129913j160114n87764J26488o01229j964562j277661J364654K424074
42879B0453799M48841j356028m10580R12752m63585k708884j908526J320628K544127
42870A8832544K82748k098323j626852P19159K553713L152476K736637J151705
42862B5703807j179651k648937k237635q93166j95888n04851j046142j016343
42854A5981194j79535Q43324P70909q27600k252877j368369J200757K311355N16196
$$ plain form
42845 16995354 15335353 14306065 16228029 19987627 22572814 22534145 20781600 18513692
42837 18513692 15872590 13022784 11280287 11895475 14054009 15444799 15121575 14530792
42829 14530792 14953369 15287079 13940540 11964688 11956377 13859612 14415105 11819803 8710948
42820 8710948 8682013 11407723 13540321 13628071 13577339 15078161 16902305 16811642 14693891
42811 14693891 12541007 11997254 12944174 14211360 14867593 14780357 14432398 14478158 15416546
42802 15416546 17410300 19992853 21862733 21567311 18939879 15531467 13068424 11782898
42794 11782898 10814721 9747705 8776556 7684207 5993776 4359256 4569555 7518097
42786 7518097 11952382 15770232 17838150 18093532 16825600 14698471 12708173 11120667
$$ packed form
42845A6995354j660001j029288J921964L759598K585187l8669j752545k267908
42837A8513692k641102k849806j742497O15188K158534J390790l23224n90783
42829A4530792M22577L33710j346539j975852q311J903235N55493k595302l108855
42820H710948k8935K725710K132598Q7750n0732J500822J824144r0663k117751
42811A4693891k152884n43753R46920J267186O56233q7236l47959M5760R38388
42802A5416546J993754K582553J869880k95422k627432l408412k463043j285526
42794A1782898r68177j067016r71149j092349j690431j634520K10299K948542
42786G518097M434285L817850K067918K55382j267932k127129j990298j587506
$$ plain form
42778 11120667 9110303 6589457 5670383 8491370 13634328 16756971 15630338 12816112
42770 12816112 11953870 12875169 12561090 10199603 8546978 9708154 12018070 12694094 11894281
42761 11894281 12004968 13662594 14701362 13170633 9623899 5959563 3459853 2619266
42753 2619266 3584858 5720858 7518305 7939529 7519919 7541944 8519683 9963373 11110610
42744 11110610 11373099 10631946 9706935 10007325 12030253 14609820 16228621 16525187 15813962
42735 15813962 13840318 10283229 6345092 4541172 6331258 10457889 13997719 14930690
42727 14930690 13702687 12448694 12624941 13485017 13334313 12116850 11611218 12669670 13710788
42718 13710788 13130805 11966124 12339821 13969636 14382237 12591122 10472159 9958876 10684235
$$ packed form
42778A1120667k010364k520846r19074K820987N142958L122643j126633k814226
42770A2816112q62242R21299l14079k361487j652625J161176K309916O76024p99813
42761A1894281J10687J657626J038768j530729l546734l664336k499710q40587
42753B619266R65592K136000J797447M21224m19610K2025R77739J443690J147237
42744A1110610K62489p41153r25011L00390K022928K579567J618801K96566p11225
42735A5813962j973644l557089l938137j803920J790086M126631L539830R32971
42727A4930690j228003j253993J76247Q60076j50704j217463n05632J058452J041118
42718A3710788n79983j164681L73697J629815M12601j791115k118963n13283P25359
$$ plain form
42709 10684235 11204154 10954164 9973456 8135980 5990597 5267314 7010412 9771280 10997672
42700 10997672 9905607 7882913 6432579 5931427 6200239 6940442 7377110 6605525 4838010
42691 4838010 3634550 4415700 7108675 10459839 13206136 14664889 14633325 13219934 10758861
42682 10758861 7706308 4643173 2361178 1665263 2792081 4987311 6887274 7640275
42674 7640275 7742012 8411355 9800768 10234631 8062384 4245087 2014428 3398215 6970648
42665 6970648 9888163 11329079 12576642 14145306 14679189 13239805 11133681 10252788
42657 10252788 10495668 10223221 8870598 7634660 7474946 7862985 8101906 8638726 10027833
42648 10027833 11509757 11995873 11932904 12514695 13071676 11205532 6399232 1873367 1328934
$$ packed form
42709A0684235N19919k49990r80708j837476k145383p23283J743098K760868J226392
42700A0997672j092065k022694j450334n01152K68812P40203M36668p71585j767515
42691D838010j203460P81150K692975L351164K746297J458753l1564j413391k461073
42682A0758861l052553l063135k281995o95915J126818K195230J899963P53001
42674G640275J01737O69343J389413M33863k172247l817297k230659J383787L572433
42665F970648K917515J440916J247563J568664N33883j439384k106124q80893
42657A0252788K42880k72447j352623j235938j59714L88039K38921N36820J389107
42648A0027833J481924M86116o2969N81791N56981j866144m806300m525865n44433
$$ plain form
42639 1328934 4773464 9122883 12199459 14214358 15588611 15682389 14489234 13655457 14311805
42630 14311805 15017991 13473517 9799374 6688819 6341611 8393029 11038115 13195869
42622 13195869 14999794 16646241 17476994 16555302 14125540 11982562 11690127 12563456 12433122
42613 12433122 10688202 9371665 10437520 12990405 14524174 14154315 13080061 12276921
42605 12276921 11568041 11071125 11626076 13052910 13698379 12943582 12798211 15342841 19410631
42596 19410631 21699706 20975523 19259974 18468775 17745150 15358599 11977872 10277498
42588 10277498 11537864 14167781 15925479 16417696 16734580 17456896 17996945 17704224 16887127
42579 16887127 16585077 17515312 19128097 19690568 17860460 14478605 12115337 12235726 13502968
$$ packed form
42639A328934L444530M349419L076576K014899J374253R3778j193155q33777O56348
42630A4311805P06186j544474l674143l110555l47208K051418K645086K157754
42622A3195869J803925J646447Q30753r21692k429762k142978k92435Q73329j30334
42613A2433122j744920j316537J065855K552885J533769l69859j074254q03140
42605A2276921p08880m96916N54951J426834O45469p54797j45371K544630M067790
42596A9410631K289075p24183j715549p91199p23625k386551l380727j700374
42588A0277498J260366K629917J757698M92217L16884P22316N40049k92721q17097
42579A6887127l02050R30235J612785N62471j830108l381855k363268J20389J267242
$$ plain form
42570 13502968 13765423 13025861 13126237 14903287 17237653 18853009 19374138 18495277 16133228
42561 16133228 13997766 14726990 18088036 20129941 18104424 14439887 13281065 14541702
42553 14541702 14713510 12925905 12236762 14133066 15583916 13796271 11057811 11760414
42545 11760414 16083794 19757960 19710985 17193411 15012334 14170783 14370090 15981279 19633870
42536 19633870 24327978 27508559 27499675 25268672 23349491 23269346 24443187 25460477 25740709
42527 25740709 25531963 24945343 23888976 22691978 21808396 20964809 19641431 18389585 18359768
42518 18359768 19245723 19179955 17348689 15264262 14481904 14513513 14344521 14621789 16464258
42509 16464258 19053376 20513493 20746772 21364605 22961076 24391698 24753226 24187281 22684759
$$ packed form
42570A3502968K62455p39562J00376J777050K334366J615356N21129q78861k362049
42561A6133228k135462P29224L361046K041905k025517l664537j158822J260637
42553A4541702J71808j787605o89143J896304J450850j787645k738460P02603
42545A1760414M323380L674166m6975k517574k181077q41551J99307J611189L652591
42536A9633870M694108L180581q884k231003j919181q0145J173841J017290K80232
42527B5740709k08746n86620j056367j196998q83582q43587j323378j251846k9817
42518A8359768Q85955o5768j831266k084427p82358L1609j68992K77268J842469
42509A6464258K589118J460117K33279O17833J596471J430622L61528n65945j502522
$$ plain form
42500 22684759 20146838 17874009 17781798 19513750 20459282 19443944 18231154 18344467 18786572
42491 18786572 18483395 18609179 20179753 21305794 19731417 16858052 16151417 18114371
42483 18114371 19910559 19938832 19702312 20528551 21321121 20865495 20056005 20179495 20625661
42474 20625661 19950160 18124057 16366209 15610562 16202108 18124597 20418368 21351228 20368936
42465 20368936 18983519 18536691 18128769 16316001 13905952 13004196 13706898 14031770 13349239
42456 13349239 13512195 15503348 17014367 15356654 11697157 10034972 11937727 14518838
42448 14518838 14640814 13280279 13687464 16102444 17023593 14343104 10758232 10279166 12990119
42439 12990119 15647864 16549716 16965505 17744324 17501084 15284854 12601860 11121339 10228068
$$ packed form
42500B2684759k537921k272829r2211J731952R45532j015338j212790J13313M42105
42491A8786572l03177J25784J570574J126041j574377k873365p06635J962954
42483A8114371J796188K8273k36520Q26239P92570m55626q09490J23490M46166
42474B0625661o75501j826103j757848p55647N91546J922489K293771R32860r82292
42465B0368936j385417m46828m07922j812768k410049r01756P02702L24872o82531
42456A3349239J62956J991153J511019j657713l659497j662185J902755K581111
42448A4518838J21976j360535M07185K414980R21149k680489l584872m79066K710953
42439A2990119K657745R01852M15789P78819k43240k216230k682994j480521q93271
$$ plain form
42430 10228068 8715758 7430802 8115136 10526190 12711809 13594390 13511251 12713320 11161865
42421 11161865 9555713 8901937 9213828 9958185 11243715 13006902 13786025 12433830 10607866
42412 10607866 11156089 14044326 16306484 16287869 15446194 15359428 15457369 14736315 13457531
42403 13457531 11950147 9834436 7720080 7558401 9748651 11902024 12269674 12432406
42395 12432406 14360220 16523478 15741291 12033005 8883536 8811293 10893480 12749162
42387 12749162 13039448 11755230 9676295 8030638 7652793 8238168 9041120 9950569 11090259
42378 11090259 11976477 12110843 11812504 11460546 10746497 9838728 10160731 12341444 14427176
42369 14427176 14225302 12672766 12498549 13948248 14461986 12760383 10708960 10447600 11817651
$$ packed form
42430A0228068j512310j284956O84334K411054K185619Q82581q3139p97931j551455
42421A1161865j606152o53776L11891P44357J285530J763187P79123j352195j825964
42412A0607866N48223K888237K262158j8615q41675q6766R7941p21054j278784
42403A3457531j507384k115711k114356j61679K190250K153373L67650J62732
42395A2432406J927814K163258p82187l708286l149469p2243K082187J855682
42387A2749162K90286j284218k078935j645657l77845N85375Q02952R09449J139690
42378A1090259Q86218J34366k98339l51958p14049r07769L22003K180713K085732
42369A4427176k01874j552536j74217J449699N13738j701603k051423k61360J370051
$$ plain form
42360 11817651 13481323 14735180 15256090 14584441 12862976 11072246 9990226 9799914
42352 9799914 10625649 12072040 12489782 10648693 8109361 7665066 9230614 9888842 8594628
42343 8594628 7880810 9588666 11759583 11734755 9964638 8570102 8225374 8770843 10858774
42334 10858774 14253108 16271119 15097309 13394459 15145272 19500241 21374303 18388719
42326 18388719 13869504 12051275 13182850 14751358 15238137 14962608 14724520 15140331 16371891
42317 16371891 17462147 16871068 14547780 12500167 12386642 13401638 13482268 11885228 9630674
42308 9630674 7962607 7309265 7448283 7923389 8446345 9340910 11240955 13873509 15637127
42299 15637127 15204637 13392387 12599392 14161383 16862554 18450986 18109382 16699667
$$ packed form
42360A1817651J663672J253857N20910o71649j721465j790730j082020j90312
42352I799914Q25735J446391M17742j841089k539332m44295J565548O58228j294214
42343H594628p13818J707856K170917k4828j770117j394536l44728N45469K087931
42334A0858774L394334K018011j173810j702850J750813M354969J874062k985584
42326A8388719m519215j818229J131575J568508M86779k75529k38088M15811J231560
42317A6371891J090256n91079k323288k047613j13525J014996Q0630j597040k254554
42308I630674j668067o53342J39018M75106N22956Q94565J900045K632554J763618
42299A5637127m32490j812250p92995J561991K701171J588432l41604j409715
$$ plain form
42291 16699667 14855024 12154464 8860394 7230147 9376699 14111371 17736487 18245250
42283 18245250 16934264 15389290 13243363 10400763 9150595 11368160 14966361 16206677
42275 16206677 15016053 14826135 16976873 18616882 17312025 14758568 13903646 14545690
42267 14545690 14189743 11996701 9595047 8605579 9286203 11213560 13540288 14815819
42259 14815819 14245816 13115550 13401716 14869969 15158230 13181297 10931007 10972224 13179747
42250 13179747 15009722 14466510 11920890 9335648 8506754 9917774 12567329 14761733
42242 14761733 15430037 14689784 13053177 10673881 8038005 6771472 8289529 11427482
42234 11427482 12894711 11004302 7894834 6921920 8714771 11169412 12558508 12815857
$$ packed form
42291A6699667j844643k700560l294070j630247K146552M734672L625116N08763
42283A8245250j310986j544974k145927k842600j250168K217565L598201J240316
42275A6206677j190624j89918K150738J640009j304857k553457q54922O42044
42267A4545690l55947k193042k401654r89468O80624J927357K326728J275531
42259A4815819n70003j130266K86166J468253K88261j976933k250290M1217K207523
42250A3179747J829975n43212k545620k585242q28894J411020K649555K194404
42242A4761733O68304p40253j636607k379296k635876j266533J518057L137953
42234A1427482J467229j890409l109468r72914J792851K454641J389096K57349
$$ plain form
42226 12815857 12126730 10463788 8857545 8999959 10702233 11523026 9970140 7488056
42218 7488056 6173682 6119398 6282048 6360446 6308412 5583786 4601903 5299949 8188229 10436997
42208 10436997 9419642 6812213 6303507 8311097 10203259 11044101 12458570 14799071
42200 14799071 16146720 15783996 15311172 15413838 14711884 12900376 11902118 12593432 13409098
42191 13409098 13588074 14643457 16909018 17881849 16225947 14438354 15074401 17106941
42183 17106941 18530247 19582920 20460149 19016716 14583676 11291068 12994590 16852474
42175 16852474 16823076 12280899 8127004 7035274 6921268 6293727 6700795 8514156 9114609
42166 9114609 7393402 6131000 7639883 10374822 12063150 13048843 14109747 13881172
$$ packed form
42226A2815857o89127j662942j606243J42414J702274Q20793j552886k482084
42218G488056j314374n4284J62650P8398n2034p24626r81883O98046K888280K248768
42208A0436997j017355k607429n08706K007590J892162Q40842J414469K340501
42200A4799071J347649l62724m72824J02666p01954j811508r98258O91314Q15666
42191A3409098J78976J055383K265561R72831j655902j787593O36047K032540
42183A7106941J423306J052673Q77229j443433m433040l292608J703522L857884
42175A6852474k9398m542177m153895j091730j14006o27541M07068J813361O00453
42166I114609j721207j262402J508883K734939J688328R85693J060904k28575
$$ plain form
42158 13881172 11348576 8703900 8778552 11093592 13018799 13700188 14499013 16329629 18495729
42149 18495729 19571923 18143209 13697551 8039157 4540545 4622861 6274179 7285714
42141 7285714 8184577 10259241 12545881 13139930 12189492 11199130 10404587 9230734 8451224
42132 8451224 9332971 11161237 12040830 11766725 11545378 11295985 9899231 8071590 8142718
42123 8142718 10344633 11827484 10430302 7494962 5836481 6448506 8238848 9799439
42115 9799439 10524131 10841080 11819005 13689614 14789527 13381855 10584930 9601025 11451001
42106 11451001 13381791 12577265 9805268 8010080 8552085 10340427 11866124 12693971
42098 12693971 13344187 14635105 16720800 18260288 17437924 14460169 11859555 11364818
$$ packed form
42158A3881172k532596k644676P4652K315040J925207O81389P98825J830616K166100
42149A8495729J076194j428714m445658n658394l498612Q2316J651318J011535
42141G285714Q98863K074664K286640N94049r50438r90362p94543j173853p79510
42132H451224Q81747J828266Q79593k74105k21347k49393j396754j827641P1128
42123H142718K201915J482851j397182k935340j658481O12025J790342J560591
42115I799439P24692L16949R77925J870609J099913j407672k796925r83905J849976
42106A1451001J930790q04526k771997j795188N42005J788342J525697Q27847
42098A2693971O50216J290918K085695J539488q22364k977755k600614m94737
$$ plain form
42090 11364818 11788927 11389450 10946412 12380811 15092811 16135277 14101327 10678336
42082 10678336 7922418 6030056 4616746 4286259 5525833 7320416 8321312 8558829
42074 8558829 8702755 8429095 7068989 5428219 5288083 7021291 9109829 10276054 10795643
42065 10795643 11280717 11403407 10532551 8697353 6267981 3619263 1829371 2635248 6525990
42056 6525990 11574628 15288765 16999121 17338909 16341729 13863867 11287698 10506603 11089868
$$ packed form
42090A1364818M24109l99477m43038J434399K712000J042466k033950l422991
42082A0678336k755918j892362j413310l30487J239574J794583J000896K37517
42074H558829J43926k73660j360106j640770j40136J733208K088538J166225N19589
42065A0795643M85074J22690q70856j835198k429372k648718j789892Q05877L890742
42056F525990N048638L714137J710356L39788r97180k477862k576169p81095N83265
$$ [...]
##END NTUPLES=NMR SPECTRUM
##END=
