##TITLE=31Pdec_LR-618-R3-CR20
 CDCl3, 124 sc
 29.06.2021
##JCAMPDX= 6.0         $$ Bruker NMR JCAMP-DX V2.0
##DATA TYPE= NMR SPECTRUM
##DATA CLASS= NTUPLES
##ORIGIN= UXNMR, Bruker Analytische Messtechnik GmbH
##OWNER= root
$$ XWIN-NMR		Version 3.5
$$ Tue Jun 29 13:38:55 2021 Russian Standard Time (UT+4h)  she@DPX200
##.OBSERVE FREQUENCY= 81.013821
##.OBSERVE NUCLEUS= ^31P
##.ACQUISITION MODE= SIMULTANEOUS
##.ACQUISITION SCHEME= undefined
##.AVERAGES= 124
##.DIGITISER RES= 16
##SPECTROMETER/DATA SYSTEM= spect
##.PULSE SEQUENCE= zgpg30
##.SOLVENT NAME= DMSO
##.SHIFT REFERENCE= (INTERNAL, DMSO, 0, 248.564)
##AUDIT TRAIL= $$ (NUMBER, WHEN, WHO, WHERE, WHAT)
$$ ##TITLE= Audit trail, XWIN-NMR		Version 3.5
$$ ##JCAMPDX= 5.01
$$ ##ORIGIN= Bruker BioSpin GmbH
$$ ##OWNER= she
$$ F:/spectra/data/she/nmr/P31/1/pdata/1/auditp.txt
$$ ##AUDIT TRAIL=  $$ (NUMBER, WHEN, WHO, WHERE, WHAT)
(   1,<2021-06-29 13:37:38.31 +0400>,<she>,<DPX200>,
      <continue with go, POWCHK disabled, PULCHK disabled
       configuration hash MD5:
       00 E9 B6 7A A2 85 ED C7 34 08 36 98 17 FE 4E 26
       data hash MD5: 32K
       BF 57 49 BF 6A F2 C6 E9 56 EC FC C7 78 AB 4F C6>)
(   2,<2021-06-29 13:37:50.17 +0400>,<she>,<DPX200>,
      <Start of raw data processing
       efp BC_mod = 2 LB = 1 FT_mod = 6 PKNL = 1 PHC0 = -6781.126 PHC1 = 308.0861 SI = 64K 
       data hash MD5: 64K
       C3 25 D0 BC 2B 63 9E 25 FA 87 17 E7 80 B3 83 AB>)
(   3,<2021-06-29 13:38:12.00 +0400>,<she>,<DPX200>,
      <pk PHC0 = -66.55783 PHC1 = 233.6001 
       data hash MD5: 64K
       5B 75 C2 C0 72 E9 C4 51 A2 3B FB 83 4D 48 09 FC>)
(   4,<2021-06-29 13:38:15.56 +0400>,<she>,<DPX200>,
      <abs ABSG = 5 
       data hash MD5: 64K
       D8 62 A3 F4 70 E8 E0 A0 D1 1B E6 5A 8E 9D 4E F1>)
$$ ##END=
$$ 
$$ hash MD5
$$ F0 83 17 3C 53 DC 9D 4E 75 DF 59 10 29 D8 39 59
##$RELAX= 
##$RELAX= 
##$RELAX= 
##$RELAX= 
##$RELAX= 
##$RELAX= 
##$RELAX= 
##$RELAX= 
$$ Bruker specific parameters
$$ --------------------------
##$DU= <F:/spectra>
##$EXPNO= 1
##$NAME= <P31>
##$PROCNO= 1
##$TYPE= <nmr>
##$USER= <she>
##$AMP= (0..31)
100 100 100 100 100 100 100 100 100 100 100 100 100 100 100 100 100 100 
100 100 100 100 100 100 100 100 100 100 100 100 100 100 
##$AQSEQ= 0
##$AQ_mod= 1
##$AUNM= <au_zg>
##$AUTOPOS= <>
##$BF1= 81.014009
##$BF2= 200.13
##$BF3= 200.13
##$BF4= 200.13
##$BF5= 200.13
##$BF6= 200.13
##$BF7= 200.13
##$BF8= 200.13
##$BYTORDA= 1
##$CFDGTYP= 0
##$CFRGTYP= 5
##$CHEMSTR= <none>
##$CNST= (0..31)
1 1 145 1 1 1 1 1 1 1 1 1 1 1 1 1 1 1 1 1 1 1 1 1 1 1 1 1 1 1 1 1 
##$CPDPRG= <waltz16>
##$CPDPRG1= <>
##$CPDPRG2= <waltz16>
##$CPDPRG3= <>
##$CPDPRG4= <mlev>
##$CPDPRG5= <mlev>
##$CPDPRG6= <mlev>
##$CPDPRG7= <mlev>
##$CPDPRG8= <mlev>
##$CPDPRGB= <>
##$CPDPRGT= <>
##$D= (0..31)
0 1 0 0 0 0 0 0 0 0 0 0.03 2e-05 3e-06 0 0 0 0 0 0 0 0 0 0 0 0 0 0 0 0 
0 0 
##$DATE= 1624959295
##$DBL= (0..7)
120 120 120 11 120 120 24 19 
##$DBP= (0..7)
150 150 150 150 150 150 150 150 
##$DBP07= 0
##$DBPNAM0= <>
##$DBPNAM1= <>
$$ [...]
##$SUBNAM3= <"">
##$SUBNAM4= <"">
##$SUBNAM5= <"">
##$SUBNAM6= <"">
##$SUBNAM7= <"">
##$SUBNAM8= <"">
##$SUBNAM9= <"">
##$SW= 501.771253377433
##$SWIBOX= (0..15)
0 1 3 0 0 0 0 0 0 0 0 0 0 0 0 0 
##$SW_h= 40650.406504065
##$TD= 32768
##$TD0= 1
##$TE= 0
##$TE2= 300
##$TE3= 300
##$TEG= 300
##$TL= (0..7)
0 120 53 12 22 120 120 120 
##$TP= (0..7)
150 150 150 150 150 150 150 150 
##$TP07= 0
##$TPNAME0= <>
##$TPNAME1= <>
##$TPNAME2= <>
##$TPNAME3= <>
##$TPNAME4= <>
##$TPNAME5= <>
##$TPNAME6= <>
##$TPNAME7= <>
##$TPOAL= (0..7)
0.5 0.5 0.5 0.5 0.5 0.5 0.5 0.5 
##$TPOFFS= (0..7)
0 0 0 0 0 0 0 0 
##$TUNHIN= 0
##$TUNHOUT= 0
##$TUNXOUT= 0
##$USERA1= <user>
##$USERA2= <user>
##$USERA3= <user>
##$USERA4= <user>
##$USERA5= <user>
##$V9= 5
##$VALIST= <valist>
##$VCLIST= <CCCCCCCCCCCCCCC>
##$VD= 0
##$VDLIST= <DDDDDDDDDDDDDDD>
##$VPLIST= <PPPPPPPPPPPPPPP>
##$VTLIST= <TTTTTTTTTTTTTTT>
##$WBST= 1024
##$WBSW= 4
##$XGAIN= (0..3)
0 0 0 0 
##$XL= 0
##$YL= 0
##$YMAX_a= 17119
##$YMIN_a= -22906
##$ZGOPTNS= <>
##$ZL1= 120
##$ZL2= 120
##$ZL3= 120
##$ZL4= 120
##$ABSF1= 248.5645
##$ABSF2= -253.2056
##$ABSG= 5
##$ABSL= 3
##$ALPHA= 0
##$AQORDER= 0
##$ASSFAC= 0
##$ASSFACI= 0
##$ASSFACX= 0
##$ASSWID= 0
##$AUNMP= <proc_1d>
##$AZFE= 0.1
##$AZFW= 0.5
##$BCFW= 0
##$BC_mod= 2
##$BYTORDP= 0
##$COROFFS= 0
##$CY= -3
##$DATMOD= 1
##$DC= 0
##$DFILT= <>
##$DTYPP= 0
##$F1P= 0
##$F2P= 0
##$FCOR= 1
##$FTSIZE= 65536
##$FT_mod= 6
##$GAMMA= 0
##$GB= 0
##$INTBC= 1
##$INTSCL= 5.30512e-09
##$ISEN= 30
##$LB= 1
##$LEV0= 0
##$LPBIN= 0
##$MAXI= 10000
##$MC2= 0
##$MEAN= 0
##$ME_mod= 0
##$MI= 50
##$NCOEF= 0
##$NC_proc= -7
##$NLEV= 6
##$NOISF1= 182.463
##$NOISF2= 159.3651
##$NSP= 0
##$NTH_PI= 0
##$NZP= 0
##$OFFSET= 248.5645
##$PC= 4
##$PHC0= -6847.684
##$PHC1= 541.6862
##$PH_mod= 1
##$PKNL= yes
##$PPARMOD= 0
##$PSCAL= 0
##$PSIGN= 0
##$REVERSE= no
##$SF= 81.014009
##$SI= 65536
##$SIGF1= 159.3651
##$SIGF2= -187.1042
##$SINO= 113.3802
##$SIOLD= 16384
##$SREGLST= <1H.CDCl3>
##$SSB= 0
##$STSI= 65536
##$STSR= 0
##$SW_p= 40650.406504065
##$SYMM= 0
##$S_DEV= 0
##$TDeff= 32768
##$TDoff= 0
##$TI= <>
##$TILT= no
##$TM1= 0
##$TM2= 0
##$TOPLEV= 0
##$USERP1= <user>
##$USERP2= <user>
##$USERP3= <user>
##$USERP4= <user>
##$USERP5= <user>
##$WDW= 1
##$XDIM= 65536
##$YMAX_p= 326216342
##$YMIN_p= -44454002
$$ End of Bruker specific parameters
$$ ---------------------------------
##NTUPLES= NMR SPECTRUM
##VAR_NAME=  FREQUENCY,     SPECTRUM/REAL,   SPECTRUM/IMAG
##SYMBOL=    X,             R,               I
##VAR_TYPE=  INDEPENDENT,   DEPENDENT,       DEPENDENT
##VAR_FORM=  AFFN,          ASDF,            ASDF
##VAR_DIM=   65536,         65536,           65536
##UNITS=     HZ,            ARBITRARY UNITS, ARBITRARY UNITS
##FACTOR=    0.620285442955139, 1,           1
##FIRST=     20137.2065510759, 0,            0
##LAST=      -20513.1999529892, 0,           0
##MIN=       -20513.1999529892, -44454002,   0
##MAX=       20137.2065510759, 326216342,    0
$$ Real data points
##PAGE= N=1
##DATA TABLE= (X++(R..R)), XYDATA
$$ [...]
15098 -991069 1686677 4971103 5819316 1565662 -3668755 -3196025 1639423 3204758 346761
15089 346761 314790 5938606 10173651 7433533 2130994 678579 1914349 1563886 748268
15080 748268 3427841 8896636 12840484 13702954 13168179 12209235 10840304 9973009 9701301
15071 9701301 7602309 2507273 -1863586 -1043820 3743090 7252603 7396136 6778811 7441676
15062 7441676 8059022 7028420 5137973 3993726 4012907 4927203 6406527 7224701 5492696
15053 5492696 1101765 -3065800 -3858495 -1581762 242970 -854388 -3448450 -4723042
15045 -4723042 -4932336 -7173674 -12311292 -16484886 -15302666 -8841190 -762637 5615841
15037 5615841 8088468 4865125 -2799489 -8663812 -7230417 -1467356 327586 -3807838
15029 -3807838 -6791267 -3827008 -245447 -3014846 -9186096 -9730822 -2756419 4285814
15021 4285814 5619892 3652895 2730456 2505419 1162450 592709 3365852 7114491 7187924
15012 7187924 4103355 3278599 6611357 9041539 5883541 -123593 -2749625 -1022166
15004 -1022166 298879 -1617002 -4031420 -3739459 -1894968 -1392614 -2381748 -3401900 -4808612
14995 -4808612 -7346461 -8416960 -4020732 4989203 12189792 12732653 8662514 5352286
14987 5352286 4777357 4623304 2758508 -10480 -1605648 -1183469 579215 2582174 3972278
14978 3972278 4175897 2999231 1042798 -252650 179910 1341429 633781 -2901620 -6654961
14969 -6654961 -7475110 -6085140 -6068585 -8285184 -9219681 -6243123 -1744309 426328 431936
14960 431936 986619 1684616 -944986 -7124814 -11463485 -9086578 -1705902 4780751 7111854
14951 7111854 6728639 6277316 6808699 8143396 9465262 9189851 6284644 2238162 -2114
14942 -2114 539377 2228285 3813264 5642346 7094034 5719612 1088951 -2858596 -2281258
14933 -2281258 1189441 2759521 1329431 427506 2186118 4151956 3515502 1427819
14925 1427819 829420 1996888 2716345 1810464 221765 -1002159 -1841266 -2327704 -2021645
14916 -2021645 -1027074 -537805 -1516017 -3003494 -2453577 1643079 7417583 10607695 8589563
14907 8589563 3265311 -609177 33269 3810200 6282123 4179025 -841110 -2809366
14899 -2809366 2356614 10982913 14724669 10878233 6292683 8110758 13869439 15461682
14891 15461682 10720359 5151824 2760706 1548165 -697548 -2114640 -781526 1812357
14883 1812357 3887010 5499922 5144957 -543743 -10008978 -14803006 -9610457 -408529
14875 -408529 3011294 -338170 -3542012 -2959051 -1495367 -1285486 -166287 3017705 5305424
14866 5305424 4323887 1904983 458195 -900563 -3817880 -6745856 -6545186 -3102321
14858 -3102321 -33437 -685187 -4520980 -7776253 -7511507 -4663427 -2390024 -1729640 -889552
14849 -889552 613760 83045 -3788792 -7091836 -5067277 1245741 6726548 9535859
14841 9535859 12017104 14202763 12013677 4367340 -2549566 -2349825 2741947 4724419
14833 4724419 624891 -4160230 -4264275 -1807681 -2388942 -6351664 -8600137 -6739565
14825 -6739565 -4600711 -5795781 -7810606 -5972236 -556576 4085004 5615879 4699719
14817 4699719 1578336 -3248061 -5914648 -2626725 3623383 5574501 1596950 -2803362
14809 -2803362 -4008081 -3900045 -3143843 999085 7127368 8477500 3920734 1794451
14801 1794451 6701071 10925727 6894078 103260 -368223 2716026 829925 -3835780
14793 -3835780 -1555299 7377965 11948023 7727078 2118405 340146 -1504882 -5603567
14785 -5603567 -6203345 -131842 5635932 3573370 -3885482 -9148021 -9292943 -6298316
14777 -6298316 -2479600 -9513 -564779 -2108592 -486036 3464036 3919362 -465074
14769 -465074 -3603839 -1656795 1159217 570006 -595235 1656897 5242609 6191498 5136974
14760 5136974 4433166 3414498 1461430 1126464 3252961 3747518 370479 -2183388 352164
14751 352164 4269190 4092934 1847426 2954297 6443046 6841073 3519489 899657 835912
14742 835912 1502973 2636445 5191551 6452758 2247078 -5424009 -8951775 -4849586
14734 -4849586 1586985 3027115 -1599782 -6890223 -7147745 -2099934 2836574 2578890
14726 2578890 -1346263 -2857283 257491 3952854 4909480 4660800 4453547 1915080 -3211475
14717 -3211475 -5738300 -2596995 1388352 978700 -1172343 -79185 2491861 1926130
14709 1926130 -316572 203035 2118641 1086862 -1116465 687729 4843691 4596905
14701 4596905 -347054 -3035596 -559718 2388538 2239198 626738 -1553581 -5919477
14693 -5919477 -10346808 -8904409 -1043077 6087646 7456441 5797483 4767669 3461652
14685 3461652 1429229 2424789 8132878 13341418 12592635 7984248 5757134 7862722
14677 7862722 10760813 10517272 6278012 536586 -2441966 -845441 1322211 -1352773
14669 -1352773 -7295769 -8820383 -3039677 3502731 4114920 785426 -522383 656207
14661 656207 -228794 -4729050 -8599073 -7019414 -19243 7473605 10167762 7581971
14653 7581971 4424511 4352636 4748436 1024757 -5249138 -7791812 -5185530 -3018722 -5049023
14644 -5049023 -8218557 -8924056 -8356729 -8045187 -5486079 1151696 8091017 10425878 8501237
14635 8501237 5808431 3474312 700831 -2154758 -4665702 -7704244 -10340504 -8858592
14627 -8858592 -2881946 1305726 -1252807 -6122857 -5552872 -366483 1253162 -3562191
14619 -3562191 -7988466 -5622954 695315 3427411 182405 -4412170 -5146317 -1742053
14611 -1742053 2030419 3101263 2036004 1385338 2231842 3562020 4292686 3810994 888658
14602 888658 -4854463 -9901584 -8920164 -1699754 5229640 6278909 3200964 1197491
14594 1197491 1613954 2057063 1581798 1724709 3223502 4944857 5690892 4914973 2632174
14585 2632174 466451 1037100 4122017 5670097 3466698 1311323 3653013 8048067
14577 8048067 7885286 2065387 -2989869 -1870757 3332338 6696688 5664727 2707480
14569 2707480 1628800 3855570 7595024 9722539 8687346 5620928 2658844 1087838
14561 1087838 1223685 2305750 1955538 -1730064 -6294636 -6280013 -865909 3097301 -611125
14552 -611125 -8901753 -13517520 -11818873 -8063267 -5118115 -1426810 2822635 2904210 -3711841
14543 -3711841 -12081335 -14989643 -10941055 -4050349 1653206 4600104 4195730 797585
14535 797585 -2919085 -3470149 -215905 3949403 5852451 4892589 2672929 1018682 623712
14526 623712 715823 -284444 -3096173 -6290423 -7290656 -5002614 -909712 2789688 5413042
14517 5413042 7456818 8805811 8715848 7413866 6030131 4632100 2277730 -148287
14509 -148287 419323 4700313 8291724 6504024 748298 -3386061 -3811015 -3704055 -5299699
14500 -5299699 -6230255 -3823612 437622 3166149 3323786 2034884 252337 -1240850
14492 -1240850 -1278949 136926 1051319 -85133 -2570318 -5041828 -7090168 -8164227 -7086468
14483 -7086468 -4170239 -1727310 -983118 -611544 385969 961456 702755 1311851 3510763
14474 3510763 5458041 6252910 7651166 9951293 10062774 6839420 4293368 5404601
14466 5404601 6623977 3518178 -1689084 -4075548 -4386319 -6509173 -8762023 -5667381
14458 -5667381 1964553 6737908 5658261 3951402 5593771 7074611 4317953 -132709
14450 -132709 -1604289 -627541 -829860 -2417113 -2515030 -388688 1782109 2597212 2656389
14441 2656389 2382242 1131597 -1403955 -4349781 -6160155 -5576276 -3050080 -1447506
14433 -1447506 -3514021 -7951532 -10154446 -8038543 -4959353 -5114820 -7978660 -9482963
14425 -9482963 -7357689 -2968202 1342572 4370219 5582835 4614205 1986200 -705946
14417 -705946 -2084529 -2173281 -1939935 -1837832 -1258487 372058 2485258 4042425 4777937
14408 4777937 4572108 2345677 -1994661 -4827962 -1958265 4231884 5386060 -1699722
14400 -1699722 -8876679 -6884261 1512486 5637179 2593844 638043 5866718 13661248
14392 13661248 16860693 15543245 13557055 10720595 4872737 -1487941 -3091899 654881
14384 654881 5344005 8090371 9576095 9757604 6568626 220321 -5226245 -6670799
14376 -6670799 -5616778 -5031731 -4859150 -3104780 50647 2121731 2270295 2784333 5344071
14367 5344071 7621831 5894780 491327 -4053919 -4938587 -4497014 -5954739 -8355402
14359 -8355402 -8676448 -7090484 -6205376 -5982905 -3859625 -41726 2014236 1527801 2032986
14350 2032986 4903406 5930806 1936149 -3116953 -3226618 1133295 4618881 5419676
14342 5419676 6571348 9193974 9945183 6644900 2015154 -437774 -1002417 -1820873 -2940446
14333 -2940446 -2957528 -1854476 -593993 960903 3229041 4813412 3868020 1378375 470744
14324 470744 2082820 3873017 4267696 4776013 6402972 6490112 2518174 -2539700 -2986891
14315 -2986891 1453095 4602015 2237694 -2503937 -4395380 -3003991 -1044730 796489
14307 796489 2990471 3534950 449366 -3148997 -1871227 3842084 7478822 5274183
14299 5274183 658892 -1471060 -476787 1858256 4527343 6176370 4756612 1293819
14291 1293819 506698 4346026 8014325 6108166 182608 -3653472 -2664427 801500
14283 801500 3762072 4775879 3034967 -593976 -2511707 -460260 2025882 -290196
14275 -290196 -5894088 -7114557 -515137 7790144 9826231 5507166 1506740 2279513
14267 2279513 5508641 6162570 2494287 -2826964 -6300952 -7110085 -6858538 -6533844 -5079820
14258 -5079820 -1612453 2214610 3658410 2271875 276123 -461456 -512667 -1772322 -5211558
14249 -5211558 -9787338 -12900961 -12346515 -8700106 -5189502 -4087119 -3963655 -1928736
14241 -1928736 2208063 5860724 7127175 6174953 3604507 37796 -2555390 -2010845
14233 -2010845 580420 1141097 -2144565 -5898113 -5630546 -1216335 3430128 4823683
14225 4823683 2350017 -2398673 -6567165 -7222447 -4000050 -354600 -79509 -2662655
14217 -2662655 -4215058 -3007299 -1425638 -1588551 -1843595 149124 2732725 1689110
14209 1689110 -3947172 -10042122 -11783762 -8171340 -1817953 3751994 5955572 4384275
14201 4384275 1568943 983123 2845468 3358115 -236796 -5440528 -7698173 -6532314
14193 -6532314 -5350981 -5675071 -5333887 -3159144 -1685892 -3041406 -5176819 -5149847 -3946584
14184 -3946584 -4472551 -6075402 -5243953 -1792317 -57019 -2299314 -4550939 -2008588
14176 -2008588 3804758 6936815 5063129 1790697 657547 753892 134057 195531 3176132
14167 3176132 6993675 6671433 1214964 -4191618 -4109259 1226047 7090943 9530731 8117245
14158 8117245 5027591 2861191 2453667 2007076 -505931 -3699779 -3510917 1533379 7992996
14149 7992996 11740441 12116862 10317831 6649568 2137618 138974 2617051 6585696
14141 6585696 7965958 7359727 7926268 9069493 7293704 2862777 294914 1539832
14133 1539832 3491895 3471114 2635233 2374137 1686163 249681 185268 2331113 4083517
14124 4083517 3262134 1121630 -518482 -1976816 -3412319 -3091379 -403778 2398138
14116 2398138 3858037 5614869 8569386 10081212 7949301 4032173 739944 -2836877
14108 -2836877 -7592884 -10331276 -7618499 -1738814 1546849 -107680 -4521799 -8935151
14100 -8935151 -11236015 -9213990 -3147789 2054217 1778888 -1948879 -3184710 -286204
14092 -286204 3007615 4113933 4296701 4430072 2805533 -1287971 -5268285 -6210307 -3952968
14083 -3952968 -593932 1243094 -143493 -3582122 -5120348 -2622555 613255 -161794
14075 -161794 -4582164 -8158959 -8883487 -8607814 -8286138 -6496462 -3090675 21352 2345262
14066 2345262 5008031 7209022 6977383 5789505 7157346 9766354 8111891 1952428
14058 1952428 -1532651 1236496 3566920 -1331650 -8787694 -8974240 -1789270 3140430
14050 3140430 1107965 -1428624 2069254 7877485 7962923 2131150 -1983240 6719
14042 6719 3920774 4126964 1378844 261306 1652658 2253630 1014371 1312274 5183330
14033 5183330 9201432 8951077 5070351 1702613 728867 902797 1568200 3672618 7247294
14024 7247294 10694412 12482340 11470558 6655501 -664941 -5823647 -5437824 -2192159
14016 -2192159 -1269409 -3169182 -4554674 -4993014 -6737136 -7738607 -2083904 10106566
14008 10106566 19630777 19094544 11947815 6384756 4495040 2424281 -1798183 -5829650
14000 -5829650 -6879074 -3924212 2547442 9541412 11993674 7889001 1619166 -1135128
13992 -1135128 -369356 -90848 -1386580 -1580553 314148 1735521 726047 -1482957 -2850942
13983 -2850942 -2942369 -2427916 -2275412 -3633163 -6561109 -8881683 -8186998 -4910227 -1697576
13974 -1697576 -77803 521565 1035790 1999049 3997723 6913171 9144100 9356601 8375833
13965 8375833 7660103 6969444 5522812 4087255 3412842 2043921 -1179800 -3734203 -2385425
13956 -2385425 1113225 1595803 -2088073 -5578311 -5789225 -4791029 -5193409 -5817373 -4622603
13947 -4622603 -2480616 -856140 1434664 5516551 8677025 7469855 3522484 1973730
13939 1973730 4136286 5871217 4259660 1906089 2313146 4242686 4142464 2121588
13931 2121588 1231531 1362544 -1356785 -7608361 -11660742 -8484157 -1335397 1928768
13923 1928768 -1193488 -5904689 -7780918 -7640919 -7532598 -6366420 -2551090 1931439
13915 1931439 3563652 2120153 683954 1462309 3645157 4981471 4005806 1235884
13907 1235884 -858536 -4876 3002131 4988649 4665264 4123840 4901675 4999752 1774777
13898 1774777 -4267397 -10551290 -15221873 -16930191 -14443425 -9068938 -4917802 -3782716
13890 -3782716 -2397865 1801236 5238599 3165222 -2487794 -5843769 -5974842 -6775450
13882 -6775450 -8659756 -7327083 -1771900 3036032 3638130 2533333 2604674 2630804 1684264
13873 1684264 2787995 7629952 11626803 9438489 2990517 -901921 412446 3182310
13865 3182310 3586639 2343038 2408703 4826809 7878251 9146760 7962438 6060028 5447712
13856 5447712 5913011 5987343 5822580 6434526 6158896 1742610 -5677727 -9659479 -6108024
13847 -6108024 1402908 6790452 8756503 9546812 9545410 7621008 4945077 3851777 3830072
13838 3830072 2743324 1236886 1795392 3865067 4113740 1679455 -687368 -1042237 -206084
13829 -206084 974368 2607556 3568447 2315371 733393 2848456 8002249 9645793
13821 9645793 3907010 -4148496 -6633119 -2963154 176023 -2029989 -7340990 -10665322
13813 -10665322 -10180989 -7956740 -6467163 -6076827 -5312699 -2683353 1590037 5362283
13805 5362283 6432399 4809068 2634897 1548726 728864 -1601601 -4997119 -6567041
13797 -6567041 -4736370 -1966720 -1912111 -4302749 -4943120 -1387987 3488187 4923277 1760719
13788 1760719 -2941101 -5630200 -5144544 -2799714 -969029 -991503 -1802841 -1709541 -1719492
13779 -1719492 -4649012 -9811460 -11820136 -7453723 -1157174 -81672 -5190169 -10818150
13771 -10818150 -11853020 -7849529 -1279739 4329880 5399175 1641440 -2048012 -1094790
13763 -1094790 2079856 1480029 -3118805 -5948623 -4545905 -2940490 -4078832 -5340998
13755 -5340998 -4243523 -2830111 -3029169 -2898745 -1284054 -1296711 -4891773 -8473751 -8454567
13746 -8454567 -6919185 -6871397 -6193044 -2283631 999836 -1999894 -9375035 -13814668 -12850205
13737 -12850205 -10257767 -7910442 -3281948 3986848 9260588 8849064 4494018 233499
13729 233499 -1841348 -1695799 -364795 335355 -465176 -1415005 -1708763 -3638615 -8930507
13720 -8930507 -14226199 -14628765 -10445887 -5787251 -2052530 1748123 3864346 1792083
13712 1792083 -1328177 263092 5196941 5906790 463337 -4377337 -4039779 -2175728
13704 -2175728 -2859373 -4458938 -5194125 -7475045 -12043117 -14477062 -12448425 -10146383
13696 -10146383 -10626195 -10436069 -7257233 -5726406 -8934905 -11068181 -6549185 -326491
13688 -326491 -39716 -3292726 -2602282 1451777 2776015 2031427 4661027 8568832 6260868
13679 6260868 -449960 -417059 9478499 18317269 16828861 9311718 4843459 5207007 7234407
13670 7234407 9721175 11865720 10859894 6860629 5060113 7356203 7361919 -102153 -9307954
13661 -9307954 -10477707 -3259760 3441415 3347437 -1471866 -5670667 -6106865 -2858257 637406
13652 637406 -1051004 -9600109 -18800981 -20099316 -12416346 -3141530 794888 -300927
13644 -300927 -1519099 115797 3199843 4752730 4148854 3796115 5701571 8381298 9008907
13635 9008907 7994778 8450767 10954994 12459529 11355824 9656581 8422136 5320405
13627 5320405 -435545 -4821825 -4479245 -2007093 -1516727 -1948800 221768 3953350 4876256
13618 4876256 2440971 392344 325898 -60369 -1731132 -2159667 171581 3075953 4232962
13609 4232962 4326254 4846001 5277675 4257799 1773680 -1075765 -3065845 -2906496 -139245
13600 -139245 3159741 3399347 -543893 -5583348 -7653922 -5660187 -1469988 2772903
13592 2772903 6118381 8348986 9481779 9954338 10529891 11411987 11566377 9608268 5807536
13583 5807536 2570976 1958953 3099614 3311828 1615233 -292108 -483177 1299229 4021961
13574 4021961 5757584 3944512 -2089015 -8449887 -9472374 -4445524 922777 1172969
13566 1172969 -2952896 -6504611 -6069477 -2190684 1921786 2955187 613596 -1458562
13558 -1458562 -228428 1733169 -263867 -4867640 -5633696 -1045355 3002558 2995835 2771452
13549 2771452 4816432 4397513 -1434613 -6123196 -2989107 3407537 4386602 1005895
13541 1005895 828876 4366251 5644729 4234557 5275088 8201103 7285062 4023561
13533 4023561 6498296 13905492 14508338 3965102 -6261465 -5665953 886527 3755510
13525 3755510 3746064 6620912 10279799 8944379 5044937 5524468 9292647 9119952 4351577
13516 4351577 1450836 2449274 2776572 1112915 1802979 5676090 7446476 5187510 4188432
13507 4188432 7392230 9314154 4615738 -3127267 -6903015 -6095880 -5054092 -5101297 -4036996
13498 -4036996 -1834382 -971985 -1382756 -186195 2896156 4279273 2134192 -345719
13490 -345719 586855 4198549 7130394 8194040 8338831 7135529 3075066 -2245087 -3887964
13481 -3887964 410375 6477194 8532469 5961796 2239068 -1324673 -6304257 -11542809
13473 -11542809 -11801326 -4633597 4726574 8717887 5995414 1798342 1075241 4036223
13465 4036223 7707904 9036601 6508725 1113870 -3870279 -5700288 -5021840 -4631741
13457 -4631741 -5544705 -5911385 -4121720 -1494312 -927057 -3299252 -5940120 -5242599 -1062780
13448 -1062780 2353109 1172176 -2922747 -4702712 -2443021 45686 -495864 -1988068
13440 -1988068 -775443 2514764 4270927 3541845 2932996 4368915 6842713 8323354
13432 8323354 7760512 5436840 2993469 2334116 2945375 1817201 -1956904 -4638736 -2988992
13423 -2988992 136753 -396337 -3915362 -4763466 -1136006 2152920 938776 -2965019
13415 -2965019 -5616059 -5949088 -4519860 -937765 4351228 8252099 7925308 4034496
13407 4034496 -627017 -3894608 -4444570 -2059744 587104 -486618 -4881515 -6876497
13399 -6876497 -3203134 1310181 -136139 -6793898 -11464934 -9927379 -4891611 -973558
13391 -973558 108271 -1057214 -3404821 -5666889 -7083828 -8134262 -8881687 -7657480
13383 -7657480 -4012499 -1579386 -4164116 -9713379 -12498766 -11183337 -9978354 -11137112
13375 -11137112 -11348635 -7443925 -1221386 3747792 6168287 5572890 1055891 -5472168
13367 -5472168 -8641691 -5841308 -816608 2302355 4788689 8991479 12256843 10903953
13359 10903953 7260005 6147105 6299143 2590515 -3768611 -5151844 882535 7150045
13351 7150045 7087638 3438654 2708734 5685205 8067660 7381371 4867351 2347431 802686
13342 802686 846245 1877662 1887077 156478 -1238659 -436795 1313592 1606073 238117
13333 238117 -1018943 -674168 1562362 4546006 5837029 4285759 2707045 4792381
13325 4792381 8980963 9616526 5232088 754955 -293126 -172327 -867904 -151984 1979561
13316 1979561 -275621 -9155851 -16335504 -13554671 -5711265 -3966979 -8912776 -11039808
13308 -11039808 -6756929 -2885308 -4026239 -6037178 -5277509 -4895069 -7362440 -8926350
13300 -8926350 -6868547 -5303024 -7781847 -10070400 -6909937 -1414715 -700555 -4908888
13292 -4908888 -7236227 -3840508 1731501 3991491 1589790 -2184598 -2828860 837049
13284 837049 4537988 2981278 -2729629 -5628397 -2427696 1963437 2328144 660970
13276 660970 1295386 2897809 1352112 -2272152 -3227488 -1163481 -199430 -1122302 189921
13267 189921 5343614 9866496 9308091 4822259 274144 -2925733 -5376593 -6530352
13259 -6530352 -5262228 -2812617 -2227818 -4109916 -4857053 -1017036 5181764 7231484
13251 7231484 2400476 -4172331 -6040619 -3765629 -2440091 -2622013 -24291 5330314
13243 5330314 6830713 1303438 -4947784 -4837564 -159842 2811953 2878600 2654491 1328765
13234 1328765 -3699763 -9538840 -9771492 -4019785 921402 482422 -2793010 -4956830
13226 -4956830 -5851597 -6625030 -6665310 -5532418 -4577166 -4438426 -3575382 -1053124 1448426
13217 1448426 1818693 -49222 -2689539 -4196360 -2983754 345950 2230894 54196
13209 54196 -3491618 -3318922 738605 3337768 1096658 -3144551 -4953069 -3747570 -1674880
13200 -1674880 98545 1688583 2988244 3814664 4378739 4494012 3541211 1833136 571967
13191 571967 75509 -370864 -801915 -594703 -162483 -415035 -600963 694720 2356926
13182 2356926 1689806 -852616 -1298566 2029294 5430680 4699037 699222 -2375870 -2781589
13173 -2781589 -2755721 -4742996 -7994331 -9377325 -6959476 -2291870 1428834 3391176
13165 3391176 5715587 9044265 9974731 5657235 -623635 -2146437 3216644 10906035
13157 10906035 15566278 15818284 13078364 9181813 6071213 4871770 4279767 2207575
13149 2207575 -705180 -1920174 -1300752 -1241576 -2314255 -2576400 -1741559 -1754639 -2080492
13140 -2080492 860355 7283203 11534920 9339009 4001378 1657991 3123569 4465402
13132 4465402 3668109 2493403 2578995 3476477 4493105 5383592 4952600 1669685 -3529953
13123 -3529953 -7069727 -6520418 -3448956 -1298869 -846328 820866 5970761 11917783
13115 11917783 13202860 8306314 1580843 -2702833 -5102738 -7336477 -7463734 -3436148
13107 -3436148 1001794 90196 -4929315 -6846569 -2967495 1824023 3753332 4995146
13099 4995146 7064995 6320328 761616 -4492874 -4332044 -1673358 -2033120 -3895014 -1946988
13090 -1946988 2320062 1600721 -5262792 -10015849 -6376326 1200343 3988905 290024
13082 290024 -4024799 -4275672 -2162785 -2119898 -5270247 -8278396 -7375480 -2582024 2364042
13073 2364042 4118788 3122344 2343180 3233652 4258621 3734539 2716823 3513911 5655635
13064 5655635 5462655 952333 -4403446 -5366406 -1899202 679035 -893881 -3675318
13056 -3675318 -3534171 -949469 1085889 2082652 3258000 3819597 2123003 -741312 -2279979
13047 -2279979 -2345198 -2045397 -577490 2868072 5866837 5909119 4828447 5144066 4544775
13038 4544775 358180 -3076207 208225 6479965 6042816 -1467674 -5962626 -3024512
13030 -3024512 -117780 -2532307 -4126356 1085770 7612234 7271217 1906591 -1573433
13022 -1573433 -2900977 -6023819 -9618414 -9359008 -6628525 -6281520 -7796242 -6619111
13014 -6619111 -2782064 -799314 -2073300 -4027354 -5704700 -8051454 -9688745 -8129435
13006 -8129435 -4225724 -709878 1693015 2364275 -1245782 -8124055 -10544921 -3661101
12998 -3661101 5731378 8197728 5566295 6210744 9703239 7792640 -212057 -5199604
12990 -5199604 -3084722 -691141 -3464525 -7174612 -6315495 -2588760 -419689 -777727
12982 -777727 -3354299 -8505593 -13492924 -13153809 -7893028 -4812161 -7409802 -10596058
12974 -10596058 -9786661 -8185517 -9993899 -12539869 -11321273 -8273861 -8649612 -12512345
12966 -12512345 -14858864 -12488333 -6611337 -224394 3885561 4230075 2347117 1794522
12958 1794522 3712556 5525412 5159189 3649361 2491918 1702448 1467478 2117111 1835274
12949 1835274 -1323852 -4689469 -3489403 1134533 2742618 -404192 -2835139 -1634259
12941 -1634259 -1217598 -4641372 -7513665 -5614527 -1935922 -396002 1300528 5984279
12933 5984279 9601672 6767558 -186682 -4616528 -4844071 -3764774 -2426626 -373016
12925 -373016 612075 -495245 -50215 4731791 9247878 7504781 2113863 730934 4272199
12916 4272199 6592297 5169186 4141672 6168698 8571236 8992144 8615464 8147153 6188052
12907 6188052 3358015 3084498 6402910 10006648 10865895 9228835 6324523 2825049
12899 2825049 182074 -186237 546403 367855 477178 3424910 7505208 7961455 4235493
12890 4235493 941289 528482 -6780 -3270231 -6901763 -7324337 -4542203 -957953 1688813
12881 1688813 2391885 632390 -2278400 -3947186 -4063671 -4403233 -5109027 -3996403 -383337
12872 -383337 3502567 5866167 6925084 6290632 2476292 -3336085 -6533669 -4439199
12864 -4439199 99875 2587905 2156014 1022606 669459 646983 18100 -1493126 -3096189
12855 -3096189 -3264522 -1522122 403334 939185 1515728 4416876 8213334 8721240 4883022
12846 4883022 360668 -1522231 -1290477 -862177 -672988 -376978 374885 2755255 7419782
12837 7419782 11529514 10516121 4259227 -1636335 -2443465 493629 2665479 1859602
12829 1859602 -781851 -2771372 -2104763 693955 1770454 -2128649 -8695422 -12393407
12821 -12393407 -11778278 -10084973 -8251645 -3281631 4546334 9169882 7243974 3745531
12813 3745531 4491385 7840740 9159752 9242583 11724590 14879338 13066258 5704146 -1184977
12804 -1184977 -2728641 94254 3652072 5469207 4632243 1933903 -193770 -522493
12796 -522493 -906060 -2496535 -2104281 3254410 9719203 10128783 4199529 -405551 1613096
12787 1613096 6814053 8984794 7229934 5304953 5786980 7654908 8147426 5362809
12779 5362809 148676 -4033887 -4641282 -3327897 -3483805 -4893481 -4134053 -546701 2010133
12770 2010133 638596 -2875833 -5507023 -6735583 -6619897 -3510684 2856090 8150620
12762 8150620 7198753 416413 -6405918 -8602378 -6513438 -2918554 717807 4128701
12754 4128701 6089688 4759284 672299 -2231543 -454604 4398411 6954002 4765000
12746 4765000 1363741 1088744 3322038 4538093 3986328 3683611 3989959 3198983 1057987
12737 1057987 -1138699 -3483873 -6285053 -6522252 -844317 7412391 10087961 4802691
12729 4802691 -2060781 -5307237 -7504713 -11719743 -14119064 -10139446 -3436974 -1323449
12721 -1323449 -3789307 -4262198 -159294 4194236 5166419 4009101 2628729 801298
12713 801298 -1086184 -1474529 -1161929 -2702413 -5038686 -3950661 136793 437081 -6376854
12704 -6376854 -13494259 -12412637 -4997744 -1092467 -5004551 -10255752 -9118749 -2669033
12696 -2669033 1806363 839382 -1609543 -385512 4227377 7657552 6878172 2741064
12688 2741064 -2564935 -7337730 -9351717 -6488953 -433917 2905941 -359118 -6986303
12680 -6986303 -10662987 -9966579 -8967721 -10518290 -12579386 -11790015 -7772098 -2852840 529618
12671 529618 1355296 308888 -1080932 -2193936 -3386804 -3756223 -1319388 2685630 2928441
12662 2928441 -2942359 -9327225 -9698905 -6068468 -5268599 -7643629 -7094294 -2165880 1267651
12653 1267651 59498 -1551455 -294164 816587 -502014 -808854 2051078 3848178
12645 3848178 1808104 1066851 6143003 11543702 9196783 1300314 -2800540 331
12637 331 4503632 6579353 6365699 3383819 -2999193 -8344145 -6650409 114515 3723502
12628 3723502 1972602 1258544 4906026 7174758 2830897 -4350760 -7797674 -7595856
12620 -7595856 -8281998 -10721108 -11423120 -8236668 -2777994 1968507 4066269 3567063 2354228
12611 2354228 1873774 939446 -1886065 -4183808 -1965286 3510812 6024742 3131003
12603 3131003 -236496 499335 2886683 2258797 -609080 -1260534 1318959 3750646 3400377
12594 3400377 934973 -1725775 -3230172 -2863050 -944597 882884 1027324 -564304
12586 -564304 -2660051 -3778690 -3195993 -2200766 -3448520 -6744272 -6859222 274862 9740731
12577 9740731 11551451 3606607 -4910675 -5637843 -1070318 1327545 32177 -947343
12569 -947343 -63929 201491 -1383961 -2996435 -3228069 -2769864 -2527436 -2609365 -2946059
12560 -2946059 -2994181 -1547490 1559443 4725776 6904972 8817069 10331502 9076717
12552 9076717 3951851 -2054631 -4940886 -3907246 -800929 2277657 3053883 -89970
12544 -89970 -4792219 -5377478 6068 5827583 6101039 1925658 -1569158 -2661355 -2874897
12535 -2874897 -2158974 380059 2668302 2096020 851891 3385848 8691842 10496149
12527 10496149 6168939 923750 1230077 6978053 11954816 10636602 3700790 -2644144
12519 -2644144 -3338442 -646973 -1366816 -7120891 -11425895 -8976982 -3313706 -673755
12511 -673755 -280979 2829361 7878116 8737785 3931821 -822292 -1409311 -744396 -3099589
12502 -3099589 -7479904 -9431743 -6973005 -2859823 -1991621 -6409529 -11724427 -10416363
12494 -10416363 -1046568 8448772 10232743 6391576 4392957 5625702 5128383 1180182
12486 1180182 -2327788 -3180978 -3271658 -2720720 1389377 8346176 12296817 10265165 6373708
12477 6373708 5357058 6743353 8131512 9436958 10728909 10017820 6615484 3572554
12469 3572554 3762268 5811761 6058890 2715067 -2900091 -7294578 -7114689 -3133874 -876129
12460 -876129 -3634382 -6644472 -3460611 3602505 6391512 3480478 1577889 3735799
12452 3735799 5014099 2193573 -870790 -1103006 -1289592 -3244043 -3734344 -1731119 -1815659
12443 -1815659 -5157115 -5035183 2445876 10741018 12818482 11397172 11682159 11283490 6459403
12434 6459403 1795087 3192278 6332660 3200851 -3732490 -5395699 -1595632 -554083
12426 -554083 -3949047 -4745237 -891831 1027349 -1022650 878638 11171528 21139132
12418 21139132 19868743 8906412 -857060 -3150272 -1098055 -88127 -1161000 -1710198
12410 -1710198 189636 3283885 4801103 4216904 3645984 3778228 2643937 674938 2519183
12401 2519183 9033112 11883306 3574837 -9876673 -15105430 -9370409 -3058279 -3481991
12393 -3481991 -6002920 -4333290 -418539 1141414 1090834 1990318 2471816 919354 153539
12384 153539 2680082 5323447 4327251 2187206 3306875 5700083 3610532 -2964158
12376 -2964158 -7635845 -6516203 -2440206 442883 1752238 2914709 3531698 2200045
12368 2200045 -397823 -1371057 940280 4234487 4335650 537074 -2886720 -2221169 615128
12359 615128 1562225 991156 2101451 3970544 2302844 -2632522 -5432806 -4274683 -3076822
12350 -3076822 -2629526 2181189 11639272 16064907 8931361 -1641443 -3670585 1545871
12342 1545871 3556743 564700 894165 6950918 10237602 5639913 -347067 -1203038
12334 -1203038 -761437 -4511872 -8024315 -3537871 6187101 10603864 6877340 3337681
12326 3337681 5963646 9710400 7426690 1144916 -1663533 217384 690555 -3187292
12318 -3187292 -6086968 -2523217 4456537 7175771 3625550 -1056276 -2719195 -2557508
12310 -2557508 -2353970 -722507 2890718 4932910 2941067 762996 3159283 7196744
12302 7196744 5420277 -2437524 -7407863 -2995140 6460116 12280889 11927608 9011214
12294 9011214 6302126 3765159 1989666 2486516 4209346 3743377 163128 -3203304
12286 -3203304 -3278655 -1119055 561807 1857386 4905328 9167594 10548993 6677730
12278 6677730 975060 -1223340 139061 -34139 -3781242 -5873142 -1237943 5973679
12270 5973679 6010297 -3706244 -14439417 -16615707 -10281358 -2416949 2291419 3869467
12262 3869467 3094511 550080 -1088883 865644 3864713 1662203 -6804084 -14052438
12254 -14052438 -12829521 -5516986 -905399 -2975111 -7088801 -7524840 -4774064 -3355824
12246 -3355824 -5070141 -7341531 -7280008 -4640679 -687370 3399684 6012944 5041186 135299
12237 135299 -5860760 -9365609 -9442971 -7487294 -4565403 -1125966 1408009 1609735 662149
12228 662149 887977 1097938 -2723574 -10108003 -13553997 -7362889 3625445 9105458
12220 9105458 5926302 434396 -1584001 -1353003 -1741324 -1296112 2005118 4834048 1951326
12211 1951326 -5419712 -9630155 -6011511 1207948 4213319 749375 -4283639 -5722378
12203 -5722378 -4209237 -4022693 -6240355 -7165479 -4568712 -2177266 -4431819 -8827183
12195 -8827183 -8599609 -2851218 1771456 1091451 -872840 352518 1979594 -349351
12187 -349351 -3620227 -1710092 3620850 4282916 -1339650 -5226028 -1943703 3033944
12179 3033944 1820256 -4257719 -7271877 -4085862 693059 2456377 2099544 2536631
12171 2536631 3439598 2140356 -1580050 -4317953 -3462388 -1129872 -1562074 -4983982 -7133964
12162 -7133964 -6083333 -5763630 -9215865 -11630033 -6098325 4779136 10034137 4601909
12154 4601909 -3918776 -5897608 -1422431 3052792 5103954 7429384 11107867 13697594
12146 13697594 13384598 10423749 4973719 -2370566 -8442303 -10067707 -8467421 -7080809
12138 -7080809 -5605743 -1174436 4519209 5447179 730965 -2055578 2688217 9564206
12130 9564206 9463342 3052619 -96876 4333692 9371592 7587481 1828369 -127105
12122 -127105 2341298 2881613 -669189 -2749801 287193 3463689 593710 -5936552
12114 -5936552 -8302639 -3843842 2827165 7114344 8541275 7869137 5391555 2921559
12106 2921559 2955720 4745603 5098349 3722424 3457792 4540158 3732000 567477 -978312
12097 -978312 651987 1496577 -1127272 -4061702 -4296916 -4251444 -6447339 -7923394 -5529458
12088 -5529458 -2336471 -2411627 -3053768 525282 5675325 5465616 -68131 -3865644 -2804583
12079 -2804583 -888180 -714124 490281 4169450 6778529 6023899 4978376 6452506
12071 6452506 8208741 7553091 6418987 7645232 9422506 7900031 3437571 182758
12063 182758 107213 732897 -962039 -4471929 -6326208 -4070383 772355 4121367 3784072
12054 3784072 1385632 -614994 -1888503 -2916548 -3161107 -2735175 -3230572 -4074668 -1400162
12045 -1400162 5321860 9198245 4571366 -3087620 -3549204 3442429 8333686 6374072
12037 6374072 2582187 730927 -2276934 -7089618 -7139163 48656 5329657 485924
12029 485924 -7923283 -7021865 3729675 12107414 10011788 1805277 -4597547 -6917543
12021 -6917543 -6725820 -4851928 -1817610 839052 2073269 2084277 964304 -982397 -1647916
12012 -1647916 1051693 5442135 7201573 4821638 1348894 102205 1020045 1810081
12004 1810081 617868 -2817844 -6591522 -6920445 -1289864 7851024 14297084 14084226
11996 14084226 9489167 6602066 9429174 16268800 21319466 20172345 14112163 8323664
11988 8323664 5786962 4692504 2614210 801434 2114358 6233232 9501895 9026260
11980 9026260 5020675 -386012 -4869378 -6760540 -5796393 -3183826 -395834 1566678
11972 1566678 1663386 -772207 -4393046 -6381205 -5603278 -3536964 -1422775 1033225 3044866
11963 3044866 1924267 -2896683 -7485916 -7499851 -2782358 3881351 9971260 13069643
11955 13069643 10782068 4230853 -948732 -809296 1786721 1804782 -603912 -1793589
11947 -1793589 -1666127 -3574886 -7619466 -9282235 -5800849 27471 3731902 4046953
11939 4046953 2887517 2584656 3874032 5288546 4649887 2163631 823810 2348456
11931 2348456 4626382 5136006 4429513 3557891 1007101 -3840028 -6876703 -4075965 1465807
11922 1465807 2808925 -1104706 -4448906 -3352144 -413644 547577 -551847 -1876962
11914 -1876962 -2491786 -1756162 963090 4668236 7168613 7582014 6353736 3645317 514333
11905 514333 111308 3689698 6959180 5379001 1792077 2783798 8014928 10072318 5680010
11896 5680010 76874 -1607381 -607574 456246 2266336 4850086 4682279 84998
11888 84998 -4945778 -6218637 -4620467 -2522009 657416 5419935 8892010 8763424 7017322
11879 7017322 6022178 4709870 2433508 2278571 5700573 7784166 3517852 -3984048
11871 -3984048 -7108906 -3620820 2160712 6179635 7468341 5532125 136459 -6497039
11863 -6497039 -11148993 -12900959 -12395717 -9695514 -5926896 -4408791 -6172515 -6907825
11855 -6907825 -2733802 3601686 7033974 7721234 8507194 7763451 2118551 -5253323 -7242881
11846 -7242881 -3900791 -2965736 -7796225 -12397858 -11388131 -8060087 -8199022 -11043906
11838 -11043906 -11285192 -6938608 -1064677 2602478 2869459 1163181 -38980 -46353 -1196603
11829 -1196603 -4956122 -7734862 -4896221 1334799 3576869 -91172 -3345637 -1702501
11821 -1702501 1020537 120804 -2208907 -1843399 -298380 -861062 -1163695 2874419 8074532
11812 8074532 7069520 5372 -4650097 -2408398 1345600 812802 -1243943 969325
11804 969325 6139085 7608045 3789738 528942 1834258 3545289 -17864 -6274582
11796 -6274582 -6785268 542356 7221892 5126101 -2723982 -7279894 -6302176 -5026114
11788 -5026114 -4833250 -74022 10679614 18338075 14805319 5340694 1640385 5809983
11780 5809983 9494379 7461586 3227158 528036 -2033402 -4976066 -4488673 248613
11772 248613 2712982 -1937972 -8160246 -7075416 685007 6115183 4496643 79728
11764 79728 -2033305 -1954953 -1014842 2306232 8544517 13317984 11769004 5109453 -1035211
11755 -1035211 -3630413 -4016261 -3591313 -2053567 -531817 -2021922 -6185958 -7221951
11747 -7221951 -996291 7537031 8967997 1676858 -5381741 -4090696 2901376 7107770
11739 7107770 5605235 2464737 566534 -1875425 -5759896 -7618937 -4636275 574080
11731 574080 3596099 4119590 4743739 5567797 3838416 -1191666 -6271313 -7856990 -5835495
11722 -5835495 -2679903 -182320 1909408 4257640 5817310 4531076 771273 -1456618
11714 -1456618 886683 4905315 4901853 640090 -1924084 255942 2403044 -360395 -4781680
11705 -4781680 -4281345 973633 4970602 5336118 5344905 6403234 5132878 -112731 -5232142
11696 -5232142 -5733144 -2311765 1321097 2943884 2203313 -169073 -1468923 1369794
11688 1369794 7080295 10163848 7965943 4366888 3758811 4700684 3114869 -775017
11680 -775017 -2677770 -157524 4840419 8633253 8860486 6010964 3368385 3723479 5244273
11671 5244273 3695325 -75905 286426 6540393 10696764 5484697 -4288745 -7882858
11663 -7882858 -3437348 1219301 1448983 936966 2821481 3909411 1226079 -2023009
11655 -2023009 -1402819 2259348 5222596 6039023 4929921 1526575 -2900231 -3991790
11647 -3991790 688379 7217788 9641228 7001800 2649537 -1382513 -5133258 -7334464
11639 -7334464 -6079717 -2806270 -1386653 -2652504 -3486246 -2207549 -1278067 -3060192
11631 -3060192 -5907226 -6621367 -4685336 -1950146 273361 1702813 1839052 400471
11623 400471 -1474199 -2141428 -1273188 438883 2660516 4985022 5917888 4316573 1505281
11614 1505281 -177868 -832097 -2587874 -5530168 -6881978 -5325558 -3321889 -3292773 -4030648
11605 -4030648 -3328348 -1951375 -1954207 -2666138 -1633174 1544328 5475745 9847525 14388689
11596 14388689 16126866 12161274 4831362 -488055 -2674576 -4845598 -6896884 -4481282
11588 -4481282 2579621 7304222 4674530 -1612004 -5627051 -7283101 -8941449 -8846818
11580 -8846818 -4441306 1049062 2161258 -426240 -1260805 1350589 4093309 5105770
11572 5105770 5822316 6551182 5679099 3519019 2171637 1605982 450593 56981 2518903
11563 2518903 5132195 2826509 -3507244 -7164579 -5198198 -2084985 -2290144 -4652700
11555 -4652700 -6124592 -6045693 -4601416 -1650748 990319 560687 -1776195 -1814795 534752
11546 534752 414767 -3733821 -6962197 -5627593 -2650522 -1552786 -872625 1367603 2944752
11537 2944752 2021748 1810398 5415731 9887443 10687400 8766825 7928936 8088540 6594009
11528 6594009 3936180 2749540 2762308 1723857 151940 709319 3895090 8112107 12469056
11519 12469056 15796452 14983533 8835920 2055331 681164 4363047 7268499 5842350
11511 5842350 1744435 -2071563 -4196743 -4062722 -1877560 800157 2691917 4131197
11503 4131197 5261188 5303443 5320827 7717418 10221916 5765636 -6630265 -16308037 -13581072
11494 -13581072 -3558514 1246428 -1223638 -2295001 1535384 4127822 2524718 2778467
11486 2778467 8630280 13989763 12521483 7139529 3958226 3278291 2736582 3484333 6350878
11477 6350878 6822670 1420708 -4436217 -2638216 5661247 11575462 10681668 6612262
11469 6612262 3101761 -136120 -2801283 -2473456 -104124 -898077 -6216233 -9551974
11461 -9551974 -4864471 4609994 10379337 9217751 5220293 2742257 1950638 1477020
11453 1477020 1338705 1798966 2000976 1178957 -369548 -2054895 -2921264 -802189 5523772
11444 5523772 12563239 13924928 7849591 -141048 -4445433 -5850081 -7522801 -8253396
11436 -8253396 -5002241 172272 1999093 -31397 -1780845 -2191039 -3971290 -6057373
11428 -6057373 -3407585 3172828 5128178 -1371216 -8348940 -7380572 -1631709 579555
11420 579555 -1259387 -1797253 -698850 -2132232 -5304476 -4939920 -1102781 245838 -2394446
11411 -2394446 -3288595 789177 5281121 5228274 1764184 -1838608 -5071783 -7742122 -7415008
11402 -7415008 -3058037 2198796 4899826 4950545 3634017 1590534 655118 3538305 9119117
11393 9119117 11987864 9519033 5640653 4484357 4146768 829013 -3870197 -4617758
11385 -4617758 -12195 5571603 7697887 6477739 5117874 5665319 6782250 5568632
11377 5568632 1772675 -909331 391967 2828752 1237221 -3821617 -5911908 -1884267
11369 -1884267 3176715 2736319 -2793148 -7395840 -6963669 -2853036 637453 527333 -2109779
11360 -2109779 -3146654 -589709 1941782 -122277 -5081785 -7018008 -4911046 -3927660
11352 -3927660 -6508985 -8579299 -7227496 -5705789 -6620485 -5977011 459343 9196805
11344 9196805 13187306 11001706 6781551 3678502 1993543 1207473 -609148 -6583967
11336 -6583967 -15718200 -20919013 -17356609 -9637977 -5195889 -3849082 -470100 4780670
11328 4780670 6635287 3977782 1340746 1026273 492575 -1841991 -4312714 -6104881
11320 -6104881 -7910307 -8222009 -4907886 -718877 -863662 -4583941 -5906587 -3571677
11312 -3571677 -2649491 -4590063 -4012560 1095918 4161326 426740 -4360403 -2374046
11304 -2374046 4376636 7703257 5271180 2004563 1599667 2997723 4243407 4507393
11296 4507393 2966887 -31115 -1847916 -1423360 -2179230 -6603893 -10459384 -8113865
11288 -8113865 -1707614 1685595 1100815 2479083 7887432 11487121 8515473 1568974
11280 1568974 -5121183 -11367874 -17038601 -18342867 -13434483 -7150164 -4531885 -3454852
11272 -3454852 303844 4237583 2720296 -2708546 -4869033 -2495436 -1961502 -5936836
11264 -5936836 -8443153 -4714880 1199943 3631773 4032356 6491165 9385233 8586366
11256 8586366 5707043 5590060 7453235 6334721 2675597 2221841 5547357 6205715 2041746
11247 2041746 -58534 4400241 8919065 5882589 -882341 -2233824 1269956 591031
11239 591031 -6157660 -9586955 -3412873 5660450 7679331 2896504 -719402 542763
11231 542763 3224947 3948189 3385004 2913541 2277116 1616369 2219735 4175316 5929185
11222 5929185 6605781 6164834 3539033 -1690808 -5729466 -3668065 2275248 3128921 -4573493
11213 -4573493 -11990404 -9181447 586367 5238435 1076743 -3018532 13589 5247149
11205 5247149 4564624 -945010 -3988833 -2581306 -1347937 -2644244 -3114021 38677
11197 38677 4596346 6957422 6444808 4112900 292137 -4381207 -7369491 -5983474 -408405
11188 -408405 5952489 9012808 7053561 2115109 -1653596 -1660586 1321598 5036117 7965608
11179 7965608 9112659 7860143 5656668 5512934 7709696 8637520 6626207 5627562 8796864
11170 8796864 11559750 7280772 -1845470 -6711709 -4129243 -507157 -1299234 -3925797
11162 -3925797 -4125927 -2856973 -2686357 -2554122 -754422 929091 495518 -238006 1095015
11153 1095015 3240581 4096337 4279318 4199979 1383103 -4813989 -9443542 -8051772 -3403766
11144 -3403766 -856068 -189185 1891012 4063880 2592753 -383825 1255064 7267270
11136 7267270 10242273 6683321 2022088 2088875 5511242 7555202 6417184 2625169
11128 2625169 -3095314 -7963574 -7532899 -1901840 2084336 -964517 -7566805 -10479411
11120 -10479411 -8571062 -6570721 -6686291 -6219257 -3689903 -2025297 -3789138 -7094275
11112 -7094275 -8607126 -7831712 -5999575 -3033729 1430981 5496216 6719074 5795075
11104 5795075 5306306 4929952 1693829 -4022714 -6914659 -3840816 1071744 2241805
11096 2241805 642099 1042774 3393753 3317787 683242 477592 3579508 3900601 -1626934
11087 -1626934 -6644378 -4225807 2860119 6752612 5530914 3237015 1803615 -101512
11079 -101512 -1844517 -1337444 -71285 -1109102 -2482795 609664 6903774 9632573
11071 9632573 7081510 5038461 6356824 5723698 -978722 -8828160 -10982230 -8533800
11063 -8533800 -7243164 -8282984 -8458279 -6978126 -5833195 -5006845 -3046051 -1359209
11055 -1359209 -2394940 -4217290 -2686512 884414 303266 -5925499 -11293166 -10165467
11047 -10165467 -5216894 -2630840 -3650484 -4823079 -4043978 -2313146 -910146 -340559
11039 -340559 -1168114 -2866190 -2813684 477759 4067703 3935087 938003 -437617 962891
11030 962891 1743515 377012 -61962 2314859 4275701 2690574 -35408 156451 2483146
11021 2483146 3162529 1698105 641242 402934 -959936 -3467869 -5256798 -6343284
11013 -6343284 -7701209 -7143567 -1636490 5905707 7991865 2376258 -4704414 -7178142
11005 -7178142 -6096852 -5513652 -6148663 -6249916 -4913535 -1827581 2723853 5705726 3689027
10996 3689027 -690851 -325233 5443061 8105681 2735015 -3431141 -1785434 4312498
10988 4312498 5359642 363592 -3711490 -4296130 -4974655 -5880866 -2592283 4151942 7094995
10979 7094995 3754582 941459 4110429 9147578 9487483 5795332 3152301 2448964
10971 2448964 165967 -4904083 -9235413 -8928016 -4097322 1299271 3244525 1520436
10963 1520436 -464174 -346801 190359 -1046333 -2297291 -395664 3580597 5334710
10955 5334710 3474048 620160 -1157012 -1962363 -1576460 405814 2217881 1824468 540669
10946 540669 504472 11823 -3267714 -6182423 -4105338 252564 388395 -2084244 856849
10937 856849 8551863 9608434 -431131 -10125509 -8136362 837827 4956842 2679944
10929 2679944 1183875 2644333 3007070 1836114 3133235 6977924 9078199 8495628
10921 8495628 7993934 7025306 2499934 -3166156 -3307672 1980177 4228182 -985973 -7306404
10912 -7306404 -7332808 -2763986 121281 14733 -21704 855411 1122594 1408968 3728016
10903 3728016 6774770 6681324 2861873 -630791 -465808 2131456 3935035 3776983 2791827
10894 2791827 2300436 2722175 3449028 2815401 -618855 -5534167 -7699629 -4218672 2291042
10885 2291042 5594272 2554324 -3221673 -5266837 -1062958 5817878 9898648 9203587
10877 9203587 6322616 4591132 4004109 1798673 -3035447 -7640630 -8949026 -7678412
10869 -7678412 -6242481 -4183286 470139 5709134 6220104 862892 -5050025 -7104600
10861 -7104600 -6878123 -6714079 -4372083 2181321 8563879 8766650 4029406 910536 1776425
10852 1776425 3153496 2838013 2501485 2970065 2693346 1776108 2311435 3745659 2939702
10843 2939702 -93065 -1483539 235864 2097424 2314838 2922526 4960089 5827051 3720868
10834 3720868 561475 -1502538 -2555627 -2405814 -80812 2578304 1704799 -2231987
10826 -2231987 -3940118 -1532708 165025 -2363548 -5471570 -4698197 -2151629 -2583480
10818 -2583480 -5766730 -7816285 -7397223 -5894652 -3463855 620371 4897771 6673870
10810 6673870 5346483 2453935 -378999 -1910322 -1681743 -1485600 -3984729 -8406063
10802 -8406063 -10547605 -8634754 -5780432 -4790150 -4299705 -2498360 -994879 -2006475
10794 -2006475 -4631511 -6474597 -6402845 -4106529 -190515 2086763 -640656 -6139235
10786 -6139235 -8177804 -5375679 -2938742 -3740281 -4269475 -2384019 -1910405 -5118184 -7506668
10777 -7506668 -5518771 -3108623 -4655374 -7340759 -7038963 -5956042 -7241073 -7530756
10769 -7530756 -2923789 2400582 2221463 -907187 95289 4558517 5146666 -289114
10761 -289114 -6384097 -8988642 -8695365 -6419177 -2467339 762881 1536153 2813065 7219101
10752 7219101 10270367 5980071 -2779381 -7438720 -5669052 -2005148 1878940 8291098
10744 8291098 15319798 17029732 13013252 9326370 8662797 7687287 5298699 4970816 6845625
10735 6845625 5953613 1280927 -1216756 1769688 5364718 4602844 1838057 1747115 4035902
10726 4035902 5321107 4364338 2025193 -750372 -2470289 -1696093 421480 1414313 1755990
10717 1755990 3742096 5964946 4093588 -1949719 -6817943 -7002708 -4389910 -1559722
10709 -1559722 1426487 4512454 6800609 8820369 10735601 8835613 335951 -8727480
10701 -8727480 -8698674 -469647 4537060 1099255 -2518382 1485826 8335891 9317613 5213969
10692 5213969 3070856 4554116 5618206 4800457 4407609 4736031 3254094 -684143 -4685467
10683 -4685467 -6631159 -6179897 -3922290 -1498401 -1189715 -3252256 -5205176 -5338595 -4772847
10674 -4772847 -4674233 -4251468 -3091178 -2348274 -1956241 -192447 2139750 1248851 -3300442
10665 -3300442 -6055093 -3112979 1629698 1980827 -1642861 -3461509 -774956 3281408
10657 3281408 4807734 3260058 400067 -2077995 -3261983 -2925971 -1337733 1024088
10649 1024088 3358060 4660081 5053950 6269803 9052687 11010032 9478609 5678218
10641 5678218 3084929 2536818 2391414 2557234 3959475 4487732 694803 -5866364 -9191950
10632 -9191950 -7054832 -3761466 -2972386 -2803131 -743690 1134926 -347856 -3871954
10624 -3871954 -5250746 -3140291 -225902 641872 -425545 -1179390 -572935 -633706 -3594466
10615 -3594466 -7330125 -7010622 -2564581 70950 -1956410 -3522020 -624407 1522006
10607 1522006 -2958885 -9029732 -7584312 -692642 1144440 -4061822 -7200977 -3515106
10599 -3515106 619692 -659384 -4313865 -5580489 -4812610 -3130005 855442 5957577
10591 5957577 7275548 3919677 1346987 3026313 6362730 9045730 11924029 13407570
10583 13407570 9439383 1936674 -1287683 1722229 4004103 1624926 -553693 1094174
10575 1094174 2846529 2277968 3250072 6658015 5851813 -2061410 -9275980 -8717347 -4167739
10566 -4167739 -1959484 -795261 2522495 4958454 3038180 155700 326928 789076
10558 789076 -1805180 -3819398 -544357 5785735 10425777 13023451 14219464 11573301
10550 11573301 4990245 91903 298234 1557275 13214 -1829520 -1312800 -444079
10542 -444079 5726 2799623 6281628 3843321 -3900300 -7208707 -2748373 918893
10534 918893 -810411 -890634 3788069 4028685 -4554121 -10765900 -5897452 1514873 1604736
10525 1604736 -280889 3141567 5386909 -619607 -6924568 -4657820 -1099087 -5413904
10517 -5413904 -9903883 -4018511 4770077 3525374 -3613400 -4799140 -1475562 -637409
10509 -637409 2050103 11044274 15557999 7141586 -879554 5272341 14071455 9884499
10501 9884499 3213740 10180339 19350185 13207326 4717781 12973372 21131020 5831586
10493 5831586 -10105219 7375521 32154551 16573319 -2569954 69679489 227655471
10486 227655471 326216342 259200415 103278118 10911206 16803188 35965511 15968922
10479 15968922 -7097668 883967 15831402 10970142 1735098 6724257 12380575 4000534
10471 4000534 -5379648 -1752823 4357088 887606 -3033268 2780903 9043899 5105596
10463 5105596 -1586186 -907020 2093900 60834 -1598509 2985237 6952474 3551551
10455 3551551 -715493 1368115 4211428 946622 -3002411 -602997 2861570 -491645
10447 -491645 -6182344 -4918458 1714724 5130810 3989418 3535508 4758258 4208082 1873957
10438 1873957 810657 952336 39266 -1263804 -524083 2349416 6116986 10338100 13300551
10429 13300551 11948508 7291909 5282753 8528334 11825871 10003171 5501031 3570467
10421 3570467 4119774 3288637 12062 -3479787 -5415323 -5268908 -2995216 -118991 770981
10412 770981 -413663 -894677 433738 1532403 1486668 2058873 3442293 3121277 1000070
10403 1000070 747808 3343257 4232925 459353 -3887263 -3605470 -143266 1187613 -848908
10394 -848908 -2954946 -3350280 -3786357 -5405049 -6001064 -2816493 3239996 7492070 6140946
10385 6140946 696739 -3582875 -4017367 -3036549 -3242087 -3176005 -847537 1723161 1770417
10376 1770417 1102451 3084037 6050265 5284304 655631 -3231001 -4034835 -3426963 -2296621
10367 -2296621 56152 2039136 1014745 -1284981 -604276 2085910 1138872 -4281536
10359 -4281536 -7928019 -5911425 -2182733 -1569944 -2906894 -2797318 -1758662 -2638528 -5770328
10350 -5770328 -8742409 -9085485 -5810405 -572860 2364919 517102 -2549912 -1363792
10342 -1363792 3179277 4689467 784896 -3862385 -5004115 -3526959 -1095139 2819244
10334 2819244 6967056 7139145 2350637 -2599671 -4005236 -4153777 -6129897 -8298744
10326 -8298744 -7770763 -5377222 -3180921 -351355 4486072 9418809 11497985 10904018
10318 10904018 9869670 9189529 8267004 6989421 5540599 3756164 1800192 -178504
10310 -178504 -3293276 -8248445 -12429182 -12088141 -7674199 -3236082 -483766 2011062
10302 2011062 3598856 1340094 -3677573 -5852638 -3370527 -1355543 -3600982 -6396015
10294 -6396015 -4441251 1365040 5866742 6005973 2360864 -2121728 -2675496 3551856
10286 3551856 11660896 11820901 1356386 -10682804 -14681775 -11335056 -7245670 -4895197
10278 -4895197 -2668987 -713339 -199354 921386 5372532 10964994 12696574 9744650
10270 9744650 6031788 4321700 3544605 1895127 -323813 -1089791 1564189 7463153
10262 7463153 13332984 15695809 15063792 14512704 14024460 10560418 4640140 1554110 3781380
10253 3781380 7282381 8060363 7321070 7168690 6736289 6165756 8464104 12868864 12429109
10244 12429109 3826452 -6053358 -9648006 -9282701 -10992520 -13183366 -10397387 -4476974
10236 -4476974 -2086806 -3034645 -814034 5567698 9495729 7386130 3291056 1444312
10228 1444312 1484918 2639660 5670459 8713640 7787315 3740152 2371411 4887416 4512764
10219 4512764 -3367341 -12884175 -14592749 -7696794 -655694 -774864 -6747913 -11450116
10211 -11450116 -9806291 -3132426 3569976 7354467 8887848 8854769 6394704 2762734
10203 2762734 2531121 7435105 12196492 11065938 5999925 3276742 4257084 5342061
10195 5342061 5357164 6292975 7367593 5281281 808398 -1446690 -791042 -1521619 -4977830
10186 -4977830 -6987901 -5167421 -2488117 -1180499 779304 4202691 5676872 3496587
10178 3496587 1124911 1090151 806298 -1593388 -2831920 -674993 889563 -1456845 -3109462
10169 -3109462 1714544 9391110 10798667 4144673 -3595193 -7455045 -9145071 -10191044
10161 -10191044 -8084863 -2465113 981028 -2349724 -8487875 -9395166 -3366027 3351882
10153 3351882 5063068 2972269 1885774 3375192 4655160 3209832 -190472 -3648726
10145 -3648726 -6898549 -9937894 -10500899 -6056010 1522007 6237747 4331390 -1571152
10137 -1571152 -6010297 -6683360 -5366020 -4426263 -4439688 -4559304 -3645099 -1403501 670784
10128 670784 361178 -2304409 -4370699 -3532461 -1129437 831 -677481 -1764506 -2769841
10119 -2769841 -3795402 -3171609 945061 6041733 6066213 -939483 -8679702 -9277014 -2784991
10110 -2784991 3397668 4266333 2398428 2074805 2141276 -1504335 -8245116 -12341541 -10699521
10101 -10699521 -6850265 -5152004 -4455304 -922087 4946903 8330630 6976178 4278294
10093 4278294 4198457 5823030 5028664 268229 -5222199 -6909440 -3704433 984336 2808418
10084 2808418 1021561 -1050930 -449633 1506735 1054431 -2864659 -7118923 -8278865
10076 -8278865 -6397124 -4195950 -3604286 -4026924 -3612855 -1551154 1054047 2618505 3112320
10067 3112320 3838571 5064397 5250332 3478318 1213379 206524 -133001 -1456348 -3534599
10058 -3534599 -4666988 -4406994 -3841505 -3667772 -4002200 -5400751 -7677410 -8392650 -5522517
10049 -5522517 -1442951 -868539 -4276202 -6833289 -5240744 -2440473 -3218286 -7399067
10041 -7399067 -10131242 -7999095 -2726160 1054979 608025 -2228923 -2881443 1032534
10033 1032534 6907498 10141580 9151293 5904273 2603144 403501 515003 3020930
10025 3020930 4711067 2030804 -3253496 -5438127 -2847199 177532 720621 1252939
10017 1252939 3197923 2389456 -3834473 -9783603 -8528473 -2877253 -1602949 -5878473
10009 -5878473 -7533056 -1832797 5664076 8109790 6838523 7186346 9357921 8978352
10001 8978352 4598078 -412263 -3013965 -3547711 -3205159 -1596141 1841562 5700114
9993 5700114 7230930 4813579 -534300 -5806406 -8066438 -6245331 -1534947 3252885
9985 3252885 4800247 1415695 -4551204 -7645742 -4783860 817912 3406183 1700662
9977 1700662 -756263 -1716369 -2555739 -3767434 -2807192 1128214 4332092 4086219 3353214
9968 3353214 5673101 8530293 7320281 3776082 3839813 7657090 8761874 4488296 151307
9959 151307 -237007 -838042 -6452517 -13189750 -13232879 -6175087 923745 3639802 4209838
9950 4209838 5547104 7084580 7701437 7822721 7017931 3806714 -495762 -1856215 738565
9941 738565 3719668 5079264 7418326 11872924 13889757 9806154 3772497 2267145
9933 2267145 4279296 3450137 -1283395 -4325479 -3270031 -2971945 -7001107 -11008769 -9031515
9924 -9031515 -2414362 2308256 2045551 -781443 -3295000 -4798956 -4648762 -1621099 3453575
9915 3453575 7147185 6980466 4175115 2033557 2412835 4166107 4544100 2275007 -422264
9906 -422264 133046 4253619 7596092 6341417 2100299 -874971 -2026356 -4316612 -7923762
9897 -7923762 -8544376 -3756385 2569125 5122408 3936037 2979618 3555211 2978023 -120098
9888 -120098 -2615925 -551307 5795737 11982791 13980803 11876811 9126133 8513865 9450960
9879 9450960 9906379 10049304 11630652 14035256 14984208 16547723 24798984 38415380 42720284
9870 42720284 24545610 -7684018 -28985232 -26153912 -11982846 -5840847 -9148514 -9513681
9862 -9513681 -2577820 3195885 2193422 -538192 -43178 399679 -2946421 -6463044 -5453097
9853 -5453097 -2291717 -1816666 -3096684 -2352184 -530279 -1051368 -2420791 -327175 3861470
9844 3861470 3812054 -2097289 -8243899 -10282419 -10310925 -11241529 -11383899 -8264891 -4011838
9835 -4011838 -2808877 -5041387 -7467070 -8069227 -7800387 -7957116 -8154767 -7113826 -4266877
9826 -4266877 -581515 1809437 1465183 -535333 -1656087 -1162673 -938636 -2423988 -4342200
9817 -4342200 -4659977 -3525389 -2770870 -3174812 -3508988 -2101961 1324885 5088441 6623498
9808 6623498 4905725 1987339 1043392 2602856 4030529 3168246 867109 -903517 -1683141
9799 -1683141 -1848712 -869763 1776144 4725004 5676722 4068944 1489229 -288028 -482432
9790 -482432 1029804 3762501 6297564 7014237 5316102 1755734 -2396933 -5071603 -4182341
9781 -4182341 -102840 3588880 3884367 2292573 2728655 5823313 8162695 7426683 5006805
9772 5006805 2385859 -1467522 -6484323 -8479857 -4026777 3115884 5123322 -131636
9764 -131636 -6614468 -8493717 -6949555 -6401809 -7400035 -6832846 -3504131 -20149 575360
9755 575360 -2217733 -6241708 -7746389 -3779957 3955604 8670670 5104600 -3692552
9747 -3692552 -9365161 -8039642 -3610148 -799977 811152 3716151 7076091 7801175
9739 7801175 5032753 383897 -4906132 -9923895 -12226934 -9758438 -4948954 -3539553
9731 -3539553 -7694016 -12501993 -11543459 -4997768 87810 -1920975 -8379512 -11320542
9723 -11320542 -6762346 859396 4232661 1423652 -2961753 -3699528 -48289 4476687
9715 4476687 5489594 1302474 -5070951 -8134707 -6110804 -3703017 -5840012 -10206272
9707 -10206272 -10440171 -6005369 -3109307 -4944884 -7247206 -6097643 -4095076 -4682807
9699 -4682807 -5696419 -3853034 -1367495 -2121548 -4468278 -4070668 -1450153 -279170 -31718
9690 -31718 2762079 6875466 7136769 2993132 -528465 -1273148 -2592333 -5899545 -7333173
9681 -7333173 -4648653 -1385937 -642547 -90651 2638577 4337480 1040931 -4734030 -6547106
9672 -6547106 -2115506 4954957 9827035 9552167 3743483 -3799341 -5624150 2634611
9664 2634611 15819973 22968347 18303911 6581038 -2600355 -3851602 655856 4755350
9656 4755350 4213062 -7044 -3524746 -3216967 129730 3182044 2879407 -1542849 -7323386
9647 -7323386 -9189533 -4412294 2622334 4159853 -1156028 -5753557 -3025742 3552351
9639 3552351 5430115 1003625 -2836347 -1291557 1796598 715866 -2980254 -2872262
9631 -2872262 2271012 6103992 3725172 -1255431 -2174731 809378 1171615 -4115569 -10289211
9622 -10289211 -11843168 -9260184 -5959851 -2667348 1117895 3212088 1278827 -2468966
9614 -2468966 -3871236 -2997428 -3099422 -4377063 -3840992 -1086677 895448 1011986 1427862
9605 1427862 3154511 4751361 5651419 6109805 4002113 -2644035 -9627239 -9632380 -2714552
9596 -2714552 2864502 2279526 -258066 -217168 488198 -200821 1268956 7332877 12645996
9587 12645996 11079606 5142721 1777878 2327386 3307316 4045399 6471477 9263270 8972327
9578 8972327 5986700 3580084 2151121 -47748 -1769115 -305660 2615078 2398921
9570 2398921 -1080155 -3207131 -1887845 -12378 -225552 -1802692 -3265159 -4173598 -4068068
9561 -4068068 -3016385 -2728531 -3766385 -3003401 2111234 8484306 11356898 11470035 12478308
9552 12478308 12895300 7824793 -1490391 -7399987 -6436021 -3302508 -2470755 -2597534 -2034438
9543 -2034438 -3299038 -7918122 -11981854 -11359711 -7671744 -5106589 -4326548 -3156366 -895326
9534 -895326 1268973 2360406 1875554 -213830 -2227041 -1806546 753723 2958636 4478721
9525 4478721 7169696 9795257 7891032 1428904 -2574552 780897 6732853 7365502
9517 7365502 2404826 -1992296 -3092441 -4119352 -7216020 -9686565 -9017451 -7367931
9509 -7367931 -8158541 -10546823 -10493688 -6827136 -3291199 -3208328 -4208157 -1412499 4478249
9500 4478249 6547071 1205191 -5696655 -6498048 -2359444 -602823 -3430260 -6267520
9492 -6267520 -6887354 -8169733 -10094658 -7241185 1623703 8722101 7768248 3380553 3312543
9483 3312543 6188430 5001540 -269268 -2431949 1100476 4611340 3595963 714230
9475 714230 -553080 -2093045 -6828135 -12320197 -13367506 -9145137 -4048105 -2179784
9467 -2179784 -3777392 -6743291 -9253114 -10333565 -9438248 -6554366 -2661062 298988
9459 298988 493711 -1968504 -4229943 -2746414 2891008 8481515 8673377 2526197 -4905241
9450 -4905241 -7453060 -4211977 -22885 449600 -2464902 -5243842 -5811888 -4533792 -2176054
9441 -2176054 374880 1086281 -1502708 -5410652 -6811013 -4946549 -2841877 -2524966 -2351488
9432 -2351488 -313768 2511110 3566135 2098278 -756220 -3835197 -6533761 -8493586
9424 -8493586 -9683069 -10105166 -9197000 -6548509 -3158256 -711591 130837 -503180 -2613656
9415 -2613656 -5153825 -5510898 -3030393 -1412932 -3722522 -6549353 -4259744 1812757
9407 1812757 4592054 1923631 -723836 329347 1896754 1039876 317137 1794571 2109823
9398 2109823 -1421652 -5200092 -5214327 -3556589 -3462236 -2819656 883243 3731411 1088559
9389 1088559 -3365764 -2461312 2865349 5105359 2182875 -333087 916471 2840702
9381 2840702 2622617 1728656 1572256 1210800 966773 2812473 5682481 5786264 3107137
9372 3107137 2314871 5556021 9475904 11122933 11577593 11674568 9447820 4640751 1037874
9363 1037874 1185397 2753616 2940910 2571660 2955337 2627507 590204 -687912 809326
9354 809326 2564505 1182435 -1866508 -1790134 3252637 10130803 14235511 13151281 7904606
9345 7904606 2237710 -164309 1143412 3496204 4384053 3339015 1238135 -198436
9337 -198436 814178 3092699 1834662 -4759756 -9852555 -5268345 5772355 10780859
9329 10780859 4706127 -3228106 -3079009 2850050 6060323 4301893 915238 -3126645
9321 -3126645 -8238264 -10387243 -4966296 4215530 7720111 3230508 -1062124 2261078
9313 2261078 10414261 14767898 10962624 2155242 -5610201 -9118708 -9658570 -9801590 -9147225
9304 -9147225 -5125139 1558301 5670989 3969892 -263969 -2423037 -3041633 -4816411
9296 -4816411 -6246250 -3868089 974481 3496791 2775319 2026897 2126495 776139 -1752408
9287 -1752408 -2077807 227340 1730887 1410301 2095859 4189598 3975166 570419 -1288987
9278 -1288987 1281646 4270730 3057319 -723406 -2748390 -2694381 -3121376 -4623705 -5910943
9269 -5910943 -6106399 -3804212 2892862 11870195 16195442 12298192 5778868 4136616
9261 4136616 6635062 7068042 4163948 2404403 3284871 2858222 -790321 -3710363 -2264277
9252 -2264277 1343425 2594864 701264 -1496540 -1783553 -639408 109298 -318694 -465865
9243 -465865 1445208 3826247 2349898 -3489271 -7389130 -4034776 2493658 3820306
9235 3820306 -565682 -3199382 -925660 434128 -3819670 -9714410 -11348525 -9184242
9227 -9184242 -6716924 -4124775 -796172 457542 -1877299 -2798869 2688019 10504182
9219 10504182 12315711 7627472 3292497 1944927 -344190 -4116079 -3501713 3437962
9211 3437962 9491726 8668730 5253723 6126165 9061446 6312404 -2669783 -9738040 -9218854
9202 -9218854 -4224370 -527835 678483 1537495 2786253 3415119 3430260 4334413 6966914
9193 6966914 10226505 12212184 12047101 10094172 6557386 1195564 -4347653 -5412272
9185 -5412272 1134010 10916534 14519832 8146574 -1265558 -4498432 -968184 2542407
9177 2542407 2041111 457975 1836073 5658529 8114934 6457910 1472583 -2621131
9169 -2621131 -1303422 4888649 9288507 6671715 739588 -408722 4265885 7412832
9161 7412832 4348971 -644111 -1973403 -1131675 -2696326 -5881567 -5846040 -1696941 2164440
9152 2164440 2526189 909071 126539 686136 1516724 1843722 1391870 179178 -1428346
9143 -1428346 -3235300 -5308045 -6739997 -5688561 -2183072 655453 429847 -844189
9135 -844189 383831 3528145 4183976 76856 -5968067 -9342420 -8073841 -4090037 -1670372
9126 -1670372 -3705503 -7607784 -6744438 1064643 8687355 8097143 2174103 1583535 9421027
9117 9421027 16330556 13948817 6266752 2135045 1976160 -462145 -6006563 -8224124
9109 -8224124 -4097977 947700 1461398 -283364 914430 4357940 4448866 -567889 -5262144
9100 -5262144 -3527696 4042671 10934963 12010495 8722844 6910320 10027245 15170917
9092 15170917 16057458 9776263 255957 -5226030 -3044850 3458990 7959970 8022762 6725506
9083 6725506 7199238 7876637 5484421 1169121 -245688 2595487 5146334 3445789 -391573
9074 -391573 -1917691 -790020 60947 -238169 -66534 637972 -52558 -2299748 -3891266
9065 -3891266 -3886536 -3478332 -2465833 1419247 7810179 11601176 8567771 1306598 -3473740
9056 -3473740 -2964084 -914642 -2079365 -6212202 -8869917 -7213295 -3360641 -1478176
9048 -1478176 -2710178 -4551426 -4860526 -4108216 -2858225 137096 4881320 7464766 4242988
9039 4242988 -2184140 -5209065 -2709991 474193 -453769 -4316828 -6718466 -5689693
9031 -5689693 -2406881 1387702 4307040 5153166 3880795 1969070 802779 608076 1118434
9022 1118434 1397395 -972322 -7452158 -14559999 -15921709 -10060340 -2729834 686691
9014 686691 1497703 3500990 6158590 6242412 3669398 981552 -1372751 -4599810 -7476745
9005 -7476745 -7433041 -5355912 -4772352 -6088429 -6057717 -3637491 -2016067 -3326220 -5103272
8996 -5103272 -4058184 -550874 2697379 4190448 4225521 3641501 3430097 4072466 4228095
8987 4228095 1797507 -2633639 -5272284 -3607306 -53990 689847 -2570496 -5806917
8979 -5806917 -4067424 3003142 10273825 12087490 8024727 2813262 385299 -194565
8971 -194565 -1881865 -4870412 -6824551 -6362482 -3775232 629166 6192574 10639045 11802281
8962 11802281 10207465 7776960 4996348 1813236 -269995 -482994 -1724316 -6777399
8954 -6777399 -12329986 -11897432 -5129913 944813 1375738 -837323 -455080 2874064 6150864
8945 6150864 7998262 8557066 6985443 2732463 -1930191 -3627471 -1758700 1165738
8937 1165738 2677104 2654907 2834503 4623296 7261590 8577105 7993487 7306582 7338554
8928 7338554 6316851 3968949 4012908 8262647 11209699 6616442 -2313732 -6561280 -4383652
8919 -4383652 -2713219 -4889239 -5886567 -2312844 1625781 2381915 3184071 6505468 7882749
8910 7882749 3870699 -195130 2178814 8211959 10475949 7912604 4916360 2916155
8902 2916155 370676 -1469770 -48205 3152798 5122633 6870276 10124105 11369581
8894 11369581 6546606 -569108 -2463052 1218494 4583068 5756272 7751422 9859868
8886 9859868 7331857 506964 -4269940 -4447472 -4019647 -4669244 -2317357 4532161 10536315
8877 10536315 11428391 9845907 9511588 9493732 8210663 7643815 9084802 9242922 5125078
8868 5125078 -741850 -3988087 -4288066 -4009957 -3672014 -2085223 949088 4551975 7654761
8859 7654761 8725937 6999324 4601318 4205328 4209580 643430 -5369125 -7528731 -3770817
8850 -3770817 -161943 -2116931 -6698603 -7688222 -4195270 81800 2854505 4214854
8842 4214854 4109494 2707414 1454541 901705 -378930 -2399035 -2215399 1496993 5457029
8833 5457029 6551035 6617802 8826614 11772764 11150869 5877701 -720460 -4817145 -4914448
8824 -4914448 -2215719 -87018 -1409677 -4857549 -5842700 -2372024 2689278 6138259
8816 6138259 7541713 6537037 1730429 -5176081 -8815758 -7074411 -4341223 -4413069 -4778504
8807 -4778504 -2209814 712306 242397 -1206613 1343374 7102950 10887974 11001134 9957268
8798 9957268 8868427 6969770 5767620 7739780 10926458 10102625 3916243 -3341353
8790 -3341353 -7336370 -7374757 -4743068 -1177811 1120080 1375467 1857264 4621814 7709439
8781 7709439 7939269 6016307 4846271 4185502 1627756 -1960846 -2916474 -563626 1953433
8772 1953433 2705247 2782609 3126948 3398968 3676559 3537121 455316 -6399834 -11883269
8763 -11883269 -9880594 -2273243 2815956 1911973 -657870 -1141174 -1270918 -2743715 -3106136
8754 -3106136 -606789 1807390 1012181 -1641163 -3321438 -3660788 -2818455 302096 4348684
8745 4348684 4036325 -3015753 -10929284 -12080947 -7089494 -3180583 -3564009 -3991697 -716989
8736 -716989 3279824 3015022 -732734 -2362552 640980 4469390 4727211 2355381 1115648
8727 1115648 1107408 -964321 -5006379 -5899017 -1121907 4028668 3029571 -2534035 -4959423
8718 -4959423 -647872 6360015 10964551 12607907 13382882 14356087 15326078 15565758 13605407
8709 13605407 8537179 2436658 -670003 786258 4165535 5795259 4484083 1797693
8701 1797693 250949 1080731 2764868 2662266 1094174 1666371 5755485 9602005 9847939
8692 9847939 8708152 9373867 9544303 5396417 -456459 -2024939 208442 62034 -3743945
8683 -3743945 -5658919 -3209479 -912026 -1768646 -2431953 -529593 130399 -3621684 -8105722
8674 -8105722 -8499219 -6086753 -4927029 -5299577 -5076586 -4021707 -2549305 119864 2601458
8665 2601458 334265 -7509224 -14177295 -13508137 -8275373 -5103489 -4770989 -3725795 -2192300
8656 -2192300 -3761733 -8289255 -11559952 -11514327 -9549433 -6502882 -2510020 133067 -678120
8647 -678120 -2442182 -1328300 1054089 43314 -3573371 -4200027 -1065526 -99914 -4066574
8638 -4066574 -7484909 -5134040 -257447 540403 -2915902 -4752440 -1673604 3261660
8630 3261660 5638968 5269564 5442620 7926448 10337804 9229710 5060475 1961480 1845171
8621 1845171 1498417 -2021554 -5567635 -3519424 3795408 9604784 8798675 2785984 -4031944
8612 -4031944 -8610617 -9125964 -4666855 2548312 7399695 6718289 2432097 -1379928 -2816822
8603 -2816822 -2542974 -1867884 -1750906 -2264906 -2238416 -755067 964668 1150491 726532
8594 726532 2170702 5045596 6071909 4339256 2722524 2761270 1979237 -1591083 -5889144
8585 -5889144 -8518492 -10468838 -12808736 -12876370 -8079259 -1334364 1901808 990394 198539
8576 198539 1907722 3948947 4041637 3062037 2730753 2867370 2285128 692259 -1095952
8567 -1095952 -1842826 -1058254 -467815 -2856746 -7619845 -9648308 -5807020 -250682 1274740
8558 1274740 434893 3289574 9107704 10277801 5084392 1982167 6532588 11799497
8550 11799497 8723422 34136 -4695192 -3732056 -3367130 -5474454 -5042430 -575413 2675142
8541 2675142 2179043 2084761 4233432 3455991 -3106945 -9108455 -7744747 -1992309 540943
8532 540943 -1129208 -2048044 -356463 1047728 274679 -1908227 -4929418 -7864635 -7609909
8523 -7609909 -2666754 2902200 4434783 3636214 4906956 6861638 4509262 -1302684
8515 -1302684 -4381877 -3280596 -3105401 -5979620 -7342223 -4165955 216813 2620673
8507 2620673 4746558 7686240 7905822 3422016 -1130850 -656902 3110024 5095510 4193236
8498 4193236 2711759 1753694 1441537 2714478 4654184 3086977 -3523125 -9570593 -8777855
8489 -8777855 -3075054 237725 -1168796 -2590160 -366381 3111702 3789477 1708847
8481 1708847 389745 2059357 4929345 5233501 1859633 -1952398 -3006662 -3024817 -5802826
8472 -5802826 -10171720 -10847880 -7186979 -5262107 -8568512 -12349344 -11224312 -7339769
8464 -7339769 -5834364 -6495920 -5734606 -3647757 -3179986 -4407194 -5035538 -4806896 -4656737
8455 -4656737 -3561963 -845305 860362 -179052 -409710 3794952 9339269 10748459
8447 10748459 8571928 6985231 5712503 1768522 -2815612 -3150964 -299223 280116
8439 280116 -1446261 -335421 3694176 4570427 531764 -2959694 -2913342 -3095985 -5765482
8430 -5765482 -7062746 -4281521 -630100 964525 2145770 3669050 2496661 -1616337
8422 -1616337 -3326769 -23638 3375101 2647476 970152 2185022 3609754 1645129
8414 1645129 -1074174 -786705 65783 -2295714 -4941809 -2629237 2594877 3547870 -1846816
8405 -1846816 -8634012 -11774119 -9789865 -3476147 3715352 6142855 2234432 -1876798
8397 -1876798 -222601 4360244 5460659 3664944 4265285 6866116 6190518 2418560 1336291
8388 1336291 3341867 1764366 -5112528 -9215741 -4528138 3472966 5896756 2453185
8380 2453185 -663884 -912600 -1028373 -2435876 -2766863 19082 4729247 8425165 8833562
8371 8833562 5898204 2387730 1604624 3160309 3188602 490571 -541745 3639901 9017437
8362 9017437 8438979 1732256 -3777496 -3450905 -907969 -1057037 -2194235 272981 4825697
8353 4825697 4663415 -1978615 -8007489 -6946453 -1934462 -630251 -3826910 -5058827
8345 -5058827 -995235 4105453 5875484 5722172 5798458 3498234 -3506667 -10331788 -9691063
8336 -9691063 -2477360 2781014 1338011 -2677272 -3852897 -2616139 -2043373 -2141659 -1216740
8327 -1216740 -71732 -830849 -3029015 -4383735 -4745254 -5989979 -7883556 -7161293 -2181057
8318 -2181057 3473157 4352708 -97152 -4345624 -3710101 -849359 -2266370 -8367795 -11259584
8309 -11259584 -5193011 4293545 6547384 -483738 -8385008 -10245624 -8370370 -7840835
8301 -7840835 -8231876 -6363334 -3395708 -3485023 -6878314 -9457047 -8937355 -7209649 -6171607
8292 -6171607 -5117753 -3170384 -971419 1191796 3956477 6274274 5185878 111832
8284 111832 -5137538 -6957961 -6562755 -7387348 -9421202 -9305593 -5713577 -1673054 -879345
8275 -879345 -3750961 -7922047 -11023943 -12008230 -10842116 -8016684 -4136778 323694 4660996
8266 4660996 7678222 8559868 7771404 6241609 4103424 1419066 -492399 -340972 794190
8257 794190 694365 -337473 209357 2388014 2655171 -762258 -4340933 -3929931 -630510
8248 -630510 1383915 1211058 1401161 2605045 2369537 -264122 -2825765 -3256038 -2399861
8239 -2399861 -1255015 1110710 4852404 7251101 5967271 2651943 744729 834245 687795
8230 687795 -831026 -2434639 -3021111 -3341743 -4271364 -4936759 -3752289 -742302 2155192
8221 2155192 3084772 1886329 -404728 -2717230 -3778068 -1759246 3915729 10391225
8213 10391225 13285689 11573714 8368344 5973468 3248547 -225361 -1191289 2131747
8205 2131747 5041095 1999909 -4267804 -5452292 578168 6681996 6256849 622518
8197 622518 -5147198 -8429119 -8572615 -5086056 482533 4550428 5967561 6926093 7677424
8188 7677424 5145174 -832565 -5438885 -6484259 -8250608 -13207637 -15934542 -11513055
8180 -11513055 -4620294 -2747226 -4737989 -4568636 -3027267 -5689058 -10838824 -10124277
8172 -10124277 -2248523 3999079 3068559 -131566 -197960 211565 -2619592 -5282981 -3330042
8163 -3330042 -467898 -3827018 -12610169 -18683583 -17715032 -13566609 -11324933 -11293789 -11245719
8154 -11245719 -10409997 -9057404 -6876403 -4080707 -2622104 -4097838 -6877187 -7240343
8146 -7240343 -3967969 -360065 -239860 -2846824 -4128164 -3122054 -3626572 -7751997 -11364405
8137 -11364405 -9665815 -4790504 -2984831 -5429711 -7151589 -4942520 -907044 2632512
8129 2632512 6040307 8317579 5989722 -521565 -4486342 -1427550 3760367 3322504
8121 3322504 -2639278 -7481939 -8115233 -7613470 -7966615 -6405559 -999851 4694367 5817482
8112 5817482 2568942 -561643 -764591 351289 -215408 -2917313 -5267681 -4571134 -594937
8103 -594937 4122053 6289038 4467836 261987 -2936690 -2875933 -416606 1765871 2424951
8094 2424951 2783880 4228745 6520586 8953815 11206079 11579088 6990777 -2266861 -9839327
8085 -9839327 -9658847 -4100247 -995581 -2406662 -1887560 5137781 13566216 15146690 9305790
8076 9305790 2874254 827289 1723621 1964870 748828 -179577 543363 2314084 3077686
8067 3077686 1228862 -2438878 -4885409 -3376825 2276833 9691865 15113674 15205666 9763077
8058 9763077 2956812 -171516 1060852 3196635 4026990 4643314 5438369 4025608 -384736
8049 -384736 -3646486 -1094514 6276730 12820767 14355134 11220309 6595120 3834420
8041 3834420 4216384 5441071 3645245 -1538883 -5736895 -5357346 -2086356 454203 2073899
8032 2073899 4716630 7586224 7482991 3534624 -1617911 -5171632 -6005488 -3608069 1737473
8023 1737473 7266826 8820109 4808208 -1949505 -6767515 -7011462 -3952138 -1346943
8015 -1346943 -1615429 -3319017 -3595414 -2566231 -2640309 -3572408 -2377876 646141 757271
8006 757271 -3469032 -6062409 -1893479 4957448 6607305 2319985 -1884243 -2650238 -2126317
7997 -2126317 -2333491 -2846861 -4084685 -7245704 -10506817 -10433447 -7657648 -6156987 -6488928
7988 -6488928 -5102674 -1259461 894721 -1062174 -3988333 -3934064 -645480 4123359 8577473
7979 8577473 9918817 6023999 -379201 -3756183 -3372756 -3922675 -7200193 -9062538 -7027463
7970 -7027463 -4585768 -4404604 -3436272 492488 2991074 -38590 -4469176 -3450199 2398189
7961 2398189 6684714 6659771 4691854 2325220 -756347 -2979862 -2248590 -632267 -2124366
7952 -2124366 -5945376 -7365391 -5118182 -2855017 -3101286 -4691881 -6299726 -7543839
7944 -7543839 -6550769 -1764069 3495064 3984268 832692 792215 5708454 9184231 6431859
7935 6431859 1129683 -1530509 -2936567 -6957413 -12070325 -13359424 -9746236 -4179351
7927 -4179351 1187930 5271563 5727461 1613341 -2965442 -2960113 670031 2799385 1939674
7918 1939674 1008648 959006 -434191 -3006403 -3487181 -1776488 -1968738 -4795539 -5072801
7909 -5072801 -327511 3689007 1262431 -4064825 -4785244 -830295 1241710 -985864
7901 -985864 -2961546 -1513661 475415 -427147 -3315079 -5870569 -7777540 -8775259 -7229127
7892 -7229127 -3297345 -123654 694581 1547407 4142640 5887486 4078660 449276 -1926951
7883 -1926951 -3119041 -3995301 -2845808 946654 3091824 20739 -4269429 -3683694 -464166
7874 -464166 -2275421 -9262835 -12721166 -8341718 -2167686 156509 1805271 6942618
7866 6942618 11673046 10227279 5172621 3456181 5400769 5590273 2864048 1317966
7858 1317966 1679417 -337552 -5661307 -8880627 -6242504 -945498 2484810 4191153
7850 4191153 6028386 6850445 4773219 1353128 -294025 36516 -111424 -2427197 -6671152
7841 -6671152 -11318440 -13632574 -11144203 -4966295 502220 3003137 4835118 7669565
7833 7669565 8621494 5400303 2014987 3610007 7455096 5821917 -2064490 -7939653
7825 -7939653 -6463643 -2670303 -3341267 -6493130 -5559123 -626041 1594472 -1836785 -6442243
7816 -6442243 -8088483 -8349831 -9560461 -9639385 -5916802 -714213 1429872 223081 -1002723
7807 -1002723 -1245803 -2599120 -4991021 -4633978 639212 7588201 10956764 8638753 2384311
7798 2384311 -4266519 -7464134 -5114362 413397 3619161 2017634 -849912 -657575
7790 -657575 1572406 1595127 -1376854 -3841972 -3489379 -2048551 -2241212 -4681960 -8299915
7781 -8299915 -11299305 -11215883 -6615576 424755 5702571 7350785 6848890 5681694 4178206
7772 4178206 3978883 7279144 11719766 10534953 1454405 -8104310 -9461567 -3878660
7764 -3878660 19774 -1341377 -2873906 -180651 3724491 3935120 1183978 -191477
7756 -191477 996645 2114735 1365880 -459546 -2358238 -4278569 -5910432 -6523279 -6099581
7747 -6099581 -5164055 -3994092 -3378000 -4855572 -7958186 -8554706 -3290684 4749952 8508241
7738 8508241 5600688 1005351 94777 2591303 5210870 6698867 7372331 6582548 4166725
7729 4166725 2422027 3068095 3808757 1604668 -2006028 -3073301 -1827984 -2236155 -4855040
7720 -4855040 -5346459 -1546607 2906569 4462660 4696983 6092180 6708096 3522392 -1559889
7711 -1559889 -3849966 -2601357 -1037007 -515988 595291 2220407 1570598 -1825522 -4146721
7702 -4146721 -2482960 931712 1920037 -385270 -3600845 -5736942 -6755686 -7546182 -8889854
7693 -8889854 -10647189 -11143044 -8694369 -4517974 -2178957 -2858632 -3363283 -854737 2607442
7684 2607442 3238974 1684004 2129144 5569987 8099855 7065290 5138916 5749024 7363653
7675 7363653 6001887 2033301 249206 2691378 5263078 3603116 -435710 -1429204
7667 -1429204 1705548 4081233 1637203 -3564674 -6613371 -6172249 -5157712 -5956058 -7565105
7658 -7565105 -7772610 -6170492 -4015539 -2228208 -682740 794400 1602743 980570 -688984
7649 -688984 -1798352 -1360659 -491623 -794599 -1342697 803670 6224122 11252893 12129162
7640 12129162 9443064 6446710 4524306 3091502 2772660 4994350 8361568 8982011
7632 8982011 5383724 316688 -3222650 -4958143 -5431621 -4397843 -2748634 -2842478 -4617506
7623 -4617506 -4286871 272385 5452655 6633109 4807759 4526561 6645037 7557263 5314217
7614 5314217 2162865 394959 -417571 -893940 -180626 1391764 1139645 -2083801 -5211751
7605 -5211751 -4838150 -2130200 -1170013 -3390375 -6289230 -7200712 -5756370 -2563683 1900549
7596 1900549 6127026 7505722 5145516 1530830 -332182 -524643 -1012437 -1518604 441679
7587 441679 4623621 6222601 1564062 -6205983 -10380401 -8951158 -6179651 -5803420 -6441555
7578 -6441555 -5138728 -2047227 828118 2959351 4649679 5074229 3799897 2601194
7570 2601194 2830371 2523996 -544266 -4209083 -4208876 -578532 2349628 2495527 2425497 4268361
7560 4268361 6289584 6373595 5426804 4877322 3635626 433797 -2853313 -3353714 -1619580
7551 -1619580 -1006617 -2857828 -4782415 -4275898 -2262798 -1796598 -3806307 -5492561 -3777627
7542 -3777627 375458 2930995 2257108 937223 540031 -2154186 -9905793 -18324772 -19830808
7533 -19830808 -13820490 -7282169 -4671566 -3188961 -85185 1662702 -945039 -4681569
7525 -4681569 -4774553 -2259716 -1345512 -2202091 -1960850 -967838 -2168086 -5053613 -5858010
7516 -5858010 -3856448 -2268251 -2269821 -1114246 2372908 4925917 3700114 599377 -677019
7507 -677019 439759 1622347 1340821 555748 1259889 3998419 6626257 6225439 2996582
7498 2996582 572488 825127 744086 -2478168 -5705069 -3900858 1517938 4044475 1730091
7489 1730091 -483852 700669 2016567 -42624 -3114428 -3054740 -575769 93042 -2973616
7480 -2973616 -7831505 -11122074 -10097129 -4412049 2326736 5240210 3887600 2469434
7472 2469434 3256897 3914874 3137426 3812617 7138578 8599799 4743563 -175523 -180725
7463 -180725 2911378 2440951 -2492360 -6100738 -5188671 -3125330 -3764341 -6553016 -8888738
7454 -8888738 -9254541 -7091153 -3061925 73787 132434 -962710 330562 3661648 5556770
7445 5556770 4942752 3501715 1392539 -1993641 -3498133 1055669 8734619 10898265
7437 10898265 4892255 -1978071 -2890274 370300 3125967 5081992 7018270 6205396
7429 6205396 1340704 -2631549 -1267677 1664351 208053 -3488346 -2990499 633451
7421 633451 147661 -4865833 -6015378 340742 6200679 3374280 -4857537 -9422160 -7965342
7412 -7965342 -5137296 -3322821 -159872 4959232 8090309 6427132 2829814 2068466
7404 2068466 4568144 6212014 3714548 -1413276 -4398543 -2065819 3955770 8706985
7396 8706985 8578125 4511551 515581 -716967 -207772 -631571 -2561155 -3837092 -2911820
7387 -2911820 -1458398 -2086503 -4116361 -4024439 -583573 3023052 3786270 3183866 4322589
7378 4322589 6543221 6278616 2568272 -1833409 -4916056 -7410457 -9528999 -9227934 -5562794
7369 -5562794 -1150855 769359 -88823 -1966233 -3538186 -3811875 -1561952 3020756 7468154
7360 7468154 9461362 8814523 6121844 1811004 -2097093 -2491981 109708 667916 -3191801
7351 -3191801 -6546893 -4407203 -341005 -1455729 -6760443 -8308067 -3866886 -112655
7343 -112655 -1251577 -2836114 -923940 483828 -2776314 -6495481 -5029123 -1627686
7335 -1627686 -2879225 -6229050 -3162322 6080543 11286703 7335874 991374 -604600
7327 -604600 575073 379162 1034657 5865476 11157021 10941682 6460341 3739258 4110610
7318 4110610 4001134 2582719 2789059 5239109 7441346 8906411 10983253 11665439 7179917
7309 7179917 -448960 -4227928 -2323354 -582193 -2403187 -3272239 412594 3987561
7301 3987561 2139907 -1710141 -1072847 2615086 3060443 881207 3016461 10065324 13287893
7292 13287893 7333474 -1366981 -3548457 869878 4877364 4814021 3233276 3138910 4444542
7283 4444542 6038018 7535814 8382943 7722279 5704839 3425608 1691606 1128315 2702442
7274 2702442 6317752 9530213 9700069 7175355 4584016 3363116 2861337 2438584 2229001
7265 2229001 1890274 795382 -456822 -963928 -1999553 -5773103 -10973971 -12514981 -7496584
7256 -7496584 774759 6626875 7991515 6544153 3888965 587283 -1921389 -1506813
7248 -1506813 2203030 7412576 12100828 14711878 13627423 8630766 3014715 1383792
7240 1383792 4259396 7109666 6110299 2908578 1874174 4186863 7061940 8288570
7232 8288570 8942856 10654411 11905509 9214598 2338989 -3533929 -2959663 2627731 5755699
7223 5755699 2334615 -2516052 -1253626 5355970 9000858 5336355 -338210 -936422
7215 -936422 3218902 6473825 6071435 4232928 3558979 4160929 4946934 4886467 3262970
7206 3262970 783744 -369072 392616 421672 -2138837 -4479553 -2928987 663481 814151
7197 814151 -3560828 -7511938 -7031595 -3393086 471514 3649005 5696758 5532124 4140187
7188 4140187 4824834 8293253 10740896 9372928 6579902 5763701 6303635 6108221 5964358
7179 5964358 7043222 6753411 2238551 -3589692 -5011065 -1984534 -121495 -1610706
7171 -1610706 -1767832 3214940 9855835 12163654 9627283 6607887 5541439 4662509 2348242
7162 2348242 383219 1371937 4433820 5425814 1878374 -3354383 -4825699 -992262 3730907
7153 3730907 4481622 1761468 -366869 -445296 -633389 -1670318 -660680 4201811 9269263
7144 9269263 8615438 985660 -8322606 -12617549 -9917168 -3908813 524600 2265444
7136 2265444 4031178 7691932 11207267 11590979 9343717 7349376 6265533 4394377
7128 4394377 2116811 2460017 5885938 8283468 6591418 3218506 1713226 781346 -3212014
7119 -3212014 -9310187 -12140508 -9094476 -3462363 366180 1584769 1735658 1603345 948683
7110 948683 -485626 -2857717 -5578090 -6295539 -2794393 3208183 6744775 5668075 3571306
7101 3571306 4450248 6793254 6212515 2532207 344444 2330588 5493974 5442220 2102122
7092 2102122 -640229 64150 2758629 3147674 -1536716 -9213617 -14230888 -12911062 -7481278
7083 -7481278 -3168005 -1975542 -1583757 -257343 343754 -1492047 -4352569 -6188004 -7653729
7074 -7653729 -10006181 -11323610 -8519017 -2767155 712526 -827592 -4216331 -4859590
7066 -4859590 -2519170 -713581 -1526412 -2973335 -1709988 2532857 5890926 4324428
7058 4324428 -1322917 -5565555 -4635275 -1024614 516930 124192 2269359 8088460 12629862
7049 12629862 11811942 8539690 8449648 11680845 12820043 8503492 1484578 -3510313 -5154500
7040 -5154500 -5399737 -5940157 -6654702 -6899721 -6796087 -6923608 -7373718 -7495337 -6539613 -4500891
7030 -4500891 -2407475 -1808990 -3603947 -6762271 -8287822 -5509416 954916 7316475
7022 7316475 10437979 10714755 10349250 9992674 8602637 5693629 1991855 -1480529 -3462487
7013 -3462487 -2686547 161914 2194387 2254188 3043708 6055963 6819609 356721 -10031474
7004 -10031474 -15693542 -14205425 -11320082 -10677587 -9241747 -5296844 -2891231 -4043672
6996 -4043672 -4136909 -689299 565142 -4529600 -9404222 -6281636 545507 1158753 -3954772
6987 -3954772 -5425139 -872257 2149211 -468023 -3868778 -4098977 -3568379 -3732426 -1526530
6978 -1526530 3169183 4915887 1714738 -1120065 -245330 317560 -2347343 -4199239 -2526008
6969 -2526008 -2296484 -7286780 -11803120 -9178116 -2735061 65984 -535113 533295 2570239
6960 2570239 939593 -3065426 -3765225 -1259707 -914402 -3126201 -2610200 1544043 3822640
6951 3822640 1884898 166460 1593173 3054364 1942533 509773 639111 490967 -461733
6942 -461733 762119 4143745 4174950 -1362962 -5778135 -2521822 4627879 7100792 4099987
6933 4099987 2259312 3953460 3549273 -3114331 -11546568 -14322448 -10484663 -5569002
6925 -5569002 -3703107 -3119447 -142569 4658641 6539651 2760872 -3429142 -6559908
6917 -6559908 -5315414 -2727111 -786728 1607752 4579248 4859454 75470 -6867911
6909 -6867911 -10755528 -10218984 -8005272 -5793360 -2153664 3546958 8137550 7827232 3288103
6900 3288103 -671610 -648906 1855150 3206178 2296532 705526 -713664 -2568499 -4012904
6891 -4012904 -2371985 2434819 5741967 3267910 -3295608 -8733881 -10752055 -10504023
6883 -10504023 -8210236 -3079818 2472322 3742802 422664 -2191009 -980011 196850
6875 196850 -3239593 -9029212 -10988714 -7472904 -2825681 -1344782 -3344136 -6658739
6867 -6658739 -8763810 -7564859 -3140757 1058410 1346064 -1626770 -3844385 -3613595 -3518453
6858 -3518453 -5969681 -9495959 -10903028 -9005211 -4559971 1635882 8355822 12803788
6850 12803788 12473118 8258726 3854258 1743132 1405548 1786329 3262916 5567332 5646071
6841 5646071 627029 -7234226 -11567399 -8976858 -2797435 1712944 3506378 4591891
6833 4591891 4952980 2710994 -1036004 -1869829 1993408 6588364 7014202 3092271 -1526256
6824 -1526256 -3622614 -1830602 3635890 9688787 10877888 5213222 -1341899 -549845
6816 -549845 7417777 13194651 9877997 1634328 -2514643 -643859 860956 -2837025
6808 -2837025 -8786736 -11258300 -9245305 -6254126 -4860522 -4584607 -4210969 -3278203 -1394509
6799 -1394509 1338563 2953708 1100480 -3413830 -6663783 -5944105 -2121785 2841414
6791 2841414 8052729 12179287 12748947 9396369 5725601 5327318 7466409 9114139 9588231
6782 9588231 10383762 11814378 12835938 13100140 12244965 8450605 1162620 -5783272 -7592294
6773 -7592294 -4581278 -1298429 -421426 -1446017 -4167473 -8172096 -9483547 -4159490
6765 -4159490 3986988 6043290 416849 -4264257 -1875126 2663098 2508226 -170801
6757 -170801 557238 3444571 2989720 313631 1892120 7951090 10912781 6954410 1425051
6748 1425051 -160545 93528 -2147371 -5469196 -5427247 -2334449 -1041436 -3627048 -6484012
6739 -6484012 -5398944 -862299 2967253 3356496 1772988 1573621 3788140 6205574 6684244
6730 6684244 6020495 6608111 9240977 12315767 13375436 10654283 4519865 -1489578 -2986070
6721 -2986070 72900 2565100 1089922 -598063 3111076 10486737 13552613 8626937
6713 8626937 1044015 -2214487 -720994 843744 -572061 -3767618 -5797277 -4901972
6705 -4901972 -1664072 1469075 2293243 879878 -1191884 -3238912 -5546736 -7358259
6697 -7358259 -6939093 -4001534 -408826 1676709 1074719 -2200763 -6200942 -7817156 -6791571
6688 -6791571 -7168864 -11181770 -13843490 -9102128 -61160 3996866 1006049 -1584256
6680 -1584256 19450 -420251 -7202016 -12824368 -8469738 1540270 5638486 2234558
6672 2234558 755387 5939419 11053628 9062943 2348414 -2524382 -3646267 -3340954
6664 -3340954 -3384305 -4294327 -5959931 -6173071 -2022403 4663696 7170517 2413081 -4134256
6655 -4134256 -5797379 -3363015 -1628391 -543123 3657502 9594968 10312412 3660772
6647 3660772 -2809570 -1406000 4932135 6371940 -610482 -8729562 -9623097 -4086170
6639 -4086170 326098 -371949 -2712648 -2175302 560273 1838573 664623 -988402 -1878329
6630 -1878329 -2065255 -657836 3101326 6382839 4562444 -2194985 -7893936 -8294775 -6095509
6621 -6095509 -5880834 -7246433 -6764133 -4333571 -3002842 -3557290 -3662652 -2055083 509238
6612 509238 4332757 10288319 15634177 15167000 8593051 2545070 2402080 5681029 7021984
6603 7021984 6474206 7978655 11368256 11533626 6237987 66294 -1626282 449533 1437170
6594 1437170 -809102 -3763326 -4647010 -4108603 -4540138 -6307884 -7312489 -6099936 -3891280
6585 -3891280 -2675487 -2297763 -1022617 1257305 2294596 561309 -2711040 -5595109
6577 -5595109 -7804761 -9431139 -9205205 -6607966 -4594673 -6986980 -13002803 -17209823
6569 -17209823 -15688248 -10010053 -4450246 -1621286 -1820493 -4174033 -6705642 -7190312
6561 -7190312 -5748031 -5037386 -6268725 -6866614 -4200425 108937 2346257 1957135 1564548
6552 1564548 2340615 2734071 2073076 2101212 3671297 4619147 2757575 -877556 -3555607
6543 -3555607 -4146166 -3089007 -447904 3572044 6640342 5516209 288882 -4197098
6535 -4197098 -2866789 3719298 9237103 8095092 1583302 -3588219 -3027316 601544
6527 601544 1763053 -513628 -1972304 415785 4523400 6775345 6898722 6651864 6067021
6518 6067021 4235098 2624058 3778045 6586784 6611361 2429799 -1598710 -1087415 2391250
6509 2391250 3815287 1497514 -1630478 -2559480 -1025571 1811877 4518018 5086513 2428521
6500 2428521 -1271420 -2520205 -1698614 -3255492 -9167703 -15141254 -15706794 -10734418 -4206862
6491 -4206862 1281193 5397961 7113972 5108968 1015343 -1435649 -1044405 68544
6483 68544 583788 1557650 3129090 3162037 786603 -1695557 -2361791 -2488957 -3728611
6474 -3728611 -4959884 -4511673 -3447478 -3707153 -4370218 -2729490 1609300 6209569 8830882
6465 8830882 8763134 5908762 1158645 -2582977 -2437904 858253 3355308 2420480 -574622
6456 -574622 -2376151 -1295156 1703522 4099121 3733342 721012 -2238612 -2258947 723318
6447 723318 3665805 3130705 -1645695 -7727688 -10606494 -8513061 -4550322 -2962186 -3733279
6438 -3733279 -3783171 -3379223 -6541503 -13088365 -15690505 -9527315 -708486 1148612 -3888640
6429 -3888640 -7265168 -4943134 -1330849 278896 2853510 8084451 10956601 6953872
6421 6953872 -409422 -4746776 -5847149 -7921461 -11214318 -11302579 -6320396 7903 3195393
6412 3195393 2423254 -417006 -3275103 -4721626 -4175783 -2186243 359183 3075420 5322334
6403 5322334 5676328 3720915 1446983 963707 1377264 -58574 -3788104 -6746772 -5691130
6394 -5691130 -660356 5117747 8096570 7159866 3997277 904794 -1419472 -3335523
6386 -3335523 -4321037 -3283998 -590037 2286413 5179955 8782181 11328948 8896589
6378 8896589 789279 -7719037 -10161936 -5179983 2930118 8202723 6974482 611737
6370 611737 -4564760 -2961928 3378386 6818544 4425485 1850219 4300429 8407122
6362 8407122 7498885 1239173 -5071377 -7981407 -7546236 -4053051 1289782 4266395 1977464
6353 1977464 -2090611 -2733418 -1018790 -1529705 -3521068 -2369854 1030777 869597 -2959507
6344 -2959507 -3711174 627447 3522091 1213115 -963132 1223445 2717242 -1770773
6336 -1770773 -7676523 -8002808 -5197170 -6075634 -8817335 -5598838 3247974 8268448 5001919
6327 5001919 -471894 -2448706 -3191420 -5668166 -6622724 -2679533 2425039 3027837 -34715
6318 -34715 -2342531 -4152258 -8975195 -15331562 -16932324 -11970498 -6426853 -5875594 -8295996
6309 -8295996 -7831715 -2751933 3178164 5464863 2683487 -3127133 -7827160 -8016852 -4284017
6300 -4284017 -670127 367725 774626 2961665 5352750 4951779 2521213 981005 -495930
6291 -495930 -5669849 -13797871 -18264431 -15087020 -8444291 -4578890 -4038549 -3786946 -3442407
6282 -3442407 -4377948 -5073203 -3062689 -386948 -1334273 -4830707 -4918256 -49911 3472734
6273 3472734 -167977 -8649300 -14958660 -15437283 -11799714 -7597623 -5225926 -4939153 -5079842
6264 -5079842 -4233750 -3343057 -3770495 -3894153 -1234296 2169505 1375357 -3509228 -6554594
6255 -6554594 -5383991 -5238220 -9717345 -13412274 -9835098 -2153230 1297818 -589325
6247 -589325 -1568156 921324 2629027 1051086 -470321 496901 1123967 -910881 -2635610
6238 -2635610 -823878 2278228 2665640 1067004 1163601 3126892 3556702 1431740 -132701
6229 -132701 934661 1966393 -778931 -6172052 -8251065 -2750495 7410391 14274869
6221 14274869 12653349 4993466 -2011781 -4758689 -5515284 -8308545 -13507316 -17082987
6213 -17082987 -14891545 -7546967 -789540 -13015 -4143203 -6482308 -2659086 3858650
6205 3858650 5893612 946170 -6584986 -10691936 -9107046 -3903268 1056974 3224784
6197 3224784 3329441 3978297 5606418 5531405 2533143 -167787 504111 2208918 702285
6188 702285 -2912651 -3505609 -95852 2691147 2119391 970511 1799434 2452616 220969
6179 220969 -3390385 -5214267 -4809461 -3436268 -1293138 1391350 2815609 1892513 143266
6170 143266 -936549 -2123766 -3733088 -3213742 1446383 7781552 11222705 9985244 5425682
6161 5425682 -299348 -4359890 -3538625 2142324 7814244 9066439 7255725 6398981 6817099
6152 6817099 5775298 2801161 -20064 -2106802 -4442794 -6233500 -5820400 -4499352
6144 -4499352 -4937294 -5971538 -3897565 614302 2141205 -1374614 -5010973 -3893503
6136 -3893503 229772 2448225 1521047 104283 511293 3124518 7129183 10232802 9415775
6127 9415775 4554818 -174325 -938711 1158583 2599513 2935732 4424281 6987027 7393077
6118 7393077 4286766 884333 743561 2779632 2892990 -72340 -2481992 -903349 2806481
6109 2806481 3441342 -895940 -6340290 -8292555 -6903167 -5779585 -6615102 -7511875 -6316804
6100 -6316804 -3459395 -1159667 -1257261 -3931958 -7379149 -8867173 -7139469 -3347543 1088217
6091 1088217 6005780 10485551 11628155 8275094 4087038 3162717 4050580 2619302 -263539
6082 -263539 279256 4300411 5657394 1466219 -3133400 -2895784 229924 1672691 1130563
6073 1130563 44661 -3336074 -10302322 -16223922 -15335972 -9412205 -5420684 -5368018 -4829962
6064 -4829962 -1712346 168040 -1755830 -3714850 -1145135 4382993 7443822 5944448
6056 5944448 2821764 1340901 1293826 340993 -2186537 -3991722 -2751333 415367 2095038
6047 2095038 1184349 -185286 -1157468 -4151190 -9858294 -13583500 -10752337 -3991024 -83619
6038 -83619 -1041954 -2982903 -3295842 -3625050 -4963469 -4696427 -584712 5609333 10207576
6029 10207576 11051309 8263857 4132528 2377943 4686108 8080340 8792207 7920994 9072383
6020 9072383 11210839 9483968 3440178 -1709636 -3223311 -3734894 -4094455 -671666 6349156
6011 6349156 9336629 4020253 -1999173 847414 9730184 13299109 7964641 1868498
6003 1868498 2252869 6355605 7197666 2965575 -2404423 -4717094 -3145424 -208026 577427
5994 577427 -1725893 -4091269 -3125675 534254 3261928 3022289 722410 -2069964 -4241291
5985 -4241291 -4781996 -3882016 -3551637 -4646899 -4515892 -645787 4620158 6722833 5416154
5976 5416154 4544986 5509805 5287121 1700980 -3177833 -6131080 -6247933 -4379842 -2093672
5967 -2093672 -1921397 -5452859 -10018948 -10315524 -4864955 1700360 4282571 2886853 1020462
5958 1020462 740322 1235329 1002200 -196013 -994107 489688 4445973 8346398 9401331
5949 9401331 7782046 5868924 4894966 4473442 4863788 6777858 8746805 7658021 2906552
5940 2906552 -2216913 -4250932 -3026416 -898387 -78687 -1040988 -2324685 -2121607 -1029225
5931 -1029225 -1888635 -5299359 -7486276 -5400442 -1607178 -271127 -523228 1241128 4281448
5922 4281448 4753395 3119187 3646243 6388323 6647774 3497731 1712847 3289118 4304757
5913 4304757 3051815 3825333 8404214 10834171 6342024 -353192 -1797909 1726330
5905 1726330 4529265 4374759 3039641 1391598 -229916 412919 4031995 6756293 5593240
5896 5593240 3633704 4384478 4713235 7474 -6965818 -9738981 -8264087 -7796564 -9425219
5887 -9425219 -9390835 -6713584 -3906536 -944945 3760974 7123923 4431253 -1550283 -3350552
5878 -3350552 -1100870 -2387563 -8170189 -9473199 -2289815 4345651 1756659 -5279577
5870 -5279577 -6844927 -2951494 -1447406 -4795409 -7730234 -6596575 -3511266 -1315177
5862 -1315177 -307424 -340439 -1466739 -2233038 -1265090 -530537 -3195565 -8054816 -9852584
5853 -9852584 -6045236 -219832 2493819 1280648 -441920 277935 2630942 3425265 1207987
5844 1207987 -1787647 -2456060 -692571 1159964 2038635 2834818 3482054 2497246 219577
5835 219577 -576474 1213480 2965326 2101190 -324952 -1529613 -590019 1354487 2862528
5826 2862528 3155904 2884874 4087834 7287702 9303485 7435856 5053293 7768631 13825335
5817 13825335 14808755 7867644 411334 -780830 1631127 2285836 1922123 3132330 3393930
5808 3393930 158446 -1977374 1996495 7261057 5331902 -1778622 -3941478 1010973
5800 1010973 4207665 251813 -5366993 -6602893 -5282167 -4647334 -2829434 1453574
5792 1453574 3736254 942387 -1949036 710576 5701290 6040171 2232847 743061
5784 743061 3118915 4402692 2216186 213985 1101279 2377133 1547309 725423 2805268
5775 2805268 6353130 7603308 5567534 2288863 -765282 -3829767 -6638198 -7428930
5767 -7428930 -5001051 -706902 2548984 3221975 2524262 2640933 3891599 4418107 2870230
5758 2870230 468461 -556195 -169571 -798132 -3709916 -6078292 -3395012 4579479 11866628
5749 11866628 12353607 7343978 4249084 7067371 11422725 11289547 7450483 5209112
5741 5209112 5805682 5557713 3290442 2749030 5846703 8726849 7647901 4543570 2935575
5732 2935575 1893050 -1304423 -5087433 -5519761 -3145831 -2533089 -4756784 -5371510 -1410373
$$ [...]
##END NTUPLES=NMR SPECTRUM
##END=
