##TITLE=31Pdec_LR-618-R3-CR19
 CDCl3, 24 sc
 28.06.2021
##JCAMPDX= 6.0         $$ Bruker NMR JCAMP-DX V2.0
##DATA TYPE= NMR SPECTRUM
##DATA CLASS= NTUPLES
##ORIGIN= UXNMR, Bruker Analytische Messtechnik GmbH
##OWNER= root
$$ XWIN-NMR		Version 3.5
$$ Mon Jun 28 13:40:00 2021 Russian Standard Time (UT+4h)  she@DPX200
##.OBSERVE FREQUENCY= 81.013821
##.OBSERVE NUCLEUS= ^31P
##.ACQUISITION MODE= SIMULTANEOUS
##.ACQUISITION SCHEME= undefined
##.AVERAGES= 124
##.DIGITISER RES= 16
##SPECTROMETER/DATA SYSTEM= spect
##.PULSE SEQUENCE= zgpg30
##.SOLVENT NAME= CDCl3
##.SHIFT REFERENCE= (INTERNAL, CDCl3, 0, 248.564)
##AUDIT TRAIL= $$ (NUMBER, WHEN, WHO, WHERE, WHAT)
$$ ##TITLE= Audit trail, XWIN-NMR		Version 3.5
$$ ##JCAMPDX= 5.01
$$ ##ORIGIN= Bruker BioSpin GmbH
$$ ##OWNER= she
$$ F:/spectra/data/she/nmr/P31/1/pdata/1/auditp.txt
$$ ##AUDIT TRAIL=  $$ (NUMBER, WHEN, WHO, WHERE, WHAT)
(   1,<2021-06-28 13:35:58.45 +0400>,<she>,<DPX200>,
      <continue with go, POWCHK disabled, PULCHK disabled
       configuration hash MD5:
       00 E9 B6 7A A2 85 ED C7 34 08 36 98 17 FE 4E 26
       data hash MD5: 32K
       39 43 5D 69 5D F3 C3 81 11 42 D3 C8 15 D8 C5 2B>)
(   2,<2021-06-28 13:37:34.59 +0400>,<she>,<DPX200>,
      <Start of raw data processing
       efp BC_mod = 2 LB = 1 FT_mod = 6 PKNL = 1 PHC0 = -8020.767 PHC1 = 3608.687 SI = 64K 
       data hash MD5: 64K
       69 B5 B0 9A AA B3 42 8C 54 07 B2 F1 05 28 FE 55>)
(   3,<2021-06-28 13:38:09.50 +0400>,<she>,<DPX200>,
      <pk PHC0 = -112.9983 PHC1 = 221.2001 
       data hash MD5: 64K
       5B 36 4A B4 61 10 57 E5 4F 77 D4 D5 61 2C 5C 7D>)
(   4,<2021-06-28 13:38:16.15 +0400>,<she>,<DPX200>,
      <abs ABSG = 5 
       data hash MD5: 64K
       B5 13 EB 6E E2 55 F8 7D 4C C6 3A 88 E9 44 0A E3>)
$$ ##END=
$$ 
$$ hash MD5
$$ 50 BE FC 97 B8 EA 7E 0C FF 8C 0E 56 C7 0F 26 18
##$RELAX= 
##$RELAX= 
##$RELAX= 
##$RELAX= 
##$RELAX= 
##$RELAX= 
##$RELAX= 
##$RELAX= 
$$ Bruker specific parameters
$$ --------------------------
##$DU= <F:/spectra>
##$EXPNO= 1
##$NAME= <P31>
##$PROCNO= 1
##$TYPE= <nmr>
##$USER= <she>
##$AMP= (0..31)
100 100 100 100 100 100 100 100 100 100 100 100 100 100 100 100 100 100 
100 100 100 100 100 100 100 100 100 100 100 100 100 100 
##$AQSEQ= 0
##$AQ_mod= 1
##$AUNM= <au_zg>
##$AUTOPOS= <>
##$BF1= 81.014009
##$BF2= 200.13
##$BF3= 200.13
##$BF4= 200.13
##$BF5= 200.13
##$BF6= 200.13
##$BF7= 200.13
##$BF8= 200.13
##$BYTORDA= 1
##$CFDGTYP= 0
##$CFRGTYP= 5
##$CHEMSTR= <none>
##$CNST= (0..31)
1 1 145 1 1 1 1 1 1 1 1 1 1 1 1 1 1 1 1 1 1 1 1 1 1 1 1 1 1 1 1 1 
##$CPDPRG= <waltz16>
##$CPDPRG1= <>
##$CPDPRG2= <waltz16>
##$CPDPRG3= <>
##$CPDPRG4= <mlev>
##$CPDPRG5= <mlev>
##$CPDPRG6= <mlev>
##$CPDPRG7= <mlev>
##$CPDPRG8= <mlev>
##$CPDPRGB= <>
##$CPDPRGT= <>
##$D= (0..31)
0 1 0 0 0 0 0 0 0 0 0 0.03 2e-05 3e-06 0 0 0 0 0 0 0 0 0 0 0 0 0 0 0 0 
0 0 
##$DATE= 1624872789
##$DBL= (0..7)
120 120 120 11 120 120 24 19 
##$DBP= (0..7)
150 150 150 150 150 150 150 150 
##$DBP07= 0
##$DBPNAM0= <>
##$DBPNAM1= <>
$$ [...]
##$SUBNAM3= <"">
##$SUBNAM4= <"">
##$SUBNAM5= <"">
##$SUBNAM6= <"">
##$SUBNAM7= <"">
##$SUBNAM8= <"">
##$SUBNAM9= <"">
##$SW= 501.771253377433
##$SWIBOX= (0..15)
0 1 3 0 0 0 0 0 0 0 0 0 0 0 0 0 
##$SW_h= 40650.406504065
##$TD= 32768
##$TD0= 1
##$TE= 0
##$TE2= 300
##$TE3= 300
##$TEG= 300
##$TL= (0..7)
0 120 53 12 22 120 120 120 
##$TP= (0..7)
150 150 150 150 150 150 150 150 
##$TP07= 0
##$TPNAME0= <>
##$TPNAME1= <>
##$TPNAME2= <>
##$TPNAME3= <>
##$TPNAME4= <>
##$TPNAME5= <>
##$TPNAME6= <>
##$TPNAME7= <>
##$TPOAL= (0..7)
0.5 0.5 0.5 0.5 0.5 0.5 0.5 0.5 
##$TPOFFS= (0..7)
0 0 0 0 0 0 0 0 
##$TUNHIN= 0
##$TUNHOUT= 0
##$TUNXOUT= 0
##$USERA1= <user>
##$USERA2= <user>
##$USERA3= <user>
##$USERA4= <user>
##$USERA5= <user>
##$V9= 5
##$VALIST= <valist>
##$VCLIST= <CCCCCCCCCCCCCCC>
##$VD= 0
##$VDLIST= <DDDDDDDDDDDDDDD>
##$VPLIST= <PPPPPPPPPPPPPPP>
##$VTLIST= <TTTTTTTTTTTTTTT>
##$WBST= 1024
##$WBSW= 4
##$XGAIN= (0..3)
0 0 0 0 
##$XL= 0
##$YL= 0
##$YMAX_a= 12021
##$YMIN_a= -13971
##$ZGOPTNS= <>
##$ZL1= 120
##$ZL2= 120
##$ZL3= 120
##$ZL4= 120
##$ABSF1= 248.5645
##$ABSF2= -253.2056
##$ABSG= 5
##$ABSL= 3
##$ALPHA= 0
##$AQORDER= 0
##$ASSFAC= 0
##$ASSFACI= 0
##$ASSFACX= 0
##$ASSWID= 0
##$AUNMP= <proc_1d>
##$AZFE= 0.1
##$AZFW= 0.5
##$BCFW= 0
##$BC_mod= 2
##$BYTORDP= 0
##$COROFFS= 0
##$CY= -3
##$DATMOD= 1
##$DC= 0
##$DFILT= <>
##$DTYPP= 0
##$F1P= 0
##$F2P= 0
##$FCOR= 1
##$FTSIZE= 65536
##$FT_mod= 6
##$GAMMA= 0
##$GB= 0
##$INTBC= 1
##$INTSCL= 5.30512e-09
##$ISEN= 30
##$LB= 1
##$LEV0= 0
##$LPBIN= 0
##$MAXI= 10000
##$MC2= 0
##$MEAN= 0
##$ME_mod= 0
##$MI= 50
##$NCOEF= 0
##$NC_proc= -7
##$NLEV= 6
##$NOISF1= 182.463
##$NOISF2= 159.3651
##$NSP= 0
##$NTH_PI= 0
##$NZP= 0
##$OFFSET= 248.5645
##$PC= 4
##$PHC0= -8133.766
##$PHC1= 3829.887
##$PH_mod= 1
##$PKNL= yes
##$PPARMOD= 0
##$PSCAL= 0
##$PSIGN= 0
##$REVERSE= no
##$SF= 81.014009
##$SI= 65536
##$SIGF1= 159.3651
##$SIGF2= -187.1042
##$SINO= 113.3802
##$SIOLD= 16384
##$SREGLST= <1H.CDCl3>
##$SSB= 0
##$STSI= 65536
##$STSR= 0
##$SW_p= 40650.406504065
##$SYMM= 0
##$S_DEV= 0
##$TDeff= 32768
##$TDoff= 0
##$TI= <>
##$TILT= no
##$TM1= 0
##$TM2= 0
##$TOPLEV= 0
##$USERP1= <user>
##$USERP2= <user>
##$USERP3= <user>
##$USERP4= <user>
##$USERP5= <user>
##$WDW= 1
##$XDIM= 65536
##$YMAX_p= 523204497
##$YMIN_p= -44004370
$$ End of Bruker specific parameters
$$ ---------------------------------
##NTUPLES= NMR SPECTRUM
##VAR_NAME=  FREQUENCY,     SPECTRUM/REAL,   SPECTRUM/IMAG
##SYMBOL=    X,             R,               I
##VAR_TYPE=  INDEPENDENT,   DEPENDENT,       DEPENDENT
##VAR_FORM=  AFFN,          ASDF,            ASDF
##VAR_DIM=   65536,         65536,           65536
##UNITS=     HZ,            ARBITRARY UNITS, ARBITRARY UNITS
##FACTOR=    0.620285442955139, 1,           1
##FIRST=     20137.2065510759, 0,            0
##LAST=      -20513.1999529892, 0,           0
##MIN=       -20513.1999529892, -44004370,   0
##MAX=       20137.2065510759, 523204497,    0
$$ Real data points
##PAGE= N=1
##DATA TABLE= (X++(R..R)), XYDATA
$$ [...]
##PAGE= N=2
##DATA TABLE= (X++(I..I)), XYDATA
13017b062576j2312K440911q34577l852144J28207O190274M759281k623144n279278
13008a145358m1864M678927K544640k512825m250097k311168N32290K820424L322141
12999C637110J027569j709987j161369J475528J416665j269696j286843K379001
12991D507978L946517M90647l148094k753996j184901j937924k579049n975K973926
12982C09129K166452q81921j788974j74603J355803K074274K350149J037604j800428
12973D647485k734580k46054J341376j389492l928638l73725N843418N833879
12965H993669j213777o732416n592150k021584o84763J46724K650624L825577
12957f28096J305412q11965J605252M638682J872912m599011o528982k054082
$$ y = [-2062576, -2074888, 366023, -468554, -4320698, -4192491, 1997783, 6757064, 4133920, -1145358, -1187222, 3491705, 6036345, 3523520, -726577, -3037745, -2505455, 314969, 3637110, 4664679, 2954692, 1793323, 3268851, 4685516, 3415820, 2128977, 4507978, 8454495, 8945142, 5797048, 3043052, 1858151, -79773, -2658822, -2664797, 309129, 2475581, 1593660, -195314, -369917, 985886, 3060160, 5410309, 6447913, 4647485, 1912905, 1666851, 3008227, 1618735, -2309903, -2683628, 3159790, 8993669, 7779892, 1047476, -4544674, -6566258, -7251021, -7104297, -4453673, -628096, 677316, -134649, 1470603, 6109285, 7982197, 3383186, -3145796, -5199878]
12949e199878K052366J570420L51647J847877K717949o6416k104990J486269O398975
12940I054219M472092l361863p685992m126864J392221K344365l53743k394117
12932f59682k171071j871L423160N080717J484792m563563m927459K399101Q740006
12923H804130O478976m03635l413975j808062p14248j416255j399678r55094j798691
12914C373468j561150K348411N604831K349723l926402m342553J110360L329029
12906H285717j057677m894051k963808O69563J504540J470317K250692M99389
12898E764682m547179o622648k078255L068102K539456l84699Q8337J752011l22439
12889g42632l250988r60825M117457M235535m94027k259354J194637L298424K52288
$$ y = [-5199878, -3147512, -1577092, -1225445, 622432, 3340381, 3273965, 1168975, 2655244, 9054219, 13526311, 10164448, 2478456, -1648408, -256187, 2088178, 1734435, -659682, -2830753, -2832624, 590536, 5671253, 7156045, 2592482, -2334977, 64124, 8804130, 15283106, 14879471, 11465496, 9657434, 8943186, 7526931, 6127253, 5172159, 3373468, 1812318, 4160729, 9765560, 12115283, 8188881, 3846328, 4956688, 8285717, 7228040, 2333989, -629819, 39744, 1544284, 3014601, 5265293, 5764682, 1217503, -5405145, -7483400, -4415298, -1875842, -2260541, -2172204, -420193, -742632, -3993620, -4954445, -836988, 3398547, 2904520, 645166, 1839803, 5138227, 5390515]
12880E390515l088807k018700Q85986J341923N323n78509q24152j821120k017815
12871b725356n0445K034497J752882L3586o42226K19699J628731K775195K334828
12862G361391r70168n013655m868771L45482M557019K348634l431486n859693
12854e531247l199691Q27341L857951O080255N681528o023p717573r203718j991797
12845a1202974O085356O942637K372483n00533p8250m23148k385110j612350L407571
12836B605682P160105M302835k407656n314800j757944K773388K002908l160562
12828F203956o205155l789339J62107P39583n12575J344286N493273N429839m49100
12819H416875m877284k272516K656213K647247q84645j822571m64494j574417
$$ y = [5390515, 2301708, 283008, 1168994, 2510917, 2516240, 1937731, 1113579, -707541, -2725356, -2775801, -741304, 1011578, 1045164, 402938, 622637, 2251368, 5026563, 7361391, 6391223, 1377568, -3491203, -3145721, 1411298, 3759932, 328446, -5531247, -8730938, -7903597, -4045646, 2034609, 7716137, 7710114, -7459, -9211177, -11202974, -5117618, 1825019, 4197502, 3696969, 3618719, 3195571, 810461, -801889, 2605682, 9765787, 14068622, 11660966, 6346166, 4588222, 7361610, 9364518, 6203956, -1199, -3790538, -3628431, -2888848, -3401423, -2057137, 3436136, 8865975, 8416875, 3539591, 1267075, 3923288, 6570535, 5685890, 3863319, 3398825, 1824408]
12811A824408l874038j811194K932886K836852j590400j283843M929772N991363
12803I955806l158181j1111284o891548K990830N544686J102528n31506K208596
12795A09927K456654o92245j044245K166466K926467J17510q51000Q34182k17907
12786E805809m192305m142364J388889M484485R72301k521369j97523L208429
12778D806352J092868l957991n020338j370795K419751L721223K642168l53844
12770C979394k753656l69344N662290P173125K9365p928072o987213L77431L652930
12761B836250K4299l019892p73949J886254k96339m087846l218070J525027L576369
12752a547897P27196j671761P96076M401467K629001l500875o088406j870589
$$ y = [1824408, -2049630, -3860824, -927938, 1908914, 318514, -965329, 3964443, 9955806, 6797625, -4313659, -11205207, -8214377, -2669691, -1567163, -2098669, 109927, 2566581, 1874336, 830091, 2996557, 5923024, 6040534, 5189534, 6023716, 5805809, 1613504, -2528860, -1139971, 3344514, 4316815, 1795446, 1597923, 4806352, 5899220, 1941229, -3079109, -4449904, -2030153, 1691070, 4333238, 3979394, 1225738, 856394, 6518684, 13691809, 13721174, 5793102, -1194111, -816680, 2836250, 2860549, -159343, -933292, 952962, 656623, -3431223, -6649293, -5124266, -1547897, -820701, -2492462, -1696386, 2705081, 5334082, 1833207, -4255199, -6125788]
12744f125788K828576J809796j637582n24576M404132N886338J275301m290092
12736C626105n843502l829261r23815J155660J176736o71991j423249Q43981L133024
12727b756312K359888J420626L751905N022824n16065p812973o677890J071487
12719d136510L363086j936088l394124L233449O404750r53693p632737k437301
12711g489168O465014N083753l251099m632960J786667L952610j755039n635784
12703e476006k033376K700703K689659J086130J936210L065840J736487N5389
12695E761036M03669R98383m01998k511939k797460o83003K581921M543673K524976
12686A0419258k727165n742819k730863K425313L249677r9619k015820k30938
$$ y = [-6125788, -3297212, -1487416, -3124998, -3649574, 754558, 6640896, 7916197, 3626105, -2217397, -6046658, -6970473, -5814813, -4638077, -5310068, -6733317, -5889336, -2756312, -396424, 1024202, 4776107, 9798931, 9282866, 1469893, -5207997, -4136510, -773424, -2709512, -6103636, -2870187, 3534563, 2580870, -5051867, -7489168, -1024154, 4059599, 808500, -3824460, -2037793, 1914817, 159778, -5476006, -7509382, -4808679, -2119020, -1032890, 903320, 3969160, 5705647, 5761036, 6164705, 7163088, 6761090, 4249151, 1451691, 768688, 3350609, 7894282, 10419258, 7692093, 1949274, -781589, 1643724, 4893401, 4793782, 2777962, 2547024]
12678B547024K305411L155702K451109L74722k130672j842414K028251L951558
12670A2840691o71184o886914o363738r3081L559720K116178R40580K134335J338077
12661H914664k842099n467564l977326k115151k342350j919100N24801J750028
12653g474097L11926n70535N96546J048290K38702J648629N187385N476353J380283
12644G843482p72251J807439K415030l634285r192231n494460L410817O052996
12636B436537L88978m274413j790962L035122L190716p11498l113008k080933
12628b919461q37853j726842k432260J07833M100892M603032R13141j787263j73899
12619a52680K142614J042505r35816L64818K221615o88207n744687n165988J012849
$$ y = [2547024, 4852435, 8008137, 10459246, 10833968, 8703296, 6860882, 8889133, 12840691, 12169507, 5282593, -1081145, -1174226, 2385494, 4501672, 5442252, 7576587, 8914664, 6072565, 605001, -3372325, -5487476, -7829826, -9748926, -9224125, -7474097, -7162171, -7732706, -7136160, -6087870, -5849168, -4200539, 986846, 6463199, 7843482, 7071231, 8878670, 11293700, 7659415, -1532816, -7027276, -3616459, 2436537, 2825515, -1448898, -3239860, -204738, 2985978, 2274480, -838528, -2919461, -3757314, -5484156, -7916416, -7808583, -3707691, 895341, 1808482, 21219, -152680, 1989934, 3032439, 2096623, 2461441, 4683056, 3994849, -1749838, -6915826, -5902977]
12610e902977M262343J299948j013930K244424N947250L695041k512314o455517
12602A564268n741944j510614M144605O852652K473799n282077o713738J61448
12594d051601N419545J990585l611962k389575L000665L995660l1317l020775
12586A301225k850297j771195J0633K687787K578793j874286l913917K155836
12578a675421R307461O550786l426447p624191k653361J756437K01039r42522
12570A493781K615343M491811l46241n483002l322432K507649L819240R63252
12562F739401J85341J902895Q61740l603455n915699l377325j43386l24787k164575
12553e839850j527336J949835M585879L214296j373811n161423m853963j329719
$$ y = [-5902977, -1640634, -340686, -1354616, 889808, 6837058, 10532099, 8019785, 1564268, -4177676, -5688290, -1543685, 5308967, 7782766, 2500689, -4213049, -4051601, 1367944, 3358529, -253433, -2643008, 357657, 4353317, 4322000, 1301225, -1549072, -3320267, -3309634, -621847, 1956946, 82660, -3831257, -1675421, 7632040, 14182826, 10756379, 3132188, 478827, 2235264, 2436303, 1493781, 4109124, 8600935, 8254694, 2771692, -550740, 1956909, 5776149, 6739401, 6924742, 8827637, 9689377, 6085922, 170223, -3207102, -3350488, -3675275, -5839850, -7367186, -5417351, -831472, 2382824, 1009013, -4152410, -9006373, -10336092]
12545a0336092J440040J266594K61851J529432M704063O397207M418485J73964
12537I855544k859436k296745R61102L211165J579801k341014l850186r26783
12529C333448K939684L071279o68488m291358m839776k995495q80898N34330J250473
12520b546801J099159j963j204553j144451N72209K649750L203576J585586j139812
12511C072700l408370m092124k211871K529679P570071P733792Q13804p696622
12503D311059r427688l535720J956883J392455o46283K735603Q784973Q253346
12495A3824628m17554p850059o590963l02288L461563L420921K429026O47848
12487H623122k371168k908153J608910N144877N0699r329065j0197064j02580
$$ y = [-10336092, -8896052, -7629458, -7367607, -5838175, -1134112, 5263095, 9681580, 9855544, 6996108, 4699363, 5660465, 8871630, 10451431, 8110417, 4260231, 3333448, 6273132, 9344411, 8675923, 4384565, -455211, -3450706, -4331604, -3797274, -2546801, -1447642, -1449605, -2654158, -3798609, -3226400, -576650, 2626926, 4212512, 3072700, -335670, -4427794, -6639665, -4109986, 3460085, 11193877, 12007681, 4311059, -5116629, -8652349, -6695466, -5303011, -5949294, -3213691, 5571282, 13824628, 13407074, 5557015, -1033948, -1336236, 2125327, 5546248, 7975274, 8623122, 6251954, 3343801, 4952711, 10097588, 10148287, 819222, -9377842, -9480422]
12479i480422Q174692M898866l183344m584422N8733K044033m35269j886259q68294
12470e261686j210817k865269j510367K184818K374665j162078j220468M625835
12462d045367Q595067M290534l483645o233867l337330l5431J381454J894249
12454i74336Q82393k275068m069990j035940L339497K604636k196526l141086
12446f866420K279118O476434K883284l900174m513666J790336O395560L577065
12438H121537k183427l242333R04971L989940J784720l237957o010110m563762
12430d436421p76435K269510K481977k3935k739813k945674p62220J149108J115664
12421d668239k1146r73232j298231m22306J824793L316603J615010j528321j610896
$$ y = [-9480422, -1305730, 3593136, 409792, -4174630, -4115897, -2071864, -2507133, -4393392, -5261686, -6472503, -9337772, -10848139, -8663321, -6288656, -7450734, -8671202, -4045367, 4549700, 8840234, 5356589, -877278, -4214608, -4250039, -2868585, -974336, -91943, -2367011, -6437001, -7472941, -4133444, -1528808, -3725334, -6866420, -4587302, 1889132, 4772416, 872242, -3641424, -1851088, 4544472, 8121537, 5938110, 2695777, 3600748, 7590688, 9375408, 6137451, 127341, -4436421, -5212856, -2943346, -461369, -485304, -3225117, -6170791, -6933011, -5783903, -4668239, -4689385, -5662617, -6960848, -7383154, -5558361, -2241758, -626748, -2155069, -3765965]
12412c765965J686488L596278J744624p86858j896354l617137n713927l458324
12404a2211175L222671O016913O01173m681925j429193M482021K382339m903581
12396f520757n629517J071865M425135P81756j363851K498665N413260K139795
12388B816351k152903j958355R4093M78676J144421L094594K477431j279447k008751
12379B706110K707890N906916K176568l733425n405048m061974l086752j068544
12371c858259K853618M203426Q43494j643324P38879K943121M1235l597144k382754
12362A42292L67688q38337l305422j644553K125725K989366K088276K730339K712117
12353G367491n41537k793201j03752K586567m38077m804325l500173N96574O07412
$$ y = [-3765965, -2079477, 1516801, 3261425, 2474567, 578213, -3038924, -8752851, -12211175, -8988504, -2971591, -2370418, -7052343, -8481536, -3999515, -1617176, -6520757, -12150274, -11078409, -6653274, -5871518, -7235369, -4736704, 676556, 2816351, 663448, -1294907, -1200814, -722138, 422283, 3516877, 5994308, 4714861, 2706110, 5414000, 11320916, 13497484, 9764059, 4359011, 297037, -2789715, -3858259, -1004641, 3198785, 4042279, 2398955, 3137834, 6080955, 6122190, 2525046, 142292, 509980, -328357, -3633779, -5278332, -3152607, -163241, 1925035, 4655374, 7367491, 6825954, 4032753, 3929001, 6515568, 6077491, 1273166, -2227007, -1630433, -1023021]
12344a023021j547963q4532K190651p51283m809571j550411N925863P007756J191642
12335F549131k441542j616479k157691l960080r46057M756698M119157j923439
12327B379698k503435L889442O095530R2413m010218m66585K370996j596296n000363
12318A251182j515761J941118j575775n416231j065682O044273N220741j978090
12310B905775n268996j842718K264555L549081L498382K050627k051814n642826
12302e37934l884358J886414N346668L558613p42380l820651l630958J39262M694062
12293C008738N141664N80366l612093l030418k58382K09413r12054m25400R69758
12284A671592L11112j981097k884530j502670P62560K855558L716854J713776
$$ y = [-1023021, -2570984, -2655516, -464865, -1216148, -6025719, -7576130, -1650267, 5357489, 6549131, 4107589, 2491110, 333419, -3626661, -4572718, 183980, 4303137, 2379698, -123737, 3765705, 9861235, 9953648, 5943430, 5476845, 7847841, 6251545, 1251182, -264579, 1676539, 100764, -5315467, -6381149, -336876, 4883865, 2905775, -2363221, -4205939, -1941384, 1607697, 5106079, 7156706, 5104892, -537934, -4422292, -2535878, 2810790, 6369403, 5627023, 1806372, -1824586, -1685324, 3008738, 8150402, 8730768, 5118675, 2088257, 1829875, 2039288, 1127234, 701834, 1671592, 1982704, 1607, -2882923, -4385593, -3623033, -767475, 2949379, 4663155]
12276D663155k426526m650679k589450R75686K279068J329360O8177q93372j148698
12267b393279L47922K447993J910851j207547k558536m89630R21264r76233k631314
12258d628509r17845P96196j409025m498964l001871K189076N438975M528849
12250a503118J870617n45659k396782k604656l20014K328366K144473q40447l447221
12241e314441l053419K13307L678320L897568L79643k535437q00012K889936K652316
12232B007781r31987j340871K903213N374207K198359k267977l490465k966926
12224A485334k602125n72128K771689K671351j418135k991701L81661J926519
12216A652465j850978l182684L656499J0216670O144198l746011o912835k242491
$$ y = [4663155, 2236629, -2414050, -5003500, -4027814, -1748746, -419386, -351209, -1244581, -2393279, -2045357, 402636, 2313487, 1105940, -1452596, -1942226, -1020962, -1997195, -4628509, -5546354, -4750158, -6159183, -10658147, -13660018, -11470942, -6031967, -1503118, 367499, -178160, -2574942, -5179598, -5499612, -3171246, -1026773, -1867220, -5314441, -8367860, -8154553, -4476233, -578665, -199022, -2734459, -3534471, -644535, 2007781, 1075794, -265077, 2638136, 8012343, 10210702, 7942725, 4452260, 1485334, -1116791, -1688919, 1082770, 3754121, 2335986, -655715, -274054, 1652465, -198513, -3381197, 275302, 10491972, 16636170, 12890159, 5977324, 3734833]
12208C734833Q07048j407266l637670l071632k043411m05946M014677P909118
12200E899751N560428r43527m038997k458233j229237j220610Q90554L120418
12192E580547N8443n499420m594156K693801N983407J406518k240686J097816
12184D486270M490579K21530o972822p391790r97027L755998K422397j027748
12176a012613j147629K380523N141779L104135k420562n510583l029016P76280
12168a717686O01656j732711j018756J909137J850464j070599j723335L67182
12160b534648N11303j538554r00538K144974J271386l787279m791782Q93445M270897
12151d460796o69331n998419k194267O330035Q132512K073668k561372q26214
$$ y = [3734833, 4541881, 3134615, -503055, -3574687, -5618098, -6024044, -2009367, 5899751, 11460179, 10516652, 6477655, 4019422, 2790185, 1569575, 2460129, 5580547, 5638990, 139570, -4454586, -1760785, 4222622, 5629140, 3388454, 4486270, 8976849, 9198379, 2225557, -5166233, -6163260, -2407262, 15135, -1012613, -2160242, 220281, 5362060, 8466195, 6045633, 535050, -2493966, -1717686, -1116030, -2848741, -3867497, -1958360, -107896, -1178495, -2901830, -2534648, -2023345, -3561899, -4462437, -2317463, -1046077, -4833356, -9625138, -8731693, -4460796, -5130127, -11128546, -13322813, -6992778, 1139734, 3213402, 652030, -174184]
12143a74184K486301K075624r11437k497614j298428R99463J651063p39234l983421
12134b391867l992082n74149J249883j447259m201266j375574M960707P486862
12126b84745L735228j264695k457710n05288R38647L01641j299762k512952k809040
12117f158676j569627K084306P302563J0112820O666056j036721n598452l084174
12109H718095J343072O56479l699401m431397j0395L278064J470518j829185k451903
12100C043947j549931j361594p24197J332280K196475q939k501208k149997m59502
12091b182666m51137j381719l49947K798214N293033M788837J070262l748650
12083E836227n757390k721949K186955L527261R74070q05327k28555q83737l739114
$$ y = [-174184, 2312117, 4387741, 3476304, 978690, -319738, 679725, 2330788, 1591554, -2391867, -6383949, -6958098, -5708215, -7155474, -11356740, -12732314, -7771607, -284745, 3450483, 2185788, -271922, -777210, 161437, 463078, -836684, -3349636, -6158676, -7728303, -5643997, 1658566, 11771386, 18437442, 17400721, 11802269, 8718095, 10061167, 10717646, 7018245, 2586848, 2576453, 5854517, 7325035, 5495850, 3043947, 1494016, 132422, -591775, 740505, 2936980, 2928041, 426833, -1723164, -2182666, -2633803, -4015522, -4365469, -1567255, 3725778, 8514615, 9584877, 5836227, 78837, -2643112, -456157, 3071104, 4045174, 3239847, 3011292, 2127555, -1611559]
12074a611559l893597J193218O135501N018406l59463m270665m833952l547676
12066f169787j274356P19824j70475l165995k735482L120583P782507N014209
12058C121028j183162k374455J993854N065160L049045j457848m931821n543853
12050b262052j993747M239188P131546K702225m167686n591270j654848J021111
12042e75533O5394p64149K39017N33426k19610R02387L415641K920859r20423
12033E597009k909370j174702m69310l244245m368228J99293N269064L502318
12025B401829k987079n150958M884N433631M171061j621145m556627j911848K135282
12016b080970L326484K411778J930808J328861j039173l013347r14248L388219
$$ y = [-1611559, -5505156, -4311938, 1823563, 6841969, 6482506, 2211841, -2622111, -6169787, -7444143, -6724319, -6894794, -10060789, -12796271, -9675688, -1893181, 3121028, 1937866, -436589, 1557265, 6622425, 9671470, 8213622, 3281801, -2262052, -4255799, -16611, 7114935, 9817160, 5649474, 58204, -1596644, -575533, -510139, -1274288, -1035271, -501845, -721455, 180932, 3596573, 6517432, 5597009, 2687639, 1512937, 1043627, -2200618, -6568846, -6369553, -1100489, 2401829, -585250, -5736208, -5731324, -297693, 3873368, 2252223, -2304404, -4216252, -2080970, 1245514, 3657292, 5588100, 6916961, 5877788, 2864441, 1950193, 5338412]
12008E338412L530530j586892n173989k904124L35859q47758k840101M31480N934746
11999B218163N592136k99150l268017k42099K392120P9649l191622k869280j098316
11990f86416j451438k231478j07880L610266N030451L315710N79435j621766k694137
11981C742747j930620L74750K244022K123615K85147k288906m188442l049398
11973b687085J722795N845600M283527j208042l859464j861048l35606j840809
11965E9868k271619M34958J255587k700097n039779J60853P016576N551591k474093
11956A993845n478517P69946P486442O176568o40072n403959n592986l415447
11948d104180k43576L665264O430028N807591K337194j337976l423963l557975
$$ y = [5338412, 8868942, 7282050, 2108061, -796063, -460204, -1307962, -4148063, -3716583, 2218163, 7810299, 7511149, 4243132, 4001033, 6393153, 6472802, 3281180, 411900, -686416, -2137854, -4369332, -4477212, -866946, 4163505, 7479215, 8058650, 6436884, 3742747, 1812127, 2186877, 4430899, 6554514, 6839661, 4550755, 362313, -2687085, -964290, 4881310, 9164837, 7956795, 4097331, 2236283, 1900677, 59868, -2211751, -1776793, -521206, -3221303, -8261082, -8100229, -1083653, 4467938, 1993845, -3484672, -2714726, 4771716, 10948284, 10308212, 4904253, -688733, -4104180, -4347756, -682492, 5747536, 11555127, 13892321, 12554345, 9130382, 5572407]
11940E572407j830873P93147K085637N72292k342550l604315j784431J531827
11932I93141L347396J964627j304097l018002j151241K096854K406759j179197
11924D156240m464776l152989J478106L981793J607982k432988l485874j369124
11916c681630L14275q9078k14182J853111L944000L063203K86528r53251m85273
11907D037703j275957l493074l175243J287613N318888M034272q03554l422777
11899B507871j955701J02884k95505k029116k257270p3758K872537M029295K333585
11890E234822k10579n37279R95073O05755k545555l505780J106023O207593M616189
11881A1966262j719889m117702n56974J456137k434021n968012k299919M982447
$$ y = [5572407, 3741534, 4534681, 6620318, 7192610, 4850060, 1245745, -538686, 993141, 4340537, 6305164, 5001067, 1983065, 831824, 2928678, 5335437, 4156240, -308536, -3461525, -1983419, 1998374, 3606356, 1173368, -2312506, -3681630, -3367355, -3456433, -3670615, -1817504, 2126496, 5189699, 5476227, 4522976, 4037703, 2761746, -731328, -3906571, -2618958, 2699930, 6734202, 5930648, 2507871, 552170, 655054, 359549, -1669567, -3926837, -4000595, -1128058, 2901237, 5234822, 5024243, 4486964, 5482037, 6087792, 3542237, 36457, 1142480, 7350073, 11966262, 10246373, 6128671, 5571697, 7027834, 4593813, -1374199, -3674118, 1308329]
11873A308329P324443L452097o10891j311734p87758j239074j894153j774965
11865D466294j039959M81706K429363K320482j163753m327658k706403J483761
11857A943833J697799k850656n429921j799509L631422M589592J317689j388140
11849A712109j175939M15998J335009Q38355o64923j691850j009026K91300K39697
11840B90730k43203J428365L963229K716196k493614n469388k650983J284731
11832a173937J071406j060428m02029J812181J709776P30895K517675M425406
11824I630945P78920o278749q109674k626671K518596J995138j44245Q84268K458560
11815A107088M67862k634881k183610L05540j59529l067250k725775K508624O937601
$$ y = [1308329, 8632772, 12084869, 11473978, 10162244, 9374486, 8135412, 6241259, 4466294, 3426335, 3908041, 6337404, 8657886, 7494133, 3166475, 460072, 1943833, 3641632, 790976, -4638945, -6438454, -2807032, 1782560, 3100249, 1712109, 536170, 952168, 2287177, 3125532, 2460609, 768759, -240267, 51033, 290730, 47527, 1475892, 5439121, 8155317, 5661703, 192315, -2458668, -1173937, -102531, -1162959, -1564988, 247193, 1956969, 2687864, 5205539, 9630945, 10409865, 4131116, -3978558, -6605229, -4086633, -2091495, -2235740, -1351472, 1107088, 1574950, -1059931, -3243541, -2938001, -3097530, -6164780, -8890555, -6381931, 555670]
11806E55670N173701n96794l521684p19316L393592K902576j961581n173942l163005
11797c110783L84190L97343j851012j452328J480562J948656r82295j931272J874004
11788c242935N362036L052759k830563n838555l499221J718657O501753Q004441
11780I228372M150992l173415p690532n620544r26136K19811k081734k921157
11772h814343o05220J756674J824301N22256q25613j744148j038091K102775N144712
11763a676697M043453j159286n576464n211008j080600L047489M822847M315917
11755A525651K583782N10651j306306k140531j285776O27800J321994k49667j555550
11746C2048k028K009499R8917m066661l888845J435379M361355Q17103k682334
$$ y = [555670, 5729371, 5132577, 1610893, 891577, 4285169, 7187745, 5226164, 52222, -3110783, -2726593, -2329250, -4180262, -5632590, -4152028, -2203372, -3185667, -5116939, -3242935, 2119101, 5171860, 2341297, -3497258, -6996479, -5277822, 1223931, 9228372, 13379364, 10205949, 2515417, -3105127, -4031263, -3811452, -5893186, -8814343, -9419563, -7662889, -5838588, -5316332, -6141945, -7886093, -8924184, -6821409, -1676697, 2366756, 1207470, -4368994, -9580002, -10660602, -7613113, -2790266, 1525651, 4109433, 4620084, 3313778, 1173247, -112529, 515271, 1837265, 1587598, 32048, 30020, 2039519, 2138436, -1928225, -5817070, -4381691, -20336, 796767, -1885567]
11737a885567L77120N416175M204988j676281m068656j686731n06381k142416
11729a967749j778907J876049L854276J900327j4906N55007O85218j388300k666999
11720A054016j200328N45949Q14046J336456K591970K084029k24380o95480J231334
11711G537612J242947k054910l954257j600038J359120J880847K521136M666614
11703A1599071L744705k660309q120853o066501k09560J420010j158422j688297
11695c140156R95424K092742J17450j211547n27700p41935k342878j692737J941940
11686d509397L766826Q53713k769110k046649J670659L151828J170678l45417
11678I43131J089096K520159J83188m002184m183903Q18612M630316J869585l727161
$$ y = [-1885567, -1508447, 3907728, 8112716, 6436435, 2367779, 681048, 174667, -1967749, -3746656, -1870607, 1983669, 3883996, 3869090, 4424097, 5109315, 3721015, 1054016, -146312, 399637, 1213683, 2550139, 5142109, 7226138, 7001758, 6306278, 7537612, 8780559, 6725649, 2771392, 1171354, 2530474, 4411321, 6932457, 11599071, 15343776, 12683467, 4562614, -1503887, -1713447, -293437, -1451859, -3140156, -2144732, -51990, 65460, -1146087, -1673787, -2415722, -4758600, -6451337, -4509397, -742571, 111142, -2657968, -4704617, -3033958, 117870, 1288548, 943131, 2032227, 4552386, 4735574, 733390, -3450513, -2631901, 1998415, 3868000, 140839]
11669A40839m505547m3445L163462K384198J571205K639788K020297j084585j277312
11660E008900L219206N151518n44154p005948n298704J553996L855060M39729
11652F379603j705681n42673q08960l230974k673767J434265K689334j397917
11644A43230m759431k671099J253920K092621J092730J662930L220649L367454
11636E403004K050176J71043k093885l213734j050210K226480J368725l299341
11628A562258m625482M72711N341820L652863j116677k387425j036306j777339
11620H6423l416827j306488L077921L888889J272389J100749L769978K269123
11612A0742157n681842j1683077q022510R22825M921040J878096j038291J165752
$$ y = [140839, -4364708, -4408153, -1244691, 1139507, 2710712, 5350500, 7370797, 6286212, 5008900, 8228106, 13379624, 12835470, 5829522, 530818, 2084814, 5939874, 6379603, 4673922, 4131249, 3322289, 91315, -2582452, -1148187, 1541147, 143230, -4616201, -7287300, -6033380, -3940759, -2848029, -1185099, 2035550, 5403004, 7453180, 7624223, 5530338, 2316604, 1266394, 3492874, 4861599, 1562258, -3063224, -2590513, 2751307, 6404170, 5287493, 2900068, 1863762, 86423, -3330404, -4636892, -1558971, 2329918, 3602307, 4703056, 8473034, 10742157, 5060315, -6622762, -14645272, -13722447, -8801407, -6923311, -7961602, -6795850]
11604f795850N243256N982814L225431P9631k115373l694838l878103j818718
11596c771750O25988R45481M98949K835989O833408O321111q44316p765395p016786
11587a337321j079128J291339k386965n545076k792235K800381M860034K004056
11579b184915j749086k342842O22059L975227L843648p6823l399089k393235O59076
11570c045980R69971j139343j176206J428459K286751p9205j824522j117342j232955
11561d930372l406136l341117R80937M394663K664665k57104R10738L786775K952412
11552C755461o39084k060826r74879o09881p93729P95162K548908J348823p01678
11543B668277O30758L312094J565416l916724o325170l455805j90399M63051Q89032
$$ y = [-6795850, -1552594, 4430220, 7655651, 7735282, 5619909, 1925071, -1953032, -3771750, -3145762, -2200281, -1701332, 1134657, 7968065, 14289176, 13444860, 5679465, -1337321, -2416449, -1125110, -3512075, -9057151, -11849386, -9049005, -4188971, -2184915, -3934001, -6276843, -5654784, -1679557, 2164091, 2087268, -1311821, -3705056, -3045980, -2076009, -3215352, -4391558, -2963099, -676348, -755553, -2580075, -3697417, -4930372, -8336508, -11677625, -10696688, -6302025, -3637360, -3894464, -2983726, 803049, 3755461, 3116377, 1055551, 80672, -529209, -1322938, -527776, 2021132, 3369955, 2668277, 3299035, 6611129, 8176545, 4259821, -2065349, -5521154, -5711553, -5248502, -4359470]
11534d359470J988295P41443k808603l511337N89520M350954L516812Q04646K72218
11525A584478R44931J65771j232635j258385o48160p37315m96521J159689K776940
11516B258793K576195Q71211j232276k876259k643901k36069J097414j518172
11508a703064m524474j993417M118646N537297Q40389j847818J544211M200812
11500F172582M97420m082362k378380K695776M032056J672448j68975j826184
11492F614381n007563n826827n41668N605250M908743n84428k962847j488752
11484G16289j422244k465854l2731L202836k78450p969400p853509K750294J1061205
11475b291564P288109j478249l360053J000913K235100k361379o347281m551055
$$ y = [-4359470, -2371175, -1629732, -4438335, -7949672, -7360152, -3009198, 507614, 1312260, 1584478, 2529409, 2695180, 1462545, 204160, -444000, -1181315, -1677836, -518147, 2258793, 4834988, 5706199, 4473923, 1597664, -1046237, -1282306, -184892, -1703064, -6227538, -8220955, -4102309, 1434988, 2275377, 427559, 1971770, 6172582, 6670002, 2587640, 209260, 2905036, 6937092, 8609540, 8440565, 6614381, 1606818, -4220009, -4761677, 843573, 5752316, 5167888, 2205041, 716289, -705955, -3171809, -3204540, -1704, -280154, -8249554, -16103063, -13352769, -2291564, 4996545, 3518296, 158243, 1159156, 3394256, 1032877, -5314404, -9865459]
11467i865459J300723O425332P367129L489969k046437l978637o99836L197680
11459E190464K810344o68880k373190o65733J686586K098827Q60088m73313j140660
11450G324533j371796j504621j135863M46997K394717K196418o86039k675021
11442D989325p06372K293324Q34825m612370p378235l720334K315442M746795
11434a237600K550714j035996k904348k115934l2974O82880p09921j278108J278540
11425d802747L981839K577109j181063j863735P97029J899888P9487r64004k14080
11416C09723p49414j982769Q92266O895632P642753K29773o709031n602764q72876
11407E3293m62252l363015l497771n82857J174733J316444K231559K993644J289651
$$ y = [-9865459, -8564736, -2139404, 5227725, 8717694, 6671257, 2692620, 1992784, 5190464, 8000808, 7331928, 4958738, 4293005, 5979591, 8078418, 8938506, 8465193, 7324533, 5952737, 4448116, 3312253, 3759250, 6153967, 8350385, 7664346, 4989325, 4282953, 6576277, 7411102, 2798732, -4579503, -8299837, -5984395, -1237600, 1313114, 277118, -2627230, -4743164, -4776138, -4093258, -4803179, -6081287, -4802747, -820908, 1756201, 575138, -1288597, -491568, 1408320, 1487807, 523803, 309723, -439691, -2422460, -1530194, 5365438, 13008191, 13237964, 6528933, 926169, 53293, -408959, -3771974, -7269745, -7852602, -6677869, -5361425, -3129866, -136222, 1153429]
11398A153429j032843r67461l09145k084075l669580n07860N194695O535068J873814
11389F186042l417209m716486k482763N69638K167254J176846q92277p52547J611775
11380e49727K135393k23974q35745J948768K102121l708697p917063l024395N148755
11371d924564N733578j62623k391450J244446L420296J519749P27373K350360
11363G517165J410938k250919k366792J500871J751533l401419n350569M26750
11355g62442O093351M195678r02150j768716J36537o98732l592358m179886k206990
11346c685708J3206K390964M431643K867256k209517m353700l72285K826196j413438
11337D94617p695586o200456J932324O799081N006455K456812K356273Q73061
$$ y = [1153429, 120586, -846875, -1156020, -3240095, -6909675, -7417535, -2222840, 4312228, 6186042, 2768833, -1947653, -4430416, -3860778, -1693524, -516678, -1408955, -2161502, -549727, 1585666, 1361692, 525947, 2474715, 4576836, 868139, -7048924, -10073319, -4924564, 809014, 646391, -1745059, -500613, 2919683, 4439432, 5166805, 7517165, 8928103, 6677184, 4310392, 5811263, 7562796, 4161377, -1189192, -762442, 5330909, 9526587, 8624437, 6855721, 6992258, 6293526, 2701168, -1478718, -3685708, -3672502, -1281538, 3150105, 6017361, 3807844, -545856, -918141, 1908055, 494617, -7200969, -13401425, -11469101, -4670020, 336435, 2793247, 5149520, 6022581]
11329F022581l302368m596368J3601M614946K791545k741906m624529j674265
11321c496763N94459r11257k605764j97604M714508O420513K240340m071367o288545
11312c601480k252683L965329O247253K546298l261329n712141l604003n66863
11304f239619L12289L62444J962129L391294J085432l514437m513660l10776L482286
11295c982618K672463P37699K058973L879915J251888l631811m363022o72613
11287b049126J536574r2943j716688o80298J029642J659349K045386K030172N3042
11278C815110k685323k912180q29875K80173J59226J338500K754785O21946l490874
11269i48512l113962K583002O269656L383805j611832l375281l113463l625123
$$ y = [6022581, 2720213, -1876155, -1862554, 2752392, 5543937, 2802031, -1822498, -3496763, -2902304, -3813561, -6419325, -6616929, -1902421, 4518092, 6758432, 2687065, -3601480, -5854163, -1888834, 4358419, 6904717, 3643388, -2068753, -5672756, -6239619, -5927330, -5564886, -3602757, -211463, 873969, -2640468, -7154128, -7464904, -3982618, -1310155, -572456, 1486517, 5366432, 6618320, 2986509, -1376513, -2049126, -512552, -605495, -2322183, -3002481, -1972839, -313490, 1731896, 3762068, 3815110, 1129787, -1782393, -2612268, -2332095, -2172869, -834369, 1920416, 2542362, -948512, -4062474, -1479472, 4790184, 8173989, 6562157, 3186876, 73413, -3551710]
11261c551710l327674k36040L192142L877642K593529R38487j729108m956737
11253c199469n485016k328292Q48755J340772P28763L55238q28169j563359J744390
11244h386387P236846P307536L60071m808239j697794M334560N400551K594879
11236A2342023R12021m76200m378573p547883n312515j35111K552151L145746
11228A101659M646245M845825M20274m686496m142802m3971K50032l536620m483387
11219e629241k27614L718050L091428J04717j535415j060702O39256K123466J323820
11210B547765j750522l431467j213023K110600K964106K286195J923928J88661
11202E626243l375356l784042J634726O018339K015150n938494p791995l125428
$$ y = [-3551710, -6879384, -7115424, -3923282, -45640, 2547889, 3486376, 1757268, -3199469, -8684485, -11012777, -10164022, -8823250, -8094487, -7739249, -8567418, -10130777, -8386387, -1149541, 6157995, 6518066, 1709827, 12033, 4346593, 9747144, 12342023, 13254044, 12777844, 8399271, 851388, -4461127, -4596238, -2044087, 1101659, 5747904, 10593729, 11014003, 6327507, 2184705, 2140734, 2390766, -1145854, -5629241, -5856855, -2138805, 952623, 1057340, -478075, -1538777, -899521, 1223945, 2547765, 797243, -2634224, -3847247, -1736647, 1227459, 3513654, 5437582, 5626243, 2250887, -1533155, 101571, 6119910, 8135060, 2196566, -5595429, -8720857]
11194h720857k7822r50696o02008K655355M116491K293910J322059K435111K081035
11185D602578j19123l29533J241777q0290l982090m279427L23594L446997J692641
11176B517124n40193j4398P0514k402516l635099j019254J899639J832400P44145
11167e47638O41585j84312j953139j119876K561900L428579r22358m387794j728758
11158d211811K822570K474887j652289l480469j500228J034430K486196L295663
11150A268949K234215j855016n659682m144293K220350P110212N843725M35137
11142G453597l435461k713216M24778J700383J2496j474766k61694J543940P29765
11133C979822j558408j778605j48532j75505k467762l777602k291119N89562L496951
$$ y = [-8720857, -8748679, -9699375, -10301383, -7646028, -3529537, -1235627, 86432, 2521543, 4602578, 4483455, 4153922, 5395699, 5315409, 1333319, -2946108, -2622514, 824483, 2517124, 1976931, 1962533, 2033047, -369469, -4004568, -5023822, -3124183, -1291783, -547638, 93947, -90365, -2043504, -3163380, -601480, 2827099, 1904741, -2483053, -4211811, -1389241, 1085646, -566643, -4047112, -5547340, -4512910, -2026714, 1268949, 3503164, 1648148, -4011534, -8155827, -5935477, 1174735, 7018460, 7453597, 4018136, 1304920, 1729698, 3430081, 3442577, 1967811, 1706117, 3250057, 3979822, 2421414, 642809, 494277, 318772, -2148990, -5926592, -8217711, -7628149, -4131198]
11124d131198N452382L851222k078266o631570l641153L019131L479669k535635
11116c215418m189508K948107Q553920L613784m679306m133275L039516M109710
11108F047530l703375r130263m572380L054716L933180m52752j622240K347183
11100d098401N395658M048725J850670J854780J239552k729813o305430m418704
11092c162963P87440L014566J748622J882332L822658K440957k532669m103617
11084C897326K94071L544361O30542k977590j590742N37486k016901m833912j836068
11075d351427K433738O31595l058287K68036P351574P172332r8395l561280n20121
11066F267765L17658l954295n169870K54019M284723J192350l439856l224081
$$ y = [-4131198, 1321184, 5172406, 3094140, -3537430, -7178583, -4159452, -679783, -3215418, -7404926, -4456819, 4097101, 7710885, 3031579, -1101696, 1937820, 6047530, 2344155, -6786108, -11358488, -8303772, -4370592, -4823344, -6445584, -4098401, 1297257, 5345982, 7196652, 9051432, 10290984, 7561171, 1255741, -3162963, -2375523, 639043, 2387665, 4269997, 8092655, 10533612, 8000943, 3897326, 4191397, 7735758, 8366300, 5388710, 3797968, 4335454, 2318553, -2515359, -4351427, -1917689, -1286094, -4344381, -4076345, 3275229, 10447561, 10349166, 6787886, 6267765, 6585423, 2631128, -2538742, -2284723, 2000000, 3192350, -247506, -3471587]
11058c471587k41631J219009J072792k60378l131518l897201J372986P104294
11050b33234L722410n647732p532427L97242N340877J016476l013613k7915K561072
11041c416844o39808j871692L904337P420581J834175l457019M33127N002164
11033I209021k78712q164802o286595R99410J542916k476536k47429O323641O112781
11024F733695m38762k493339J556161L034195J69737m11194J281554j436993o627128
11015A367926m680837L739175O388273q00817p102797m342268K051299M064117
11007F84071J912318q75286l428601m386084j328034L360094L895615M17138j075417
10998h24186P80955J071043j398991j843274J001663K305456J39506j648350j319140
$$ y = [-3471587, -3713218, -2494209, -1421417, -1681795, -4813313, -8710514, -7337528, -233234, 3489176, -2158556, -9690983, -9293741, -3952864, -2936388, -5950001, -5977916, -3416844, -4056652, -5928344, -2024007, 5396574, 7230749, 3773730, 4206857, 9209021, 8930309, 765507, -5521088, -4521678, -2978762, -5455298, -5702727, 620914, 6733695, 6294933, 3801594, 5357755, 8391950, 8561687, 8150493, 9432047, 7995054, 1367926, -3312911, 426264, 6814537, 6013720, -1089077, -5431345, -3380046, 684071, 2596389, 1721103, -1707498, -6093582, -7421616, -4061522, -165907, 251231, -824186, -43231, 1027812, -371179, -2214453, -1212790, 1092666, 1232172, -416178, -1735318]
10989a735318j423236j818812M47275L148030N66351n258780n360632J667464
10981i767658O509202L677191j101392j895775p53850l05289J816883N662377
10973C841689N382240q77452n821270l951112Q7391L26926r79162M64706K238518
10964G12474K73423k850465k226138R55199K103708Q56117n6193l46053j016205
10955a594133p12387J506498K616482N172l084403j602431L504128O182221L179077
10946A0000224k447901n325139l137700J377196K970856l01710m120603l287407
10938d272184R06299K913970J726718J540636L356515K879722j232982m015376
10930C803318k380100j63229q32314j329146J539448L993954J073283m177072
$$ y = [-1735318, -3158554, -4977366, -4530091, -1382061, -815710, -6074490, -11435122, -9767658, -3258456, 418735, -682657, -2578432, -3332282, -3637571, -1820688, 3841689, 9223929, 8346477, 2525207, -1425905, -1338514, -1011588, -1990750, -1526044, 712474, 985897, -1864568, -4090706, -3135507, -1031799, -175682, -231875, -577928, -1594133, -2306520, -800022, 1816460, 1821632, -1262771, -2865202, 638926, 6821147, 10000224, 7552323, 2227184, -910516, 466680, 3437536, 3135826, -984777, -4272184, -3365885, -451915, 1274803, 2815439, 6171954, 9051676, 7818694, 3803318, 1423218, 1259989, 427675, -901471, 637977, 4631931, 5705214, 1528142]
10922A528142m235463J721023O267983L514479l915753q453006n638663J762644
10914g448614O538346M364753j322815l420887j89547K870010J226099k237131
10906C80214j684382L302995P167210N401628l39271m399146l325071N32240J985654
10897I022071m56805k709824r41198K871954L761441N67192l097525l794137j542201
10888C680968J033177Q67135k730103n863697l508590K898637N633824J587949
10880C599300k411817j82906L734831J906507l151995l261061J553650L624051
10872E410560P01871j530617q7049J404445K93715j597904k690431k751250m4216
10863h90876N127317O193328j088453q349744m474242O013577Q099447k63791
$$ y = [1528142, -2707321, -986298, 5281685, 8796164, 4880411, -3572595, -9211258, -7448614, -910268, 3454485, 2131670, -1289217, -1478764, 1391246, 2617345, 380214, -1304168, 1998827, 9166037, 14567665, 14228394, 9829248, 6504177, 7036417, 9022071, 8565266, 5855442, 4914244, 7786198, 11547639, 12114831, 9017306, 5223169, 3680968, 4714145, 5581280, 2851177, -3012520, -6521110, -3622473, 2011351, 3599300, 1187483, 1004577, 4739408, 6645915, 3493920, 232859, 1786509, 5410560, 6112431, 4581814, 4494765, 5899210, 6192925, 4595021, 1904590, -846660, -890876, 4236441, 10429769, 9341316, 991572, -3482670, 2530907, 10630354, 10366563]
10855A0366563n356819r44727K238022l468071q954622m507559L578736M308095
10847b740382k53909p60202L268663M907880K494729L39970N2030k89148j010195
10838F009436j578882l267807n659086m712019N52743M416577K696945p74174
10830b316267j055238M78012R57854J757166L581526K740176j323199k117271
10822B702759L044448N873160o15926r655245j0167005k731671L707976N752053
10814b089451N950075M118027q60694m143357p39770M283772J916169o330714
10806B104057j0316546o447597j007330J179997J871995K905072L221263L136958
10798c352131M257068M960247K600082n93626o19888P55613r98377m286405l700727
$$ y = [10366563, 5009744, 4065017, 6303039, 2834968, -6119654, -10627213, -7048477, -2740382, -2994291, -3754493, -485830, 4422050, 6916779, 7256749, 7308779, 7019631, 6009436, 4430554, 1162747, -4496339, -9208358, -8655615, -4239038, -1542093, -2316267, -3371505, -2893493, -1935639, -178473, 3403053, 6143229, 4820030, 2702759, 5747207, 11620367, 11004441, 1349196, -8817809, -11549480, -7841504, -2089451, 3860624, 7978651, 7117957, 2974600, 2234830, 6518602, 8434771, 2104057, -8212489, -14660086, -15667416, -14487419, -12615424, -9710352, -6489089, -3352131, 904937, 5865184, 8465266, 7871640, 7251752, 8007365, 7008988, 2722583, -978144]
10789i78144J04695J629255P21176K175165N293405L847670k316407n567081k901107
10780B008627o35241l027969n059347j691345L080216K605143k181002m894281
10772i795199k847371R49383K966417K519489J070357N35186J460018K086396
10764a055324O77185j400592j342650P06583K053907J931711J894647J830100
10756E295567j96963l520442m595796k458575n46825j316506k490736q81358K675938
10747h035696M526997K850859n26631k152828j91418L486388M647549J426349
10739F031569k868912l487158j84371K811441K519522M14453m36256P74049K548782
10730H123119L425078L098673J623929j322375n351633p781315n366316P94297
$$ y = [-978144, -873449, 755806, 1476982, 3652147, 8945552, 12793222, 10476815, 4909734, 2008627, 1373386, -1654583, -6713930, -8405275, -5325059, -2719916, -4900918, -9795199, -12642570, -11693187, -8726770, -6207281, -5136924, -4601738, -3141720, -1055324, -378139, -1778731, -3121381, -2414798, -360891, 1570820, 3465467, 5295567, 5098604, 1578162, -3017634, -5476209, -6023034, -7339540, -9830276, -10711634, -8035696, -3508699, -657840, -1184471, -3337299, -3528717, -42329, 4605220, 6031569, 3162657, -324501, -508872, 2302569, 4822091, 5236544, 4800288, 5574337, 8123119, 11548197, 14646870, 16270799, 14948424, 9596791, 1815476, -3550840, -2756543]
10722b756543M418860J403009l770384l544775J887116N092333K795481n07R73848
10713F498438L044205K692231J413394J116713l97020m108625n311290o79351
10705D268695M579753L465425k122882m451709j633440Q70001k56841j940843
10697B778159r45070J109529J085249p32082j391041L03420J812829j2166l992042
10688A6785m844681l53012M115499K419217l023251m680945j541022K78832j241940
10679h854518r61197L112184N443755K870474M50057K315374M351798J836019
10671A0563946k390581l423484k048660j380079j291905j090670j926162k415497
10663e403092J199491O588387N629580k000758n521501J66647N121978M60120
$$ y = [-2756543, 1662317, 3065326, -705058, -4249833, -2362717, 2729616, 5525097, 5524590, 6498438, 9542643, 12234874, 13648268, 14764981, 14367961, 10259336, 4948046, 4268695, 8848448, 12313873, 10190991, 5739282, 4105842, 4975843, 4719002, 2778159, 1833089, 2942618, 4027867, 3295785, 1904744, 2208164, 4020993, 4008827, 16785, -4827896, -5180908, -1065409, 1353808, -1669443, -6350388, -7891410, -7612578, -8854518, -9815715, -6703531, -1259776, 1610698, 2060755, 4376129, 8727927, 10563946, 8173365, 4749881, 2701221, 1321142, 29237, -1061433, -2987595, -5403092, -4203601, 2384786, 8014366, 6013608, 492107, 658754, 5780732, 6240852]
10655F240852o748395n535082J315947L885948J685814R27792J619102O4172j136826
10646B319324K019681M974341J634986l546766k715434J255644N14480k918427
10638C537829j624125K418818J731365j852270q67306K751428J461379k206459
10630E350659J34384N269064K458214o096430p164510K70545K509132m878834
10622b147776r193195k585496N443374N457524K533483L963560N892564K571776
10614A1935814j835128j027163K193424J756070j361507k734643k524345k810623
10606C591899k216416M18308J770895p44568l594739k098394K554820N442945
10598E124750M394897J333463o74433j16393J330762J47661l750684n346647j862000
$$ y = [6240852, -507543, -6042625, -4726678, -840730, 845084, 1772876, 3391978, 3456150, 2319324, 4339005, 9313346, 10948332, 7401566, 4686132, 5941776, 6456256, 3537829, 1913704, 4332522, 6063887, 4211617, 3344311, 6095739, 7557118, 5350659, 5485043, 10754107, 13212321, 7115891, -48619, 221926, 2731058, -2147776, -11340971, -13926467, -8483093, -3025569, -492086, 3471474, 9364038, 11935814, 10100686, 9073523, 11266947, 13023017, 11661510, 8926867, 6402522, 3591899, 1375483, 1793791, 3564686, 2820118, -774621, -2873015, -318195, 5124750, 9519647, 10853110, 10178677, 10062284, 11393046, 11540707, 7790023, 2443376, 581376]
10589E81376J733504J41594l232866k047070J838166J963102p62296J99031M684635
10580E099176N572086P74901m107913n451726m935293l066169J659488O611045
10572B155595O449717J444984k714742l071870r33640K649433N949201M357314
10564A6285992l003291q313258n149767J095165K000637m36538L39575K529933
10556E348448J141016k93246L271630N891651N6927p407598n169521K404613K502011
10547G745931l471798l415751K863856M374459K04949K20632N292917O055827
10539A9871022J143451j627345j409002l642654n343613R4448O296971K188752
10531A7572030o405971m813481M309604N642816j272910l226845R76787R63663
$$ y = [581376, 2314880, 2456474, -776392, -2823462, -985296, 977806, 215510, 414541, 5099176, 10671262, 11446163, 7338250, 1886524, -3048769, -6114938, -4455450, 2155595, 8605312, 10050296, 7335554, 4263684, 3330044, 5979477, 11928678, 16285992, 13282701, 4969443, -180324, 914841, 2915478, 2478940, 2818515, 5348448, 6489464, 6196218, 9467848, 15359499, 15416426, 8008828, 2839307, 5243920, 7745931, 4274133, 858382, 3722238, 8096697, 8301646, 8522278, 13815195, 19871022, 21014473, 19387128, 17978126, 14335472, 8991859, 9086307, 15383278, 17572030, 11166059, 6352578, 10662182, 16304998, 15032088, 11805243, 12782030, 13745693]
10523A3745693k142222J214898O560655K668106l726573R97542Q385345J853026
10515B9556470q595145k044778J1310426N509280j1123919q254389R347783R043990
10507C4749718p794760q109884Q107348P447252q755201l698530J9773289J7762553
10499E9481785q612024q129279K1149563K0048032j6517057j7419292K9584025
10492G9585753L9583493q040216l752728R2066505J18750945n5010734k74148657
10485a0965639k70921591m7636365J25447939R4622176n657289j2361703L6028485
10478i1443987L0026706j1637571p618716K7559279K4098250r849293j3671109
10471e2536441J0547285J2119681r196756j0466397R106425J2305027j646061
$$ y = [13745693, 11603471, 12818369, 19379024, 22047130, 18320557, 19318099, 27703444, 29556470, 20961325, 18916547, 30226973, 35736253, 24612334, 16357945, 25705728, 34749718, 26954958, 18845074, 26952422, 34399674, 25644473, 21945943, 41719232, 59481785, 50869761, 42740482, 63890045, 83938077, 67421020, 50001728, 79585753, 119169246, 111129030, 107376302, 199442807, 318193752, 263183018, -10965639, -281887230, -329523595, -204075656, -109453480, -115110769, -127472472, -91443987, -61417281, -73054852, -80673568, -53114289, -29016039, -38865332, -52536441, -41989156, -29869475, -39066231, -49532628, -40426203, -28121176, -29767237]
10464b9767237o97521J3130453Q396196j1890026j3792744M590901J1388743p4656
10456a8715891m120545N655027P522639l397253o895660J861556M769756k414269
10448a5734640l308037N382849Q102982J612651m21016L635602P83641q327713
10440h273681q398319J321604N404222J208474J414829O510212L142104p834543
10432e505098r625562N53577O283485R94691k935577J070907L827794N14981j361962
10423f182764O29143r15954o044282n184200J996393M608937O76994R8712M513450
10414e803571L805710l640314o625351j484076J960056m92885o48654M432837
10406h496248N785342j91122m258608q65698K815881J049923r57636J619717M474149
$$ y = [-29767237, -30464758, -17334305, -8938109, -20828135, -34620879, -30029978, -18641235, -18715891, -22836436, -17181409, -9658770, -13056023, -19951683, -18090127, -13320371, -15734640, -19042677, -13659828, -5556846, -3944195, -4365211, -729609, 54032, -8273681, -16672000, -15350396, -9946174, -8737700, -7322871, -812659, 2329445, -5505098, -15130660, -14577083, -8293598, -7298907, -10234484, -9163577, -5335783, -4820802, -6182764, -5553621, -6469575, -12513857, -17698057, -15701664, -11092727, -10415733, -10317021, -5803571, -1997861, -5638175, -12263526, -13747602, -11787546, -12280431, -12929085, -8496248, -2710906, -2902028, -7160636, -8026334, -5210453, -4160530, -5118166, -3498449, 975700]
10397I75700L021349n4397r90997k42778R80737J730411q91048o670130p963205
10388a0104358n60169N991539J677215o190945m336996L079165J853148n563673
10380a4155074l420049P935911J0360099q56286q215762j771451N169057O54976
10372d298579o139474l001473M563038N075784J97007j853024j425075l154580
10364a0036376m926485k478492J654091L034337K961373L813058L382515M10285
10356b185694j064000J205055L083720J603455k02432l27537j529085l943558
10348c360076l021211Q27491M44655n200471o955267m84258N499261L629107J9857
10339h600912K742664P485444N393393j906751n988057n251205m612072n035276
$$ y = [975700, 3997049, 3942652, 2951655, 2708877, 3689614, 5420025, 4528977, -2141153, -10104358, -10664527, -4672988, -2995773, -9186718, -13523714, -10444549, -8591401, -14155074, -17575123, -9639212, 720887, -135399, -8351161, -10122612, -4953555, -4298579, -10438053, -13439526, -8876488, -3800704, -3603697, -5456721, -6881796, -10036376, -14962861, -17441353, -15787262, -12752925, -9791552, -5978494, -2595979, -2185694, -3249694, -2044639, 1039081, 2642536, 2440104, 2112567, 583482, -3360076, -6381287, -5553796, -5109141, -10309612, -17264879, -17749137, -12249876, -8620769, -8600912, -5858248, 1627196, 7020589, 5113838, -874219, -6125424, -10737496, -15772772]
10331a5772772k828781K364169O509710P121620M829905P83245l090522l733132
10323c816558q71566J585191J402544J401503L518802M307234R57842k816464
10315E668528k401170M7448n62082l658279m375994j875883l30187j727350k843319
10306a2058288p30614K419142K352836p81696j882479K095977O693215M981807
10298C089900k276546o481464l081983J879264J134044l169540m112226r87093
10290a4005644J475703J832570K385950K888568J069476j875274k971982l108663
10282a2309296m588917n177971j379759M573859P790377Q036371P272711L984663
10274H202038k196555n280274j743430J068027l451728p531143j208267P768505
$$ y = [-15772772, -18601553, -16237384, -9727674, -2606054, 2223851, 3007096, -83426, -3816558, -4688124, -3102933, -1700389, -298886, 3219916, 7527150, 8484992, 5668528, 3267358, 3314806, 2752724, -905555, -5281549, -7157432, -7487619, -9214969, -12058288, -12788902, -10369760, -8016924, -8798620, -10681099, -8585122, -1891907, 3089900, 813354, -5668110, -8750093, -6870829, -5736785, -8906325, -13018551, -14005644, -12529941, -10697371, -8311421, -5422853, -4353377, -6228651, -9200633, -12309296, -16898213, -22076184, -23455943, -18882084, -11091707, -3055336, 4217375, 8202038, 6005483, 725209, -1018221, 49806, -3401922, -10933065, -12141332, -4372827]
10266d372827M193271p734875q486957N134889J3970063O967224l215420l386404
10258C068964Q12328k0927j785640J726875M315152j135921p698968n359741J804396
10249d273482L155568r12700k139845M50396J176571n02486k42174J849722J855358
10240D16928k23189j400769j801610k983534l345650j276604Q75188J299733K385238
10231f054269M841168M314312m63610l148575L0819L032513N07394k308535P06263
10222A457480M556703J661635l953997l096328K454067K912057k731853n406603
10214b146839j347232K672621J367222j427834m13727K979659L745666M20559
10206E850095l688998m521191j637035J000196N352k042783l35229L086846J053209
$$ y = [-4372827, -179556, -7914431, -16401388, -11266499, 2703564, 9670788, 6455368, 3068964, 3881292, 3860365, 2074725, 3801600, 8116752, 6980831, -718137, -6077878, -4273482, -1117914, -2030614, -4170459, -3720063, -2543492, -3045978, -3288152, -1438430, 416928, 193739, -1207030, -3008640, -5992174, -9337824, -10614428, -9739240, -8439507, -6054269, -1213101, 3101211, 2637601, -510974, -480155, 2552358, 3059752, 751217, 1457480, 6014183, 7675818, 3721821, 625493, 3079560, 5991617, 3259764, -2146839, -3494071, -821450, 545772, -882062, -1295789, 1683870, 5429536, 5850095, 2161097, -2360094, -3997129, -2996933, -2991581, -5034364, -5369593, -2282747, -1229538]
10197a229538n941438p544352Q34055R050581O531125k018877m537273N11223
10189d344494M312477K177004j889166l336304j684575J774891M540323L181377
10181D731533j609556l701219n22467J685622k048841o196798l739812J653732
10173i747806K372336M39485K874982P424810N570093k010003n650734k413012
10165a139849M62623r04781j615818J155409K527126o83419l740845j866926K568529
10156c237951M906523M518059K785309o1889k935292l225765q80882P00788k05977
10147B362923j381080r63247j78826l18563n36280n5972L87716K81236O1037j47482
10137d88538l64199Q3494J062383P14699j495134k865160j415265Q18730J616433
$$ y = [-1229538, -7170976, -14715328, -13881273, -4830692, 1700433, -318444, -4855717, -4344494, -32017, 2144987, 255821, -3080483, -4765058, -2990167, 1550156, 4731533, 3121977, -579242, -1101709, 583913, -1464928, -7661726, -11401538, -9747806, -7375470, -6935985, -4061003, 3363807, 8933900, 6923897, 1273163, -1139849, -677226, -1582007, -3197825, -2042416, 484710, -198709, -3939554, -5806480, -3237951, 1668572, 6186631, 8971940, 8910051, 5974759, 2748994, 1868112, 2568900, 2362923, 981843, 18596, -160230, -478793, -1015073, -1071045, -683329, -402093, -341056, -488538, -852737, -769243, 293140, 1007839, -487295, -3352455, -4767720, -3948990, -2332557]
10128b332557K428898M525793N014682J551245k600935l546443k986503l592806
10120a538626k537143K936739P502245M318949l041128m922953n06139J703194
10112C915138j567709l596670K72126M979846M064404j343927n787728o495465
10104e559985l834449R37126N444135O809202M511491P03312k445916l624348
10096B940568j983387J109433J811427j232098m036780l050819m77157M53722
10088d465091J257948L794232M893217K124728p5407K079072L495979r98168n278637
10079F827873j299653M960720J490866q463462r576497N41853O626457J61761
10071A269918p757210n242772K819231N400931K263148R1534J01143p33272j950480
$$ y = [-2332557, 96341, 4622134, 9636816, 11188061, 8587126, 5040683, 2054180, -1538626, -4075769, -1139030, 6363215, 10682164, 7641036, 2718083, 2211944, 3915138, 2347429, -1249241, -977115, 4002731, 8067135, 6723208, 935480, -5559985, -9394434, -8457308, -3013173, 3796029, 8307520, 9010832, 6564916, 2940568, 957181, 2066614, 3878041, 2645943, -1390837, -4441656, -4918813, -4465091, -3207143, 587089, 5480306, 7605034, 7529627, 9608699, 13104678, 12106510, 6827873, 5528220, 10488940, 11979806, 3516344, -6060153, -5518300, 1108157, 1269918, -6487292, -11730064, -8910833, -3509902, -1246754, -1155220, -1054077, -1787349, -3737829]
10062c737829j305413K30805J102478K175165K908149M85263l492730k828848
10054d462960K557210M223043j212304n262983j263948M295468K907782j687892
10046I3416p84367M107705M537516n24074m346302m029393k680736j577864Q71001
10037d333098L231811K251674n49635p98712Q27859l01729m146078n386861j775720
10028a0980489K988386N147396M406419J663893j625644k165442J745171N706707
10020F886397L708308k736016n678981j853631K933384K441750j860805m100379
10012b59973j906539J995852M026723L039450L47998j811086k158682j457972
10004A815771j460202k645482l488418k131564J344910M414721M433825J905873
$$ y = [-3737829, -5043242, -4812437, -3709959, -1534794, 1373355, 1858618, -1634112, -4462960, -1905750, 2317293, 1104989, -4157994, -5421942, -1126474, 1781308, 93416, -690951, 3416754, 7954270, 7430196, 3083894, -945499, -3626235, -5204099, -4333098, -1101287, 1150387, 600752, -197960, 629899, 328170, -3817908, -9204769, -10980489, -7992103, -2844707, 1561712, 3225605, 1599961, -565481, 1179690, 6886397, 10594705, 7858689, 2179708, 326077, 3259461, 5701211, 3840406, -259973, -2166512, -170660, 3856063, 6895513, 7243511, 5432425, 3273743, 1815771, 355569, -2289913, -5778331, -7909895, -6564985, -2150264, 2283561, 4189434]
9996D189434K18761Q96278R40062k441944o222555m920098J063762N366412M349039
9987C439151Q71120j598450l216900m179081k507214J329667K600411p65320l584048
9978g610664l85696O139643Q473969M171720j902610m306131k479872K77123R15642
9969C293124m96763j385616m43013K98017r26224j847012Q9324K041724l48215
9960B75346m333861k636008M716093R028634N601168r8056k124006k119492l336316
9951D973502l957171j769157O98914R32202O56877Q16440j284046n147101m679309
9942h758849J700827O088160K909384j884808j181850J401240p11438m413487
9934d850821k909641J186533M72551l380643k414281L099366M760018L03927l138520
$$ y = [4189434, 4408195, 5304473, 6244535, 3802591, -2419964, -7340062, -6276300, -909888, 3439151, 4310271, 2711821, -505079, -4684160, -7191374, -5861707, -3261296, -4026616, -7610664, -7996360, -1856717, 6617252, 10788972, 8886362, 4580231, 2100359, 2377482, 3293124, 2796361, 1410745, 967732, 1265749, 339525, -1507487, -1418163, 623561, 275346, -4058515, -6694523, -1978430, 7050204, 12651372, 12553316, 10429310, 8309818, 4973502, 1016331, -752826, -53912, 878290, 1535167, 2351607, 1067561, -4079540, -8758849, -7058022, -969862, 1939522, 54714, -1127136, 274104, -437334, -4850821, -7760462, -6573929, -6101378, -9482021, -11896302, -8796936, -4036918, -3732991, -6871511]
9925f871511j088517K342233K323666l21416k169755j103785L006436P083174
9917C200525O043772l32862n138249l780097n91671k31057M82242M198063M683435
9908H534101k306017p756223k441024N820053L639228n037480n435566K523866
9900b459062M968760q93377l139136K012283M334350J99051j242619K374237J135101
9891G289588o429485p429642K283482R147811N339534P86129J562276j563739
9883A0985954j0492631r849372L899140R038446l772420p152321J9072525M3354161
9875E5083482K2569725k7513758m7985238k0596232J0439125Q610337p279640
9868f672199n149087Q618227Q675615l964658q120258K42523N768161K072852
$$ y = [-6871511, -7960028, -5617795, -3294129, -3615545, -5785300, -6889085, -3882649, 3200525, 9244297, 8911435, 3773186, -6911, -598582, -829639, -347397, 3850666, 8534101, 6228084, -1528139, -3969163, 1850890, 5490118, 452638, -4982928, -2459062, 2509698, 1616321, -1522815, 489468, 4823818, 5022869, 3780250, 6154487, 7289588, 860103, -6569539, -4286057, 4861754, 10201288, 10987417, 12549693, 10985954, 493323, -9356049, -5456909, 3581537, -190883, -7343204, 11729321, 55083482, 77653207, 50139449, 2154211, -18442021, -8002896, 607441, -6672199, -11821286, -3203059, 5472556, 1507898, -6612360, -6369837, -601676, 1471176]
9860A471176j906282j296530j044714k730579j847521J416161J895673j17762
9852d160378L22880K295125L40591m340602m915787r90539R82973k07583J246922
9843i426398O202999P309175J331041m347685k601422K998444M185357l34352
9835E317159m604389m115183l27642K431965J707444j194786k875815j710387
9827e371634L01945O88168K69315J301682K955243K276106m34369j211858J419426
9818B194024L450480Q40505m426010o562973l400263J034064J948267l2407j21643
9809e075956L373045N762143K120315n078250q186384m104852K174214M735420
9801d280305L535625K041011J590207R67660p44224l307373n510229m944799l50664
$$ y = [1471176, -435106, -1731636, -2776350, -5506929, -7354450, -5938289, -4042616, -4160378, -3837498, -1542373, -1201782, -5542384, -10458171, -11448710, -10465737, -10673320, -9426398, -3223399, 4085776, 5416817, 1069132, -1532290, 1466154, 5651511, 5317159, 712770, -3402413, -3730055, -1298090, 409354, -785432, -3661247, -5371634, -5069689, -4381521, -4112206, -2810524, 144719, 2420825, 1986456, 774598, 2194024, 5644504, 6485009, 2058999, -4503974, -7904237, -6870173, -4921906, -4954313, -5075956, -1702911, 4059232, 6179547, 1101297, -7085087, -11189939, -9015725, -4280305, -744680, 1296331, 2886538, 3854198, 3109974, -197399, -5707628, -10652427, -11003091]
9792a1003091M770876M813638k777l022409q24141J953622R50019q16029N96644
9783b583648K332129L39343k291896o47591K304822L05749m600453m625135Q97870
9774h568810M780873L873368K224927J887472J53895k631001k078906J186007
9766H27825R50685l182337l483286K748869P308788L834164k419010l988933k322512
9757B74253k221284k429392P3474K276716Q0864l469301k868344P02082K330718
9748e250214J849110K085214K262416N50428k95306K517561N057166K469494j844333
9739I401536j577787J122979m96229m905045m243677J424486L256757j535510
9731B447510m997604j786058K761022K443312n11711j284739m31803m24685o4039
$$ y = [-11003091, -6232215, -1418577, -1421354, -4443763, -5267904, -3314282, -2364263, -3180292, -2583648, -251519, 87824, -2204072, -2851663, -546841, -241092, -4841545, -9466680, -8568810, -3787937, 85431, 2310358, 4197830, 4351725, 1720724, -358182, 827825, 1778510, -1403827, -4887113, -2138244, 5170544, 9004708, 6585698, 2596765, 274253, -1947031, -4376423, -4302949, -2026233, -1945369, -5414670, -8283014, -7580932, -5250214, -3401104, -1315890, 946526, 1496954, 1201648, 3719209, 8776375, 11245869, 9401536, 7823749, 8946728, 8450499, 3545454, -698223, 726263, 3983020, 2447510, -2550094, -4336152, -1575130, 868182, 356471, -928268, -1360071, -1784756, -1848795]
9722a848795K097820L382170J203254j990964k471740p83580K73428K79625M44368
9713E85586R06420J534545K737249L456986J611246j741855k683546p84444m92714
9704E129473l642386n644864k689772K035219L548199K253457J356658R35127
9696C281111m36556j339150L6917J555974K61976k170262j963990M39805J392510
9687A058335J59484o27538N5239N40580J70673L04606J464455K383303J948000
9678G457137P4221k620821m266438k483008K122158N082093L215905j215912l924846
9669C440489l846988k333677K0300K290500J875886j601726l698241j029246K835095
9660b047608K584754j77516K22775L699160M560155J242768j390223n80336L97585
$$ y = [-1848795, 249025, 3631195, 4834449, 2843485, 371745, -411835, -138407, 141218, 585586, 1492006, 3026551, 5763800, 9220786, 10832032, 9090177, 6406631, 5622187, 5129473, 1487087, -4157777, -6847549, -4812330, -1264131, 989326, 2345984, 3281111, 2844555, 1505405, 1542322, 3098296, 3360272, 1190010, -773980, -334175, 1058335, 1217819, 590281, 645520, 1186100, 1356773, 1661379, 3125834, 5509137, 7457137, 7531358, 4910537, 644099, -1838909, 283249, 5365342, 8581247, 7365335, 3440489, -406499, -2740176, -2719876, -429376, 1446510, -155216, -3853457, -4882703, -2047608, 537146, 359630, 582405, 4281565, 8841720, 10084488, 8694265, 8113929, 8511514]
9651H511514j042520k477590j757120q92466j297460m95822K368186K748994k375984
9642C289732p770678o223496Q03451N068805L117234l26069r71858p08031k246717
9633e967627l363847r34491K561163J971163k074570l084517J804890P106716
9625a981120O621397J946182r06677p13214j299041l570808l675565l61736K000072
9616a940510P69778k35853K063488L160501k057282q779920p005710L442802J0737167
9607A54461O442388l478705p401502l082922J614545Q03716k601184k936215J3778
9598a0471640K033195J552452J570285L804084M748646R32996m197991l872431
9590c900404J634375M292829K46031l804785r92275M381171L302667l436727o112926
$$ y = [8511514, 7468994, 4991404, 3234284, 2341818, 1044358, 548536, 2916722, 5665716, 3289732, -4480946, -10704442, -9900991, -4832186, -1714952, -2041021, -3012879, -3720910, -5967627, -9331474, -10265965, -7704802, -5733639, -7808209, -10892726, -9087836, -1981120, 4640277, 6586459, 5679782, 4966568, 3667527, 96719, -3578846, -3940582, -1940510, -1170732, -1406585, 656903, 3817404, 1760122, -7019798, -14025508, -10582706, 154461, 6596849, 3118144, -4283358, -7366280, -5751735, -4948019, -7549203, -10485418, -10471640, -8438445, -6885993, -5315708, -1511624, 3237022, 4170018, -27973, -3900404, -2266029, 2026800, 2272831, -1531954, -2524229, 1856942, 5159609, 1722882, -4390044]
9581d390044j067816M090337K462381k817578n084292l470423r05127J930859
9573i251703N038301N453206J317715k848362j142852M511718O127351Q44182
9565A0049556n174288n554526j671328Q76196J67948j206264j207673l88083P59681
9556c348781K900448N235703M772424N69974l292233k303240J807568L019819
9548I361682m9847k013959L77426K442478p14261n188439l973633J020671J431874
9539B693992l271858l916586K879807P298349J287763p240518n297171M914387
9531f51835Q468621j95816r387825p602737J181365N788535L897179J718784K060440
9522E276711J564417j187225k769815j395980L9515l86716l22303J519100J611955
$$ y = [-4390044, -5457860, -1367523, 1094858, -1722720, -6807012, -10277435, -11182562, -9251703, -4213402, 1239804, 2557519, -290843, -1433695, 3078023, 9205374, 10049556, 4875268, -679258, -2350586, -1474390, -1306442, -2512706, -3720379, -4108462, -3348781, -448333, 4787370, 9559794, 10129768, 6837535, 4534295, 6341863, 9361682, 9311835, 7297876, 7675302, 10117780, 9403519, 4215080, 241447, 1262118, 2693992, -577866, -4494452, -1614645, 5683704, 6971467, -269051, -5566222, -651835, 7816786, 7620970, -1766855, -9369592, -8188227, -2399692, 1497487, 3216271, 5276711, 6841128, 5653903, 2884088, 1488108, 1527623, 1140907, 818604, 2337704, 3949659]
9513C949659k457341o144827l603778K903251N369217J506988k346240j196902
9505b019973J706750J269316j188375j107495J137691J215226j250099j780636
9497b017595J255668L476514J245050k692223l523924j315148J00116n17921n16494
9488d505957J676771L695966K616248q84608l379674k861702p42578J76921j084815
9479e293428k672341j815419K106944O210947O388946J867479k892461k601137
9471A299530K076132M452990M41065n078681m359861J786371M153457j722777
9463C048226q172097n572815L892419Q799153L624025m811061p077388k212469
9455h482007L385088M489068J450872j881274k025843J307408M521974L282220
$$ y = [3949659, 1492318, -4652509, -8256287, -5353036, 16181, 1523169, -823071, -2019973, -313223, 956093, -232282, -1339777, -202086, 1013140, -236959, -2017595, -761927, 2714587, 3959637, 1267414, -2256510, -3571658, -3471542, -3989463, -4505957, -2829186, 866780, 3483028, 2598420, -781254, -3642956, -4385534, -4208613, -5293428, -7965769, -9781188, -7674244, -1463297, 4925649, 6793128, 3900667, 1299530, 3375662, 7828652, 8269717, 3191036, -1168825, 617546, 4771003, 3048226, -5123871, -10696686, -6804267, 1994886, 5618911, 807850, -6269538, -8482007, -5096919, -607851, 843021, -1038253, -3064096, -1756688, 2765286, 6047506]
9447F047506k265011o610925m810084J612067O282538M981829m73032n110295
9439c45407o010866m067851j553492O71956K954286M775606M668163K648954R76254
9430D717603J124037J459996j47834k599012k960680j001564N50766M24450N07111
9421B074873K114608L179895J089674l174097n704882m087392J10696L257772
9413a138853L387473J700444L78635l65900j719077l001169j667562K148860M079026
9404C801877J279742k811650l293502j212382j178705k921564j462405L868957
9396c929632P106162M505856j63848k328729k998150m203821l360156J820698
9388c551620O630281M711443j660856l817625P81029N019126K704698l234250
$$ y = [6047506, 3782495, -2828430, -7638514, -6026447, 256091, 5237920, 4764888, -345407, -6356273, -10424124, -11977616, -11305660, -8351374, -3575768, 1092395, 3741349, 4717603, 5841640, 7301636, 7153802, 4554790, 1594110, 592546, 1143312, 1567762, 2074873, 4189481, 7369376, 8459050, 5284953, -419929, -4507321, -4396625, -1138853, 2248620, 3949064, 4327699, 3961799, 2242722, -758447, -2426009, -277149, 3801877, 5081619, 2269969, -1023533, -2235915, -3414620, -6336184, -7798589, -3929632, 3176530, 7682386, 7518538, 5189809, 2191659, -2012162, -5372318, -3551620, 3078661, 7790104, 6129248, 2311623, 3092652, 8111778, 10816476, 7582226]
9380G582226o044388m071419p51250J240592K020139K210784J761145N09795j810287
9371B647337n049983o858029l701083L842685R072478O352767q38018l684944
9363A783210K0300K959709o56281o267357n687919P58757M779947J894956l198835
9354c613513m202932j177975J618361K161359J658789J281633R73055N75132L0037
9345f96054q43371j520274q57097R94508K267542K066044J324590N42319r46453
9336B331754k483474j984975K01050Q02826j090132k095292k98239J412398R28769
9327b275315R68487L243957L722142n46041m702581l209938O38513M77914j801084
9318c483946j62148L200147J021093m734247m318319K997488O500486J644356
$$ y = [7582226, 1537838, -2533581, -3284831, -2044239, -24100, 2186684, 3947829, 4457624, 2647337, -2402646, -9260675, -12961758, -9119073, -46595, 6306172, 5468154, 1783210, 1803510, 4763219, 4106938, -2160419, -7848338, -7089581, -2309634, -414678, -3613513, -7816445, -8994420, -7376059, -5214700, -3555911, -2274278, -1301223, -726091, -696054, -1539425, -3059699, -3916796, -2922288, -654746, 1411298, 2735888, 3278207, 2331754, -151720, -2136695, -1935645, -1132819, -2222951, -4318243, -4616482, -3204084, -2275315, -1306828, 1937129, 5659271, 5113230, 410649, -2799289, -2160776, -1682862, -3483946, -3646094, -445947, 575146, -4159101, -8477420, -5479932, 1020554, 2664910]
9310B664910k772578l19640K738221L22491k014862J749839N749239K441615l218220
9301G341015k393435J552219o92423o741652n905294J744030M715958n32513l895442
9292d807537J077038O961077N325193p61953l960022l902120l842770k725296
9284f636390J673806O166485N862510J667827j743369l105116m516293o192681
9276f823221o168379m095634j451628R34583K503282J897215n49001j317129J715518
9267a3354394N178366M645448J379243J23772J449927J460441j081073k693291
9259b891561j344276K85054j18073m72814J508346L554532K261194q61904j200869
9250G19629J723664L112976j37074m783905n500140j636438K445596K818338k9368
$$ y = [2664910, -107668, -427308, 2310913, 2633404, 618542, 2368381, 8117620, 10559235, 7341015, 4947580, 6499799, 5807376, -934276, -6839570, -5095540, -379582, -912095, -4807537, -3730499, 3230578, 8555771, 7793818, 3833796, -68324, -3911094, -6636390, -4962584, 1203901, 7066411, 8734238, 6990869, 3885753, -630540, -6823221, -12991600, -17087234, -18538862, -17604279, -15100997, -13203782, -13752783, -15069912, -13354394, -8176028, -3530580, -2151337, -2027565, -577638, 882803, -198270, -2891561, -4235837, -3950783, -4068856, -4541670, -3033324, 521208, 2782402, 1920498, 719629, 2443293, 5556269, 5419195, 635290, -4864850, -6501288, -4055692, -1237354, -1266722]
9241a266722k416092j554138J637958L554442K086749n66814o78113J545035J753269
9232D095574k129803n866172l891714L041333Q102350O061147j381804p846143
9224A84768q224059k728298L459548M926851J505646j882737j669061K06651K48203
9215c972488j268104j880683j313112n34094J229449M232417N250883J983582
9207C727850j712680r64051J697671K55152l851361l417066J848117M047813M12162
9198B043607k155217M40958K467431n82692l407249p27095K780751J117775j781209
9189A97060O69960N102274L704328j901763l538852n87610J39069k459372k061612
9180g36518K931586O032754L519145m88337k201218l023087l605715j189897L677912
$$ y = [-1266722, -3682814, -5236952, -3598994, -44552, 2042197, 1475383, 797270, 2342305, 4095574, 1965771, -3900401, -7792115, -4750782, 3351568, 9412715, 8030911, 184768, -8039291, -10767589, -7308041, -2381190, -875544, -2758281, -4427342, -4220691, -3972488, -5240592, -7121275, -8434387, -8968481, -7739032, -3506615, 1744268, 3727850, 2015170, 1051119, 2748790, 3003942, -847419, -4264485, -2416368, 1631445, 2043607, -111610, 329348, 2796779, 2214087, -1193162, -1920257, 860494, 1978269, 197060, 867020, 5969294, 9673622, 7771859, 4233007, 3645397, 3784466, 1325094, -736518, 2195068, 8227822, 11746967, 11258630, 9057412, 6034325, 2428610, 1238713, 4916625]
9171D916625N131263P24868m002583l657025k71269J254436O0231j918327l679468
9162a441249m313693k435511P25075J618842L8826k1169K545749L261486m01796
9153d23440m119854l498266r25459p39187j677779J42743L567398L740436m3123
9144c976531l155349k379749L57095J673304J041482L77843J197478L089970M257685
9135B483228L227015K46399k994457m672215l607332K6886L725081M107990J198912
9126C741507q59044R3967L31837l351908o478175k773034M497027N461914j397512
9117g33421o048714j801220M826283M487336j378116m153983r76547L029447L462016
9108G13081J409106k57305q87190j697744l541745n110402l300154K597030P445548
$$ y = [4916625, 10047888, 10772756, 6770173, 3113148, 2841879, 4096315, 4156546, 2238219, -1441249, -5754942, -8190453, -7465378, -5846536, -5807710, -5828879, -3283130, -21644, -423440, -4543294, -8041560, -8967019, -9706206, -11383985, -11241242, -7673844, -3933408, -3976531, -7131880, -9511629, -9154534, -7481230, -6439748, -6061905, -4864427, -1774457, 2483228, 5710243, 5956642, 2962185, -1710030, -5317362, -5290476, -1565395, 2542595, 3741507, 2882463, 2976430, 3308267, -43641, -6521816, -9294850, -4797823, 664091, -733421, -6782135, -8583355, -3757072, 730264, -647852, -4801835, -5778382, -2748935, 713081, 2122187, 1864882, 977692, -720052, -4261797, -9372199, -12672353, -10075323, -2629775]
9099b629775N229252j961155n409439k001815J492589l16621l036066r69443K656920
9090f945553J842190q68769J337359O756184O766573p3480n192367l057189J491221
9081B056169K139678n2129j019543q70215j572544j923465j61478J512892K78788
9072C88153j651204j09483L542487L712699n34457l636879k177715J98577k48151
9063e15973p06500K443213N262451J311450o489148q003537j172666M159617J749194
9054a961899j119459L384383R062829N081136n435008r253692l617188P54014
9046c104884j469018k258594L945917R136238M718808m058706o235460j034805
9038c60504L592955L476723O69098k812896n585212m327683J720041O355875L778318
$$ y = [-2629775, 2599477, 638322, -4771117, -6772932, -5280343, -5596964, -8633030, -9602473, -6945553, -5103363, -5972132, -4634773, 2121411, 8887984, 8814504, 3622137, 564948, 2056169, 4195847, 4143718, 3124175, 2253960, 681416, -1242049, -1403527, 109365, 388153, -1263051, -1372534, 2169953, 5882652, 5348195, 1711316, -466399, -267822, -515973, -1222473, 1220740, 6483191, 7794641, 1305493, -6698044, -7870710, -3711093, -1961899, -3081358, 303025, 9365854, 14446990, 9011982, -241710, -3858898, -3104884, -4573902, -6832496, -2886579, 6249659, 10968467, 6909761, 674301, -360504, 3232451, 6709174, 7378272, 4565376, -1019836, -5347519, -3627478, 2728397, 6506715]
9029F506715k282834m077066j670388j148201l164339k391379J960790L956097
9021b310605O87220l203163k876869O45736L617260M009895J702333j610115k438478
9012a776786M86335K930139N34954l861090m009948r2422J988128N04839l72378
9003c668229R98191J420940K14456J011516M045096M271379J45056k997316j795498
8994C645591m1627r47672j245236J886418M431673K196665j449550j083079J700851
8985I094034J477680j842162l742788k941690k105489j875620j05650L179752
8977A138067N038868L928450R28050k805558o101918o314857k063865L141553
8969c111210M273916J483187p32375o51502q10372k032459j335515K230253M374848
$$ y = [6506715, 4223881, 146815, -1523573, -2671774, -5836113, -8227492, -6266702, -2310605, -1623385, -4826548, -7703417, -7057681, -3440421, 569474, 2271807, 661692, -1776786, -1290451, 1639688, 2174642, -1686448, -5696396, -5788818, -3800690, -3295851, -3668229, -2670038, -1249098, -1034642, -23126, 4021970, 8293349, 8438405, 5441089, 3645591, 3603964, 2656292, 1411056, 3297474, 7729147, 9925812, 8476262, 7393183, 9094034, 10571714, 8729552, 4986764, 2045074, -60415, -1936035, -2041685, 1138067, 6176935, 10105385, 11033435, 8227877, 2125959, -4188898, -6252763, -3111210, 1162706, 2645893, 1913518, 1262016, 451644, -1580815, -2916330, -686077, 3688771]
8960C688771J541216l160547l851255O353L201868K148498p62399j260919P76491
8951B328077J619758p35093l702402l814665j602649o36706k214855l570329k025342
8942a4354206J442361M156875N132019M595330K173868j659809l791355j624357
8934c929274K402573L143099L0615j750859J107800M865934M011582r50227m584795
8925D346448l890752p46045K344224M714624N213064J803200m272010p462751
8917B050002m387918R81740K321689m19854j699513Q10012K999646J269002j790227
8908B134579j725691Q59880J690599l25986j743736l06351J509178L15909l041906
8899f33525m451245j943844J904035L403653K062175K68933l83875n46080q85917
$$ y = [3688771, 5229987, 2069440, -1781815, -1775462, 1426406, 3574904, 2812505, 1551586, 2328077, 3947835, 3212742, -489660, -4304325, -5906974, -6543680, -8758535, -12328864, -14354206, -12911845, -8754970, -3622951, 972379, 3146247, 1486438, -2304917, -3929274, -1526701, 1616398, 1647013, -103846, 1003954, 5869888, 9881470, 8931243, 4346448, 455696, -290349, 2053875, 6768499, 11981563, 13784763, 9512753, 2050002, -2337916, -1356176, 965513, 545659, -1153854, -343842, 2655804, 3924806, 2134579, 408888, 1268768, 2959367, 2633381, 889645, 583294, 2092472, 2408381, -633525, -5084770, -7028614, -5124579, -1720926, 341249, 610182, 226307, -319773, -1205690]
8890a205690o81194L48424R24337O13412J246144L477761M015815p1641n620356
8881C047012o439274j923533K086554J736105l86836q42905n25267j347294j889621
8872f485059k03879J882267J209584j597592k801602m66852L576318N838385L999001
8863D950571q65109m215971k609332J305804J864155j125973k080388P61223J949511
8854f5509j454807l554567J132122P751106P786881J635786l260704l986634l760165
8845B223509l705710j407191K393572L313776N61934j699917j213244k10955m26328
8836a70554q49935j048943j689519j551687R30038L377943K162179j020750j223039
8827a084267J414764J901453r98441l272153l193477l192070l409222r37006L083730
$$ y = [-1205690, -1886884, -1538460, -614123, -711, 1245433, 4723194, 8739009, 8667368, 3047012, -3392262, -5315795, -3229241, -1493136, -1879972, -2722877, -3248144, -4595438, -6485059, -6688938, -4806671, -3597087, -5194679, -7996281, -8463133, -4886815, 951570, 4950571, 4085462, -130509, -2739841, -1434037, 430118, -695855, -2776243, -2015020, -65509, -1520316, -5074883, -3942761, 3808345, 11595226, 13231012, 9970308, 5983674, 2223509, -1482201, -2889392, -495820, 2817956, 3379890, 1679973, 466729, 255774, -170554, -1020489, -2069432, -3758951, -5310638, -4380600, -1002657, 1159522, 138772, -1084267, 330497, 2231950, 1233509, -2038644, -5232121, -8424191, -11833413, -12770419, -9686689]
8818i686689L304824p94965l228299j231407Q75971K01963k02911J413837J709602
8809g638074m11631n28273K837872M339438J231942j297743L19024J379545j789437
8800a557337m134023j041565K699572J636657k95933J903263L440745j346128
8792A305251n879457q51754P755387N640710o223941j1023967j434528R520576
8784a191723Q469148l51204m973389l360596j824822k558327k228370K24042K042979
8775e752262J612261k24032k454963l718622j791666L119983O602818N123495
8767B517012J059978q14993o7675Q794j543517k155131o12961P48777J5494j057598
8757a901820L7585K020679J148653k646857l965546J088369P865108P504523j139309
$$ y = [-9686689, -6381865, -7176830, -10405129, -11636536, -10760565, -10558602, -10761513, -9347676, -7638074, -8049705, -8577978, -5740106, -1400668, -168726, -1466469, -1147445, 232100, -1557337, -5691360, -6732925, -4033353, -2396696, -2692629, -789366, 2651379, 1305251, -4574206, -5425960, 2329427, 7970137, 1746196, -9277771, -10712299, -1191723, 7277425, 6926221, 1952832, -1407764, -3232586, -5790913, -8019283, -7795241, -5752262, -4140001, -4364033, -6818996, -10537618, -12329284, -9209301, -2606483, 2517012, 3576990, 2761997, 2694322, 2703116, 1159599, -995532, -1608493, -859716, -844222, -1901820, -1864235, 156444, 1305097, -1341760, -5307306, -4218937, 3646171, 11150694, 10011385]
8748A0011385q774931p551015j017359K386311J687355K277970M733255L532603
8740G285574k053060m533174K82053N505513L011097m031337n766153j38322M880127
8731D442318L365132j353783l515910l027280l002915l338294j606468J441914
8723f595286K167193L965j057080J484952M457382L561756j38158j759774K27403
8714B352353K091334O30268k477738l729905k604270j089601j47297R05549K241703
8705a827604K820997J755110p16657l210676l626825q57963L051353M135049J322474
8696B845258j695020j273222J263573J972960J1938k161446l329627m461270n034808
8687a1861664k485942L048680O796751M931061J2116k293770q61467J39538j632669
$$ y = [10011385, 1236454, -6314561, -7331920, -4945609, -3258254, -980284, 3752971, 7285574, 5232514, 699340, 981393, 6486906, 9498003, 5466666, -299487, -437809, 4442318, 7807450, 6453667, 2937757, -89523, -3092438, -6430732, -8037200, -6595286, -4428093, -4424128, -5481208, -3996256, 461126, 4022882, 3884724, 2124950, 2352353, 4443687, 5073955, 2596217, -1133688, -3737958, -4827559, -4974856, -4069307, -1827604, 993393, 2748503, 2031846, -1178830, -4805655, -5663618, -2612265, 1522784, 2845258, 1150238, -122984, 1140589, 3113549, 3125487, 964041, -2365586, -6826856, -11861664, -14347606, -11298926, -4502175, 428886, 441002, -1852768, -2714235, -2574697, -4207366]
8678d207366k863478l00012L000043J683852k999500m039445O92947M736634L120044
8669a176281J08214J274444L196414n56720o536261n077489L452085P411217J717837
8660C813460m178335j826597K967910R29717m944897n127164L78071L162979R34466
8651c890390l29293J747054K458654k64162k089589p22396J35247j620762k282914
8642f858551O25239L559656L255500K149488L153212L963547J392859k526693
8634H714257l667177k210886j344783j619817r77407Q04335J603491N43847q59832
8625I86028j087332j21256J158565J557891Q6367k670343m173101k232329K448210
8616d047300O747774P901713N458102J016040l332670o129724o359043l359367
$$ y = [-4207366, -7070844, -7370856, -4370813, -2686961, -5686461, -9725906, -9032959, -4296325, -1176281, -1068067, 206377, 3402791, 2846071, -3690190, -8767679, -5315594, 2095623, 3813460, -364875, -2191472, 776438, 1706155, -3238742, -8365906, -7987835, -4824856, -3890390, -4219683, -2472629, -13975, -278137, -2367726, -3090122, -2954875, -4575637, -6858551, -6233312, -2673656, 581844, 2731332, 5884544, 9848091, 11240950, 8714257, 5047080, 2836194, 1491411, -128406, -1105813, -301478, 1302013, 1845860, 986028, -101304, -222560, 936005, 2493896, 2580263, -90080, -4263181, -6495510, -4047300, 2700474, 10602187, 16060289, 17076329, 13743659, 7613935, 1254892, -2104475]
8608b104475J479759L877473Q35952m076225l943363J530208M670494J616817
8600C886640j005912K728080O531470J248254q411788q853084J102932P101620
8592D328212R10170p308049n330344L028622N816593J456640j675211j01427J316357
8583B441563j98057j223784K85699J215099m54560j706004P1467K127080L50555
8574B909058m255130o293441k590843L799851O696795L535092j758572l601868
8566a559058j665569m95907k361496m172665k854906J38162K203683L765456N655857
8557a346443N697865K173802j941779k822849j680849j934100k553695r1729L799449
8548g00328L528566j274603m248087j794728J826505J796155j69788L4448J991502
$$ y = [-2104475, -624716, 3252757, 4088709, 12484, -3930879, -2400671, 2269823, 3886640, 2880728, 5608808, 12140278, 13388532, 4976744, -3876340, -2773408, 4328212, 5238382, -2069667, -7400011, -4371389, 1445204, 2901844, 1226633, 1125206, 2441563, 2243506, 1019722, 1305421, 2520520, 2065960, 359956, 431423, 2558503, 2909058, -1346072, -7639513, -10230356, -6430505, 266290, 3801382, 2042810, -1559058, -3224627, -3720534, -6082030, -10254695, -13109601, -12971439, -10767756, -7002300, -1346443, 4351422, 6525224, 4583445, 1760596, 79747, -1854353, -4408048, -4499777, -700328, 2828238, 1553635, -2694452, -4489180, -2662675, -866520, -1036308, -1001860, 989642]
8539I89642K772711K711833L816182M293835N32348n627900p411099k560020K741044
8530B258576K413139j187112j811658Q28093J565379q38177j387216K414030N530023
8521I785077K843440l051190o316375o346693n923174l983073K184580Q759790
8513b047618Q103487Q79127l221511r2939K170713k984496q381342l700413P184673
8504b090319J0477498K400994o029374n601042l95367J252790r31035j821133
8496b736988j64423J400509K273890L706330M541557K679936k19182o21078P88366
8487A1648917k2966l307115m543467j826974P81081l58894l138112l809518k505816
8478g082864j020095J230151M455767N038328O43421l630191j223068M840300
$$ y = [989642, 3762353, 6474186, 10290368, 14584203, 15116551, 9488651, 2077552, -482468, 2258576, 4671715, 3484603, 1672945, 2501038, 4066417, 3228240, 1841024, 4255054, 9785077, 12628517, 9577327, 3260952, -3085741, -9008915, -12991988, -10807408, -2047618, 6055869, 6934996, 3713485, 3620546, 5791259, 2806763, -5574579, -9274992, -2090319, 8387179, 10788173, 4758799, -842243, -1237610, 15180, -915855, -2736988, -2901411, -1500902, 772988, 4479318, 9020875, 11700811, 11481629, 10860551, 11648917, 11625951, 8318836, 3775369, 1948395, 2729476, 2370582, -767530, -4577048, -7082864, -8102959, -6872808, -2417041, 2621287, 3264708, -365483, -1588551, 3251749]
8470C251749M861855k872688q862165o540111j117778N12016N05074L532447O432810
8461b96791L583802k083363l378348j228346k367630o112941m611833K910041
8453a3585409P250911L658223r21299L36029L948134L635839N51552o54299j84192
8444D035489q24873j819435j291288j075004l173447m572554j405156M128774
8436e997494O276043L321131j581268n049610n314439k086287J947895K573779
8428e910250J10690l7481L850090N935079K224668k297394k068534k23527j684193
8419a00852k991917J157053O137596L742766k792222k900306L157696L910827
8411I320641l799700q691531l363990L746373K365440l838924m828016j34064
$$ y = [3251749, 8113604, 5240916, -3621249, -10161360, -11279138, -10767122, -10262048, -6729601, -296791, 3287011, 1203648, -2174700, -3403046, -5770676, -11883617, -16495450, -13585409, -6334498, -2676275, -3597574, -3261545, 686589, 4322428, 4873980, 4219681, 4035489, 3210616, 1391181, 99893, -975111, -4148558, -8721112, -10126268, -5997494, 278549, 3599680, 2018412, -3031198, -8345637, -10431924, -8484029, -5910250, -5799560, -5837041, -1986951, 3948128, 6172796, 3875402, 1806868, 1583341, -100852, -3092769, -1935716, 4201880, 7944646, 5152424, 2252118, 5409814, 9320641, 5520941, -3170590, -6534580, -2788207, -422767, -4261691, -9089707, -9223771]
8403i223771K825010J763794J013365K074969J636601r29535j539696J555489
8395h23774M250200K470436k014779m141803k088960Q35891N97406k521008m271557
8386g707948j954206J966662L290210J731694N14191J130471J790148J074997
8378A836219q9250n34035j40993J032813K185709R90273l141543o031468l543201
8369g435476J440901K473254m95013j421910J190805K072383m27158o07373L780794
8360E71207N812998P95630m568553k577190K617339K300197j764167q60372M784071
8351G111160N729998o82322n661622l320523N58034p64911m050228k802471J187307
8342b695578J066770l342820m846759J84669O440210P135594K766339m88732O65682
$$ y = [-9223771, -6398761, -4634967, -3621602, -1546633, 89968, -839567, -2379263, -823774, 3426426, 5896862, 3882083, -259720, -2348680, -1512789, -915383, -3436391, -7707948, -9662154, -7695492, -4405282, -2673588, -2159397, -1028926, 761222, 1836219, 1746969, 1212934, 1071941, 2104754, 4290463, 5280736, 2139193, -3892275, -7435476, -5994575, -3521321, -4016334, -5438244, -4247439, -2175056, -2602214, -3209587, 571207, 6384205, 7179835, 2611282, 34092, 2651431, 4951628, 3187461, 2327089, 7111160, 12841158, 12158836, 6497214, 3176691, 3734725, 2969814, -1080414, -3882885, -2695578, -1628808, -4971628, -9818387, -9633718, -3193508, 3942086, 6708425, 6219693, 6885375]
8333F885375K703793O02104m797984p290887l487020K356896L997736J460187
8325B430200k20987N80841J07681l237717m683537j33518O183159O222398q64637
8316F383883p156299o082703J343M261127M039144J895833J00662j619581k838150
8307a014741j316599K738854M726921J501793l029865k672007J662520K764848
8299E361724j834665n556110k659342K805951L212022j098501l072585k37149
8291c078655K315983R12122j314318n29605J676816J867410M15733l66002p29052
8282A170432j998419k839199j323353P50234N3580k398769k075662K032279N396033
8273a232844M197424Q9056k875904l050148j180448J557097L379972K361035m49698
$$ y = [6885375, 9589168, 10191272, 5393288, -1897599, -5384619, -3027723, 970013, 2430200, 2209213, 2790054, 2897735, -339982, -5023519, -5157037, 1026122, 7248520, 6383883, -772416, -6855119, -6853776, -2592649, 1446495, 3342328, 3442990, 1823409, -1014741, -2331340, 407514, 5134435, 6636228, 3606363, 934356, 2596876, 5361724, 3527059, -2029051, -4688393, -1882442, 1329580, 231079, -2841506, -3078655, -762672, 149450, -1164868, -1694473, -17657, 1849753, 2265486, 1899484, 1170432, -827987, -3667186, -4990539, -4240305, -4186725, -6585494, -8661156, -6628877, -1232844, 2964580, 3053636, 177732, -2872416, -4052864, -2495767, 884205, 3245240, 2795542]
8264B795542q21343K739253N239731J439769n758640q191934l559757J691926
8256d425453K020397K6548Q04627L435993L061910q49868l542424j918451J896675
8247E09954M378805M329236K025428j891470n270342n096489j194769K681646
8239D71999L111596Q01188j150256j116684K72190J613299J527167o13432l340183
8230A576884l864014j569638P98279R60177L32097J362231L311858L427590J287907
8221G623371r15176j890346k134942j609683K38570J849279M31842l316427m679179
8212d402691j204483L278646L744429R18531l87112J263380K182973l39078l907968
8203A146627m710693k633398l92961O50751J180905J325568J95959j737529k187664
$$ y = [2795542, 1974199, 4713452, 9953183, 11392952, 5634312, -2557622, -6117379, -4425453, -2405056, -2378508, -1573881, 1862112, 4924022, 4074154, 531730, -1386721, 509954, 4888759, 9217995, 11243423, 9351953, 4081611, -1014878, -2209647, 471999, 3583595, 4384783, 3234527, 2117843, 2390033, 4003332, 5530499, 4917067, 1576884, -2287130, -3856768, -3058489, -2098312, -1766215, -403984, 2907874, 6335464, 7623371, 6708195, 4817849, 2682907, 1073224, 1311794, 3161073, 3592915, 276488, -4402691, -5607174, -2328528, 1415901, 2334432, 1947320, 3210700, 5393673, 5054595, 1146627, -3564066, -6197464, -6590425, -5939674, -4758769, -3433201, -3237242, -4974771, -7162435]
8194g162435l0426K809926L696334K489506J091740L91963o73631k662265l645313
8185c694601j167358L919236P155574N218885J62958k846266j858296J04089K26505
8176G220726j21125J177802K273954K4313l916615m404543n60837K373575N33672
8167D600922l312614m414099k418948j41706J100851J593692J048918k14771P9002
8158b078753K798818M517838J826275k982798m663633k370812K0211K39226k33361
8149b926989k09545m90536j054581n84710O84565J353066K046329L983840M681730
8140G483169N96649n474451o117611l24487L976496J765373j557726K57100L575997
8131D180509J254557m655444n592027k73961L316176P73692k233314K75421M975599
$$ y = [-7162435, -7192861, -4382935, -686601, 1802905, 2894645, 3286608, 2612977, -49288, -3694601, -4861959, -942723, 6212851, 11431736, 11594694, 8748428, 6890132, 6994221, 7220726, 7099601, 8277403, 10551357, 10575670, 6659055, 2254512, 1693675, 4067250, 4600922, 1288308, -3125791, -5544739, -5686445, -4585594, -2991902, -1942984, -2157755, -2078753, 720065, 5237903, 7064178, 4081380, -582253, -2953065, -2932854, -2693628, -2926989, -3136534, -3627070, -4681651, -5266361, -4581796, -3228730, -1182401, 2801439, 7483169, 8079818, 2605367, -3512244, -3836731, 139765, 1905138, 347412, 604512, 4180509, 5435066, 779622, -4812405, -5086366, -1770190, -996498, -3229812, -2954391, 2021208]
8122B021208M627485r09400m758741k806941J472110K567495j08614k512029j560944
8113a968371J440258K923820J403857j172321k201395j475109p54429r51103r55459
8104c710252N08905K771516L736702K406693J97959p72475l70259m04831j701188
8095B662770k581691j354318Q93874J793161J239660J191060K054490J788014
8087G687020o74326l241132l161835l62597K715020L623958J679523j744795m234457
8078B286379m480595l357080j989294K51833L836747O191213L965814j754200
8070D950817n815741n249449k062148R03160L312970N144618M816704J982558
8062G983489n68793m23682J010258Q04842j388658l456323l687174k121527k19730
$$ y = [2021208, 6648693, 5739293, 980552, -1826389, -354279, 2213216, 2104602, -407427, -1968371, -528113, 2395707, 3799564, 2627243, 425848, -1049261, -1803690, -2754793, -3710252, -3201347, -429831, 3306871, 5713564, 5911523, 5139048, 4768789, 4363958, 2662770, 81079, -1273239, -379365, 1413796, 2653456, 3844516, 5899006, 7687020, 7012694, 3771562, 609727, 247130, 2962150, 6586108, 8265631, 6520836, 2286379, -2194216, -5551296, -7540590, -7288757, -3452010, 2739203, 6705017, 4950817, -864924, -6114373, -8176521, -7273361, -3960391, 1184227, 6000931, 7983489, 7414696, 6991014, 8001272, 8806114, 7417456, 3961133, 273959, -1847568, -2067298]
8053b067298K47043n71080R3613L617606O312151L812712j625943l670983j627507
8044D520314q47921k546243j424796L633448N354373j32991n570451l751965R62987
8035A96755Q13558k217350j395198J827833J050928k314724j275655L418077M023272
8026D127496k87055k047368Q03844J620220j880034k795678K220064O048063K904808
8017A0714360k188006k534100l71777r15403k514676p77780K564366K877054J092946
8008G946984J495394L489877K442837k560065p395607q480654n503403n6173M789577
7999c831233N488051K112424o96392O0968J530630K92619j861875j733931o74744
7990F86517j619826l190402k197929M31818J697307K218796M189451N615847K808186
$$ y = [-2067298, -1820255, -2391335, -2297722, 1319884, 7632035, 11444747, 9818804, 6147821, 4520314, 3672393, 1126150, -298646, 3334802, 8689175, 8556184, 2985733, -766232, 196755, 1010313, -1207037, -2602235, -774402, 276526, -2038198, -3313853, 104224, 4127496, 3840441, 1793073, 2596917, 4217137, 2337103, -458575, 1761489, 7809552, 10714360, 8526354, 5992254, 5620477, 4705074, 2190398, 1412618, 3976984, 6854038, 7946984, 9442378, 12932255, 15375092, 12815027, 5419420, -3061234, -8564637, -8620810, -3831233, 1656818, 3769242, 3072850, 3133818, 4664448, 4957067, 3095192, 1361261, 686517, -933309, -4123711, -6321640, -5889822, -4192515, -1973719, 2215732, 7831579, 10639765]
7981A0639765k504055m663841k280143O91865J742458K088409K234629R29125
7973H878212r53984q50093M43145o54331l923071m581316o74401L589736L877995
7964E151892R55390k013812l507960l109390o38537K126263K184647l02498j502886
7955f56891M36794K462122J332155j773749l521197k631094P4744L157154M323633
7946C203671J675731k765585l852512q1029L465446J937224k312085l290755R2049
7937a927845L166069K391784o57951k443971j767288k74164k90733k382568m223481
7928h410148k693548J853325M932328L336639l64484j263880J152519K836771
7920A379522J303936j381307k209909q69275J227094K995734L386830J251650
$$ y = [10639765, 8135710, 3471869, 1191726, 1883591, 3626049, 5714458, 7949087, 8878212, 7924228, 7074135, 7517280, 6862949, 2939878, -1641438, -2315839, 1273897, 5151892, 6107282, 4093470, 585510, -2523880, -3162417, -1036154, 1148493, 845995, -656891, -220097, 2242025, 3574180, 1800431, -1720766, -4351860, -4277116, -1119962, 3203671, 4879402, 2113817, -1738695, -1819724, 1645722, 3582946, 1270861, -2019894, -1927845, 1238224, 3630008, 2972057, 528086, -1239202, -1513366, -1804099, -4186667, -8410148, -11103696, -9250371, -4318043, -981404, -1345888, -2609768, -1457249, 1379522, 2683458, 1302151, -907758, -1777033, -549939, 2445795, 5832625, 7084275]
7912G084275k606583m775044k697108J887659M627905L287766n35592l912046
7904B361232n182828m126156j248708K178280M144627L034723p50971m216432
7896c806233l534087K093195Q020974P739288N44841o326444o069698j135829
7888b473993O17585k244574k966132J774154N548497K368027k955160k266902
7880b598498K322436J988453l345365m294683J657228M748018r39986o681298
$$ y = [7084275, 4477692, -297352, -2994460, -1106801, 3521104, 6808870, 6273278, 2361232, -2821596, -6947752, -8196460, -6018180, -1873553, 1161170, 410199, -3806233, -7340320, -5247125, 2773849, 10513137, 11057978, 4731534, -1338164, -2473993, -1856408, -4100982, -7067114, -5292960, 255537, 2623564, -331596, -2598498, -276062, 1712391, -1632974, -5927657, -4270429, 477589, -462397, -7143695]
$$ [...]
##END NTUPLES=NMR SPECTRUM
##END=
