##TITLE=31Pdec_LR-618-R3-CR18
 CDCl3, 124 sc
 28.06.2021
##JCAMPDX= 6.0         $$ Bruker NMR JCAMP-DX V2.0
##DATA TYPE= NMR SPECTRUM
##DATA CLASS= NTUPLES
##ORIGIN= UXNMR, Bruker Analytische Messtechnik GmbH
##OWNER= root
$$ XWIN-NMR		Version 3.5
$$ Mon Jun 28 12:07:41 2021 Russian Standard Time (UT+4h)  she@DPX200
##.OBSERVE FREQUENCY= 81.013821
##.OBSERVE NUCLEUS= ^31P
##.ACQUISITION MODE= SIMULTANEOUS
##.ACQUISITION SCHEME= undefined
##.AVERAGES= 124
##.DIGITISER RES= 16
##SPECTROMETER/DATA SYSTEM= spect
##.PULSE SEQUENCE= zgpg30
##.SOLVENT NAME= CDCl3
##.SHIFT REFERENCE= (INTERNAL, CDCl3, 0, 248.564)
##AUDIT TRAIL= $$ (NUMBER, WHEN, WHO, WHERE, WHAT)
$$ ##TITLE= Audit trail, XWIN-NMR		Version 3.5
$$ ##JCAMPDX= 5.01
$$ ##ORIGIN= Bruker BioSpin GmbH
$$ ##OWNER= she
$$ F:/spectra/data/she/nmr/P31/1/pdata/1/auditp.txt
$$ ##AUDIT TRAIL=  $$ (NUMBER, WHEN, WHO, WHERE, WHAT)
(   1,<2021-06-28 12:06:16.68 +0400>,<she>,<DPX200>,
      <continue with go, POWCHK disabled, PULCHK disabled
       configuration hash MD5:
       00 E9 B6 7A A2 85 ED C7 34 08 36 98 17 FE 4E 26
       data hash MD5: 32K
       2E 34 B4 8F F4 0D 1D ED E7 6F 6E 27 DD CF 6A A7>)
(   2,<2021-06-28 12:06:21.03 +0400>,<she>,<DPX200>,
      <Start of raw data processing
       efp BC_mod = 2 LB = 1 FT_mod = 6 PKNL = 1 PHC0 = -7950.293 PHC1 = 3395.887 SI = 64K 
       data hash MD5: 64K
       FA 37 BE CC 55 6A 59 33 E3 91 37 6D BC 26 84 C4>)
(   3,<2021-06-28 12:06:57.75 +0400>,<she>,<DPX200>,
      <pk PHC0 = -543.1922 PHC1 = 502.2 
       data hash MD5: 64K
       8B CC 65 C6 70 19 DB 3D EF 3F 2B 1E D9 F8 62 F1>)
(   4,<2021-06-28 12:07:00.96 +0400>,<she>,<DPX200>,
      <abs ABSG = 5 
       data hash MD5: 64K
       AB 70 02 B9 64 54 B1 7A 3D 40 83 89 52 36 5E 70>)
$$ ##END=
$$ 
$$ hash MD5
$$ 28 C7 8E 9C 44 EB DA B4 1B F8 84 BB BB FC DE EB
##$RELAX= 
##$RELAX= 
##$RELAX= 
##$RELAX= 
##$RELAX= 
##$RELAX= 
##$RELAX= 
##$RELAX= 
$$ Bruker specific parameters
$$ --------------------------
##$DU= <F:/spectra>
##$EXPNO= 1
##$NAME= <P31>
##$PROCNO= 1
##$TYPE= <nmr>
##$USER= <she>
##$AMP= (0..31)
100 100 100 100 100 100 100 100 100 100 100 100 100 100 100 100 100 100 
100 100 100 100 100 100 100 100 100 100 100 100 100 100 
##$AQSEQ= 0
##$AQ_mod= 1
##$AUNM= <au_zg>
##$AUTOPOS= <>
##$BF1= 81.014009
##$BF2= 200.13
##$BF3= 200.13
##$BF4= 200.13
##$BF5= 200.13
##$BF6= 200.13
##$BF7= 200.13
##$BF8= 200.13
##$BYTORDA= 1
##$CFDGTYP= 0
##$CFRGTYP= 5
##$CHEMSTR= <none>
##$CNST= (0..31)
1 1 145 1 1 1 1 1 1 1 1 1 1 1 1 1 1 1 1 1 1 1 1 1 1 1 1 1 1 1 1 1 
##$CPDPRG= <waltz16>
##$CPDPRG1= <>
##$CPDPRG2= <waltz16>
##$CPDPRG3= <>
##$CPDPRG4= <mlev>
##$CPDPRG5= <mlev>
##$CPDPRG6= <mlev>
##$CPDPRG7= <mlev>
##$CPDPRG8= <mlev>
##$CPDPRGB= <>
##$CPDPRGT= <>
##$D= (0..31)
0 1 0 0 0 0 0 0 0 0 0 0.03 2e-05 3e-06 0 0 0 0 0 0 0 0 0 0 0 0 0 0 0 0 
0 0 
##$DATE= 1624867413
##$DBL= (0..7)
120 120 120 11 120 120 24 19 
##$DBP= (0..7)
150 150 150 150 150 150 150 150 
##$DBP07= 0
##$DBPNAM0= <>
##$DBPNAM1= <>
$$ [...]
##$SUBNAM3= <"">
##$SUBNAM4= <"">
##$SUBNAM5= <"">
##$SUBNAM6= <"">
##$SUBNAM7= <"">
##$SUBNAM8= <"">
##$SUBNAM9= <"">
##$SW= 501.771253377433
##$SWIBOX= (0..15)
0 1 3 0 0 0 0 0 0 0 0 0 0 0 0 0 
##$SW_h= 40650.406504065
##$TD= 32768
##$TD0= 1
##$TE= 0
##$TE2= 300
##$TE3= 300
##$TEG= 300
##$TL= (0..7)
0 120 53 12 22 120 120 120 
##$TP= (0..7)
150 150 150 150 150 150 150 150 
##$TP07= 0
##$TPNAME0= <>
##$TPNAME1= <>
##$TPNAME2= <>
##$TPNAME3= <>
##$TPNAME4= <>
##$TPNAME5= <>
##$TPNAME6= <>
##$TPNAME7= <>
##$TPOAL= (0..7)
0.5 0.5 0.5 0.5 0.5 0.5 0.5 0.5 
##$TPOFFS= (0..7)
0 0 0 0 0 0 0 0 
##$TUNHIN= 0
##$TUNHOUT= 0
##$TUNXOUT= 0
##$USERA1= <user>
##$USERA2= <user>
##$USERA3= <user>
##$USERA4= <user>
##$USERA5= <user>
##$V9= 5
##$VALIST= <valist>
##$VCLIST= <CCCCCCCCCCCCCCC>
##$VD= 0
##$VDLIST= <DDDDDDDDDDDDDDD>
##$VPLIST= <PPPPPPPPPPPPPPP>
##$VTLIST= <TTTTTTTTTTTTTTT>
##$WBST= 1024
##$WBSW= 4
##$XGAIN= (0..3)
0 0 0 0 
##$XL= 0
##$YL= 0
##$YMAX_a= 9930
##$YMIN_a= -12437
##$ZGOPTNS= <>
##$ZL1= 120
##$ZL2= 120
##$ZL3= 120
##$ZL4= 120
##$ABSF1= 248.5645
##$ABSF2= -253.2056
##$ABSG= 5
##$ABSL= 3
##$ALPHA= 0
##$AQORDER= 0
##$ASSFAC= 0
##$ASSFACI= 0
##$ASSFACX= 0
##$ASSWID= 0
##$AUNMP= <proc_1d>
##$AZFE= 0.1
##$AZFW= 0.5
##$BCFW= 0
##$BC_mod= 2
##$BYTORDP= 0
##$COROFFS= 0
##$CY= -3
##$DATMOD= 1
##$DC= 0
##$DFILT= <>
##$DTYPP= 0
##$F1P= 0
##$F2P= 0
##$FCOR= 1
##$FTSIZE= 65536
##$FT_mod= 6
##$GAMMA= 0
##$GB= 0
##$INTBC= 1
##$INTSCL= 5.30512e-09
##$ISEN= 30
##$LB= 1
##$LEV0= 0
##$LPBIN= 0
##$MAXI= 10000
##$MC2= 0
##$MEAN= 0
##$ME_mod= 0
##$MI= 50
##$NCOEF= 0
##$NC_proc= -9
##$NLEV= 6
##$NOISF1= 182.463
##$NOISF2= 159.3651
##$NSP= 0
##$NTH_PI= 0
##$NZP= 0
##$OFFSET= 248.5645
##$PC= 4
##$PHC0= -8493.485
##$PHC1= 3898.087
##$PH_mod= 1
##$PKNL= yes
##$PPARMOD= 0
##$PSCAL= 0
##$PSIGN= 0
##$REVERSE= no
##$SF= 81.014009
##$SI= 65536
##$SIGF1= 159.3651
##$SIGF2= -187.1042
##$SINO= 113.3802
##$SIOLD= 16384
##$SREGLST= <1H.CDCl3>
##$SSB= 0
##$STSI= 65536
##$STSR= 0
##$SW_p= 40650.406504065
##$SYMM= 0
##$S_DEV= 0
##$TDeff= 32768
##$TDoff= 0
##$TI= <>
##$TILT= no
##$TM1= 0
##$TM2= 0
##$TOPLEV= 0
##$USERP1= <user>
##$USERP2= <user>
##$USERP3= <user>
##$USERP4= <user>
##$USERP5= <user>
##$WDW= 1
##$XDIM= 65536
##$YMAX_p= 364851522
##$YMIN_p= -257580347
$$ End of Bruker specific parameters
$$ ---------------------------------
##NTUPLES= NMR SPECTRUM
##VAR_NAME=  FREQUENCY,     SPECTRUM/REAL,   SPECTRUM/IMAG
##SYMBOL=    X,             R,               I
##VAR_TYPE=  INDEPENDENT,   DEPENDENT,       DEPENDENT
##VAR_FORM=  AFFN,          ASDF,            ASDF
##VAR_DIM=   65536,         65536,           65536
##UNITS=     HZ,            ARBITRARY UNITS, ARBITRARY UNITS
##FACTOR=    0.620285442955139, 1,           1
##FIRST=     20137.2065510759, 0,            0
##LAST=      -20513.1999529892, 0,           0
##MIN=       -20513.1999529892, -257580347,  0
##MAX=       20137.2065510759, 364851522,    0
$$ Real data points
##PAGE= N=1
##DATA TABLE= (X++(R..R)), XYDATA
$$ [...]
$$ plain form
12798 -8588418 -11368668 735583 4803445 -14159904 -39137762 -41064366 -18945742 -1683018
12790 -1683018 -7551570 -20763618 -17168158 2602003 19040744 22318568 20073230 21180949
12782 21180949 24555126 23743942 14087573 -4711781 -26981556 -42223477 -42730794 -30694541
12774 -30694541 -15912549 -7513819 -8429037 -14724922 -18682329 -14783667 -3114812 14288713
12766 14288713 36126961 55664592 58168022 35795119 1887804 -22412925 -33030380
12759 -33030380 -38579487 -34478393 -6174045 36282526 54503921 29627152 -7781655
12752 -7781655 -17119683 377315 13771468 11967804 10787766 17022369 17207005 4734749
12744 4734749 -9329166 -18585801 -30064116 -42821155 -41208814 -20904168 -1022015
$$ packed form
12798h588418k780250J2104251M067862j8963349k4977858j926604K2118624J7262724
12790a683018n868552j3212048L595460J9770161J6438741L277824k245338J107719
12782B1180949L374177q11184r656369j8799354k2269775j5241921n07317J2036253
12774c0694541J4781992Q398730r15218o295885l957407L898662J1668855J7403525
12766A4288713K1838248J9537631K503430k2372903l3907315k4300729j0617455
12759c3030380n549107M101094K8304348M2456571J8221395k4876769l7408807
12752g781655r338028J7496998J3394153j803664j180038O234603J84636j2472256
12744D734749j4063915r256635j1478315j2757039J612341K0304646J9882153
$$ plain form
12737 -1022015 3237960 1855787 9111221 18484666 16469490 7683891 5830404 9151214
12729 9151214 6023561 -940290 1590671 11537612 10535164 -7236156 -24408245 -25180993
12721 -25180993 -14111216 -1777921 12327264 29746450 38781625 27698466 6188004
12714 6188004 -3904041 1554198 5093467 -3145364 -9043169 2808876 22887819 27953774
12706 27953774 12146088 -8466073 -20234838 -24626940 -24303960 -13568361 7950029
12699 7950029 25014923 23262399 8398333 -3580347 -9479947 -18569710 -32674440 -41405663
12691 -41405663 -37682531 -25454001 -11198429 378656 2498021 -7362362 -16144364 -7154565
12683 -7154565 12529247 15528249 -6395100 -26364206 -20603363 -4160918 -7289237 -29995557
$$ packed form
12737a022015M259975j382173P255434R373445k015176q785599j853487L320810
12729I151214l127653o963851K530961R946941j002448j7771320j7172089p72748
12721b5180993J1069777J2333295J4105185J7419186R035175j1083159k1510462
12714F188004j0092045N458239L539269q238831n897805J1852045K0078943N065955
12706B7953774j5807686k0612161j1768765m392102L22980J0735599K1518390
12699G950029J7064894j752524j4864066j1978680n899600r089763j4104730q731223
12691d1405663L723132J2228530J4255572J1577085K119365r860383q782002Q989799
12683g154565J9683812K999002k1923349j9969106N760843J6442445l128319k2706320
$$ plain form
12675 -29995557 -45683194 -41888494 -29179501 -12291455 16029838 46594433 51084844
12668 51084844 23881616 -282725 6329704 20435326 890847 -46330862 -70987345
12661 -70987345 -47140859 -6516868 8202423 -2771692 -8468251 4470734 19469078
12654 19469078 19745045 8705426 -872884 -1952827 6120314 19031485 24845163 11891328
12646 11891328 -13744300 -28828085 -20043863 -2185745 1417816 -9980920 -16706437
12639 -16706437 -9047957 248272 -3238133 -16765628 -29722949 -39972668 -50402265
12632 -50402265 -57645567 -56876085 -53235548 -55286189 -58438310 -48558995 -24790485 -6113705
12624 -6113705 -8143951 -22318866 -26890329 -13268360 7274768 19989241 20372513 11542431
$$ packed form
12675b9995557j5687637L794700J2708993J6888046K8321293L0564595M490411
12668E1084844k7203228k4164341O612429J4105622j9544479m7221709k4656483
12661g0987345K3846486M0623991J4719291j0974115n696559J2938985J4998344
12654A9469078K75967j1039619r578310j079943Q073141J2911171N813678j2953835
12646A1891328k5635628j5083785Q784222J7858118L603561j1398736o725517
12639a6706437P658480R296229l486405j3527495j2957321j0249719j0429597
12632e0402265p243302P69482L640537k050641l152121R879315K3768510J8676780
12624f113705k030246j4174915m571463J3621969K0543128J2714473L83272q830082
$$ plain form
12616 11542431 -2759394 -17757703 -25807948 -21932841 -10696499 -2465037 -1718739 -3503118
12608 -3503118 -3554766 -6126211 -15281865 -22408890 -13000510 12891074 37332893 45578046
12600 45578046 40065339 27780569 7062399 -20508435 -36850804 -25427623 2281579
12593 2281579 18299971 14920942 9421993 11400011 9769662 -790098 -5775319 2682317
12585 2682317 8086585 -2515401 -12702703 -2539630 15601148 14849711 -2980341 -11668503
12577 -11668503 -2605604 7748073 10719939 13876058 13813977 -5398824 -36289872 -43851476
12569 -43851476 -15711104 12518678 5956656 -19430572 -23862498 -2860941 13065022
12562 13065022 8333122 -934229 554115 6700873 7228815 2920998 -2726319 -8992859
$$ packed form
12616A1542431j4301825j4998309q050245L875107J1236342Q231462P46298j784379
12608c503118n1648k571445r155654p127025R408380K5891584K4441819Q245153
12600D5578046n512707j2284770k0718170k7570834j6342369J1423181K7709202
12593B281579J6018392l379029n498949J978018j630349j0559760m985221Q457636
12585B682317N404268j0601986j0187302J0163073J8140778p51437j7830052q688162
12577a1668503R062899J0353677K971866L156119o2081j9212801l0891048p561604
12569d3851476K8140372K8229782o562022k5387228m431926K1001557J5925963
12562A3065022m731900r267351J488344O146758N27942m307817n647317o266540
$$ plain form
12554 -8992859 -10064715 1001964 15365401 13206174 -7240284 -22369775 -14733415 3098684
12546 3098684 7980916 -3056906 -14790675 -16811487 -10448784 480214 11382631 13078494
12538 13078494 300325 -16704987 -21562233 -13720679 -9393643 -17961465 -28945647 -28285267
12530 -28285267 -17728842 -9274113 -7438255 -8097833 -10951580 -19569633 -27947681 -21433705
12522 -21433705 1346443 19199325 13161534 -7049184 -15755220 -5667606 7737211
12515 7737211 14803909 23317935 35399642 34711489 12256719 -11086207 -7868275 18890043
12507 18890043 41297725 43846763 35941453 30141449 27818831 27642305 30072298 29920956
12499 29920956 20489401 8532349 8961251 20547480 24103268 11331740 -1833834 -31010
$$ packed form
12554h992859j071856J1066679J4363437k159227k0446458j5129491P636360J7832099
12546C098684M882232j1037822j1733769k020812O362703J0928998J0902417J695863
12538A3078494j2778169j7005312m857246P841554M327036q567822j0984182O60380
12530b8285267J0556425Q454729J835858o59578k853747q618053q378048O513976
12522b1433705K2780148J7852882o037791k0210718q706036J0087614J3404817
12515G737211P066698Q514026J2081707o88153k2454770k3342926L217932K6758318
12507A8890043K2407682K549038p905310n800004k322618j76526K429993j51342
12499B9920956r431555j1957052M28902J1586229L555788j2771528j3165574J802824
$$ plain form
12491 -31010 9646183 12322869 7211541 932185 -7949128 -21051748 -26626396 -12458853
12483 -12458853 12207841 24634737 17343852 5013594 3276873 13176609 26530973
12476 26530973 34852049 32218554 20186072 11077771 16460015 31064125 37694120 29450176
12468 29450176 17209330 12805651 15136674 17502552 19187967 22170830 22389497 13023536
12460 13023536 -4811463 -21050936 -27541879 -26361240 -25439876 -27790518 -28339198 -22432893
12452 -22432893 -13871115 -9989972 -10754292 -9493485 -4514357 -1633702 -2872817 -2255127
12444 -2255127 1925682 757042 -10643043 -21233371 -18815520 -9884711 -10215184 -19202330
12436 -19202330 -19733011 -4487956 13066887 18497727 14052301 9916712 8730350 6884623
$$ packed form
12491c1010R677193K676686n111328o279356q881313j3102620n574648J4167543
12483a2458853K4666694J2426896p290885j2330258j736721R899736J3354364
12476B6530973Q321076k633495j2032482r108301N382244J4604110O629995q243944
12468B9450176j2240846m403679K331023K365878J685415K982863K18667r365961
12460A3023536j7834999j6239473o490943J180639R21364k350642n48680N906305
12452b2432893Q561778L881143p64320J260807M979128K880655j239115O17690
12444b255127M180809j168640j1400085j0590328K417851Q930809l30473q987146
12436a9202330n30681J5245055J7554843N430840m445426m135589j186362j845727
$$ plain form
12428 6884623 3157420 -1994762 -9502972 -16412991 -13240233 4351256 24158335 26845365
12420 26845365 7740783 -16246857 -22712493 -4062152 27041472 48350405 44454249
12413 44454249 17722941 -13702956 -30189941 -26118865 -12989191 -6832931 -11777470
12406 -11777470 -16897946 -10586354 4388821 15035813 16477151 17815414 25775559 31041269
12398 31041269 20219775 -2963822 -19101640 -15315994 2692598 20526508 27763215
12391 27763215 20204877 412569 -19551412 -24783954 -13191268 1377173 6579969
12384 6579969 5972973 10013227 18572404 20948962 11280792 -3622161 -12542107 -11201044
12376 -11201044 -4726946 -2385506 -10584870 -28044975 -45858717 -53212154 -45387111 -28457047
$$ packed form
12428F884623l727203n152182p508210o910019L172758J7591489J9807079K687030
12420B6845365j9104582k3987640o465636J8650341L1103624K1308933l896156
12413D4454249k6731308l1425897j6486985M071076J3129674O156260m944539
12406a1777470n120476O311592J4975175J0646992J441338J338263P960145N265710
12398C1041269j0821494k3183597j6137818L785646J8008592J7833910P236707
12391B7763215p558338j9792308j9963981n232542J1592686J4568441N202796
12384F579969o06996M040254Q559177K376558r668170j4902953q919946J341063
12376a1201044O474098K341440q199364j7460105j7813742p353437P825043J6930064
$$ plain form
12368 -28457047 -16038560 -17690424 -27968822 -30774895 -19211283 -7239136 -13810227
12361 -13810227 -37347823 -55945332 -53952994 -37693077 -21082018 -7452208 5499373
12354 5499373 12254448 4716548 -11761095 -20073657 -10680770 9796348 30509839 46982238
12346 46982238 56060437 50917305 30794335 10071235 5616081 14921812 17847808 4123753
12338 4123753 -11242771 -8844680 6521804 11700068 -2218848 -18241405 -18691159 -7989361
12330 -7989361 -634422 2193333 9506604 19580749 18185934 -870778 -25514924 -39383401
12322 -39383401 -37927470 -27927685 -17953902 -12084997 -8272247 -1659993 7574163 12818422
12314 12818422 12369593 15527950 27231089 33501077 18501405 -6933454 -13895555 4866366
$$ packed form
12368b8457047J2418487j651864j0278398k806073J1563612J1972147o571091
12361a3810227k3537596j8597509J992338J6259917J6611059J3629810J2951581
12354E499373O755075p537900j6477643q312562R392887K0477118K0713491J6472399
12346D6982238R078199n143132k0122970k0723100m455154R305731K925996j3724055
12338D123753j5366524K398091J5366484N178264j3918916j6022557m49754J0701798
12330g989361P354939K827755P313271J0074145j394815j9056712k4644146j3868477
12322c9383401J455931R999785R973783N868905L812750O612254R234156N244259
12314A2818422m48829L158357J1703139O269988j4999672k5434859o962101J8761921
$$ plain form
12306 4866366 24680916 26031659 20895763 28005494 39845887 34463124 9832733 -13776874
12298 -13776874 -21274420 -15478983 -5169181 3723107 5858725 -151031 -5400073 296903
12290 296903 12838962 18550306 14010124 9167394 10471412 13692746 15347403 18268484
12282 18268484 21943943 19776728 11974282 9877901 19255862 28520150 23647042 8541693
12274 8541693 -514121 2454815 7815429 8654370 12565526 28000954 46747505 51583592
12266 51583592 39925831 27491893 24677657 21900674 8014699 -8130970 -10540120
12259 -10540120 -3110981 -3108783 -9721727 -3300176 19817623 37667199 38519098 39553843
12251 39553843 51599575 51968448 20911990 -15958597 -18401061 6692485 14163497 -10530040
$$ packed form
12306D866366J9814550J350743n135896P109731J1840393n382763k4630391k3609607
12298a3776874p497546N795437J0309802Q892288K135618o009756n249042N696976
12290B96903J2542059N711344m540182m842730J304018L221334J654657K921081
12282A8268484L675459k167215p802446k096381R377961R264288m873108j5105349
12274H541693r055814K968936N360614Q38941L911156J5435428J8746551M836087
12266E1583592j1657761j2433938k814236k776983j3885975j6145669k409150
12259a0540120P429139K198o612944O421551K3117799J7849576Q51899J034745
12251C9553843J2045732L68873l1056458l6870587k442464K5093546P471012k4693537
$$ plain form
12243 -10530040 -31401800 -18579020 11830772 29126072 27801397 17760272 2217503
12236 2217503 -13187153 -12074617 8564978 23896951 13320488 -8836268 -16780171
12229 -16780171 -11412711 -9980636 -11767183 -3407451 10099036 10090644 -2791229 -8876582
12221 -8876582 -2931121 501676 -1900547 5295639 24346150 32128625 14556871 -8891508
12213 -8891508 -12934454 -2171976 68922 -13052265 -27232665 -31145118 -27262445 -20738693
12205 -20738693 -12861743 -6595900 -6759258 -12366364 -17247291 -19530470 -22585111 -25003720
12197 -25003720 -18066961 1858987 23415555 28969813 13108167 -11001009 -24778318
12190 -24778318 -21720270 -9794795 1715192 12150648 23645558 31231703 26875917
$$ packed form
12243a0530040k0871760J2822780L0409792J7295300j324675j0041125j5542769
12236B217503j5404656J112536K0639595J5331973j0576463k2156756p943903
12229a6780171N367460J432075j786547Q359732J3506487q392j2881873o085353
12221h876582N945461L432797k402223P196186J9050511P782475j7571754k3448379
12213h891508m042946J0762478K240898j3121187j4180400l912453L882673O523752
12205b0738693P876950O265843j63358n607106m880927k283179l054641k418609
12197b5003720O936759J9925948K1556568N554258j5861646k4109176j3777309
12190b4778318L058048J1925475J1509987J0435456J1494910P586145m355786
$$ plain form
12183 26875917 12424318 36017 -2935532 -2650435 -8163352 -17713630 -21661823 -16229767
12175 -16229767 -8196047 -6030866 -10698267 -16239986 -16845617 -11906937 -4929638 1196266
12167 1196266 6456411 10909806 12259037 9480063 7396137 12388364 22239088 25156435
12159 25156435 12815835 -7846123 -19895611 -13934799 1547387 8533830 -1716142
12152 -1716142 -19217640 -26701202 -20354042 -14388356 -21545413 -34351363 -34083631 -16608235
12144 -16608235 1433320 5437909 1645589 5078119 15756468 18712422 6395658 -10744981
12136 -10744981 -19645589 -20410759 -19193132 -13724083 767582 13610168 3550400 -31012967
12128 -31012967 -60319872 -56016251 -27823635 -10152952 -15252576 -20678908 -7528562
$$ packed form
12183B6875917j4451599j2388301k971549K85097n512917r550278l948193N432056
12175a6229767Q033720K165181m667401n541719o05631M938680O977299O125904
12167A196266N260145M453395J349231k778974k083926M992227R850724K917347
12159B5156435j2340600k0661958j2049488N960812J5482186O986443j0249972
12152a716142j7501498p483562O347160N965686p157057j2805950K67732J7475396
12144a6608235J8041555M004589l792320L432530J0678349K955954j2316764j7140639
12136a0744981q900608p65170J217627N469049J4491665J2842586j0059768l4563367
12128c1012967k9306905M303621K8192616J7670683n099624n426332J3150346
$$ plain form
12121 -7528562 11413112 15403343 8871186 9520057 14721882 5240362 -19734596 -36123005
12113 -36123005 -29091606 -12843843 -6197364 -5240738 5542587 25778572 38396706 32546132
12105 32546132 15088903 -537904 -8358663 -11643835 -16233016 -23929339 -30467597 -29552898
12097 -29552898 -19389114 -4697829 7172768 11194476 7843141 3376092 3992996 7630789
12089 7630789 6761035 2142179 4534552 15760564 19757444 5866721 -9783162 -5697503
12081 -5697503 9266919 5558245 -23066420 -50107198 -53761893 -39183170 -18699555
12074 -18699555 3230526 16870784 8119179 -13281802 -15452123 6725326 14211736
12067 14211736 -18372030 -56457266 -53802116 -25237524 -25912413 -66907146 -98783243
$$ packed form
12121g528562J8941674L990231o532157O48871N201825r481520k4974958j6388409
12113c6123005P031399J6247763O646479R56626J0783325K0235985J2618134n850574
12105C2546132j7457229j5626807p820759l285172m589181p696323o538258R14699
12097b9552898J0163784J4691285J1870597M021708l351335m467049O16904L637793
12089G630789q69754m618856K392373J1226012L996880j3890723j5649883M085659
12081e697503J4964422l708674k8624665k7040778l654695J4578723K0483615
12074a8699555K1930081J3640258q751605k1400981k170321K2177449P486410
12067A4211736l2583766l8085236K655150K8564592o74889m0994733l1876097
$$ plain form
12060 -98783243 -84038555 -43855126 -18164018 -13175427 -9385823 1794782 11583827
12053 11583827 11675889 2373032 -10541706 -18828836 -18614758 -17104427 -22813256 -29035308
12045 -29035308 -20979985 -441266 12882955 8183522 -3847187 -8959295 -4765968 5043872
12037 5043872 16239005 20758463 14128220 8243041 18286356 34777983 30757463 2136953
12029 2136953 -22623878 -21867411 -6480230 4682518 11263017 18315056 18814381 7588965
12021 7588965 -4704640 -8139087 -7438986 -5059963 8902316 32050479 37602085 11257700
12013 11257700 -19559995 -21665196 -5297127 -5862637 -28057968 -42662721 -34609031 -20236784
12005 -20236784 -14401394 -11175314 -4412845 -1361570 -5730379 -7691588 -690443 7805633
$$ packed form
12060i8783243J4744688M0183429K5691108M988591L789604J1180605R789045
12053A1583827R2062r302857j2914738q287130K14078J510331n708829o222052
12045b9035308Q055323K0538719J3324221m699433j2030709n112108M193327R809840
12037E043872J1195133M519458o630243n885179J0043315J6491627m020520k8620510
12029B136953k4760831P56467J5387181J1162748O580499P052039M99325j1225416
12021G588965j2293605l434447P00101K379023J3962279K3148163N551606k6344385
12013A1257700l0817695k105201J6368069n65510k2195331j4604753Q053690J4372247
12005b0236784N835390L226080O762469L051275m368809j961209P001145Q496076
$$ plain form
11997 7805633 10196192 9421451 9721511 9864986 10514023 15702720 23125481 25848172 26700506
11988 26700506 36207316 51462238 52867796 30897340 3344584 -5379864 5870187
11981 5870187 16346926 10021623 -8823066 -25627490 -32966670 -33891060 -31567272 -23777028
11973 -23777028 -12129639 -8679391 -20579225 -31740915 -18386093 14117084 31131171
11966 31131171 15090217 -9348071 -11655859 3925733 15042677 19373839 28610597
11959 28610597 37750953 31130690 12894817 3018719 6329906 11294688 15084419 22733993
11951 22733993 25930754 12539597 -5166981 -3176602 14033851 18929154 7479210
11944 7479210 4145574 15688632 18990768 5966503 1594477 19558047 35978780 29629163
$$ packed form
11997G805633K390559p74741L00060J43475O49037N188697P422761K722691Q52334
11988B6700506R506810J5254922J405558k1970456k7552756q724448J1250051
11981E870187J0476739o325303j8844689j6804424p339180r24390K323788P790244
11973b3777028J1647389L450248j1899834j1161690J3354822L2503177J7014087
11966C1131171j6040954k4438288k307788J5581592J1116944M331162R236758
11959B8610597R140356o620263j8235873r876098L311187M964782L789731P649574
11951B2733993L196761j3391157j7706578J990379J7210453M895303j1449944
11944G479210l333636J1543058L302136j3024265m372026J7963570J6420733o349617
$$ plain form
11936 29629163 16287769 18219061 27880407 28287849 23792776 22829556 13306205 -14784141
11928 -14784141 -41160402 -39845765 -17393719 892992 8755705 15567549 18531456 7573131
11920 7573131 -10559897 -19198588 -15832823 -7995931 3930772 17949912 18777627 607626
11912 607626 -13033812 -1679276 13649788 -1002636 -35383030 -45087698 -16093659
11905 -16093659 19095988 32916995 33646954 36420155 36956752 28134940 16632019 9474871
11897 9474871 4413067 2723661 10716691 20770666 13330099 -12711396 -33161964 -32101101
11889 -32101101 -21391208 -16346400 -13643850 -6486463 -1098031 -2110883 1153488 16880880
11881 16880880 33042592 33429128 19893409 4366205 -9794102 -23584438 -29790735
$$ packed form
11936B9629163j3341394J931292R661346M07442m495073r63220r523351k8090346
11928a4784141k6376261J314637K2452046J8286711P862713O811844K963907j0958325
11920G573131j8133028q638691L365765P836892J1926703J4019140Q27715j8170001
11912F07626j3641438J1354536J5329064j4652424l4380394r704668K8994039
11905a6093659L5189647J3821007P29959K773201N36597q821812j1502921p157148
11897I474871n061804j689406P993030J0053975p440567k6041495k0450568J060863
11889c2101101J0709893N044808K702550P157387N388432j012852L264371J5727392
11881A6880880J6161712L86536j3535719j5527204j4160307j3790336o206297
$$ plain form
11874 -29790735 -20821488 -2979655 10423604 15233739 15348902 12382038 7850999 9379650
11866 9379650 22089205 37018037 38976126 24652796 5328707 -6345378 -6333537 711992
11858 711992 5614903 1950474 -6420256 -8533934 173916 12682774 20844568 23713231
11850 23713231 22507608 16192281 6774063 -100746 -5471377 -18277003 -39161550 -53359879
11842 -53359879 -49582034 -36852586 -30619959 -29868702 -22714633 -10103035 -6853634 -17901537
11834 -17901537 -29350644 -29396555 -25420722 -30293580 -40380527 -40357953 -27234330 -15708488
11826 -15708488 -16045147 -18914948 -11409991 846182 1316556 -11612457 -22353392 -23021236
11818 -23021236 -24166958 -34384663 -44672294 -43505402 -34416472 -26248728 -17755117 -6306461
$$ packed form
11874b9790735Q969247J7841833J3403259M810135J15163k966864m531039J528651
11866I379650J2709555J4928832J958089j4323330j9324089j1674085J1841P045529
11858G11992M902911l664429q370730k113678Q707850J2508858Q161794K868663
11850B3713231j205623o315327r418218o874809n370631j2805626k0884547j4198329
11842e3359879L777845J2729448O232627P51257P154069J2611598L249401j1047903
11834a7901537j1449107m5911L975833m872858j0086947K2574J3123623J1525842
11826a5708488l36659k869801P504957J2256173M70374j2929013j0740935o67844
11818b3021236j145722j0217705j0287631J166892R088930Q167744Q493611J1448656
$$ plain form
11810 -6306461 -1238051 -11333918 -26468309 -28948509 -17749007 -5930184 -832264 -2924349
11802 -2924349 -14695011 -30467722 -27813069 4780179 39712587 40790537 17517109
11795 17517109 12711041 34436404 41768106 11156446 -23966135 -24578215 -3925004 -2697823
11787 -2697823 -29388472 -57182274 -64986964 -52181612 -24026136 9218771 25993744
11780 25993744 12538010 -15259480 -30122217 -28021991 -24401139 -23719918 -17398198 -8253862
11772 -8253862 -11145009 -27073822 -38431130 -34071563 -21091547 -8497740 3373408
11765 3373408 12901221 12981953 3038726 -7414907 -12438500 -15987152 -20377030 -19021108
11757 -19021108 -6172195 13452818 29099124 33588341 27625539 18806062 15193985 16100777
$$ packed form
11810f306461N068410j0095867j5134391k480200J1199502J1818823N097920k092085
11802b924349j1770662j5772711K654653L2593248L4932408J077950k3273428
11795A7517109m806068K1725363P331702l0611660l5122581o12080K0653211J227181
11787b697823k6690649k7793802p804690J2805352K8155476L3244907J6774973
11780B5993744j3455734k7797490j4862737K100226L620852O81221O321720R144336
11772h253862k891147j5928813j1357308M359567J2980016J2593807J1871148
11765C373408R527813Q0732r943227j0453633n023593l548652m389878J355922
11757a9021108J2848913J9625013J5646306M489217n962802q819477l612077R06792
$$ plain form
11749 16100777 13175406 4568257 -278749 2443843 -321658 -19657136 -43119833 -48662410
11741 -48662410 -34834385 -19281779 -10232891 600959 15614094 22343583 14191040
11734 14191040 3964062 6448289 17624927 20689687 7438559 -12382445 -20137066
11727 -20137066 -5093927 24169897 46008643 47665759 37738920 31367736 29689690 23876759
11719 23876759 13005743 4141310 -1450069 -7605058 -11621866 -8695896 -5618787 -12854525
11711 -12854525 -24195530 -23953270 -15719813 -21893184 -48070707 -69189546 -62234512 -34869335
11703 -34869335 -9027796 7447691 17585095 17934520 3418598 -17519973 -28941099
11696 -28941099 -25207325 -11263441 9006171 31712194 45244642 38748547 18288598
$$ packed form
11749A6100777k925371q607149m847006K722592k765501j9335478k3462697n542577
11741d8662410J3828025J5552606R048888J0833850J5013135O729489q152543
11734A4191040j0226978K484227J1176638L064760j3251128j9821004p754621
11727b0137066J5043139K9263824K1838746J657116r926839o371184j678046n812931
11719B3876759j0871016q864433n591379o154989m016808K925970L077109p235738
11711a2854525j1341005K42260Q233457o173371k6177523k1118839O955034K7365177
11703c4869335K5841539J6475487J0137404L49425j4515922k0938571j1421126
11696b8941099L733774J3943884K0269612K2706023J3532448o496095k0459949
$$ plain form
11689 18288598 2543000 905463 5028965 3275631 -4699647 -10091392 -6096434 4821881
11681 4821881 12008039 6125005 -9557706 -20751476 -19205023 -13541753 -16661377 -26972851
11673 -26972851 -31433616 -24982321 -16505099 -14783475 -18286530 -21508958 -22406122 -19351623
11665 -19351623 -9238142 4880026 11137833 2437919 -11175187 -12493366 2060254
11658 2060254 19675176 28119640 26327052 17685049 3739224 -11117327 -18672749 -17561187
11650 -17561187 -16822253 -21567360 -23868198 -17195482 -10133277 -12170200 -14659964 -4227028
11642 -4227028 10567774 8206282 -11102147 -24102131 -21617227 -20726566 -30268268 -31578277
11634 -31578277 -11403863 10296433 9599462 -3446296 -3938823 5258999 1514470 -15072312
$$ packed form
11689A8288598j5745598j637537M123502j753334p975278n391745L994958J0918315
11681D821881P186158n883034j5682711j1193770J546453N663270l119624j0311474
11673b6972851m460765O451295Q477222J721624l503055l222428q97164L054499
11665a9351623J0113481J4118168O257807q699914j3613106j318179J4553620
11658B060254J7614922Q444464j792588q642003j3945825j4856551p555422J111562
11650a7561187P38934m745107k300838O672716P062205k036923k489764J0432936
11642d227028J4794802k361492j9308429j2999984K484904Q90661r541702j310009
11634c1578277K0174414K1700296o96971j3045758m92527R197822l744529j6586782
$$ plain form
11626 -15072312 -20828497 -10128674 -5825859 -21264628 -39331325 -39811671 -24955022 -6860966
11618 -6860966 9906333 20687928 14859083 -6602405 -21735115 -11849899 13892618
11611 13892618 31308553 30875028 22669735 18195209 18931943 19271611 11866564 -6750666
11603 -6750666 -28942939 -38341051 -26752720 -6345710 1391323 -11501320 -31415881
11596 -31415881 -38456482 -28362007 -17197123 -21098841 -33551303 -32810341 -14266799 -452395
11588 -452395 -8883891 -25741158 -28574242 -20648951 -19093315 -20786890 -10683047 1857446
11580 1857446 -9248993 -39995566 -53045512 -31427721 -2078427 8302552 8067027
11573 8067027 12231196 11123822 -6284627 -23448482 -19879260 -4523672 1904042 359701
$$ packed form
11626a5072312n756185J0699823M302815j5438769j8066697m80346J4856649J8094056
11618f860966J6767299J0781595n828845k1461488j5132710R885216K5742517
11611A3892618J7415935m33525q205293m474526P36734L39668p405047j8617230
11603f750666k2192273r398112J1588331K0407010P737033j2892643j9914561
11596c1415881p040601J0094475J1164884l901718j2452462P40962J8543542J3814404
11588d52395q431496j6857267k833084P925291J555636j693575J0103843J2540493
11580A857446j1106439l0746573j3049946K1617791K9349294J0380979k35525
11573H067027M164169j107374j7408449j7163855L569222J5355588O427714j544341
$$ plain form
11565 359701 1817885 -184875 -14715316 -26289280 -16061653 1168456 -3345212 -22573239
11557 -22573239 -20931907 9431739 35637445 32493345 11840340 -4165769 -9904483
11550 -9904483 -6729626 7000860 24504442 30801776 24460414 19949495 21909769 18906937
11542 18906937 9319341 8513371 20380192 27282600 21273157 19251485 30041120 32524090
11534 32524090 10044533 -15789220 -14475794 5991625 12248616 -2622063 -11848883
11527 -11848883 1519759 22541553 31112608 27563693 23173416 22972210 27395355 37849662
11519 37849662 51264912 57681242 50544388 34284870 18685081 11165805 14603679 24505627
11511 24505627 27954427 15208150 -5595590 -14775951 -4712713 11933188 19480713
$$ packed form
11565C59701J458184k002760j4530441j1573964J0227627J7230109m513668j9228027
11557b2573239J641332L0363646K6205706l144100k0653005j6006109n738714
11550i904483L174857J3730486J7503582O297334o341362m510919J960274l002832
11542A8906937r587596q05970J1866821O902408o009443k021672J0789635K482970
11534C2524090k2479557k5833753J313426K0467419O256991j4870679r226820
11527a1848883J3368642K1021794Q571055l548915m390277k01206M423145J0454307
11519C7849662J3415250O416330p136854j6259518j5599789p519276L437874R901948
11511B4505627L448800j2746277k0803740r180361J0063238J6645901P547525
$$ plain form
11504 19480713 14050889 -1304193 -22710136 -40331807 -41177182 -28002460 -23250580 -39776449
11496 -39776449 -57810790 -49494637 -19895148 -1386862 -7900973 -19528621 -19578711 -21275983
11488 -21275983 -39650308 -56989993 -43596989 -5062083 19315701 7807137 -18070031
11481 -18070031 -27219827 -17624105 -8127104 -7851682 -11547511 -16097942 -22754915 -25305093
11473 -25305093 -12931944 12014934 31425204 31726779 18936215 9150994 10015353 15790663
11465 15790663 16577442 8443498 -3577594 -10381219 -8054125 -2458302 -2048234 -6491846
11457 -6491846 -6917234 948873 8574497 4110005 -11623805 -23981699 -21364542 -9567426
11449 -9567426 -4695502 -12911881 -23449320 -23646271 -13848299 -2050091 8858341 18568159
$$ packed form
11504A9480713n429824j5355082k1405943j7621671q45375J3174722M751880j6525869
11496c9776449j8034341Q316153K9599489J8508286o514111j1627648n0090j697272
11488b1275983j8374325j7339685J3393004L8534906K4377784j1508564k5877168
11481a8070031r149796R595722R497001K75422l695829m550431o656973k550178
11473b5305093J2373149K4946878J9410270L01575j2790564r785221Q64359N775310
11465A5790663P86779q133944j2021092o803625K327094N595823M10068m443612
11457f491846m25388P866107P625624m464492j5733810j2357894K617157J1797116
11449i567426M871924q216379j0537439j96951R797972J1798208J0908432R709818
$$ plain form
11441 18568159 19945308 7093012 -8262451 -5835291 13523892 25079739 16127638
11434 16127638 6253786 16256814 33589940 32090554 15744546 14087960 34781030
11427 34781030 50013267 38813132 16941622 8444549 8195994 -4366762 -26510998
11420 -26510998 -33693838 -18631591 -5034847 -14364333 -36004593 -43193590 -28618044
11413 -28618044 -9633835 -1212195 1671031 10067233 20306419 17988116 86859 -17570467
11405 -17570467 -18601286 -4935294 8156364 11067497 6616814 430969 -6194350 -12019984
11397 -12019984 -12485045 -5890758 1379622 1113439 -7232953 -17021615 -21998420 -19123966
11389 -19123966 -6736348 12814887 28298818 25615175 4045572 -18419415 -22914274
$$ packed form
11441A8568159J377149j2852296j5355463K427160J9359183J1555847q952101
11434A6127638r873852J0003028J7333126j499386j6346008j656586K0693070
11427C4781030J5232237j1200135k1871510q497073k48555j2562756k2144236
11420b6510998p182840J5062247J3596744r329486k1640260p188997J4575546
11413b8618044J8984209Q421640K883226Q396202J0239186k318303j7901257j7657326
11405a7570467j030819J3665992J3091658K911133m450683o185845o625319n825634
11397a2019984m65061O594287P270380k66183q346392r788662m976805K874454
11389a9123966J2387618J9551235J5483931k683643k1569603k2464987m494859
$$ plain form
11382 -22914274 -10715796 736361 1918306 1978961 12294489 28592048 37491104 35138330
11374 35138330 29407424 25646803 20487655 11272943 2783611 471643 2752716 4006149
11366 4006149 1345155 -4504249 -11249934 -14696458 -9338993 6660537 26915313 38836495
11358 38836495 32214671 9039562 -14511608 -20828385 -9023005 4190485 5043510 -2931020
11350 -2931020 -10142580 -15817815 -20654270 -15440372 5326084 25389399 23959515 8791674
11342 8791674 8359347 28758304 43823274 35902672 20766861 17930274 19587147 8506221
11334 8506221 -11764762 -26180318 -32896283 -36027737 -26165004 5854134 42180540 51425073
11326 51425073 29502865 4975334 266257 6421149 2529817 -14581566 -28678851
$$ packed form
11382b2914274J2198478J1452157J181945O0655J0315528J6297559Q899056k352774
11374C5138330n730906l760621n159148r214712q489332k311968K281073J253433
11366D006149k660994n849404o745685l446524N357465J5999530K0254776J1921182
11358C8836495o621824k3175109k3551170o316777J1805380J3213490Q53025p974530
11350b931020p211560n675235m836455N213898K0766456K0063315j429884j5167841
11342H791674m32327K0398957J5064970p920602j5135811k836587J656873j1080926
11334H506221k0270983j4415556o715965l131454R862733L2019138L6326406R244533
11326E1425073k1922208k4527531m709077O154892l891332j7111383j4097285
$$ plain form
11319 -28678851 -24973758 -7137274 5242606 -2074262 -18513024 -18825805 3520316 25883347
11311 25883347 28012902 19254077 19746248 28319056 28881537 18953453 9900571 4480144
11303 4480144 -4084976 -13645519 -14800815 -10146850 -12145637 -21227225 -23816015 -13084086
11295 -13084086 3772632 17877369 23331831 13366445 -10814715 -30999653 -29916812
11288 -29916812 -14257611 -1796063 6838676 20666602 31029527 21745343 3305407
11281 3305407 3941461 24196899 33488485 18208261 20906 -3896028 -5521232 -15844513
11273 -15844513 -21653851 -12733317 -5317846 -15260825 -28932325 -23859272 -2554939 13878448
11265 13878448 12383980 -6944130 -36737920 -59200572 -54606841 -27882285 -8971983
$$ packed form
11319b8678851L705093J7836484J2379880p316868j6438762l12781K2346121K2363031
11311B5883347K129555q758825M92171Q572808N62481r928084r052882n420427
11303D480144q565120r560543j155296M653965j998787r081588k588790J0731929
11295a3084086J6856718J4104737N454462r965386k4181160k0184938J082841
11288b9916812J5659201J2461548Q634739J3827926J0362925r284184j8439936
11281C305407O36054K0255438R291586j5280224j8187355l916934j625204j0323281
11273a5844513n809338Q920534P415471r942979j3671500N073053K1304333J6433387
11265A3878448j494468j9328110k9793790k2462652M593731K6724556J8910302
$$ plain form
11258 -8971983 -12731298 -19263548 -9991748 1132221 -5348209 -19052378 -18911294 -9637661
11250 -9637661 -9918822 -17943086 -17984269 -10967757 -9658965 -11154759 -2459297 11767274
11242 11767274 14315239 5094746 -101308 1674403 -1549926 -10657439 -12956189 -8364690
11234 -8364690 -13976447 -35884164 -56237753 -56962716 -42340369 -30420045 -30867449 -35931338
11226 -35931338 -29085376 -3853645 23652697 29917885 16533510 12013361 30124500
11219 30124500 45454347 30201243 -1967047 -15328958 -2981823 11692399 16941494
11212 16941494 23472120 34247168 35422623 23101993 11880520 9117953 4679906 -5566902
11204 -5566902 -8806474 1495012 10543684 2480697 -17848786 -32904233 -32228863 -18926538
$$ packed form
11258h971983l759315o532250R271800J1123969o480430j3704169J41084R273633
11250i637661k81161q024264m1183P016512J308792j495794Q695462J4226571
11242A1767274K547965r220493n196054J775711l224329r107513k298750M591499
11234h364690n611757k1907717k0353589p24963J4622347J1920324m47404n063889
11226c5931338O845962K5231731K7506342O265188j3384375m520149J8111139
11219C0124500J5329847j5253104l2168290j3361911J2347135J4674222N249095
11212A6941494O530626J0775048J175455j2320630j1221473k762567m438047j0246808
11204e566902l239572J0301486R048672q062987k0329483j5055447O75370J3302325
$$ plain form
11196 -18926538 -5540736 -5208836 -18020444 -28842089 -28771269 -29702996 -40626556 -41471429
11188 -41471429 -8731661 38793641 54380170 27092705 -3094913 -4101687 7909255
11181 7909255 4986660 -5630330 2526246 30896237 54222897 54587115 37128138 17295023
11173 17295023 7401478 11356066 21704275 25789434 20680879 15296677 15200531 16883012
11165 16883012 19900531 29010240 38759352 33393762 10774728 -10338140 -16503333 -16126299
11157 -16126299 -19363343 -20236153 -12943409 -8122987 -15072062 -22286024 -14412725 3194826
11149 3194826 15022914 19367581 22579716 19305864 283531 -25295939 -36235624 -27545240
11141 -27545240 -15364690 -13690229 -20568475 -27631859 -30524663 -28757481 -25066368 -25122559
$$ packed form
11196a8926538J3385802L31900j2811608j0821645P0820r31727j0923560q44873
11188d1471429L2739768M7525302J5586529k7287465l0187618j006774J2010942
11181G909255k922595j0616990Q156576K8369991K3326660L64218j7458977j9833115
11173A7295023r893545L954588J0348209M085159n108555n384202r6146J682481
11165A6883012L017519R109709R749112n365590k2619034k1112868o165193L77034
11157a6126299l237044q72810P292744M820422o949075p213962P873299J7607551
11149C194826J1828088M344667L212135l273852j9022333k5579470j0939685Q690384
11141b7545240J2180550J674461o878246p063384k892804J767182L691113n6191
$$ plain form
11133 -25122559 -30675506 -35734769 -36732302 -41124116 -56090645 -73090559 -74645194 -55058940
11125 -55058940 -26424077 -5967702 -2935549 -13569900 -23795030 -22753753 -17658709
11118 -17658709 -25413492 -44469455 -49918097 -27867883 286371 5165078 -10245397
11111 -10245397 -17643963 -4016903 15638343 23816046 19512024 11126196 6512932 11142379
11103 11142379 22511228 26931500 15291995 -119905 436453 15740642 26345644
11096 26345644 24434301 21213526 22758205 19741340 7713633 -2376123 -3950146 -7185063
11088 -7185063 -18598767 -23486085 -5126093 28151425 51137098 51647373 38775556 25666974
11080 25666974 17567524 14872820 14774668 8867950 -9456874 -32080529 -39804672 -23776253
$$ packed form
11133b5122559n552947n059263r97533m391814j4966529j6999914j554635J9586254
11125e5058940K8634863K0456375L032153j0634351j0225130J041277N095044
11118a7658709p754783j9055963n448642K2050214K8154254M878707j5410475
11111a0245397p398566J3627060J9655246Q177703m304022q385828m613264M629447
11103A1142379J1368849M420272j1639505j5411900N56358J5304189J0605002
11096B6345644j911343l220775J544679l016865j2027707j0089756j574023l234917
11088g185063j1413704m887318J8359992L3277518K2985673N10275j2871817j3108582
11080B5666974q099450k694704r8152n906718j8324824k2623655p724143J6028419
$$ plain form
11072 -23776253 2764874 18723251 16943736 7714430 4140205 9440895 18025596 24353573
11064 24353573 28538496 34516924 44001558 52725966 53844355 45746030 34440854 26113447
11056 26113447 20096862 13670653 10692380 16266128 22433815 12075116 -15246446 -33128656
11048 -33128656 -18556995 14125648 27094653 6288581 -23342993 -34252157 -29938783
11041 -29938783 -31119992 -41990661 -46288431 -32210947 -8084018 7286990 3082481
11034 3082481 -14146084 -26130232 -20822656 -6373522 -1131039 -8233815 -10713230 2716869
11026 2716869 19054872 18786069 2953013 -10455580 -11025495 -3487470 5343318 13438247
11018 13438247 18102446 15845160 9019908 3307565 -1888154 -11718891 -24118490 -28555576
$$ packed form
11072b3776253K6541127J5958377j779515r229306l574225N300690Q584701O327977
11064B4353573M184923N978428R484634Q724408J118389q098325j1305176q327407
11056B6113447o016585o426209k978273N573748O167687j0358699k7321562j7882210
11048c3128656J4571661L2682643J2969005k0806072k9631574j0909164M313374
11041b9938783j181209j0870669m297770J4077484K4126929J5371008m204509
11034C082481j7228565j1984148N307576J4449134N242483p102776k479415J3430099
11026B716869J6338003k68803j5833056j3408593n69915P538025Q830788Q094929
11018A3438247M664199k257286o825252n712343n195719r830737j2399599m437086
$$ plain form
11010 -28555576 -18510455 1137009 19915151 29481067 26473136 14232404 1482959
11003 1482959 -6107996 -11492328 -17935236 -19143273 -6902011 13336530 25217656 21252915
10995 21252915 10791933 6006638 8228328 11601335 13027424 13681548 15394885 19727884
10987 19727884 27371003 35288163 37396462 31115978 20667231 10431715 -2650636 -24170348
10979 -24170348 -48463955 -56867425 -38118964 -8085271 3398197 -10224283 -21492543
10972 -21492543 -6391284 20241981 25536460 6348911 -8998393 -5731362 -1072095
10965 -1072095 -10179893 -21478852 -21282260 -18748757 -25799759 -32213143 -24468448 -13288417
10957 -13288417 -16223649 -24986214 -18268316 654937 8210848 -835989 -8078773 -6226964
$$ packed form
11010b8555576J0045121J9647464J8778142R565916l007931j2240732j2749445
11003A482959p590955n384332o442908j208037J2241262K0238541J1881126l964741
10995B1252915j0460982m785295K221690L373007J426089O54124J713337M332999
10987A9727884P643119P917160K108299o280484j0448747j0235516j3082351k1519712
10979b4170348k4293607q403470J8748461L0033693J1483468j3622480j1268260
10972b1492543J5101259K6633265N294479j9187549j5347304L267031M659267
10965a072095r107798j1298959J96592K533503p051002o413384P744695J1180031
10957a3288417k935232q762565O717898J8923253P555911r046837p242784J851809
$$ plain form
10949 -6226964 -11026113 -31421510 -51808840 -54468362 -41772272 -26685440 -15740452
10942 -15740452 -9396838 -7125143 -5922035 -3549716 -5234946 -16103549 -27735067 -26448379
10934 -26448379 -14317442 -6052860 -5828392 -5392072 -4595710 -11968465 -22542064 -19214569
10926 -19214569 -2938503 2553240 -12938007 -27560565 -19704585 671009 9863173
10919 9863173 4020483 -2661952 -1912061 3030597 8247601 12292466 14084922 16057396
10911 16057396 22129726 27656918 23079012 12317725 11293193 20414427 17641395 -8166607
10903 -8166607 -35297085 -37554914 -19376275 -4204356 -839924 -1068973 -299802 -43245
10895 -43245 3125621 12304854 19674358 17838793 14891341 20966150 27179516 17466417
$$ packed form
10949f226964m799149k0395397k0387330k659522J2696090J5086832J0944988
10942a5740452O343614K271695J203108K372319j685230j0868603j1631518J286688
10934b6448379J2130937Q264582K24468M36320P96362p372755j0573599L327495
10926a9214569J6276066N491743j5491247j4622558P855980K0375594R192164
10919I863173n842690o682435P49891M942658N217004M044865J792456J972474
10911A6057396O072330N527192m577906j0761287j024532R121234k773032k5808002
10903h166607k7130478k257829J8178639J5171919L364432k29049P69171K56557
10895d3245L168866R179233P369504j835565k947452O074809O213366r713099
$$ plain form
10887 17466417 -3897963 -16783033 -14291733 -8000508 -6014148 -5313323 -5891714 -13095735
10879 -13095735 -23348913 -25047486 -17278691 -11815009 -12650410 -9060893 5351781 20597916
10871 20597916 24785082 20468076 19291527 26759416 37238202 40169171 29980488 13162354
10863 13162354 2756392 1015082 -6071092 -27889041 -49644069 -47103418 -17494359
10856 -17494359 17631022 37889102 39034508 25395305 3477200 -16095525 -24565760
10849 -24565760 -24927949 -24908429 -22388934 -11616940 -416153 -2762945 -14590118 -17015133
10841 -17015133 -6335037 -426141 -10043777 -24118477 -31203205 -35055851 -38215193 -30142772
10833 -30142772 -6822897 14207290 15280135 2586230 -7240600 -12762317 -21980330 -30015902
$$ packed form
10887A7466417k1364380j2885070K491300O291225J986360P00825n78391p204021
10879a3095735j0253178j698573P768795N463682q35401L589517J4412674J5246135
10871B0597916M187166m317006j176549P467889J0478786K930969j0188683j6818134
10863A3162354j0405962j741310p086174k1817949k1755028K540651K9609059
10856a7494359L5125381K0258080J145406j3639203k1918105j9572725q470235
10849b4565760l62189J9520K519495J0771994J1200787k346792j1827173k425015
10841a7015133J0680096N908896r617636j4074700p084728l852646l159342Q072421
10833c0142772K3319875K1030187J072845j2693905r826830n521717r218013q035572
$$ plain form
10825 -30015902 -22904384 -1247215 17172654 19838504 12314543 6887106 7050054 4918462
10817 4918462 -9897598 -36882990 -58458971 -54924282 -29601175 -8589892 -8601450 -17477121
10809 -17477121 -17202968 -12245553 -17786798 -30353830 -32021348 -20011110 -10749943 -13691332
10801 -13691332 -20295233 -21984702 -21029311 -18538579 -8746278 6881899 14654342 7717652
10793 7717652 -1306083 2968161 17799496 27574634 23352868 8878307 -7041913 -16037895
10785 -16037895 -12757080 -37112 10651350 9477802 -2482317 -16425317 -24456305
10778 -24456305 -23672318 -17466389 -14418442 -18938467 -22121541 -11892774 6159051 12311203
10770 12311203 2465556 -2958135 8291247 16611395 -350783 -28713361 -35247845 -16739928
$$ packed form
10825c0015902P111518K1657169J8419869K665850p523961n427437J62948k131592
10817D918462j4816060k6985392k1575981L534689K5323107K1011283j1558q875671
10809a7477121K74153M957415n541245j2567032j667518J2010238R261167k941389
10801a3691332o603901j689469R55391K490732R792301J5628177P772443o936690
10793G717652r023735M274244J4831335R775138m221766j4474561j5920220q995982
10785a6037895L280815J2719968J0688462j173548j1960119j3943000q030988
10778b4456305P83987O205929L047947m520025l183074J0228767J8051825O152152
10770A2311203r845647n423691J1249382Q320148j6962178k8362578o534484J8507917
$$ plain form
10762 -16739928 -2252758 -4670970 -2183450 20168381 40253622 32121559 7994217
10755 7994217 120907 13300347 23158029 16027176 3291624 -4129158 -9313876 -11628012
10747 -11628012 247282 26062524 44542303 40981789 29164974 29623572 38184690 34679032
10739 34679032 15254775 -3615285 -10498824 -9466806 -4632253 6775925 20234221
10732 20234221 19808960 -1004919 -25918519 -35090222 -29971967 -27328467 -34186702 -41722711
10724 -41722711 -42077477 -38173624 -34376286 -28038431 -15659660 -762407 9511504 11713031
10716 11713031 7097342 -89271 -2814670 4348208 16948140 22582175 16398658 8784157
10708 8784157 10433000 15537357 10308239 -4910367 -14534913 -9575739 1294833 5805904
$$ packed form
10762a6739928J4487170k418212K487520K2351831K0085241q132063k4127342
10755G994217p873310J3179440R857682p130853j2735552p420782n184718k314136
10747a1628012J1875294K5815242J8479779l560514j1816815M58598Q561118l505658
10739C4679032j9424257j8870060o883539J032018M834553J1408178J3458296
10732B0234221m25261k0813879k4913600r171703N118255K643500o858235p536009
10724d1722711l54766L903853L797338O337855J2378771J4897253J0273911K201527
10716A1713031m615689p186613k725399P162878J2599932N634035o183517p614501
10708H784157J648843N104357n229118j5218606r624546M959174J0870572M511071
$$ plain form
10700 5805904 2108920 -6319933 -18813331 -32592337 -38682530 -32142968 -19861377 -9894632
10692 -9894632 -630038 9906083 13213102 3253328 -6641520 1862149 22816766 30443034
10684 30443034 15272950 -3423916 -7690045 -4241987 -6369392 -9634055 -2742463 8776214
10676 8776214 9271269 -1668158 -8923850 -6170557 -3791928 -9931584 -18238307 -19713470
10668 -19713470 -14926036 -8036367 1491472 13674256 22239952 22312114 18348127 16355458
10660 16355458 12834200 710383 -16533159 -27101721 -27356017 -25586736 -26800205 -24668224
10652 -24668224 -14891918 -6096633 -6376002 -6916138 5187794 20718195 14431939 -17121937
10644 -17121937 -42140451 -31207225 4064488 26257717 18501175 -1790567 -11946526
$$ packed form
10700E805904l696984q428853j2493398j3779006o090193O539562J2281591R966745
10692i894632R264594J0536121L307019r959774r894848Q503669K0954617P626268
10684C0443034j5170084j8696866m266129L448058k127405l264663O891592J1518677
10676H776214M95055j0939427p255692K753293K378629o139656q306723j475163
10668a9713470M787434O889669R527839J2182784Q565696P2162l963987j992669
10660A6355458l521258j2123817j7243542j0568562k54296J769281j213469K131981
10652b4668224R776306Q795285k79369n40136J2103932J5530401o286256l1553876
10644a7121937k5018514J0933226L5271713K2193229p756542k0291742j0155959
$$ plain form
10637 -11946526 -8165321 1278412 9816420 12948695 7574651 -1386288 -2900955 5300680
10629 5300680 12179851 9940204 6936614 16154646 36070315 50430599 45288216 22731507
10621 22731507 -342902 -6546758 5316563 18731776 18784044 8564362 -1557365 -13762570
10613 -13762570 -36097811 -59570255 -62763528 -42573115 -20238321 -10469961 -4854713
10606 -4854713 5108833 10047283 1728127 -9444925 -12469632 -13389444 -16920312 -9372290
10598 -9372290 16478359 35676187 19319214 -20677846 -44264719 -36225820 -18133688
10591 -18133688 -9251500 -5313788 -127401 353658 -4284179 -395595 17912024 35800939
10583 35800939 37938818 27497146 15280135 3424951 -9745206 -19820249 -21623393
$$ packed form
10637a1946526L781205R443733Q538008L132275n374044q960939j514667Q201635
10629E300680O879171k239647l003590R218032J9915669J4360284n142383k2556709
10621B2731507k3074409o203856J1863321J3415213N2268j0219682j0121727j2205205
10613a3762570k2335241k3472444l193273K0190413K2334794R768360N615248
10606d854713R963546M938450q319156j1173052l024707r19812l530868P548022
10598i372290K5850649J9197828j6356973l9997060k3586873Q038899J8092132
10591a8133688Q882188L937712N186387M81059m637837L888584J8307619J7888915
10583C5800939K137879j0441672j2217011j1855184j3170157j0075043j803144
$$ plain form
10576 -21623393 -16972890 -10150065 -2702962 2524065 284273 -9314268 -18778044 -22148258
10568 -22148258 -19782231 -13774102 -6232722 -1308861 -74488 4473405 16590538 25331852
10560 25331852 17061556 -1622928 -9807310 -1304045 8980055 9119374 3124374 -2971454
10552 -2971454 -9582733 -12642791 -1696098 23126052 46246614 55425153 53062428 45069189
10544 45069189 32841815 20241527 13627313 10873519 4573989 -2496050 -2131336 -1083443
10536 -1083443 -15173990 -40373049 -53295551 -45404188 -31967027 -21152666 -2494016
10529 -2494016 23994075 37309010 29548003 22370801 31147484 39503877 30427879 17164004
10521 17164004 19324841 30669221 34745812 31860057 27028782 12626012 -11988254 -24995326
$$ packed form
10576b1623393M650503O822825P447103N227027k239792r598541r463776l370214
10568b2148258K366027O008129P541380M923861J234373M547893J2117133Q741314
10560B5331852q270296j8684484q184382Q503265J0284100J39319n995000o095828
10552b971454o611279l060058J0946693K4822150K3120562R178539k362725p993239
10544D5069189j2227374j2600288o614214k753794o299530p070039L64714J047893
10536a083443j4090547k5199059j2922502P891363J3437161J0814361J8658650
10529b494016K6488091J3314935p761007p177202Q776683Q356393r075998j3263875
10521A7164004K160837J1344380M076591k885755m831275j4402770k4614266j3007072
$$ plain form
10513 -24995326 -12972901 3316468 974891 -8899397 -6136045 723886 -4438887 -7766282
10505 -7766282 12975563 45867137 61172243 55278351 43428597 27338858 7674703
10498 7674703 6651884 34461078 55970703 40183567 18150835 34021025 65979731
10491 65979731 68840602 68961157 118972443 166687366 89705613 -108987069 -257580347
10484 -257580347 -231516375 -114241684 -60065222 -82128266 -83050026 -36713867 -14159134
10477 -14159134 -45228288 -70955151 -49656702 -17729980 -15860051 -27775647 -26893593
10470 -26893593 -26370286 -44908234 -64112846 -55535292 -23360008 6255584 17925851
10463 17925851 11572228 -5826476 -19889250 -18897140 -12234752 -19381310 -37600552 -44643255
$$ packed form
10513b4995326J2022425J6289369k341577r874288K763352O859931n162773l327395
10505g766282K0741845L2891574J5305106n893892j1849754j6089739j9664155
10498G674703j022819K7809194K1509625j5787136k2032732J5870190L1958706
10491F5979731K860871J20555N0011286M7714923p6981753j98692682j48593278
10484b57580347K6063972J17274691N4176462k2063044r21760M6336159K2554733
10477a4159134l1069154k5726863K1298449L1926722J869929j1915596Q82054
10470b6893593N23307j8537948j9204612Q577554L2175284K9615592J1670267
10463A7925851o353623j7398704j4062774R92110O662388p146558j8219242p042703
$$ plain form
10455 -44643255 -35391432 -27207845 -25827584 -18437784 -6486128 -9430513 -25142402 -24043940
10447 -24043940 876602 15158976 -4126539 -31296984 -34631339 -23881822 -23866970 -29238469
10439 -29238469 -22227620 -13011975 -22335023 -38678589 -32920009 -7290187 9072282 9392763
10431 9392763 15388992 32703383 38443690 22497819 7741726 14115613 29083335 30422139
10423 30422139 17576421 3916042 -5409915 -11871942 -13174320 -9380759 -8734033 -14392871
10415 -14392871 -15850740 -6589275 391124 -9661636 -27901586 -31698542 -16361373 -480190
10407 -480190 482827 -9102054 -17636903 -22453567 -27459064 -33785588 -38945654 -39704712 -32335639
10398 -32335639 -16195634 106600 3800285 -6405283 -17662675 -21604879 -26558154
$$ packed form
10455d4643255R251823Q183587J380261P389800J1951656k944385j5711889J098462
10447b4043940K4920542J4282374j9285515k7170445l334355J0749517J4852n371499
10439b9238469P010849R215645r323048j6343566N758580K5629822J6362469L20481
10431I392763N996229J7314391N740307j5945871j4756093O373887J4967722J338804
10423C0422139j2845718j3660379r325957o462027j302378L793561O46726n658838
10415a4392871j457869R261465O980399j0052760j8239950l796956J5337169J5881183
10407d80190R63017r584881q534849m816664n005497o326524n160066p59058P369073
10398c2335639J6140005J6302234L693685j0205568j1257392l942204m953275
$$ plain form
10391 -26558154 -41983121 -59264262 -61993734 -50977221 -42810914 -43555224 -40771887 -26239921
10383 -26239921 -10134207 -3762057 -2533876 2203170 6627142 3530856 -2466914 -4598582
10375 -4598582 -10199043 -28980530 -50830230 -55502598 -42414350 -30351274 -27132467 -21356777
10367 -21356777 -8772331 -4962564 -21912155 -49395756 -69841064 -76325776 -67147256
10360 -67147256 -40647079 -7951645 6629243 -5865394 -24165455 -26148503 -18449381
10353 -18449381 -18785844 -24197051 -20627184 -12416215 -14463666 -20937930 -10897673 14928194
10345 14928194 31109537 25686331 14895678 12094092 8051989 -4887143 -12784896 -3037753
10337 -3037753 10139429 4290470 -17906779 -34126652 -35462718 -34934769 -43811547 -55837881
$$ packed form
10391b6558154j5424967j7281141k729472J1016513Q166307p44310K783337J4531966
10383b6239921J6105714O372150J228181M737046M423972l096286n997770k131668
10375d598582n600461j8781487k1849700m672368J3088248J2063076L218807N775690
10367b1356777J2584446L809767j6949591k7483601k0445308o484712R178520
10360f7147256K6500177L2695434J4580888j2494637j8300061j983048P699122
10353a8449381l36463n411207L569867Q210969k047451o474264J0040257K5825867
10345A4928194J6181343n423206j0790653k801586m042103j2939132p897753R747143
10337c037753J3177182n848959k2197249j6219873j336066N27949q876778j2026334
$$ plain form
10329 -55837881 -58908187 -51444540 -41602145 -35464310 -30630917 -21110140 -6851279 4692969
10321 4692969 9189193 12897156 21524448 25604028 10840044 -16336505 -30341294 -20178608
10313 -20178608 -5427935 -7439029 -19538897 -21711973 -12676970 -6589576 -4106597 9849289
10305 9849289 37133795 55878750 48274993 25173340 11591669 14872427 18005847 3336233
10297 3336233 -24651478 -43415680 -37807117 -17930928 -7315248 -13846519 -20356264 -8437585
10289 -8437585 16575225 33361731 31767184 20837549 11793215 5024171 -3731261 -13887445
10281 -13887445 -21393299 -24342528 -23754635 -21349996 -17513963 -10079678 2655103 15730398
10273 15730398 19660484 13376973 8459471 13177512 19515457 16463961 9111320 10065887
$$ packed form
10329e5837881l070306P463647R842395O137835M833393R520777J4258861J1544248
10321D692969M496224L707963Q627292M079580j4763984k7176549j4004789J0162686
10313b0178608J4750673k011094j2099868k173076R035003O087394K482979J3955886
10305I849289K7284506J8744955p603757k3101653j3581671L280758L133420j4669614
10297C336233k7987711j8764202N608563J9876189J0615680o531271o509745J1918679
10289h437585K5012810J6786506j594547j0929635r044334o769044q755432j0156184
10281a3887445p505854k949229N87893K404639L836033P434285J2734781J3075295
10273A5730398L930086o283511m917502M718041O337945l051496p352641R54567
$$ plain form
10265 10065887 16709254 14773126 3698771 -1195299 4102984 2689022 -15804500 -34698589
10257 -34698589 -31573876 -9752304 5811584 -1289040 -24330642 -45306835 -51559176
10250 -51559176 -42829975 -29552165 -23385427 -25778291 -28689619 -27524097 -25715867 -24062869
10242 -24062869 -16618646 -3787515 1692243 -8034821 -22105972 -26105958 -22965803 -24920097
10234 -24920097 -30773617 -27300723 -11310014 5447018 14818000 21549902 30260561 35518839
10226 35518839 31366141 21943062 15595993 13610112 10829629 4967418 623384 3236866
10218 3236866 9649225 6691675 -15561297 -47484956 -64679398 -55398691 -36120973 -30737983
10210 -30737983 -40914218 -49312400 -46785858 -40190377 -34628284 -26055309 -15297163 -12275792
$$ packed form
10265A0065887O643367j936128j1074355m894070N298283j413962j8493522j8894089
10257c4698589L124713K1821572J5563888p100624k3041602k0976193o252341
10250e1559176Q729201J3277810O166738k392864k911328J165522J808230J652998
10242b4062869P444223J2831131N479758r727064j4071151l999986L140155j954294
10234b4920097n853520L472894J5990709J6757032R370982O731902Q710659N258278
10226C5518839m152698r423079o347069j985881k780483n862211m344034K613482
10218C236866O412359k957550k2252972l1923659j7194442R280707J9277718N382990
10210c0737983j0176235q398182K526542O595481N562093Q572975J0758146L021371
$$ plain form
10202 -12275792 -18657105 -21319642 -13047936 -6275320 -13703267 -26485182 -26707528 -13788645
10194 -13788645 -2521221 290550 626355 799782 -4253661 -12307435 -12482734 -4371748
10186 -4371748 -2996881 -15515899 -26891324 -21853378 -10113165 -12601312 -28459902 -35096859
10178 -35096859 -21818626 -4825833 -2288530 -10217808 -13305900 -7145037 3023729 15834295
10170 15834295 31098575 40200828 35600286 26666409 29149247 39948744 40953799 30113422
10162 30113422 27844693 44314539 60415939 55622049 38281729 29727452 30420810 23490936
10154 23490936 5182285 -11091645 -19822071 -29871507 -41472820 -37680787 -9708242
10147 -9708242 23698795 34939037 17698755 -11191400 -33195128 -41636634 -38522578
$$ packed form
10202a2275792o381313k662537Q271706O772616p427947j2781915k22346J2918883
10194a3788645J1267424K811771L35805J73427n053443q053774j75299Q110986
10186d371748J374867j2519018j1375425N037946J1740213k488147j5858590o636957
10178c5096859J3278233J6992793K537303p929278l088092O160863J0168766J2810566
10170A5834295J5264280R102253m600542q933877K482838J0799497J005055j0840377
10162C0113422k268729J6469846J6101400m793890j7340320q554277O93358o929874
10154B3490936j8308651j6273930q730426j0049436j1601313L792033K7972545
10147i708242L3407037J1240242j7240282k8890155k2003728q441506L114056
$$ plain form
10140 -38522578 -28349210 -15966275 -5044696 3032229 8009630 10243404 12179623 17407021
10132 17407021 26468259 35493715 39780239 37381596 30229630 23668441 22098347 21869770
10124 21869770 13216054 -4607576 -15489462 -4186385 20749872 34311316 26286212
10117 26286212 12701747 12052559 21526895 23945407 10388311 -11375298 -26142521 -23651442
10109 -23651442 -5837560 13895638 21187882 12493345 -4981481 -21716151 -28941364
10102 -28941364 -19217398 4321216 22363527 17385373 -3158777 -16335343 -15630174 -14744395
10094 -14744395 -18467550 -13681939 2778816 12292302 4720707 -3063816 2092166 3307024
10086 3307024 -16284894 -36883178 -28026469 1178517 13613482 775645 -9175684
$$ packed form
10140c8522578J0173368J2382935J0921579Q076925M977401K233774J936219N227398
10132A7407021R061238R025456M286524k398643p151966o561189j570094k28577
10124B1869770q653716j7823630j0881886J1303077K4936257J3561444q025104
10117B6286212j3584465o49188R474336K418512j3557096k1763609j4767223K491079
10109b3651442J7813882J9733198P292244q694537j7474826j6734670p225213
10102b8941364R723966K3538614J8042311m978154k0544150j3176566P05169Q85779
10094a4744395l723155M785611J6460755R513486p571595p784523N155982J214858
10086C307024j9591918k0598284Q856709K9204986J2434965j2837837r951329
$$ plain form
10079 -9175684 -1712656 3517049 -7154995 -15751101 -5412924 9791974 9627233 -864570
10071 -864570 -7669468 -15139630 -30844463 -39836129 -24273806 1535270 7447558 -5353527
10063 -5353527 -6020201 14998267 29928569 19407466 3200700 5177728 12676386 -1019070
10055 -1019070 -28664793 -35766094 -12493467 11270156 9485133 -6826775 -13044703 -7254641
10047 -7254641 -4312114 -6952940 -4631436 4160318 9201813 8103098 9771974 15600245
10039 15600245 15469960 8107480 6617299 13832834 11172933 -11361864 -30079745 -15736760
10031 -15736760 21784846 42515163 28819970 3665844 -7688759 -8909712 -13380285
10024 -13380285 -15412223 -407565 27994197 50216043 55161479 47092436 32210426
$$ packed form
10079i175684P463028N229705j0672044q596106J0338177J5204898j64741j0491803
10071h64570o804898p470162j5704833q991666J5562323K5809076N912288j2801085
10063e353527o66674K1018468J4930302j0521103j6206766J977028P498658j3695456
10055a019070k7645723p101301K3272627K3763623j785023j6311908o217928N790062
10047g254641K942527k640826K321504Q791754N041495j098715J668876N828271
10039A5600245j30285p362480j490181P215535k659901k2534797j8717881J4342985
10031a5736760L7521606K0730317j3695193k5154126j1354603j220953m470573
10024a3380285k031938J5004658K8401762K2221846M945436q069043j4882010
$$ plain form
10017 32210426 13558096 -2025039 -6226941 -698766 4263671 3899745 2617067 2819308
10009 2819308 162493 -7691079 -16388646 -21787851 -24073367 -22946417 -16513863 -7370934
10001 -7370934 -2076152 -1876658 -1336827 1684108 3063138 1731211 2213237 4512167 2675153
9992 2675153 -1305897 4945518 23540915 35684056 25211915 3443432 -5270157 3140316
9984 3140316 10252395 3366106 -10791189 -20524071 -21524042 -12992231 3693647 19261154
9976 19261154 23007804 18004845 16440489 17579661 6679262 -18824928 -38871973 -35462155
9968 -35462155 -13730679 10116577 27182653 32592798 20195255 -5117551 -22769995
9961 -22769995 -19307614 -5504223 2398790 5966573 13665436 19872327 14332065 2577349
$$ packed form
10017C2210426j8652330j5583135m201902N528175M962437l63926j282678K02241
10009B819308k656815p853572q697567n399205k285516J126950O432554R142929
10001g370934N294782J99494N39831L020935J379030j331927M82026K298930j837014
9992B675153l981050O251415J8595397J2143141j0472141k1768483q713589Q410473
9984C140316P112079o886289j4157295r732882r99971Q531811J6685878J5567507
9976A9261154L746650n002959j564356J139172j0900399k5504190k0047045L409818
9968c5462155K1731476K3847256J7066076N410145j2397543k5312806j7652444
9961b2769995L462381J3803391P903013L567783P698863O206891n540262j1754716
$$ plain form
9953 2577349 -3492777 -7260298 -18712057 -31446313 -30894048 -20249227 -14991774 -15301240
9945 -15301240 -8198217 4609721 6343744 -5979079 -16139388 -14717549 -8163320 -681635
9937 -681635 8874290 10633573 -8647208 -37065270 -44617009 -26204586 -10186335 -15222963
9929 -15222963 -27030480 -29308944 -28049948 -29259749 -20936658 2704132 23140899 23890125
9921 23890125 13927367 7315097 2221661 -2059472 7119034 29292450 37694469 17762841
9913 17762841 -4945401 -2744959 11020503 7370804 -10006238 -15352768 -4464141 5316359
9905 5316359 7597331 9708872 13018412 16308133 26381871 41640142 42325584 21904640
9897 21904640 5872072 10811705 12081028 -11656900 -31398049 -11617610 25155994
$$ packed form
9953B577349o070126l767521j1451759j2734256N52265J0644821N257453l09466
9945a5301240P103023J2807938J734023j2322823j0160309J421839O554229P481685
9937f81635R555925J759283j9280781k8418062p551739J8412423J6018251n036628
9929a5222963j1807517k278464J258996j209801Q323091K3640790K0436767P49226
9921B3890125r962758o612270n093436m281133R178506K2173416Q402019j9931628
9913A7762841k2708242K200442J3765462l649699j7377042n346530J0888627R780500
9905E316359K280972K111541L309540L289721J0073738J5258271O85442k0420944
9897B1904640j6032568M939633J269323k3737928j9741149J9780439L6773604
$$ plain form
9890 25155994 31377229 11038087 4696198 14648062 8149885 -15795878 -27764122 -27276347
9882 -27276347 -34282179 -33402999 -3316653 13110371 -32362498 -68098314 36531677
9875 36531677 252043172 364851522 248372126 41967830 -43389940 28320 24802406
9868 24802406 -21177319 -48394797 -8435891 29351544 9374706 -23979339 -17105889
9861 -17105889 8685879 13702183 8212470 14592881 17943245 1499474 -13524866 -5487677
9853 -5487677 7905786 4348429 -3186581 3565358 10653293 191829 -12203290 -4488002
9845 -4488002 10858358 8587993 -5887367 -9837192 -4781702 -9598571 -21436166 -17402084
9837 -17402084 6692334 27905657 29287710 19651065 15816059 20940110 25531984 20571568
$$ packed form
9890B5155994O221235k0339142o341889R951864o498177k3945763j1968244M87775
9882b7276347p005832Q79180L0086346J6427024m5472869l5735816J04629991
9875C6531677K15511495J12808350j16479396k06404296q5357770M3418260K4774086
9868B4802406m5979725k7217478L9958906L7787435j9976838l3354045O873450
9861a7105889K5791768N016304n489713O380411L350364j6443771j5024340Q037189
9853e487677J3393463l557357p535010O751939P087935j0461464j2395119P715288
9845d488002J5346360k270365j4475360l949825N055490m816869j1837595M034082
9837a7402084K4094418K1213323J382053r636645l835006N124051M591874m960416
$$ plain form
9829 20571568 6738371 -4699459 -1352166 16300818 33313055 35190845 21038791
9822 21038791 2481647 -4452448 10487263 38980444 54070425 36860414 2442770
9815 2442770 -15893504 -7315045 9246393 17358767 20304278 22964249 20874505 15703091
9807 15703091 19058201 30431467 32900803 22164972 17220663 27487600 31825332 9707209
9799 9707209 -25503030 -45676223 -45087326 -37085868 -26946448 -11312403 3930199 7576204
9791 7576204 884849 -5785088 -9097131 -10402826 -4770992 10721922 24347807 23051391
9783 23051391 13229924 10597588 13715692 6396719 -14971488 -34541269 -39060713 -31979141
9775 -31979141 -23435379 -18967994 -20792588 -29565129 -41325135 -49148022 -49085199 -41124002
$$ packed form
9829B0571568j3833197j1437830L347293J7652984J7012237J877790j4152054
9822B1038791j8557144o934095J4939711K8493181J5089981j7210011l4417644
9815B442770j8336274Q578459J6561438Q112374K945511K659971k089744n171414
9807A5703091L355110J1373266K469336j0735831m944309J0266937M337732k2118123
9799I707209l5210239k0173193N88897Q001458J0139420J5634045J5242602L646005
9791G576204o691355o669937l312043j305695N631834J5492914J3625885j296416
9783B3051391r821467k632336L118104p318973k1368207j9569781m519444P081572
9775c1979141Q543762M467385j824594q772541j1760006p822887O2823P961197
$$ plain form
9767 -41124002 -27834074 -16175664 -13947275 -18574048 -17865365 -8877269 -4671839 -12012494
9759 -12012494 -15515786 161026 23502712 30915462 20264415 8353110 591050 -12504507
9751 -12504507 -29191900 -32109174 -15659615 3880702 13575938 19419535 26889171 25512977
9743 25512977 8330808 -8096962 -2427149 19898390 32226267 22548982 7571518
9736 7571518 7118022 17607130 20467225 10454746 3264484 12378931 27976218 28553624
9728 28553624 10629857 -5061990 -926735 14016775 16437990 -1613673 -25129674
9721 -25129674 -35930338 -30900224 -19759684 -11729008 -7933523 -5303529 -5536451 -15830956
9713 -15830956 -35971527 -49309418 -38869180 -13101693 -516769 -12891312 -29594871
$$ packed form
9767d1124002J3289928J1658410K228389m626773P08683Q988096M205430p340655
9759a2012494l503292J5676812K3341686P412750j0651047j1911305p762060j3095557
9751a2504507j6687393k917274J6449559J9540317R695236N843597P469636j376194
9743B5512977j7182169j6427770N669813K2325539J2327877r677285j4977464
9736G571518m53496J0489108K860095j0012479p190262R114447J5597287N77406
9728B8553624j7923767j5691847M135255J4943510K421215j8051663k3516001
9721b5129674j0800664N030114J1140540Q030676L795485K629994k32922j0294505
9713a5830956k0140571j3337891J0440238K5767487J2584924j2374543j6703559
$$ plain form
9706 -29594871 -28505870 -15901722 -9703051 -8115245 2553582 18314450 21682756 13144198
9698 13144198 12929667 27545996 37367131 26000343 3705767 -8607882 -4759449 6945490
9690 6945490 17966911 24260980 24858734 22577753 20021919 12690434 -4740125 -24091221
9682 -24091221 -28571991 -16225947 -5761757 -12854140 -31614939 -45076529 -43015577 -24704933
9674 -24704933 2883082 23119136 19731710 -2323907 -18116924 -13373636 -1039976
9667 -1039976 1756908 -2064717 -1959440 -2094986 -12623906 -27167796 -27823077 -9437947
9659 -9437947 15455982 32520984 34781123 22533357 7351507 8335040 28587391 43507466
9651 43507466 31544076 8970737 9670163 33764363 45211131 25218157 -524654
$$ packed form
9706b9594871J089001J2604148O198671J587806J0668827J5760868L368306q538558
9698A3144198k14531J4616329R821135j1366788k2294576j2313649L848433J1704939
9690F945490J1021421O294069N97754k280981k555834p331485j7430559j9351096
9682b4091221m480770J2346044J0464190p092383j8760799j3461590K060952J8310644
9674b4704933K7588015K0236054l387426k2055617j5793017M743288J2333660
9667a039976K796884l821625J05277j35546j0528920j4543890o55281J8385130
9659i437947K4893929J7065002K260139j2247766j5181850R83533K0252351J4920075
9651D3507466j1963390k2573339O99426K4094200J1446768j9992974k5742811
$$ plain form
9644 -524654 -468190 21154268 38444894 40264607 32447674 17933642 -2871369 -19048473
9636 -19048473 -17135353 -756306 12606850 12865551 3584475 -8710855 -18264069 -17226133
9628 -17226133 -3806345 8807177 5951313 -7523819 -13863989 -8118347 -1295403 977257
9620 977257 3740887 4207841 -10602845 -38642062 -54285506 -39318173 -9142601 6703983
9612 6703983 399807 -12037042 -16197504 -11229345 -1044390 10776049 17267959 11498190
9604 11498190 -3850408 -17341707 -19976328 -11629312 612138 6016281 -2822003 -20462416
9596 -20462416 -30963145 -25494592 -11614134 372896 10880848 22142701 26223822
9589 26223822 15537595 -1198801 -7532132 -313087 9215236 11178527 3895259 -8600512
$$ packed form
9644e24654N6464K1622458J7290626J819713p816933j4514032k0805011j6177104
9636a9048473J913120J6379047J3363156K58701r281076j2295330r553214J037936
9628a7226133J3419788J2613522k855864j3475132o340170N745642O822944K272660
9620I77257K763630M66954j4810686k8039217j5643444J4967333L0175572J5846584
9612F703983o304176j2436849m160462M968159J0184955J1820439O491910n769769
9604A1498190j5348598j3491299k634621Q347016J2241450N404143q838284j7640413
9596b0462416j0500729N468553J3880458J1987030J0507952J1261853M081121
9589B6223822j0686227j6736396o333331P219045R528323J963291p283268j2495771
$$ plain form
9581 -8600512 -15420990 -4267870 19491464 30397914 15280923 -4690082 -4370498 6789150
9573 6789150 3276570 -11089608 -9997815 8337481 17413096 6577655 -7589073 -18185166
9565 -18185166 -37480554 -60298027 -58606013 -29305822 -8405078 -15559010 -22024916 -1466980
9557 -1466980 22943570 17025837 -8172207 -17312906 -6067355 2915259 2398714 1949605
9549 1949605 1176791 -2799979 5019011 33904176 56879216 43253539 10665429 2588414
9541 2588414 21551880 29434598 11346092 -7284290 -10414571 -11863723 -16903748 -7409193
9533 -7409193 19832696 39080615 36718814 31509259 37861058 43403531 40093240 42177457
9525 42177457 52397460 45073352 8783733 -24963685 -24736755 -4821808 1899374 -6215841
$$ packed form
9581h600512o820478J1153120K3759334J0906450j5116991j9971005L19584J1159648
9573F789150l512580j4366178J091793J8335296R075615j0835441j4166728j0596093
9565a8185166j9295388k2817473J692014K9300191K0900744p153932o465906K0557936
9557a466980K4410550n917733k5198044r140699J1245551Q982614n16545m49109
9549A949605p72814l976770P818990K8885165K2975040j3625677l2588110q077015
9541B588414J8963466P882718j8088506j8630382l130281j449152n040025R494555
9533g409193K7241889J9247919k361801n209555O351799N542473l310291K084217
9525D2177457J0220003p324108l6289619l3747418K26930J9914947O721182q115215
$$ plain form
9517 -6215841 -8519650 -2356439 -1409283 -5822854 -4432073 1076971 932636 -685199 6665326
9508 6665326 15614871 8601047 -13534499 -31721283 -35344020 -30511595 -24292831 -17754601
9500 -17754601 -12870363 -11784068 -11224182 -8895803 -10237583 -17991118 -22915251 -16917272
9492 -16917272 -6398409 290303 7915563 21672762 30611075 22376656 5981424 21415
9484 21415 3565066 -2087987 -25240152 -53784062 -71465636 -71156675 -55654122 -36597463
9476 -36597463 -26588527 -22434513 -6578143 23509934 42533230 30752620 4375026
9469 4375026 -8970386 -9799534 -15297698 -22054660 -13293641 4101349 5471329 -9303330
9461 -9303330 -14490227 -3624001 -720980 -16258505 -25743419 -9575155 14106916 18326816
$$ packed form
9517f215841k303809O163211R47156m413571J390781N509044j44335j617835P350525
9508F665326Q949545p013824k2135546j8186784l622737M832425O218764O538230
9500a7754601M884238J086295N59886K328379j341780p753535m924133N997979
9492a6917272J0518863O688712P625260J3757199Q938313q234419j6395232n960009
9484B1415L543651n653053k3152165k8543910j7681574L08961J5502553J9056659
9476c6597463J0008936M154014J5856370L0088077J9023296j1780610k6377594
9469D375026j3345412q29148n498164o756962Q761019J7394990J369980j4774659
9461i303330n186897J0866226K903021j5537525r484914J6168264K3682071M219900
$$ plain form
9453 18326816 7532319 5288567 16083165 22577668 13857530 -2722687 -15194026 -18579362
9445 -18579362 -14330320 -7892698 -5357759 -6404572 -3687496 6245137 16227250 17414712
9437 17414712 10324534 2480343 -1070097 -1335658 -2722761 -9164058 -20406129 -31295181
9429 -31295181 -36155105 -32171320 -18205032 2821353 17949252 12355557 -8576081 -18253466
9421 -18253466 -2498100 18742659 19650009 4930496 -3926700 -6075106 -15909227 -27939682
9413 -27939682 -21560669 -1537509 1407876 -21508528 -41237626 -35351655 -18411078 -12507429
9405 -12507429 -15579543 -17333055 -20368970 -24355322 -13875817 13306590 27999088 7993416
9397 7993416 -22939123 -25192772 439410 19090912 16698538 14292477 26823172 40119849
$$ packed form
9453A8326816j0794497k243752J0794598O494503q720138j6580217j2471339l385336
9445a8579362M249042O437622K534939j046813K717076R932633R982113J187462
9437A7414712p090178p844191l550440k65561j387103o441297j1242071j0889052
9429c1295181m859924L983785J3966288K1026385J5127899n593695k0931638r677385
9421a8253466J5755366K1240759R07350j4719513q857196k148406r834121j2030455
9413b7939682O379013K0023160K945385k2916404j9729098N885971J6940577N903649
9405a2507429l072114j753512l035915l986352J0479505K7182407J4692498k0005672
9397G993416l0932539k253649K5632182J8651502k392374k406061J2530695J3296677
$$ plain form
9389 40119849 38612255 31035233 33890024 44671882 45918370 28934800 3194460 -15922623
9381 -15922623 -23066155 -25425134 -30267825 -33660649 -27309305 -13826433 -3959648 973144
9373 973144 8071735 11747920 -4861685 -37388768 -52599405 -32342890 -4986630 -7579468
9365 -7579468 -31860274 -38019528 -13750663 12614123 17341908 9471812 7829058 14675861
9357 14675861 21146620 20914152 12069826 -50906 -770750 16428311 31839407 20573483
9349 20573483 -8627416 -21454415 -8029539 4607823 -964932 -4950202 12682676
9342 12682676 35420321 35808101 17936676 7112663 10347233 13795349 11086689 8529978
9334 8529978 6422047 -1068399 -8738671 -4611919 8238255 13770230 8280234 5051693
$$ packed form
9389D0119849j507594p577022K854791J0781858J246488j6983570k5740340j9117083
9381a5922623p143532k358979m842691l392824O351344J3482872R866785M932792
9373I73144P098591L676185j6609605l2527083j5210637K0256515K7356260k592838
9365g579468k4280806o159254K4268865K6364786M727785p870096j642754O846803
9357A4675861O470759k32468q844326j2120732p19844J7199061J5411096j1265924
9349B0573483k9200899j2826999J3424876J2637362n572755l985270J7632878
9342A2682676K2737645L87780j7871425j0824013L234570L448116k708660k556711
9334H529978k107931p490446p670272M126752J2850174N531975n489996l228541
$$ plain form
9326 5051693 11401407 19457916 23991161 31263058 42742794 46114977 32816220 12812328
9318 12812328 1883881 2762099 7066144 7938404 2946908 -7843706 -18187182 -16598409
9310 -16598409 -291519 15925009 13503606 -8458104 -31867874 -38801275 -27845428
9303 -27845428 -12324759 -5066968 -4861544 658713 16140691 27505805 18876521 -3314247
9295 -3314247 -17839761 -20067778 -26213329 -40167887 -39341179 -10580125 19554742 16319884
9287 16319884 -12442038 -25794458 -6800002 18599770 23261628 12161043 4448774
9280 4448774 5644967 11343633 20109866 27996206 24973435 11053902 3356730 13609351
9272 13609351 30129285 34695880 25250595 9466421 -9889372 -27866372 -30674532 -15699887
$$ packed form
9326E051693O349714Q056509M533245P271897J1479736L372183j3298757k0003892
9318A2812328j0928447Q78218M304045Q72260m991496j0790614j0343476J588773
9310a6598409J6306890J6216528k421403k1961710k3409770o933401J0955847
9303b7845428J5520669P257791K05424N520257J5481978J1365114q629284k2190768
9295c314247j4525514k228017o145551j3954558Q26708K8761054L0134867l234858
9287A6319884k8761922j3352420J8994456K5399772M661858j1100585p712269
9280D448774J196193N698666Q766233P886340l022771j3919533p697172J0252621
9272A3609351J6519934M566595r445285j5784174j9355793j7977000k808160J4974645
$$ plain form
9264 -15699887 -5173260 -17381223 -34960487 -27230878 3318256 24323736 19961845
9257 19961845 6091775 -1043784 -2731436 -507348 10683345 23825010 20501803 874652
9249 874652 -11149405 -4096231 4307615 509758 -61608 18623406 41639224 43558669
9241 43558669 24972018 6004202 -3756189 -6894654 -1635127 12982259 24190959 20442554
9233 20442554 12206042 16174920 26081739 22503117 5446435 -8097038 -14816378 -25790687
9225 -25790687 -37448877 -31282607 -7331423 10392365 10922847 11785494 24339422 29454103
9217 29454103 7533357 -26636310 -41548052 -29416834 -8769667 3961479 5541787
9210 5541787 -4268229 -22722350 -35598249 -28006836 -6227162 6234894 -2717469 -21790205
$$ packed form
9264a5699887J0526627j2207963j7579264P729609L0549134K1005480m361891
9257A9961845j3870070p135559j687652K224088J1190693J3141665l323207j9627151
9249H74652j2024057P053174Q403846l797857n71366J8685014K3015818J919445
9241D3558669j8586651j8967816r760391l138465N259527J4617386J1208700l748405
9233B0442554q236512L968878R906819l578622j7056682j3543473o719340j0974309
9225b5790687j1658190O166270K3951184J7723788N30482Q62647J2553928N114681
9217B9454103k1920746l4169667j4911742J2131218K0647167J2731146J580308
9210E541787r810016j8454121j2875899P591413K1779674J2462056q952363j9072736
$$ plain form
9202 -21790205 -34893464 -37949760 -33233550 -21310432 -6700048 217877 -2767743 -3012451
9194 -3012451 8257353 18880522 12363265 -3640901 -4204881 16257782 33717434 28873782
9186 28873782 13917621 10483774 14875049 5641095 -20751202 -43588106 -47532154 -39139646
9178 -39139646 -30350848 -23768080 -20505514 -25090603 -33054422 -29082678 -8967774 9806070
9170 9806070 11279679 2312944 -2081402 -1878671 -4811378 -7337715 -1721042 5211606
9162 5211606 -211887 -15546771 -24425679 -19637550 -8709499 643434 5662323 3231689
9154 3231689 -4666933 -5288703 7403538 16159262 3437982 -14925535 -7235883 23933697
9146 23933697 41271671 28009724 9715768 7681390 4898955 -18227394 -43785237
$$ packed form
9202b1790205j3103259l056296M716210J1923118J4610384O917925k985620k44708
9194c012451J1269804J0623169o517257j6004166n63980K0462663J7459652m843652
9186B8873782j4956161l433847M391275r233954k6392297k2836904l944048Q392508
9178c9139646Q788798O582768L262566m585089p963819L971744K0114904J8773844
9170I806070J473609q966735m394346K02731k932707k526337N616673O932648
9162E211606n423493j5334884q878908M788129J0928051R352933N018889k430634
9154C231689p898622o21770J2692241Q755724j2721280j8363517P689652L1169580
9146B3933697J7337974j3261947j8293956k034378k782435k3126349k5557843
$$ plain form
9139 -43785237 -43419551 -24820570 -16576734 -19577849 -10394223 11225357 15944926 -7278381
9131 -7278381 -29426648 -22693059 435874 8267846 -5483236 -18228208 -12757968 2861256
9123 2861256 10321031 3885452 -6553123 -9914157 -6182672 -3412165 -5490558 -8285579
9115 -8285579 -9314557 -13799286 -24527496 -32119195 -26063601 -11816718 -3781846 -1879594
9107 -1879594 9210376 32590827 46600764 31354626 -2750692 -27218569 -30180019
9100 -30180019 -23962859 -20533393 -16563464 -7017451 2387324 6911500 15508097 36983591
9092 36983591 59123834 58701221 33506815 8235931 1786678 3110591 -8271414 -28728339
9084 -28728339 -35080562 -19067820 1232945 7775509 4007158 1681552 -417519 -11451514
$$ packed form
9139d3785237L65686J8598981Q243836l001115R183626K1619580M719569k3223307
9131g278381k2148267O733589K3128933P831972j3751082j2744972N470240J5619224
9123B861256P459775o435579j0438575l361034L731485K770507k078393k795021
9115h285579j028978m484729j0728210p591699O055594J4246883Q034872J902252
9107a879594J1089970K3380451J4009937j5246138l4105318k4467877k961450
9100c0180019O217160L429466L969929R546013R404775M524176Q596597K1475494
9092C6983591K2140243m22613k5194406k5270884o449253J323913j1382005k0456925
9084b8728339o352223J6012742K0300765O542564l768351k325606k099071j1033995
$$ plain form
9076 -11451514 -29467627 -41500725 -41605235 -37360782 -36737861 -37716138 -34747778 -28851439
9068 -28851439 -26022104 -28736423 -33425202 -35421786 -33420502 -28803564 -22161668 -11567260
9060 -11567260 4971079 25018478 41043393 46428848 42296869 36255142 33519939 31592800
9052 31592800 25927502 18638716 16614944 20342685 20669526 11285178 -411072 -2735095
9044 -2735095 2446282 1854111 -7831056 -12746237 -2660506 11511159 11996836 -1007179
9036 -1007179 -11771477 -12544049 -10213898 -9385153 -3847229 9533319 20453563 17556759
9028 17556759 3828256 -9232604 -18389589 -30407801 -47418302 -58455881 -50169362
9021 -50169362 -24038956 1544974 9165697 671293 -6535676 -552522 14579333 30343475
$$ packed form
9076a1451514j8016113j2033098j04510M244453O22921r78277K968360N896339
9068b8851439K829335k714319m688779j996584K001284M616938O641896J0594408
9060a1567260J6538339K0047399J6024915N385455m131979o041727k735203j927139
9052C1592800n665298p288786k023772L727741L26841r384348j1696250k324023
9044b735095N181377n92171r685167m915181J0085731J4171665M85677j3004015
9036a007179j0764298p72572K330151Q28745N537924J3380548J0920244k896804
9028A7556759j3728503j3060860r156985j2018212j7010501j1037579Q286519
9021e0169362K6130406K5583930P620723q494404p206969N983154J5131855J5764142
$$ plain form
9013 30343475 45061414 57346200 58673347 44209961 24814703 16082199 19659089 26491444
9005 26491444 32570637 37793626 35679849 22013529 9538251 13766478 26101198 23841269
8997 23841269 7436914 1401267 12505835 15775156 -4581136 -27119992 -25678701 -7648148
8989 -7648148 3361343 4955638 10017582 16573870 11720559 -691883 -2435774 10525261
8981 10525261 23634722 27192071 24998538 20912363 15511515 14891663 24031139 32489224
8973 32489224 26199801 13032040 15477321 35893293 50757079 44685802 29200143 19669400
8965 19669400 13537414 3039547 -7359191 -10523333 -11622114 -19265209 -28985520 -27685088
8957 -27685088 -10812784 12664915 28767893 27421415 8547673 -16106473 -31825165
$$ packed form
9013C0343475J4717939J2284786J327147j4463386j9395258q732504L576890O832355
9005B6491444O079193N222989k113777j3666320j2475278M228227J2334720k259929
8997B3841269j6404355o035647J1104568L269321k0356292k2538856J441291J8030553
8989g648148J1009491J594295N061944O556288m853311j2412442j743891J2961035
8981A0525261J3109461L557349k193533m086175n400848o19852R139476Q458085
8973C2489224o289423j3167761K445281K0415972J4863786o071277j5485659r530743
8965A9669400o131986j0497867j0398738l164142j098781p643095r720311J300432
8957b7685088J6872304K3477699J6102978j346478j8873742k4654146j5718692
$$ plain form
8950 -31825165 -33640484 -25331771 -8899565 12801248 24483692 8482032 -26915820
8943 -26915820 -47396835 -33608150 -7619803 -2494208 -16847191 -19857937 2848140
8936 2848140 28997383 29521476 3948159 -21926315 -26226477 -11879656 158395 -5869049
8928 -5869049 -25007401 -39004855 -37347262 -26661120 -18631940 -15038312 -9386755 1277132
8920 1277132 12478049 18537032 17990869 13836715 11829427 17191793 29511920 41086146
8912 41086146 42449310 30324148 11357359 -613927 5833755 27495659 45378551
8905 45378551 42340178 21867567 3167063 -1045110 6532826 19133571 33067640 41109274
8897 41109274 33044222 10273661 -11221605 -19843145 -19297177 -13822400 2032580 25896383
$$ packed form
8950c1825165j815319Q308713J6432206K1700813J1682444j6001660l5397852
8943b6915820k0481015J3788685K5988347N125595j4352983l010746K2706077
8936B848140K6149243N24093k5573317k5874474m300162J4346821J2038051o027444
8928e869049j9138352j3997454J657593J0686142Q029180L593628N651557J0663887
8920A277132J1200917O058983n46163m154154k007288N362366J2320127J1574226
8912D1086146J363164j2125162j8966789j1971286O447682K1661904J7882892
8905D5378551l038373k0472611j8700504m212173P577936J2600745J3934069Q041634
8897D1109274q065052k2770561k1495266q621540N45968N474777J5854980K3863803
$$ plain form
8889 25896383 35390212 14705395 -15352669 -18006970 10459075 35579718 31424119 9609436
8881 9609436 -5644267 -8814005 -5774276 4954146 23252015 32665020 18356727 -5058835
8873 -5058835 -6645175 18814666 43187911 44659984 34181183 31106449 31491171 19748414
8865 19748414 -184093 -8872864 -3615317 -3618844 -18726385 -33503264 -32125959 -21712264
8857 -21712264 -17082979 -16458813 -10169530 -3920120 -12129715 -30874666 -38534032 -26601877
8849 -26601877 -11563303 -9716387 -16352790 -18941724 -16730490 -15491356 -14106651 -9672736
8841 -9672736 -7439066 -11701543 -13611861 -3924388 6271723 -3731129 -30806121 -43525168
8833 -43525168 -20285162 20983462 43307584 33373890 11110357 -63005 1038370
$$ packed form
8889B5896383R493829k0684817l0058064k654301K8466045K5120643m155599k1814683
8881I609436j5253703l169738L039729J0728422J8297869R413005j4308293k3415562
8873e058835j586340K5459841K4373245J472073j0478801l074734L84722j1742757
8865A9748414j9932507q688771N257547l527j5107541j4776879J377305J0413695
8857b1712264M629285O24166O289283O249410q209595j8744951p659366J1932155
8849b6601877J5038574J846916o636403k588934K211234J239134J384705M433915
8841i672736K233670m262477j910318R687473J0196111j0002852k7074992j2719047
8833d3525168K3240006M1268624K2324122r933694k2263533j1173362J101375
$$ plain form
8826 1038370 543542 -8047901 -16912871 -15961279 -4378492 11060443 24552380 34640136
8818 34640136 40119208 36485407 20152916 -3087267 -17633600 -11437903 9717537 26568016
8810 26568016 27647411 20965616 19941234 24024844 22558954 13927517 7845488 7939394
8802 7939394 6196960 -185250 -523486 11209654 22325644 18942462 8345055 8097731
8794 8097731 18859331 25461031 22662202 21522154 28125846 33246421 29219025 22923321
8786 22923321 23772425 28949222 28607149 19428089 7934830 4963517 17241167 37484763
8778 37484763 45586624 31607237 15022312 23752085 53162596 67001641 45435298
8771 45435298 10007197 -10722103 -18004359 -27573833 -37647018 -36699393 -29679597 -29900526
$$ packed form
8826A038370m94828q591443q864970R51592J1582787J5438935J3491937J0087756
8818C4640136N479072l633801j6332491k3240183j4546333O195697K1155440J6850479
8810B6568016J079395o681795j024382M083610j465890q631437o082029R3906
8802G939394j742434o382210l38236J1733140J1115990l383182j0597407k47324
8794H097731J0761600O601700k798829j140048O603692N120575m027396o295704
8786B2923321Q49104N176797l42073r179060j1493259k971313J2277650K0243596
8778C7484763Q101861j3979387j6584925Q729773K9410511J3839045k1566343
8771D5435298l5428101k0729300p282256r569474j0073185R47625P019796k20929
$$ plain form
8763 -29900526 -32586267 -23050400 -6915603 -4090485 -11882809 -3274580 29643214 56771595
8755 56771595 49774050 21399433 7035797 18954926 36065857 33152780 6867067
8748 6867067 -23632718 -32085716 -5746703 40032104 71954409 71788570 54249956 43746696
8740 43746696 41415898 29806691 5644785 -12019079 -11052713 -5484440 -13082952 -26447715
8732 -26447715 -24127014 -5288308 6653995 -1644064 -13659125 -7869433 11476266 23439997
8724 23439997 21288407 16522358 16033029 14859487 13312118 21394682 38606201 46935015
8716 46935015 35761550 19509097 16666846 23323677 23894076 18643225 21113355 32527117
8708 32527117 38424365 31451962 20377600 13532922 8691958 4234135 6637535 19613285
$$ packed form
8763b9900526k685741R535867J6134797K825118p792324Q608229L2917794K7128381
8755E6771595o997545k8374617j4363636J1919129J7110931k913077k6285713
8748F867067l0499785q452998K6339013M5778807L1922305j65839j7538614j0503260
8740D3746696k330798j1609207k4161906j7663864R66366N568273p598512j3364763
8732b6447715K320701J8838706J1942303q298059j2015061N789692J9345699J1963731
8724B3439997k151590m766049m89329j173542j547369Q082564J7211519Q328814
8716D6935015j1173465j6252453k842251O656831N70399n250851K470130J1413762
8708C2527117N897248o972403j1074362o844678m840964m457823K403400J2975750
$$ plain form
8700 19613285 35511576 43983022 42175776 32801474 20272347 12110718 14901387 23817786
8692 23817786 24447004 10668681 -6225656 -11413784 -3169778 8860361 15266280 12100649
8684 12100649 1496927 -7555160 -5483522 5644609 12915680 10461798 7508022 11025223
8676 11025223 11181971 -1776826 -13431300 1871299 41680830 68587265 54441411
8669 54441411 18260637 3128258 21119743 41036404 33917666 10733293 1210338
8662 1210338 9620414 13559844 2770859 -4849425 7283520 28937508 39834048 37099363
8654 37099363 30585823 22045731 6788339 -10646385 -20400377 -23393671 -26972250 -27795248
8646 -27795248 -17041388 -765435 4970540 321250 1962893 13140498 15742540 1268426
$$ packed form
8700A9613285J5898291Q471446j807246r374302j2529127q161629K790669Q916399
8692B3817786O29218j3778323j6894337n188128Q244006J2030139O405919l165631
8684A2100649j0603722r052087K071638J1128131P271071k453882k953776L517201
8676A1025223J56748j2958797j1654474J5302599L9809531K6906435j4145854
8669E4441411l6180774j5132379J7991485J9916661p118738k3184373r522955
8662A210338Q410076L939430j0788985p620284J2132945K1653988J0896540k734685
8654C7099363o513540q540092j5257392j7434724r753992k993294l578579q22998
8646b7795248J0753860J6275953N735975m649290J641643J1177605K602042j4474114
$$ plain form
8638 1268426 -11751506 -5451326 9996663 13707148 5194998 -10870 3697665 8339710
8630 8339710 8485931 5051000 -2219362 -11320304 -11784288 3063801 21401030 25499831
8622 25499831 16007089 8369379 7976332 6578549 3090495 7914958 20953809 23501021
8614 23501021 2936461 -27157899 -43357434 -40287732 -30469314 -22055051 -10046256 9338950
8606 9338950 25888687 24159622 3513677 -16558405 -16205440 777530 10275766 -1270209
8598 -1270209 -17928394 -15468126 4851559 17534863 6964527 -14094579 -23792096 -16422033
8590 -16422033 -1882732 9799239 15062521 14905824 14092984 17347984 21089131 15764460
8582 15764460 2457798 -1727262 14458442 35376614 33052197 2286039 -30486693
$$ packed form
8638A268426j3019932O300180J5447989L710485q512150n205868L708535M642045
8630H339710J46221l434931p270362r100942m63984J4848089J8337229M098801
8622B5499831r492742p637710l93047j397783l488054M824463J3038851K547212
8614B3501021k0564560l0094360j6199535L069702R818418Q414263J2008795J9385206
8606I338950J6549737j729065k0645945k0072082L52965J6982970R498236j1545975
8598a270209j6658185K460268K0319685J2683304j0570336k1059106r697517P370063
8590a6422033J4539301J1681971N263282j56697q12840L255000L741147n324671
8582A5764460j3306662m185060J6185704K0918172k324417l0766158l2772732
$$ plain form
8575 -30486693 -36057756 -11907069 19350994 33412198 23314717 1614549 -12339808
8568 -12339808 -10415725 -2117970 -260731 -3564738 -1785643 4397455 2645424 -8822995
8560 -8822995 -14426395 -6713089 -3408321 -21137644 -42389317 -33148826 6904855 36736199
8552 36736199 25076933 -11798483 -36999283 -39311862 -32953067 -24814983 -8184196 14194349
8544 14194349 26791566 26606720 30465650 46987499 58673740 45823629 16329575 -3287934
8536 -3287934 465733 18643290 36563092 45938172 42779430 27312508 8277718 -2677886
8528 -2677886 -3644560 -2558544 -4227108 -5302555 -3124807 -549260 980202 4624786
8520 4624786 9757657 8134973 -4693042 -19787483 -24953410 -21638232 -22770649 -33286284
$$ packed form
8575c0486693n571063K4150687L1258063J4061204j0097481k1700168j3954357
8568a2339808J924083Q297755J857239l304007J779095O183098j752031j1468419
8560h822995n603400P713306L304768j7729323k1251673R240491M0053681K9831344
8552C6736199j1659266l6875416k5200800k312579O358795Q138084J6630787K2378545
8544A4194349J2597217j84846L858930J6521849J1686241j2850111k9494054j9617509
8536c287934L753667J8177557J7919802R375080l158742j5466922j9034790j0955604
8528b677886r66674J086016j668564j075447K177748K575547J529462L644584
8520D624786N132871j622684j2828015j5094441n165927L315178j132417j0515635
$$ plain form
8512 -33286284 -41653380 -35854125 -22117593 -19300171 -34128554 -49237538 -41343730 -9167870
8504 -9167870 22269309 26629051 2784906 -24730654 -29851195 -8846199 18059906 27950739
8496 27950739 18263485 6838810 8076229 14792260 10722522 -3584126 -10207373 -555523
8488 -555523 11400808 9972552 8032 -2826485 4686305 12721834 15000543 11926571
8480 11926571 1257621 -18626158 -36938122 -37772117 -21141724 -2268946 11780376
8473 11780376 27657050 43938837 44735726 26887449 14222673 25671797 43104038
8466 43104038 34357775 1102506 -21603161 -13668836 6424064 12926385 6287296 3172559
8458 3172559 9205306 16580377 18480375 11649006 -7684308 -35761976 -54011922 -45024705
$$ packed form
8512c3286284q367096N799255J3736532K817422j4828383j5108984P893808L2175860
8504i167870L1437179M359742k3844145k7515560n120541K1004996K6906105R890833
8496B7950739r687254j1424675J237419O716031m069738j4306648o623247R651850
8488e55523J1956331j428256r964520k834517P512790Q035529K278709l073972
8480A1926571j0668950j9883779j8311964q33995J6630393J8872778J4049322
8473A1780376J5876674J6281787P96889j7848277j2664776J1449124J7432241
8466D3104038q746263l3255269k2705667P934325K0092900O502321o639089l114737
8458C172559O032747P375071J899998o831369j9333314k8077668j8249946Q987217
$$ plain form
8450 -45024705 -15352719 10166954 17260998 13799761 11955478 12175267 9578857 4303991
8442 4303991 -2551223 -14378539 -30833753 -39977805 -29193738 -2359579 22298464 31410278
8434 31410278 26950769 18123175 10474396 5097653 2106962 670606 -1016660 -2466807
8426 -2466807 -23216 7979716 17396469 22638794 23213195 22654362 22280703 20428008 18197743
8417 18197743 20751706 29384400 35869349 30487383 15436057 4664558 8123172 20286626
8409 20286626 27448626 23342336 14018315 9525756 14309583 24136503 29581001 24716410
8401 24716410 14835113 11727194 18130926 23100091 18873659 14509077 21403652 31334073
8393 31334073 25130091 2237936 -15716416 -13908149 327484 16243578 34280327
$$ packed form
8450d5024705K9671986K5519673P094044l461237j844283K19789k596410n274866
8442D303991o855214j1827316j6455214r144052J0784067K6834159K4658043R111814
8434C1410278m459509q827594p648779n376743k990691j436356j687266j450147
8426b466807K443591Q002932R416753N242325N74401n58833l73659j852695k230265
8417A8197743K553963Q632694O484949n381966j5051326j0771499L458614J2163454
8409B0286626P162000m106290r324021m492559M783827R826920N444498m864591
8401B4716410r881297l107919O403732M969165m226432m364582O894575R930421
8393C1334073o203982k2892155j7954352J808267J4235633J5916094J8036749
$$ plain form
8386 34280327 51171961 49847239 22358803 -10598316 -23174375 -18197998 -17303116 -24862984
8378 -24862984 -25358056 -14396899 -7643396 -13958284 -20595581 -14189327 -970247 3674151
8370 3674151 -4845973 -18555218 -27273294 -25848744 -17649568 -12493126 -14388202 -13980210
8362 -13980210 -3590579 5158288 -4674377 -26217872 -34173441 -20925855 -5169179 495724
8354 495724 6468238 20280570 27593892 15716396 -2910799 -9504761 -6300488 -6503003
8346 -6503003 -9908778 -8104679 -3703552 -4845640 -8031179 -4342396 3817676 8776091
8338 8776091 13431854 24517775 36758128 39973569 34987618 26796637 11540218 -10946552
8330 -10946552 -21993256 -5570918 21265980 24876952 -233057 -27519000 -37748431
$$ packed form
8386C4280327J6891634j324722k7488436l2957119j2576059M976377Q94882p559868
8378b4862984m95072J0961157O753503o314888o637297O406254J3219080M644398
8370C674151q520124j3709245q718076J424550Q199176N156442j895076M07992
8362a3980210J0389631Q748867r832665k1543495p955569J3247586J5756676N664903
8354D95724N972514J3812332P313322j1877496j8627195o593962L204273k02515
8346f503003l405775J804099M401127j142088l185539L688783Q160072M958415
8338H776091M655763J1085921J2240353L215441m985951q190981j5256419k2486770
8330a0946552j1046704J6422338K6836898L610972k5110009k7285943j0229431
$$ plain form
8323 -37748431 -36112890 -28771537 -10917175 13073766 22277097 5448117 -21679477 -35178204
8315 -35178204 -26009312 -150610 28080624 39142231 23258754 -2779990 -12286541
8308 -12286541 -5145220 -5040870 -16692656 -15546958 8198855 26540520 15813117 -4873523
8300 -4873523 -4589681 10650285 11001651 -8390658 -22710854 -15535869 5682190 28467916
8292 28467916 44517838 42857078 19249622 -7247539 -11046792 4570261 11500032 -967155
8284 -967155 -12117143 -5036201 7411734 4484197 -12318424 -25034656 -22543034 -5868948
8276 -5868948 18937411 41161879 47305242 34182416 14294637 -167817 -10985075
8269 -10985075 -22829456 -28210291 -17457595 1198750 6674339 -8665677 -28856640
$$ packed form
8323c7748431J635541P341353J7854362K3990941R203331j6828980k7127594j3498727
8315c5178204R168892K5858702K8231234J1061607j5883477k6038744r506551
8308a2286541P141321J04350j1651786J145698K3745813J8341665j0727403k0686640
8300d873523K83842J5239966L51366j9392309j4320196P174985K1218059K2785726
8292B8467916J6049922j660760k3607456k6497161l799253J5617053O929771j2467187
8284i67155j1149988P080942J2447935k927537j6802621j2716232K491622J6674086
8276e868948K4806359K2224468O143363j3122826j9887779j4462454j0817258
8269a0985075j1844381n380835J0752696J8656345N475589j5340016k0190963
$$ plain form
8262 -28856640 -33378444 -18646971 1894903 12521760 7028262 -9111251 -24494557
8255 -24494557 -31405511 -31007573 -28064192 -22764230 -12384514 231177 6971124 5257603
8247 5257603 2062005 3160648 4126425 -2062419 -12787694 -18618348 -16003306 -9217393
8239 -9217393 -918954 9915237 19808393 20869492 13007686 6768399 8741020 13290765
8231 13290765 14982091 18383278 25783464 26147061 10539948 -10130634 -19664032 -21454889
8223 -21454889 -28121302 -31906585 -13129304 19644657 29118554 2200470 -24887423 -16258131
8215 -16258131 11717094 16527903 -7886706 -27653502 -22337622 -8381671 -5425074 -9268461
8207 -9268461 -9526913 -9602986 -13296291 -10100058 7819083 26283727 25369411 8271276
$$ packed form
8262b8856640m521804J4731473K0541874J0626857n493498j6139513j5383306
8255b4494557o910954L97938K943381N299962J0379716J2615691O739947j713521
8247E257603l195598J098643R65777o188844j0725275n830654K615042O785913
8239i217393Q298439J0834191R893156J061099p861806o239287J972621M549745
8231A3290765J691326L401187P400186L63597j5607113k0670582r533398j790857
8223b1454889o666413l785283J8777281L2773961R473897k6918084k7087893Q629292
8215a6258131K7975225M810809k4414609j9766796N315880J3955951K956597l843387
8207i268461k58452p6073l693305L196233J7919141J8464644r14316j7098135
$$ plain form
8199 8271276 -3142387 1542170 11581294 15609436 16520774 20676056 23959051 17237813
8191 17237813 -169884 -20146208 -35516997 -42983167 -38603694 -19768473 5661345
8184 5661345 20305276 14325533 -2067250 -9699586 -1868826 11431110 17816004 12614189
8176 12614189 -3104861 -22851724 -32034760 -18455112 9114460 25430598 19669123
8169 19669123 9581079 14801781 29044498 33453611 26055365 18604711 12178038 -919271
8161 -919271 -13762615 -8917742 10007140 15773993 -3203757 -23116753 -19577807 -3482831
8153 -3482831 -1791071 -15503222 -20847358 -7869623 5747609 3328597 -7064076 -6821316
8145 -6821316 7163218 21653313 26948600 27163896 29671733 31522016 22853945 3662854
$$ packed form
8199H271276j1413663M684557J0039124M028142R11338M155282L282995o721238
8191A7237813j7407697j9976324j5370789p466170M379473J8835221K5429818
8184E661345J4643931n979743j6392783p632336P830760J3299936O384894n201815
8176A2614189j5719050j9746863r183036J3579648K7569572J6316138n761475
8169A9669123j0088044N220702J4242717M409113p398246p450654o426673j3097309
8161i19271j2843344M844873J8924882N766853j8977750j9912996L538946J6094976
8153c482831J691760j3712151n344136J2977735J3617232k419012j0392673K42760
8145f821316J3984534J4490095N295287K15296K507837J850283q668071j9191091
$$ plain form
8137 3662854 -10117231 -4320136 13021275 19579552 8305806 -2958141 2642864 17473491
8129 17473491 22861789 16750912 12869381 16924122 20172933 17050343 13359165 12613553
$$ packed form
8137C662854j3780085N797095J7341411O558277j1273746j1263947N601005J4830627
8129A7473491N388298o110877l881531M054741L248811l122590l691178p45612
$$ [...]
##END NTUPLES=NMR SPECTRUM
##END=
