##TITLE=31Pdec_LR-618-R3-CR18-TFA
 CDCl3, 124 sc
 28.06.2021
##JCAMPDX= 6.0         $$ Bruker NMR JCAMP-DX V2.0
##DATA TYPE= NMR SPECTRUM
##DATA CLASS= NTUPLES
##ORIGIN= UXNMR, Bruker Analytische Messtechnik GmbH
##OWNER= root
$$ XWIN-NMR		Version 3.5
$$ Mon Jun 28 12:31:25 2021 Russian Standard Time (UT+4h)  she@DPX200
##.OBSERVE FREQUENCY= 81.013821
##.OBSERVE NUCLEUS= ^31P
##.ACQUISITION MODE= SIMULTANEOUS
##.ACQUISITION SCHEME= undefined
##.AVERAGES= 124
##.DIGITISER RES= 16
##SPECTROMETER/DATA SYSTEM= spect
##.PULSE SEQUENCE= zgpg30
##.SOLVENT NAME= CDCl3
##.SHIFT REFERENCE= (INTERNAL, CDCl3, 0, 248.564)
##AUDIT TRAIL= $$ (NUMBER, WHEN, WHO, WHERE, WHAT)
$$ ##TITLE= Audit trail, XWIN-NMR		Version 3.5
$$ ##JCAMPDX= 5.01
$$ ##ORIGIN= Bruker BioSpin GmbH
$$ ##OWNER= she
$$ F:/spectra/data/she/nmr/P31/1/pdata/1/auditp.txt
$$ ##AUDIT TRAIL=  $$ (NUMBER, WHEN, WHO, WHERE, WHAT)
(   1,<2021-06-28 12:30:15.40 +0400>,<she>,<DPX200>,
      <continue with go, POWCHK disabled, PULCHK disabled
       configuration hash MD5:
       00 E9 B6 7A A2 85 ED C7 34 08 36 98 17 FE 4E 26
       data hash MD5: 32K
       11 6C 5E B3 15 D5 18 7C 7A B9 A6 DC 57 7E E6 60>)
(   2,<2021-06-28 12:30:17.50 +0400>,<she>,<DPX200>,
      <Start of raw data processing
       efp BC_mod = 2 LB = 1 FT_mod = 6 PKNL = 1 PHC0 = -8030.145 PHC1 = 3696.287 SI = 64K 
       data hash MD5: 64K
       7D E2 99 6D 82 FB 8C 99 CF 9F E9 84 1C 29 7F E3>)
(   3,<2021-06-28 12:30:46.32 +0400>,<she>,<DPX200>,
      <pk PHC0 = -17.0093 PHC1 = 41.6 
       data hash MD5: 64K
       9A B5 74 AE F1 36 FD 2A 84 0C E0 F5 E2 7A 56 FC>)
(   4,<2021-06-28 12:30:49.39 +0400>,<she>,<DPX200>,
      <abs ABSG = 5 
       data hash MD5: 64K
       66 F4 33 63 7A F4 85 95 50 D1 1B 47 EC 05 1D DE>)
$$ ##END=
$$ 
$$ hash MD5
$$ 87 24 EE 4B C9 CA D0 F7 86 5F 80 33 2B 62 A8 1A
##$RELAX= 
##$RELAX= 
##$RELAX= 
##$RELAX= 
##$RELAX= 
##$RELAX= 
##$RELAX= 
##$RELAX= 
$$ Bruker specific parameters
$$ --------------------------
##$DU= <F:/spectra>
##$EXPNO= 1
##$NAME= <P31>
##$PROCNO= 1
##$TYPE= <nmr>
##$USER= <she>
##$AMP= (0..31)
100 100 100 100 100 100 100 100 100 100 100 100 100 100 100 100 100 100 
100 100 100 100 100 100 100 100 100 100 100 100 100 100 
##$AQSEQ= 0
##$AQ_mod= 1
##$AUNM= <au_zg>
##$AUTOPOS= <>
##$BF1= 81.014009
##$BF2= 200.13
##$BF3= 200.13
##$BF4= 200.13
##$BF5= 200.13
##$BF6= 200.13
##$BF7= 200.13
##$BF8= 200.13
##$BYTORDA= 1
##$CFDGTYP= 0
##$CFRGTYP= 5
##$CHEMSTR= <none>
##$CNST= (0..31)
1 1 145 1 1 1 1 1 1 1 1 1 1 1 1 1 1 1 1 1 1 1 1 1 1 1 1 1 1 1 1 1 
##$CPDPRG= <waltz16>
##$CPDPRG1= <>
##$CPDPRG2= <waltz16>
##$CPDPRG3= <>
##$CPDPRG4= <mlev>
##$CPDPRG5= <mlev>
##$CPDPRG6= <mlev>
##$CPDPRG7= <mlev>
##$CPDPRG8= <mlev>
##$CPDPRGB= <>
##$CPDPRGT= <>
##$D= (0..31)
0 1 0 0 0 0 0 0 0 0 0 0.03 2e-05 3e-06 0 0 0 0 0 0 0 0 0 0 0 0 0 0 0 0 
0 0 
##$DATE= 1624868826
##$DBL= (0..7)
120 120 120 11 120 120 24 19 
##$DBP= (0..7)
150 150 150 150 150 150 150 150 
##$DBP07= 0
##$DBPNAM0= <>
##$DBPNAM1= <>
$$ [...]
##$SUBNAM3= <"">
##$SUBNAM4= <"">
##$SUBNAM5= <"">
##$SUBNAM6= <"">
##$SUBNAM7= <"">
##$SUBNAM8= <"">
##$SUBNAM9= <"">
##$SW= 501.771253377433
##$SWIBOX= (0..15)
0 1 3 0 0 0 0 0 0 0 0 0 0 0 0 0 
##$SW_h= 40650.406504065
##$TD= 32768
##$TD0= 1
##$TE= 0
##$TE2= 300
##$TE3= 300
##$TEG= 300
##$TL= (0..7)
0 120 53 12 22 120 120 120 
##$TP= (0..7)
150 150 150 150 150 150 150 150 
##$TP07= 0
##$TPNAME0= <>
##$TPNAME1= <>
##$TPNAME2= <>
##$TPNAME3= <>
##$TPNAME4= <>
##$TPNAME5= <>
##$TPNAME6= <>
##$TPNAME7= <>
##$TPOAL= (0..7)
0.5 0.5 0.5 0.5 0.5 0.5 0.5 0.5 
##$TPOFFS= (0..7)
0 0 0 0 0 0 0 0 
##$TUNHIN= 0
##$TUNHOUT= 0
##$TUNXOUT= 0
##$USERA1= <user>
##$USERA2= <user>
##$USERA3= <user>
##$USERA4= <user>
##$USERA5= <user>
##$V9= 5
##$VALIST= <valist>
##$VCLIST= <CCCCCCCCCCCCCCC>
##$VD= 0
##$VDLIST= <DDDDDDDDDDDDDDD>
##$VPLIST= <PPPPPPPPPPPPPPP>
##$VTLIST= <TTTTTTTTTTTTTTT>
##$WBST= 1024
##$WBSW= 4
##$XGAIN= (0..3)
0 0 0 0 
##$XL= 0
##$YL= 0
##$YMAX_a= 8696
##$YMIN_a= -9622
##$ZGOPTNS= <>
##$ZL1= 120
##$ZL2= 120
##$ZL3= 120
##$ZL4= 120
##$ABSF1= 248.5645
##$ABSF2= -253.2056
##$ABSG= 5
##$ABSL= 3
##$ALPHA= 0
##$AQORDER= 0
##$ASSFAC= 0
##$ASSFACI= 0
##$ASSFACX= 0
##$ASSWID= 0
##$AUNMP= <proc_1d>
##$AZFE= 0.1
##$AZFW= 0.5
##$BCFW= 0
##$BC_mod= 2
##$BYTORDP= 0
##$COROFFS= 0
##$CY= -3
##$DATMOD= 1
##$DC= 0
##$DFILT= <>
##$DTYPP= 0
##$F1P= 0
##$F2P= 0
##$FCOR= 1
##$FTSIZE= 65536
##$FT_mod= 6
##$GAMMA= 0
##$GB= 0
##$INTBC= 1
##$INTSCL= 5.30512e-09
##$ISEN= 30
##$LB= 1
##$LEV0= 0
##$LPBIN= 0
##$MAXI= 10000
##$MC2= 0
##$MEAN= 0
##$ME_mod= 0
##$MI= 50
##$NCOEF= 0
##$NC_proc= -7
##$NLEV= 6
##$NOISF1= 182.463
##$NOISF2= 159.3651
##$NSP= 0
##$NTH_PI= 0
##$NZP= 0
##$OFFSET= 248.5645
##$PC= 4
##$PHC0= -8047.154
##$PHC1= 3737.887
##$PH_mod= 1
##$PKNL= yes
##$PPARMOD= 0
##$PSCAL= 0
##$PSIGN= 0
##$REVERSE= no
##$SF= 81.014009
##$SI= 65536
##$SIGF1= 159.3651
##$SIGF2= -187.1042
##$SINO= 113.3802
##$SIOLD= 16384
##$SREGLST= <1H.CDCl3>
##$SSB= 0
##$STSI= 65536
##$STSR= 0
##$SW_p= 40650.406504065
##$SYMM= 0
##$S_DEV= 0
##$TDeff= 32768
##$TDoff= 0
##$TI= <>
##$TILT= no
##$TM1= 0
##$TM2= 0
##$TOPLEV= 0
##$USERP1= <user>
##$USERP2= <user>
##$USERP3= <user>
##$USERP4= <user>
##$USERP5= <user>
##$WDW= 1
##$XDIM= 65536
##$YMAX_p= 536323832
##$YMIN_p= -63842743
$$ End of Bruker specific parameters
$$ ---------------------------------
##NTUPLES= NMR SPECTRUM
##VAR_NAME=  FREQUENCY,     SPECTRUM/REAL,   SPECTRUM/IMAG
##SYMBOL=    X,             R,               I
##VAR_TYPE=  INDEPENDENT,   DEPENDENT,       DEPENDENT
##VAR_FORM=  AFFN,          ASDF,            ASDF
##VAR_DIM=   65536,         65536,           65536
##UNITS=     HZ,            ARBITRARY UNITS, ARBITRARY UNITS
##FACTOR=    0.620285442955139, 1,           1
##FIRST=     20137.2065510759, 0,            0
##LAST=      -20513.1999529892, 0,           0
##MIN=       -20513.1999529892, -63842743,   0
##MAX=       20137.2065510759, 536323832,    0
$$ Real data points
##PAGE= N=1
##DATA TABLE= (X++(R..R)), XYDATA
$$ [...]
##PAGE= N=2
##DATA TABLE= (X++(I..I)), XYDATA
15099 -10459279 -13327753 -14371563 -11153282 -5596095 -1065566 2604420 6665816 8757335
15091 8757335 6313982 2825727 4386345 10371701 13467031 9591419 2597886 -1973020
15083 -1973020 -3140742 -3020635 -3182993 -4213142 -5703900 -5445374 -1758381 2504760 2114878
15074 2114878 -2865412 -5621192 -1408080 5687850 8266674 5200762 1607286 839495
15066 839495 1125818 307633 -374623 912414 2889139 2899899 1051441 51872 1075482
15057 1075482 2053784 885939 -1378511 -2093927 -786542 535861 653214 691343 1812712
15048 1812712 3143121 3189500 2016052 711340 -203592 -489070 499171 2504399 3466696
15039 3466696 2006416 -85268 -252518 737757 221004 -1197271 135834 4618296 7475627
15030 7475627 5506031 2124888 2220484 4770937 4902621 1614794 -1393821 -2246112 -3354382
15021 -3354382 -6355962 -8857030 -8253788 -5575733 -3283482 -1755013 -191995 1053374
15013 1053374 1312364 1198357 1456474 1638828 1476336 1821352 2584155 1759154 -1454516
15004 -1454516 -4544695 -5035073 -4134033 -4584148 -6589859 -8397278 -9171105 -8746069 -6539544
14995 -6539544 -3489319 -2674545 -4755794 -5620283 -2609206 216264 -1431521 -3520713
14987 -3520713 778592 8827184 10790359 4619390 -511831 1759468 6367216 6434995
14979 6434995 3456152 2149785 1825005 -576156 -3897573 -5561239 -6637090 -8179970
14971 -8179970 -6957298 -1337177 2861013 -91956 -5851198 -5674691 254547 3659728
14963 3659728 1157288 -2177445 -2354849 -1278602 -704936 916312 3285614 2732859 -1261684
14954 -1261684 -3775415 -1625253 2181949 3999848 4774597 6590129 8171259 7280660
14946 7280660 4551003 2128389 1063044 1968551 5298620 9120236 9752281 6591704
14938 6591704 3392499 3188546 5236575 8366036 13013049 17388239 16065092 6548529
14930 6548529 -5525673 -11741912 -9730359 -3593304 2288969 6147186 7044011 4491566
14922 4491566 221645 -2521358 -2340419 -985962 -1000766 -2879588 -4600663 -3712339 -199725
14913 -199725 2979396 3085784 805702 -1087923 -1495274 -1396704 -1319961 -1070661 -1366456
14904 -1366456 -2612886 -2609393 721338 4614141 4148106 213295 -418714 5130176 10890188
14895 10890188 9766036 2257822 -5545812 -9197261 -8047129 -3438987 1761216 4108368
14887 4108368 2960633 1159195 726494 678895 574951 2282785 5842357 7730290 6317892
14878 6317892 4992450 6423145 7960721 6725740 4822111 4566688 2894003 -3296085
14870 -3296085 -9661520 -9267021 -2843615 2541746 3617703 3030222 2458595 768838 -1010941
14861 -1010941 146005 3250362 3684037 522589 -2568937 -4465739 -7807233 -11687743
14853 -11687743 -10691812 -4380737 -533015 -4209730 -9777000 -9509365 -4860117 -2401071
14845 -2401071 -2629327 -867891 2570814 1709647 -4589818 -8945974 -5561343 1435688
14837 1435688 4035164 1107784 -1739352 -1217673 18341 -746922 -1512791 682331 4264833
14828 4264833 5224155 3654016 4055085 8185485 11220393 7728750 -460702 -5474293
14820 -5474293 -2193863 6381235 12686067 11870493 5436484 -899470 -2483377 418125
14812 418125 3788763 4737427 4078830 3713136 3558881 2862222 2690445 4286317 5892120
14803 5892120 4394881 116263 -3022036 -2661035 -615220 584182 1136656 2423514
14795 2423514 4184390 5356150 6394077 8464108 10768346 10826679 7842981 4151060
14787 4151060 2337902 2079867 1332467 29577 347658 2793535 4614899 4038348 3777324
14778 3777324 6960842 10992474 9982667 3436556 -2221772 -2292404 433226 913162 -1176374
14769 -1176374 -2833066 -2643333 -862087 2428761 5797173 6126030 3467621 2924593 7327262
14760 7327262 11471154 9144829 2956276 662599 3704775 6461406 5904519 4548056
14752 4548056 3671906 1121863 -2831296 -4397613 -2904860 -2084461 -2853511 -1547757 2280241
14743 2280241 3537430 677222 24016 6000110 13174743 13890514 8745376 3417118
14735 3417118 -398521 -4142779 -6157279 -3726174 571160 1423560 -1225688 -2801967
14727 -2801967 -1904565 -1499963 -2619629 -2808130 -1418903 -1128279 -3098899 -5125319 -5578296
14718 -5578296 -5179437 -4192843 -1975855 -72309 -1501184 -5789306 -8665251 -7946117 -5886187
14709 -5886187 -4483861 -2728054 -326723 218736 -1975917 -3575805 -2168597 -602047
14701 -602047 -2221325 -4587454 -2771167 2628688 5934216 4798586 3180225 4486973
14693 4486973 6109750 3765746 -1519560 -4424153 -2286164 2225368 5364892 6303742
14685 6303742 6095594 5218832 3765279 2371308 1271129 -300409 -2238498 -2631129 -644433
14676 -644433 1299473 906171 64948 1981360 5333424 5833024 3540695 3354175 6792740
14667 6792740 8586946 4364810 -2786530 -7076837 -7482873 -6477579 -4840549 -2377314
14659 -2377314 -952119 -1920604 -2855693 -1549782 -635145 -2799356 -4179250 626975 8836026
14650 8836026 12597479 11134956 11151898 14286591 13463435 5070725 -3700040 -4906156 -567807
14641 -567807 2328557 1960412 848805 -300998 -1557225 -392328 4128356 6852620
14633 6852620 2882532 -3903516 -5391147 -728718 3409116 3157101 1313352 844318
14625 844318 959740 561081 125772 -678155 -2331898 -2318096 1797984 6133559 4081863
14616 4081863 -2902438 -5689611 -1182025 2233750 -2427187 -9563724 -9347911 -1963602
14608 -1963602 4195520 5280175 4889009 5412266 4337963 468955 -2324773 -178187
14600 -178187 5629499 10601103 11632687 8671844 4087188 1178617 1396311 2690526
14592 2690526 2267898 506970 -42825 1219714 2725273 4089211 6272146 8381602
14584 8381602 7934513 4936930 2236173 916113 -1068092 -4277316 -5541525 -2715915
14576 -2715915 1361796 2582675 1062118 19065 787608 1898107 2137198 1720643 872390
14567 872390 -246314 -306726 2062788 5390144 5608270 535742 -6633097 -9560233 -4936489
14558 -4936489 3853472 9861778 9545345 5725818 3086810 2367006 945751 -2177444
14550 -2177444 -5222997 -7253930 -9372445 -11426985 -11027262 -7586450 -4219390 -3331382
14542 -3331382 -3090579 -980792 1664919 1977101 483447 50256 920532 393991 -2786135
14533 -2786135 -6786413 -9486101 -10401134 -9783524 -8019156 -5879112 -3518613 230047
14525 230047 5541304 9494235 8925192 4746009 631779 -1958015 -4206329 -5839100
14517 -5839100 -4660600 -1007127 1068609 -1154851 -5465730 -7718293 -6235521 -2081301
14509 -2081301 2557395 4842959 2735920 -1982061 -4178665 -1099269 3864597 5276154
14501 5276154 2327046 -832696 -750773 1608586 2952931 1755704 -518528 -1599189
14493 -1599189 -1063346 -543522 -1481168 -3383508 -4721801 -4794261 -3975155 -2943909 -2555027
14484 -2555027 -3450009 -4754534 -4557047 -3011055 -2960472 -5357175 -6445293 -2829622 2826939
14475 2826939 5487002 5256994 5793409 6503831 3248202 -2906693 -5341904 -2508169 -1200462
14466 -1200462 -5234573 -8234883 -3684476 4089217 6483270 3490608 1471878 1080525
14458 1080525 -2932015 -10036944 -11466420 -2436271 9939235 14889223 9939736 1508662
14450 1508662 -3213373 -2205441 1273077 2228326 -1239762 -5835867 -6974209 -4193138
14442 -4193138 -430248 2904176 6269179 7886191 4229340 -4054113 -10876775 -11350187
14434 -11350187 -6659360 -1089912 2386856 2296450 -1605046 -6596267 -8361637 -6332099
14426 -6332099 -4626577 -5851856 -7616777 -7450291 -7002644 -8037828 -8251181 -5410756 -2290692
14417 -2290692 -2370367 -3113431 771122 8593421 13811758 12713040 7924262 3112497 -764964
14408 -764964 -3110173 -2580007 -174336 668416 -901628 -1564026 766810 3484534 3543674
14399 3543674 1753693 77512 -2016821 -4970903 -5874668 -2396303 1837315 1023967
14391 1023967 -3878667 -5217375 860377 8347797 8717977 1575530 -5343916 -5644788
14383 -5644788 -693859 3528013 3630832 1650842 1536160 4059734 5881598 3582083
14375 3582083 -2292412 -8030889 -10854557 -10725681 -8518572 -4680313 -320968 2534675
14367 2534675 3065604 2375759 1095511 -1482969 -4353764 -3884197 879532 4563413 1802308
14358 1802308 -4094944 -4459163 2434595 8395192 6843159 1637545 418929 3767685
14350 3767685 6302873 5496113 3496664 1760242 -223569 -1238261 918282 4471900
14342 4471900 4842083 1909231 777540 3468284 5402586 3256486 971005 3192747
14334 3192747 6962726 5947434 435693 -3407134 -3500261 -4449040 -8949876 -12479735 -9730736
14325 -9730736 -2409771 3056606 3398379 773630 -1587653 -2886453 -3977545 -5359440
14317 -5359440 -6522899 -6358958 -4224927 -1190684 420947 -305072 -1367272 -328413
14309 -328413 2084292 2388639 -1435330 -7268252 -10730530 -9040863 -3111571 3100793
14301 3100793 5250702 2009409 -3460234 -6379277 -5300417 -3127170 -2610103 -2632399 -833009
14292 -833009 1556792 740606 -3623572 -6744033 -4669376 636035 4542004 5976812
14284 5976812 7126943 8151929 6460521 1892110 -1409535 -564649 1510957 160112
14276 160112 -4274096 -7157089 -6162991 -3603717 -2070214 -1423792 -1368811 -3456463 -7773592
14267 -7773592 -10221228 -6959777 -544564 2518436 673810 -457020 3394894 8337537
14259 8337537 7775147 2166133 -1532825 398480 4215825 5220014 3793942 2439156
14251 2439156 813639 -2399194 -5366405 -5321766 -3499412 -3361945 -4515428 -3155238 984543
14242 984543 2992358 -94356 -4682327 -5804548 -3609640 -1624716 -1175602 -949151 -277025
14233 -277025 611961 2484348 6018773 9581141 11026732 10951706 11088952 10303218 5971992
14224 5971992 -712784 -4854483 -4124709 -1230513 1098322 3654129 7101203 8586957
14216 8586957 5563631 415471 -2637009 -3455131 -4564300 -5101436 -1535933 5002933
14208 5002933 7665373 2999291 -3159016 -3118326 2120804 4712405 1065720 -4365083
14200 -4365083 -6748061 -6655486 -5883138 -2846346 3236276 7287108 3655316 -4796649 -8992534
14191 -8992534 -5461559 -172580 922252 -559164 -389230 974059 786411 -75755 789426
14182 789426 1539207 -1740236 -7854696 -10972786 -8484638 -3570480 400851 3009182
14174 3009182 3456242 -425572 -7451346 -11983392 -10682712 -6890925 -5422056 -6280965
14166 -6280965 -6553664 -5333128 -3338703 -426576 2976865 4513602 3492813 3079501
14158 3079501 4972443 5128829 69777 -5435983 -3909666 3000626 6044881 2179510
14150 2179510 -1382296 481652 2481233 -1815435 -8853120 -10465645 -6565174 -4599964
14142 -4599964 -7455450 -9298537 -4818015 3155332 7867309 6617508 1839033 -3033616
14134 -3033616 -5885437 -5658269 -2622754 1097416 2956083 2380267 1138734 1242039 2886545
14125 2886545 4656984 5534067 5990344 6385878 5041575 78422 -6358507 -8570171 -4307996
14116 -4307996 940432 271334 -5221533 -7827607 -4137006 560954 861932 -770632
14108 -770632 1053242 5237064 5647859 925327 -3112946 -1857435 2411795 5314965
14100 5314965 6352133 6941873 6177018 2732618 -1276705 -2681567 -2201892 -2860068 -4425620
14091 -4425620 -4009851 -1917344 -1894539 -4716346 -6449296 -4811280 -2501977 -1770560 -473570
14082 -473570 2896908 4701731 1407281 -4123913 -6842836 -7191656 -8750486 -10469294
14074 -10469294 -8094716 -2506470 548315 -369370 -490028 2175928 2808156 -2080684
14066 -2080684 -8338151 -10013263 -6899870 -2416918 1771096 4954847 5124415 1964057
14058 1964057 -995961 -1194874 -799201 -1820051 -1463933 2641166 6310297 4001422 -2542560
14049 -2542560 -7133184 -8352482 -9203819 -9483408 -6340599 -1926492 -2217578 -7062988 -9286958
14040 -9286958 -6080214 -3861807 -8180317 -15311005 -18454417 -16949179 -14440753 -12344040
14032 -12344040 -10281740 -9463381 -10376548 -9840051 -5459638 -728333 -377113 -2374091 -403518
14023 -403518 6106786 10257579 7112799 -41182 -4987186 -6212300 -6265503 -6064495 -3549967
14014 -3549967 2241500 8438431 10744602 7699486 1862490 -2820373 -4236148 -2967307
14006 -2967307 -946023 163903 -249297 -1793905 -3744048 -5592368 -6616876 -5515697
13998 -5515697 -2013064 1348275 1432007 -895005 -1353449 1271870 2930650 1031460 -902731
13989 -902731 507836 1854187 -1184667 -4706096 -1590068 5837290 7609072 1474988
13981 1474988 -3283150 -617186 3048610 -92057 -6880931 -9253482 -6742967 -4993271
13973 -4993271 -5751754 -6204398 -5910043 -7044752 -8876167 -8461880 -6397468 -6335562 -9024515
13964 -9024515 -11565046 -12195018 -11528284 -9677483 -6262176 -2624029 -364392 1246107
13956 1246107 3030493 3113422 344847 -1988431 -762774 1157310 -528383 -3430907
13948 -3430907 -1864201 2823206 3072945 -3071232 -8294715 -6317624 85409 4020229
13940 4020229 2849008 -772627 -2765215 -909921 2991527 3967536 -156108 -4618026
13932 -4618026 -3607427 1190927 3318331 1493183 233231 1175080 1344818 462169 1767807
13923 1767807 4048823 1492171 -5484519 -7771105 -461121 9387290 13093954 11411508
13915 11411508 9359876 6796596 1549609 -3193823 -2601242 1808378 4771382 5245491
13907 5245491 5440768 4596479 495438 -4627167 -6275703 -4780840 -4271997 -5459659 -5228630
13898 -5228630 -2897258 -1226252 -1152959 -685842 642642 961089 221290 877184 3627572
13889 3627572 6068028 6259301 4728022 2731463 1114717 569310 669580 -311077 -2252398
13880 -2252398 -1973889 1555376 3545266 -211437 -5505056 -4408776 3137559 8927067
13872 8927067 7869825 3367654 280817 -982928 -1135310 1063507 4946695 5961804
13864 5961804 1804360 -2993950 -2735274 1735455 4815069 3749040 810448 -1030923
13856 -1030923 -1375274 -1528281 -2517913 -3985429 -4219406 -2175571 119084 -812868 -4865741
13847 -4865741 -7455248 -5582773 -2388579 -2830121 -6592280 -8770774 -6868548 -3440692
13839 -3440692 -1354792 103245 2639861 5005076 4340618 533017 -3369854 -5210542
13831 -5210542 -5903392 -6705371 -6480790 -3693446 229935 2212302 1905952 2048441 4080073
13822 4080073 6143118 6373062 5413802 4187240 1977972 -1126348 -2593687 -1045823
13814 -1045823 894974 564934 -339599 617545 814076 -4064054 -11649239 -14157812 -9197633
13805 -9197633 -3497942 -3319454 -6291819 -6500238 -3427749 -961265 -180963 1478353 4559869
13796 4559869 5722929 2243108 -4622574 -11143035 -13626730 -9882623 -1446748 5461045
13788 5461045 4893898 -1581923 -5845169 -3231088 1665955 1938134 -2052402 -4416220
13780 -4416220 -3105404 -1828084 -2427907 -1463826 2884407 5702833 1925471 -5250813
13772 -5250813 -8197702 -5683309 -4002324 -7034809 -10880664 -10376985 -6151214 -2012075
13764 -2012075 1069881 4426614 7226163 6609761 1980823 -3713709 -7189662 -7463876
13756 -7463876 -5299281 -1736419 2203515 5090259 5160008 1706439 -3007665 -4434665
13748 -4434665 -309655 5931265 8518551 5869452 1318124 -2122038 -4210990 -4593845
13740 -4593845 -1822960 3075978 5769935 3624210 -1164737 -5058314 -6900980 -6807069
13732 -6807069 -4772900 -2131255 -1028265 -948618 554017 2638376 1638930 -1871148 -2813452
13723 -2813452 -918388 -2775818 -10061008 -13676590 -6743843 3494922 5633449 517610
13715 517610 -2207681 112947 1755090 876595 1937567 5871686 8162799 7805537 8791408
13706 8791408 11301647 10547748 6172525 3823871 5097275 4775070 785543 -2051077
13698 -2051077 -1587748 -2562116 -6794574 -8017606 -2230959 4680979 6161889 4849583
13690 4849583 6240906 8655327 7346173 4001538 4062651 7290498 8281799 5028573 1022313
13681 1022313 -460301 364061 1620400 1770999 727219 601976 3206369 6140350 5380943
13672 5380943 2403958 2809244 6405342 6371097 1484892 266171 7136785 13302420 9783399
13663 9783399 1867662 273240 3881266 3107088 -3132416 -6300832 -3152545 57012
13655 57012 -608325 -1273129 1045646 3420341 3777820 4823448 7886513 9564659 7717772
13646 7717772 4977437 3509062 1777963 -921545 -2063492 -547350 1227048 2059788
13638 2059788 3569871 5249341 3814421 47054 33872 5920547 11336707 10599866 7120831
13629 7120831 7145727 9564314 8388121 2731195 -2020244 -2065520 997882 3952258 5283501
13620 5283501 4746241 3153625 2630919 4125820 4968347 1964962 -3280057 -5477400 -2629898
13611 -2629898 1179769 1283585 -1678506 -3207570 -907338 2956967 4573579 2773949
13603 2773949 -293543 -1814878 -865970 1461142 3584699 4541234 4006509 2078817 -587998
13594 -587998 -2702679 -2945003 -1256799 426553 -279556 -3138918 -4836546 -3146507 -565583
13585 -565583 -1307995 -5173685 -7659512 -6433009 -3865897 -1922800 1183877 6599532
13577 6599532 10998048 10926609 8080236 6308757 5943352 5395225 5935871 9612609 13878468
13568 13878468 13962817 10242530 7752016 7942355 6415966 444239 -6074431 -7742070
13560 -7742070 -4433469 -526822 382966 -1853337 -4878538 -6019942 -4517854 -2032263
13552 -2032263 -306616 743117 1426859 772836 -1006276 -844175 2855013 6316597 5215617
13543 5215617 1668038 1243527 4134929 5045759 1559089 -3240128 -6732549 -9452677
13535 -9452677 -11149168 -10091563 -7408150 -6416178 -6687849 -4803227 -1696492 -1991099 -4595934
13526 -4595934 -2452805 5142246 8789724 2810735 -5322433 -6252951 -2323891 -1589239
13518 -1589239 -3880042 -2450552 3587785 7928360 7270284 4758110 3139699 1427498
13510 1427498 -978297 -2607438 -2998142 -2725292 -495295 4968781 10513977 11203577 7399125
13501 7399125 4197246 3751132 3362558 1553066 406648 524315 -998830 -5162685 -7958123
13492 -7958123 -5555313 357947 4865562 5319527 2844248 360907 582723 4251861
13484 4251861 9068907 11491829 10123607 6324314 1910276 -1996249 -4297327 -4292196 -2719480
13475 -2719480 -853739 843804 1720960 194286 -3617322 -6252674 -4938679 -1628498
13467 -1628498 355046 1707251 4754480 7488944 5706375 532269 -2256909 -956352
13459 -956352 21175 -1870665 -3276052 -1216103 2070002 3538685 3740538 3605220 1514349
13450 1514349 -2600965 -4509335 -1572693 1959830 400064 -5001660 -7921558 -5703309
13442 -5703309 -1657784 698435 1510507 2441497 3894899 5152324 5476258 4782001 4060446
13433 4060446 4436450 5196678 4425363 2543131 2849075 6835788 11341133 12549429 10627712
13424 10627712 8023559 5419762 2210175 -917472 -2846125 -4003307 -4963149 -4850363
13416 -4850363 -3559836 -3233005 -4617696 -4538904 -501032 4776193 7379531 7984130 8906571
13407 8906571 8352639 3776820 -1251285 -930799 2892728 2653899 -2758782 -6127084 -4016493
13398 -4016493 -2088265 -4573562 -6782985 -3950296 -464483 -2751166 -7966169 -8010585
13390 -8010585 -1990806 3156515 3085683 -109729 -3859143 -7919767 -10721098 -9381001
13382 -9381001 -5005603 -2769204 -4955684 -8263612 -9414786 -9080684 -8651228 -7439325
13374 -7439325 -5236734 -3836888 -3701578 -2455451 1052580 4335056 5153321 4769491 5042866
13365 5042866 5407766 5269852 6144540 8257679 8136325 3556708 -1540305 -1558214 2860877
13356 2860877 6049008 5628297 4784890 5902469 6632842 4161232 -44185 -2183817 -923193
13347 -923193 1666402 2731370 866166 -3134665 -6513834 -6447634 -2899543 948303 2043661
13338 2043661 848358 482408 2571296 4847877 3611361 -1522235 -6297629 -6160552
13330 -6160552 -1461445 2933158 3043620 -732784 -5376248 -8223716 -7750225 -4157442
13322 -4157442 -612539 -1233638 -5782284 -8875711 -6914037 -3018163 -1810920 -2304229
13314 -2304229 -863391 1067032 -1214708 -6489635 -7482909 -1813230 3707089 3472867
13306 3472867 1764596 5343212 11786613 12522775 5824413 -645036 -1124214 925724
13298 925724 -401189 -4491209 -6420027 -5091355 -4117519 -5303977 -5889026 -3407105 178373
13289 178373 1333923 -231852 -1841683 -1383153 1686878 7301631 13641327 16064029
13281 16064029 11272005 2853340 -1546432 190045 2292223 391380 -1938452 -47939
13273 -47939 3091353 1431844 -3789824 -5738965 -3234324 -2562429 -6887727 -11215251 -10749952
13264 -10749952 -7820521 -6573608 -6383096 -5362270 -5744682 -9969449 -14526685 -13674345
13256 -13674345 -7720468 -2341175 -616146 -630348 -441832 -534192 -945997 -244323 1621823
13247 1621823 2711923 2215695 1527618 1702359 2352583 3371287 5186935 6972960 7042127
13238 7042127 5250328 2662091 -958312 -6305915 -11143775 -11419524 -6908417 -2514166
13230 -2514166 -2338906 -5210713 -7752527 -9034043 -9787868 -9326567 -6276453 -1386519 2825372
13221 2825372 4787176 4682993 3444676 2497156 3387872 5788467 6907261 5007528 2410214
13212 2410214 2219787 2918883 153906 -5571002 -7497302 -1679744 6092901 6919224 649792
13203 649792 -3971933 -1167098 5072727 7958736 6830151 5243205 3786776 310094
13195 310094 -4046000 -4797219 -952297 2688383 1876807 -1805327 -3776483 -1731301 3465906
13186 3465906 9246203 11883283 8508878 952805 -4790227 -5140119 -2660739 -1266486
13178 -1266486 -928802 -250616 -994623 -5222173 -9711423 -8557045 -1342980 5715999 7391219
13169 7391219 4465375 559328 -2209607 -3041206 -1357694 1896315 3990224 3374865
13161 3374865 1566114 766541 901621 232659 -2089166 -5177656 -7596796 -8774813 -9433163
13152 -9433163 -10455377 -11023350 -8820974 -3114187 3430486 7489654 8623550 8430681
13144 8430681 7611173 6354664 6342395 8943078 11833354 11016661 6551657 2884752 2763870
13135 2763870 4119021 4100033 2996548 2453459 2488499 2228342 1621241 837217 -305454
13126 -305454 -1272872 -1229736 -1336731 -3914433 -8085897 -9454717 -6273997 -2878988 -3967122
13117 -3967122 -7900180 -9221456 -6156259 -1855451 903610 2401285 3391726 3476697 3033652
13108 3033652 3939912 6851048 9505683 9160940 5845075 2362822 1608153 4051078 7149928
13099 7149928 7345785 3674474 -692574 -1755630 516126 2322834 1285827 -472356
13091 -472356 193990 2641875 3420821 1323019 -1321722 -2820837 -4699072 -8297095 -11243469
13082 -11243469 -10539741 -7840576 -7414559 -8601810 -5207987 5046484 14776959 15234387
13074 15234387 7860662 2134531 2750839 4909119 3486709 972694 2558415 7292751
13066 7292751 9002428 4633397 -2408707 -7050225 -7419980 -4560824 -133617 4201456
13058 4201456 6677112 6263642 3539900 327584 -1426492 -608547 2450319 5898699
13050 5898699 7311812 5519918 1977803 -105372 986839 2977500 1662521 -3777107
13042 -3777107 -8991225 -9489710 -6201797 -3861452 -4652567 -6147373 -5572787 -3426802 -2077061
13033 -2077061 -2873465 -5465799 -8191965 -8560676 -5320255 -785753 832422 -1758766
13025 -1758766 -5601109 -7522485 -7291091 -5996115 -3925553 -1514865 -31732 408808
13017 408808 1309423 2445454 509763 -6145877 -13146410 -13754926 -6619568 2492041 6739690
13008 6739690 4422655 -646335 -3523971 -2684228 -724919 -571473 -1734968 -1881701 -1319185
12999 -1319185 -2694019 -5773556 -6380814 -2379338 2857298 5524401 6437916 7625311
12991 7625311 7270946 2793119 -3303986 -5986466 -5171909 -5509608 -8724475 -11059686 -9161702
12982 -9161702 -4316629 268544 2775535 2433829 -472763 -3091026 -1993395 2015460
12974 2015460 4495278 4000258 4185765 7352511 10024348 8168409 3464409 464302
12966 464302 -118439 -1128089 -3493750 -5297992 -5738948 -5965613 -5805149 -3507579 351651
12957 351651 2253198 667434 -1387634 -935995 329690 -1050278 -4552044 -6482425
12949 -6482425 -5899090 -5586298 -6385918 -4985637 -70362 3176571 -533650 -7834473 -10221841
12940 -10221841 -6177629 -3361492 -6741134 -11023984 -9345498 -3906990 -1233420 -578133
12932 -578133 4455143 13631454 18292954 13857803 6403987 3101087 2750216 910325
12924 910325 -1230241 186946 3519133 3795014 1601299 2674668 8264760 12249773
12916 12249773 9599340 2584601 -3737331 -7910788 -11088533 -13028321 -12434854 -9456772
12908 -9456772 -5272583 -608502 3401660 4645041 2597251 26904 -243312 805360
12900 805360 134462 -2642600 -4939757 -5265087 -4885913 -4926160 -4172761 -1142734 2981681
12891 2981681 5009990 3198692 -741570 -3355684 -2994722 -1261166 -567911 -854205 -22005
12882 -22005 2431846 4098925 2801104 -672012 -4181088 -6833229 -8269390 -7204265
12874 -7204265 -3317989 506019 833015 -1667171 -2861201 -453523 3775941 6973943
12866 6973943 7870222 6361785 3220453 605762 162648 209982 -2256769 -6293177 -7163055
12857 -7163055 -2854473 3010347 6303141 7001675 6833047 5879252 4015646 2482897 1367942
12848 1367942 -1310446 -5389145 -7190178 -5564699 -4950439 -7936606 -9363956 -4189593
12840 -4189593 2576996 1972550 -4851829 -7756820 -2973024 1943941 829941 -2240831
12832 -2240831 -1263014 2056690 2938251 2120240 3165656 5160048 4877715 3611865 4958332
12823 4958332 7020219 3775446 -5094719 -11796680 -10076316 -2907303 2145513 2055921
12815 2055921 -273755 -1789786 -2833928 -4768559 -6848229 -7193198 -5822808 -4786925
12807 -4786925 -5189456 -5832304 -5487211 -4729563 -4320236 -3700197 -2911873 -3913528 -7352742
12798 -7352742 -10158132 -9864530 -9231957 -11796493 -14489551 -11004015 -2414831 2458462
12790 2458462 -1119484 -8059095 -11728340 -11337076 -8078318 -1216891 6990741 9131933
12782 9131933 1969498 -7157057 -9901023 -8053679 -7797512 -7721539 -2100413 6774275 10115369
12773 10115369 6207946 2517060 3081590 3417549 651772 -537509 3202206 6846229
12765 6846229 4803433 -9338 -1179364 1349787 2784789 2079049 2816472 6596489
12757 6596489 10749870 12512809 11453364 7829790 2195672 -3010739 -4722805 -3066695
12749 -3066695 -1561888 -2396416 -3346324 -957679 4152066 7069436 4243884 -1742911
12741 -1742911 -4475061 -653726 6707533 12189358 13029310 9523586 3163086 -3311887
12733 -3311887 -6244064 -4614660 -1912917 -1530023 -1935988 80719 3284547 3908449 2573333
12724 2573333 3619695 7385888 8946973 5723758 809834 -2891596 -6029407 -7941653
12716 -7941653 -4776053 3296486 8494049 4682255 -3627453 -7361901 -5193425 -3755280
12708 -3755280 -7187609 -12455637 -14872460 -13208508 -8911140 -4385009 -2423338 -3718020
12700 -3718020 -4742200 -1587141 4071617 6562637 4046021 841050 1044684 3535031
12692 3535031 4814781 3721315 1684059 815419 2940534 7823165 11249276 8215616
12684 8215616 -9947 -5326879 -2230300 4902541 7487869 3589909 -1126678 -2088913
12676 -2088913 -502532 1066812 2832756 5188358 5798398 2793219 -1319979 -2519203
12668 -2519203 -912484 -51619 -1088909 -1357855 528043 1606899 -1541327 -8089530
12660 -8089530 -13974726 -15937188 -13091313 -6534636 438071 3462909 1286581 -1908113
12652 -1908113 -922285 4016263 7546128 5787756 422165 -4023460 -4967882 -3497057
12644 -3497057 -2900793 -5657200 -10468545 -12594478 -8911699 -2251368 1526342 518939
12636 518939 -1884801 -2786404 -3499755 -6020819 -8706341 -8092816 -3668886 1396257 3775232
12627 3775232 2797567 219871 -1711491 -2251412 -2698732 -4374017 -6021638 -4692478 105876
12618 105876 4687484 5005867 1363178 -1970031 -1367362 2999279 8237091 11648741 12170464
12609 12170464 9857409 5315032 172705 -3023771 -3141740 -2460173 -4128940 -7183767
12601 -7183767 -6858722 -1350729 4664433 5853087 2838921 -447929 -3344240 -7383340
12593 -7383340 -10350485 -7801044 -1020806 2839767 978960 -150597 5969574 15716133
12585 15716133 19030425 11748237 384420 -5126512 -1065443 7551237 12510590 10343195
12577 10343195 5066221 2808356 4851144 7865792 9623176 10659739 10485927 6846728
12569 6846728 280249 -4707234 -5247912 -3459824 -2045914 -144365 3676586 7568007
12561 7568007 8855928 7926146 6655388 5119153 2608599 -196668 -2647359 -5473588
12553 -5473588 -8261783 -8239684 -4444286 -395214 650355 481201 2337795 5055063 5030302
12544 5030302 2190963 -282291 -840860 -143694 1861788 5116798 6784370 4001344
12536 4001344 -1107243 -3556004 -2580919 -2268945 -4737289 -6988633 -5816608 -2280922
12528 -2280922 440237 1223256 1545992 3371321 7168802 10940543 11528496 8324292 4810774
12519 4810774 4461979 6150759 6035341 3011361 -423339 -1847694 -657797 2785529
12511 2785529 6488744 6392916 637331 -6144748 -7079917 -1939482 2404853 1227401 -2564080
12502 -2564080 -3833785 -2282482 -1530375 -3710110 -7528561 -10295130 -10147574 -7394289
12494 -7394289 -4699954 -4651051 -6416622 -6406232 -3000034 1120769 2411655 694504 -1325028
12485 -1325028 -1722967 -1262206 -1954387 -4429282 -6842022 -6602974 -3372137 302302 1751890
12476 1751890 730375 -1248973 -2778565 -3013403 -1833352 -480241 -317797 -282682 1796936
12467 1796936 4398339 2777886 -3350241 -7066718 -3448353 2382693 2122613 -3628955
12459 -3628955 -6801936 -3870356 627893 2387277 2075245 797639 -2277836 -5480670
12451 -5480670 -3954715 3240536 9952044 10035079 4104399 -3003408 -7674208 -8318787 -4886662
12442 -4886662 -246217 1485487 257248 141845 2356982 2990999 347975 -756782
12434 -756782 3607302 9240285 9260803 3684467 -1717292 -3700547 -3289557 -1094045 3142769
12425 3142769 6694263 5229886 -804551 -5491465 -4633918 -411367 2442589 2141421
12417 2141421 -110043 -2971178 -5383111 -5385331 -1206803 5844600 11080068 10518641 5303527
12408 5303527 813375 780711 3578551 5445677 5650272 5974644 6291841 4266745 -379331
12399 -379331 -4824475 -7310423 -9172503 -11453340 -12598270 -11255008 -8618688 -6154968
12391 -6154968 -3602793 -1138159 -714680 -2703675 -3624599 -334951 4955644 6770561
12383 6770561 2873576 -3441634 -7224146 -6590118 -3841832 -2541784 -3227696 -2747239 797549
12374 797549 4051990 2649667 -1704794 -3176747 -683101 892148 -711786 -1939305
12366 -1939305 -1280381 -3231940 -9924224 -15395396 -14363326 -11070828 -12047767 -14723711
12358 -14723711 -11896715 -4508096 -568540 -2440989 -4474232 -3692186 -3678455 -5825943
12350 -5825943 -5442961 -338229 4179496 3744852 2272367 5207366 10099212 10224766 4943140
12341 4943140 259807 -171984 761214 -668706 -3092309 -2059166 3438802 8506648
12333 8506648 7297209 87947 -6315033 -6565133 -3387512 -3463521 -8121255 -12322540 -12709163
12324 -12709163 -11614231 -11612223 -11066810 -8139215 -5121101 -4788936 -5377232 -3422097 408138
12315 408138 2551065 2229156 1661215 1466905 270853 -1245538 -450456 2203389 2604470
12306 2604470 -568176 -2610811 816626 6623348 7567013 1875407 -4181681 -4343499
12298 -4343499 -229804 1116657 -3414466 -8679689 -7473918 227253 6431490 4240948
12290 4240948 -3933509 -9312360 -7264747 -2048294 -59447 -1230541 -268925 4713566
12282 4713566 8878648 7232690 1449113 -2438536 -1543884 1429536 2625020 1220893
12274 1220893 -981707 -1772774 276214 4604775 7520384 4312452 -5497827 -15979913
12266 -15979913 -19782680 -15271904 -7681060 -3506062 -4818717 -8764834 -11168707 -10043243
12258 -10043243 -6412769 -2722880 -727018 -520142 -966768 -794994 299778 1298225 1049077
12249 1049077 -3707 -301037 150668 -675536 -3073437 -3317924 1837331 9280342 11876506
12240 11876506 7089670 -193064 -4459965 -5716477 -6949361 -8563231 -8195259 -4377963
12232 -4377963 1898799 8040433 10830713 8515383 3617247 1511095 4148940 7440327
12224 7440327 7204088 5166500 5744479 8984341 10841100 9503767 7269541 6058233
12216 6058233 4763488 1970128 -1387618 -3213029 -2664049 -1027188 -946961 -3897517 -7404659
12207 -7404659 -6749069 -1436032 2444177 -437687 -7034754 -9810185 -6746616 -2657242
12199 -2657242 -1244352 -1193544 -543492 323976 1261176 3029195 3923242 770375 -4612688
12190 -4612688 -5266601 1242530 7783187 6719050 206648 -3616434 -1888406 1196836
12182 1196836 2349418 2922098 4273147 4557319 2069937 -1582826 -3685162 -3728904 -3038540
12173 -3038540 -2591590 -2410231 -2127375 -1416515 -551239 -605360 -2091856 -3584772 -3204751
12164 -3204751 -1585131 -1591564 -4372449 -7255460 -6910417 -3773621 -1807168 -3728890 -7523713
12155 -7523713 -8473665 -4487320 1395973 4330340 2881376 -167595 -1955471 -2710937
12147 -2710937 -4033161 -5744336 -6276350 -5397260 -4569416 -4610133 -4660344 -3782029 -2168909
12138 -2168909 -318721 1683731 3340161 3271891 529561 -4166925 -9029178 -12335020
12130 -12335020 -12566795 -8776608 -2214119 3272177 4435902 2357772 1297294 3324806
12122 3324806 5682554 4495937 -184705 -4485278 -5087977 -2017452 2501661 6251333
12114 6251333 7828516 6658626 3078718 -1843337 -6624403 -9397531 -8639762 -5128542
12106 -5128542 -2450732 -3637189 -7307608 -9090288 -7214032 -4696328 -5142626 -8118399
12098 -8118399 -9847282 -7295849 -757124 6360568 9728588 7742281 3830124 3433800
12090 3433800 7738849 12176303 12079012 7719367 2632122 -510449 -761741 1497461 3560780
12081 3560780 1849223 -2935301 -5228656 -2616729 -818560 -5430135 -11699676 -9735162
12073 -9735162 964899 9879809 9492765 3643310 -553236 -1849743 -1673067 1591284
12065 1591284 8727439 14539069 13562124 8458116 6124109 7143641 6139531 2133480
12057 2133480 889528 5101725 9131512 7252066 1855114 -1180906 -1351400 -2312837
12049 -2312837 -4153502 -2895591 2332054 6915982 7149548 5060588 4566137 5690666
12041 5690666 5444975 2857854 335402 404260 3021162 5892770 6135172 2316123 -3479252
12032 -3479252 -6294025 -3145903 2973069 6163402 4745867 2804093 4023293 6817991
12024 6817991 7227833 4213184 -370453 -5268027 -10173144 -13311074 -12045459 -6678755
12016 -6678755 -1224452 909005 454312 278234 1161247 1343052 -154692 -1639649 -950072
12007 -950072 1544443 3363403 2970295 1099830 -962547 -2731318 -3479256 -1820861 1958504
11998 1958504 4824766 4652706 3610425 4835480 6864151 5552097 1364050 -312440
11990 -312440 2499524 4911999 2982386 171678 1489792 4878923 4113169 -1599093
11982 -1599093 -6630847 -7079029 -4672381 -2166459 308102 2982405 4640016 5015245
11974 5015245 5922458 8012547 8787253 5870322 678451 -2929201 -2836017 -455090 1030017
11965 1030017 -344392 -3581194 -5844220 -5608852 -4077825 -3061324 -2924270 -3641595 -5730684
11956 -5730684 -8010603 -6706386 -300574 6095147 5497835 -1765293 -7596192 -5824209
11948 -5824209 909689 5341610 3948076 -659991 -3867037 -3631408 -1430630 200819
11940 200819 511835 397786 -109699 -2107199 -4905439 -5596428 -3369183 -1560527 -2858355
11931 -2858355 -5043909 -4484874 -1262930 2436055 5980113 8316761 5844127 -2214419
11923 -2214419 -9197300 -8274573 -2310117 402592 -1528416 -2403343 -539554 -509419 -3487076
11914 -3487076 -4493033 -1765545 -520690 -3927923 -7821383 -8164543 -6813694 -5923596
11906 -5923596 -3437859 1452240 4756696 4181580 3143149 3855976 2731611 -2415444
11898 -2415444 -6938121 -6661476 -4565903 -4442340 -4074921 -1146753 246676 -3624641 -8362297
11889 -8362297 -8286715 -6007737 -6934675 -8929738 -6319674 -305192 3644369 5220631 6918220
11880 6918220 5972503 -1041628 -8580536 -8337070 -3102880 -2664135 -7098564 -7135703 -1522200
11871 -1522200 20996 -5856422 -9765912 -6070917 -2710784 -6681547 -11231316 -7534917
11863 -7534917 82812 1890293 -1013488 -230508 4193806 3826826 -3131182 -7993797
11855 -7993797 -4763012 1579560 3373302 545552 -1366561 597223 4386771 6691295
11847 6691295 6318249 4534513 3643633 5054770 8000613 9916655 8115390 1870742
11839 1870742 -5934956 -9846298 -6808905 -288307 3115468 1605493 -325026 821255
11831 821255 2773073 2392411 1484089 3545025 6957015 6170487 -502825 -8020006 -10375427
11822 -10375427 -6953891 -2372678 -1455066 -4966700 -9527073 -11167615 -8696421 -3410865
11814 -3410865 3165891 9278055 11704320 8159072 1505387 -2123779 -884091 749521
11806 749521 -490668 -1292179 2451673 7982576 8807255 3770043 -1860941 -3745786 -2470204
11797 -2470204 -198412 2457528 5282551 7310437 7809033 6377894 2343941 -3293586
11789 -3293586 -6083552 -2264358 5124563 8646230 6122827 3368352 5101930 7839283
11781 7839283 5905787 856726 -870832 1658427 2023951 -3771368 -10783238 -11543421
11773 -11543421 -5812489 -52323 1474952 1052083 2418191 4745770 4082923 -647279
11765 -647279 -5779340 -7314056 -5245957 -2430073 -494536 1349321 3861125 6180947
11757 6180947 7305411 7506688 7154181 5553571 2654448 776276 2179447 5182436
11749 5182436 5383125 1357084 -3352210 -5023577 -4080101 -2965003 -2117314 -587446 1156759
11740 1156759 2035748 2867660 5087395 7699230 8490216 7675181 7146532 6575652 3901468
11731 3901468 -316169 -2931957 -3101234 -3201302 -4132304 -3990069 -2679425 -3153937 -5884556
11722 -5884556 -6783080 -3693588 -512769 -1044013 -2893981 -2019900 498218 1687403 3318952
11713 3318952 8525540 13640463 11060438 879382 -7104732 -5314876 2751408 8271931
11705 8271931 7703225 4490314 2769409 2655102 1349428 -2737067 -7375516 -8457523
11697 -8457523 -4992361 -862481 -287395 -3098446 -6234855 -7830337 -7320642 -3895750
11689 -3895750 1597273 5207252 4307700 1631305 700134 -318631 -4622532 -8937628
11681 -8937628 -7098605 -754914 1749479 -1825583 -4482118 -2246668 -772348 -4726861
11673 -4726861 -8538705 -5070715 2183690 4093723 -13896 -1839956 2904196 8805164
11665 8805164 9672420 6997968 6240561 8407124 9158765 5333204 -478955 -2892749 -346562
11656 -346562 2936312 2451710 -786841 -2327531 -1023574 1821 -814831 -1042219 818839
11647 818839 2078321 167056 -3063028 -4326816 -3657561 -3330663 -4183845 -5530370 -6616910
11638 -6616910 -5985614 -2016674 3519385 5616548 2799672 373306 2949241 7025872
11630 7025872 6261839 1705640 413008 4586620 8600895 7921875 5168405 4792796 6364945
11621 6364945 6655396 5390011 5097313 6460663 7121322 5196109 1655346 -1551952 -4129316
11612 -4129316 -6722532 -8278513 -6366484 -1143776 3019004 2323608 -1211334 -2500255
11604 -2500255 -808067 -165973 -1801070 -1294815 4074587 9871908 10592843 7554298 5661375
11595 5661375 5107099 2335908 -2120078 -3429767 -665216 923785 -2059124 -5948857
11587 -5948857 -5884232 -2863750 -1148855 -1281126 59761 3997875 6867023 4462527 -2933267
11578 -2933267 -10444499 -12725370 -8272931 -692529 4089878 2736128 -2699039 -6946937
11570 -6946937 -6786581 -4052135 -3114039 -5643508 -8961868 -10088790 -9906271 -11300165 -13878064
11561 -13878064 -13502163 -7945577 -407764 4382860 5582246 5533470 5206849 3264242 -593409
11552 -593409 -4041277 -4816787 -3536743 -2878848 -4472078 -7050413 -7574418 -4304273 1016215
11543 1016215 4317143 2874071 -2231913 -7185866 -8604252 -5963565 -1635420 1547980
11535 1547980 3088370 4481886 5782647 4532257 -112625 -4385188 -4316843 -1648293
11527 -1648293 -1208994 -3273995 -3656361 -1665980 -2072826 -6996955 -11285751 -9557905 -3632381
11518 -3632381 978824 2477421 2562853 1873890 261846 -459633 1416420 3829286 3216657
11509 3216657 -519114 -4642439 -7911959 -10720669 -11978079 -9685099 -4484737 332725
11501 332725 2284439 1071498 -2525757 -6720422 -8723806 -7237601 -4230453 -2290310
11493 -2290310 -1485044 -779262 -694379 -2005688 -3391614 -2962139 -889617 1309226 2308405
11484 2308405 515159 -4714374 -9532356 -7503501 1852967 10784824 13336890 12797238
11476 12797238 14280868 15344035 11083295 4177953 1302468 2284293 1709115 -411122
11468 -411122 1030798 5675591 6964539 2913621 -1294637 -2919447 -4842914 -6943040
11460 -6943040 -3733347 5306464 11581104 8947864 2498755 297084 2440565 4076527
11452 4076527 3900893 3373840 1536237 -3192978 -8593777 -11002766 -10007182 -7109084 -2509813
11443 -2509813 3140837 6757174 6266847 3403835 208733 -3721097 -7574274 -7563805 -3052986
11434 -3052986 19978 -2976310 -7896918 -7887455 -3594037 -1107913 -2208522 -3164816 -1860442
11425 -1860442 122318 1946812 4392096 6426041 5898947 3543970 1838669 478534
11417 478534 -2338626 -4900949 -3614521 532287 2692037 1796243 1833235 4307966 5114854
11408 5114854 1375008 -3464352 -4587386 -2239885 39190 827718 1207987 1632711 1451312
11399 1451312 677299 -1964 -488702 -1140866 -1938664 -2670037 -3212720 -3111758 -1879511
11390 -1879511 -34232 1483552 3165442 6364897 10201193 11082356 6805901 -238573
11382 -238573 -5505343 -7026236 -6351964 -5562533 -4920286 -3342370 440 4617982 8373051
11373 8373051 8374485 3522375 -3279280 -6724741 -4465782 -391638 -437242 -4641108 -6054691
11364 -6054691 248830 9371206 11759676 5510538 -1184975 -982630 3870091 6386563
11356 6386563 4304433 575057 -2605425 -5105105 -5576404 -2240822 2757885 4424820
11348 4424820 1468682 -2046727 -2850916 -2486769 -3360794 -4469152 -3984947 -3310266 -4928786
11339 -4928786 -7721383 -8054156 -5149547 -2104974 -1166720 -934227 504578 2108829 1734051
11330 1734051 64911 -28302 1880974 2395506 -978708 -5474460 -5852089 -1100083 4202016
11321 4202016 5799070 4570949 3832601 3972346 2681144 -262351 -1854147 -537092
11313 -537092 685715 -1864033 -6818051 -8738394 -5136641 67275 1966281 1790600
11305 1790600 5159868 12932242 17895175 13768882 4753310 897128 4359298 6377426
11297 6377426 361346 -7707201 -7383082 1223667 7652810 5862528 1570434 2364073
11289 2364073 6512586 6572125 734180 -5112895 -5947146 -3371053 -1815173 -2536149 -3304618
11280 -3304618 -2091393 800619 3574462 4863389 5028028 5509447 6290029 4831165 -531311
11271 -531311 -6503672 -7101968 -1054409 5789299 7369455 4416974 2058361 2559001 4005127
11262 4005127 5074641 6885047 9584244 10783759 8942739 5799522 3958765 3931672
11254 3931672 4587533 4634850 2826204 -1168276 -5176437 -6055700 -3734791 -1275803 -18772
11245 -18772 2226775 6641299 10469762 11045849 9705496 8948353 8554642 7487639 6701534
11236 6701534 6555464 4322985 -1548788 -7156422 -7659475 -4079066 -1046993 55298
11228 55298 578345 -479016 -4558697 -7838349 -4771028 2392357 4893734 -189372 -5768947
11219 -5768947 -5406521 -1705255 -492291 -2165124 -3275890 -2755520 -2199886 -2444106 -3081020
11210 -3081020 -3427408 -2109895 1749568 5719522 5852054 2478168 145778 533839 340446
11201 340446 -2060213 -3604848 -2873700 -3289483 -6148212 -6670969 -2187944 1485832 -1756496
11192 -1756496 -8435327 -10699024 -7593834 -3938330 -1209347 2562739 5925665 5206005
11184 5206005 1860353 1050302 2971650 2812500 -378139 -2022671 -123603 2102945
11176 2102945 3277064 6362760 11435702 12770012 7332469 825282 457442 5406112
11168 5406112 9036681 8025585 5022523 3762902 5207165 7991865 10077937 10000374
11160 10000374 7904852 5201386 2880181 1060825 65527 220305 540533 -334508 -1651240
11151 -1651240 -1153922 1388458 3348881 2438669 -965960 -4675581 -6145362 -3891023
11143 -3891023 78410 429948 -5305049 -11660491 -11003245 -4161191 171665 -2503844
11135 -2503844 -7062234 -7661340 -5877383 -5759536 -6101673 -3459807 626538 1722751 37008
11126 37008 -136090 2032254 2508764 -871378 -5091418 -6577967 -5117115 -1811347 3019420
11117 3019420 7910607 9609735 7058400 3615805 2560671 2348015 -411444 -4498636
11109 -4498636 -4620556 1021107 7169021 7615845 2835211 -1003895 220037 4386120
11101 4386120 6828268 5860939 3422034 1819332 1660511 2537437 4060175 5644627 6041205
11092 6041205 3927918 -553477 -4836263 -5402410 -1418279 3424412 4395689 1301362
11084 1301362 -1407821 -862567 377002 -1250351 -4200665 -3608189 1457289 6225232
11076 6225232 6630697 4394969 3706279 4930856 4445404 280293 -4677036 -6157489 -3709798
11067 -3709798 -745712 268284 673498 2598936 4665267 3199933 -2283407 -7442046
11059 -7442046 -8281200 -6059108 -4995704 -6203018 -6393049 -2794254 2727217 5687146
11051 5687146 4274372 1263285 390149 1915941 3128302 2878121 3246855 5550664 7254907
11042 7254907 5711068 3116499 3710876 6783531 7240713 3660820 756492 2021321
11034 2021321 4803589 5600826 5756423 7936449 10650148 10864016 9251322 8111783 6445908
11025 6445908 2294205 -1693780 -721603 4447465 7485287 4836795 -225498 -2681894
11017 -2681894 -1244804 2012549 4351058 4085548 2278499 2722878 7529162 13296526
11009 13296526 14915695 12401910 9970008 8918785 6282285 850900 -4554329 -7984856
11001 -7984856 -10594176 -12213600 -9769932 -3081148 2198515 1442709 -2149162 -1716275
10993 -1716275 4157531 10295794 11911773 9402754 6376277 5497765 6600116 7293193
10985 7293193 5207989 494954 -4057864 -5878970 -5079196 -3798363 -3961990 -5920245
10977 -5920245 -8131947 -7878666 -3787533 1680893 3832738 1050042 -2632427 -1751162
10969 -1751162 4240572 10216928 11128273 7447727 4064182 4240573 6260924 6858297 6166049
10960 6166049 6783875 8831408 9503038 8011339 7161337 8424660 9151508 7104313 4314914
10951 4314914 3434400 3453443 2390136 1022294 243330 -1779338 -5330068 -5816661 -493105
10942 -493105 4971212 3807550 -636352 493436 6983260 9197552 3290366 -2852822
10934 -2852822 -2121894 1973999 2746185 354210 -1376023 -2386173 -4294758 -5005135 -1748755
10925 -1748755 2974583 4086434 1124739 -1753962 -1847867 -291032 579655 -776423 -4442932
10916 -4442932 -7770676 -6512088 -25045 6450532 7696406 5026516 3727181 5434785
10908 5434785 6663257 4445096 117405 -3012397 -3510853 -2598344 -2349110 -3683370 -5714993
10899 -5714993 -6849004 -6246629 -4023170 -1033382 627720 -1378777 -6013161 -7987637
10891 -7987637 -3797973 2683754 4649505 1449623 -1496361 -1419198 -1186622 -2960659 -4874895
10882 -4874895 -5833781 -7810519 -10733432 -10630075 -6211274 -2161026 -2021819 -2625025 23650
10873 23650 3801219 4457109 2769289 2229613 2467623 648533 -2428329 -3042692 -452973
10864 -452973 2470721 3798904 3830251 2795726 1111910 953160 3636668 6135425 4130166
10855 4130166 -1693901 -5998239 -5459737 -1887665 1316495 2559125 1482382 -1847487
10847 -1847487 -5776844 -7161226 -4396202 253697 2598825 1192352 -494076 2170875
10839 2170875 8634843 12602849 9719546 3687812 1267834 2758858 2275693 -2885946
10831 -2885946 -8631727 -10732073 -9789018 -7905249 -5559471 -3893778 -4920725 -6881737
10823 -6881737 -4638955 2251805 7180277 5778646 2097690 1076119 416585 -4105210
10815 -4105210 -9760630 -10164274 -4701312 1648682 5871024 8388836 8733000 5856866
10807 5856866 2104433 1409970 3562861 4706515 3356016 1825315 1758103 2033184 1501649
10798 1501649 965876 1983242 5187446 9361062 11520948 9643190 5807921 3869437
10790 3869437 3646477 1632885 -1755570 -1466045 3437192 6745147 4521542 1140562
10782 1140562 1270083 2397806 1158534 497016 3227464 4523789 -492714 -6613002
10774 -6613002 -5457457 1173544 4622320 3284331 3107696 5824474 6833240 4474426
10766 4474426 1931144 -259227 -4487897 -8489797 -6579491 498060 5604400 6302994
10758 6302994 7442633 11357682 14201136 13955078 13525273 13507515 10294627 4111189 629213
10749 629213 1547502 1855186 -264045 403380 5876694 9962914 8984973 8729310 13583946
10740 13583946 16823195 10789454 739811 -1602373 5004019 10640928 9349299 5820134
10732 5820134 6012847 8800108 9854323 8655612 8099308 9602838 11312753 10648131 7549737
10723 7549737 4967166 5577262 8065465 8298003 4798765 975898 574695 2953862 4810505
10714 4810505 4994976 5239122 6698719 7809490 6006839 936232 -4295820 -5541210
10706 -5541210 -1933306 2910237 5208026 5561596 7131619 10008215 10352701 5761660
10698 5761660 -828157 -3854456 -876280 4779098 6823148 2272272 -4649991 -6721072
10690 -6721072 -2690421 1012358 -429224 -3229702 -1524353 2726094 2758093 -1685109
10682 -1685109 -3241650 2151682 9580065 12414492 10052627 5871072 1872705 -1381993
10674 -1381993 -2548528 -573092 3239722 6255627 6907437 5336438 2775796 814674
10666 814674 362808 1197212 2854119 4885195 5697384 3394077 -801487 -2678161 -729809
10657 -729809 1277646 137527 -1824279 -1247571 253585 -801789 -3595053 -4947266
10649 -4947266 -4805711 -4674954 -3320853 282892 2399479 -705477 -5653882 -6299378 -3239672
10640 -3239672 -1888889 -2738874 -1407019 2344549 3744837 1576096 89677 1397644
10632 1397644 2721238 2260632 1644038 1732978 1647825 2111491 4186589 5380087 3048413
10623 3048413 274520 1389211 3501494 920539 -3540076 -1646511 6156628 10429766
10615 10429766 7669020 4794749 6508785 9029916 9854951 12913435 18973663 20994573
10607 20994573 15442116 9606710 10660412 14751630 14346308 10404482 9466247 12565866
10599 12565866 14274374 11026180 5168184 1487620 2591064 6681462 8808731 6129961
10591 6129961 1738554 536945 2598529 4665887 6286636 8808447 10032990 6716783
10583 6716783 1349415 -655063 414612 98236 -1310003 466598 4911197 7240395
10575 7240395 7001424 7627379 8540496 6659765 4218978 5509520 7970221 6981528 6529102
10566 6529102 12759702 20047473 18024585 10200701 9292780 15232807 15747033 9058110
10558 9058110 6662843 11376161 12770176 8401178 8783671 15450833 15408664 5473832 846607
10549 846607 9144228 16480701 11582264 4150970 5429737 8885384 5462256 1437638
10541 1437638 5192281 10905040 10946683 11004695 17925093 25181486 24573805 20250677 18473927
10532 18473927 16336077 12231127 13009594 19215907 19405581 11026954 8785015 19078987
10524 19078987 26101191 18755563 10517846 14682121 20847382 16194911 9885811 14546829
10516 14546829 22653736 23314190 23442719 30344705 33518754 26255220 23329365 33601637
10508 33601637 39333046 28387803 20051250 30076297 39636236 31844265 26890335 42777307
10500 42777307 55877110 45149569 38394056 61735835 82898073 68611939 56572940
10493 56572940 90873552 128337805 112215131 103288402 199176199 325786265 272426168
10486 272426168 -9361138 -289377627 -337786756 -204297868 -102518245 -110524599 -131152216
10479 -131152216 -97180619 -58367193 -60711815 -70840614 -55448627 -40009910 -48411538
10472 -48411538 -56290917 -42013957 -26858381 -30729579 -35756152 -24685086 -14250837
10465 -14250837 -21484352 -32071354 -28825443 -21361577 -23556885 -28162018 -25122495 -21135907
10457 -21135907 -22272999 -19655455 -9104594 -3379150 -9678036 -16098917 -14266118 -13776792
10449 -13776792 -20506516 -22800266 -14051785 -7319396 -11646738 -14695917 -5825172 3421054
10441 3421054 124585 -6915440 -4363213 1311777 -2972351 -12415255 -13455689 -7447431
10433 -7447431 -5896424 -9680619 -11020318 -10274967 -13894980 -19667960 -19271472 -13028126
10425 -13028126 -9025090 -9567894 -9991428 -9102701 -10271136 -13143232 -13293446 -9803640 -6353412
10416 -6353412 -5381979 -6111484 -6883839 -5908831 -2268957 1380162 1129962 -1407136 -497884
10407 -497884 3563730 3325081 -3503641 -8933662 -6734910 -1558388 -301926 -1971079
10399 -1971079 -2578225 -3083259 -5362554 -6365387 -3513308 -813600 -2799029 -6976218
10391 -6976218 -8624009 -8594176 -10101412 -12048703 -11842293 -11093850 -12487124 -14259386 -13358102
10382 -13358102 -10978352 -9791446 -8788498 -6030424 -3736802 -5530918 -10530461 -14318761
10374 -14318761 -14165011 -10400481 -4941773 -994605 -1563205 -5898049 -9847082 -10918837
10366 -10918837 -9834322 -6924198 -1969082 1919408 576006 -3765838 -4326708 -1010460
10358 -1010460 -1702122 -9014689 -14455554 -11319343 -5340607 -5184930 -8930198 -8598279 -3694986
10349 -3694986 -1327636 -4745245 -9471109 -10653609 -8525066 -6173271 -5657489 -6424095
10341 -6424095 -5615497 -1166201 4329564 5661675 2148375 -1201277 -1399071 -1546469 -4520963
10332 -4520963 -7689793 -7697585 -5979349 -5331045 -5056725 -3785765 -3280023 -4959277 -6055325
10323 -6055325 -3727248 -57889 1246514 312513 -736157 -2204567 -5266192 -8373285
10315 -8373285 -9106786 -7730415 -6006595 -4771178 -4900928 -7318962 -9558679 -6526714
10307 -6526714 1896642 8181498 6146224 -1047583 -5973442 -6287828 -4618470 -2880635
10299 -2880635 -1836739 -3252568 -7140850 -9172236 -5875080 -342963 2096678 1742045
10291 1742045 2766045 5373145 5541505 2070062 -1622150 -3223460 -4289100 -6089005
10283 -6089005 -6655021 -3993808 119901 1563182 -1628682 -7129884 -10636718 -10075696
10275 -10075696 -7028213 -3646179 374494 5868462 10737847 11787299 9478493 7055363
10267 7055363 5049442 1061956 -4447218 -7073918 -4865300 -1393183 -347895 -987099
10259 -987099 -984263 52977 1960552 5086323 7891944 7228159 3012999 -1082065 -3304850
10250 -3304850 -5945926 -9931355 -12035450 -10163905 -7104498 -6173357 -6982050 -7944152 -8881936
10241 -8881936 -8752702 -5131181 1376359 6209310 6551186 3900565 -259827 -5816313
10233 -5816313 -9530230 -6251650 2147508 6063645 775584 -6686971 -8078053 -4879878
10225 -4879878 -3074605 -3103781 -1774034 646581 2037897 3427195 6233312 7777798
10217 7777798 5050487 -169735 -4602928 -8079157 -10541409 -9349883 -4688742 -2430956
10209 -2430956 -5678759 -8562187 -4987385 1403329 3178805 517808 -883376 618095
10201 618095 2637160 4653528 6376130 3976423 -4202468 -11796166 -12349578 -9356899
10193 -9356899 -9751476 -11390075 -7298576 514699 2975002 -1145110 -3534910 -497251
10185 -497251 1732293 -1849728 -7684585 -10529072 -10127388 -8215657 -5350459 -3051500
10177 -3051500 -3354651 -4618132 -3213918 -105157 189665 -2425771 -3312339 -1443755 -985608
10168 -985608 -3155531 -3654721 -491521 2267526 1481125 -70040 1166339 3982936 4898792
10159 4898792 2700901 -1258188 -4235117 -3121209 2188723 6758972 5937808 1709160
10151 1709160 -934535 -2048970 -4814541 -7343224 -4704211 979597 1411089 -5164378
10143 -5164378 -10523153 -8550096 -3074384 -206738 96255 843653 2503319 4607258
10135 4607258 7495869 9103520 5489589 -2082070 -6255277 -3483003 702457 320067
10127 320067 -2652846 -3193269 -1541602 -1160817 -2174721 -2234734 -1291843 -778425 -158719
10118 -158719 1535572 2596533 942136 -1888610 -2495053 -492186 1119126 -432
10110 -432 -2888174 -4395625 -2427795 1232451 2007208 -1850624 -6062220 -5715293 -2351341
10101 -2351341 -1475771 -4160828 -6327385 -5931243 -5118739 -4989683 -4190980 -3483694 -5581033
10092 -5581033 -9224686 -9567347 -5875709 -2601100 -1470462 426432 2920884 1290765
10084 1290765 -4257162 -5956783 -224617 5581568 4089861 -1192465 -2669282 -461114
10076 -461114 116285 -1586639 -1953293 -535161 -145715 -1414648 -3011728 -5347767 -8856701
10067 -8856701 -10791184 -8865309 -5972035 -6292017 -8725754 -8938265 -5900332 -1932627
10059 -1932627 1454023 3411614 2266266 -1123572 -1616252 3356333 8335832 7096441
10051 7096441 2181508 391305 1607279 239592 -3791559 -4606169 -1285364 -182655
10043 -182655 -3852588 -5880675 -1075389 5795625 6996748 2966136 456481 2059182
10035 2059182 3550673 1383430 -2225799 -3185778 -1098690 1390916 2862308 3945569
10027 3945569 4538600 3339114 956570 425502 2564497 3723783 1447443 -367236
10019 -367236 2971395 7922007 5908797 -3921698 -11961869 -10633324 -3607776 925333
10011 925333 853837 -360646 -423883 409157 1738409 2649755 1388024 -1404077 -2077767
10002 -2077767 467025 2272785 576543 -1623114 -1093184 -49978 -1709567 -4367242
9994 -4367242 -5018545 -4897963 -5995253 -6058894 -3038168 -602230 -2619417 -5762336 -4831675
9985 -4831675 -2069937 -3026279 -5791434 -3423444 4029607 8957762 7773184 4708010
9977 4708010 3330882 2210444 311760 -612023 -533326 -1493620 -2488523 -614835 2297756
9968 2297756 1686833 -637642 1920535 8537228 9934642 2928008 -3484265 -1763226
9960 -1763226 3153738 3198668 -56649 -246277 1763677 -153060 -6235424 -10146917 -8736567
9951 -8736567 -5626392 -4806212 -6070685 -7483504 -8168886 -7812361 -6294768 -4260863 -2148433
9942 -2148433 773899 4441581 6143871 3146377 -3307665 -8723789 -9921039 -7540257
9934 -7540257 -4518605 -3202010 -3463966 -2968192 168599 4917712 8460552 9296551 7779035
9925 7779035 4556283 892847 -489830 1725575 4218881 2301435 -3759076 -9273412
9917 -9273412 -11381375 -10568995 -6970890 -805353 3841298 2245855 -3252719 -5511677
9909 -5511677 -3462982 -3191951 -6678880 -8276813 -5496141 -3984034 -6955291 -8938612
9901 -8938612 -6371659 -5262344 -10213230 -14351516 -9996331 -2128591 -432270 -3929414
9893 -3929414 -4937615 -3154911 -3660942 -5198077 -3306431 -1623201 -6432649 -12856932
9885 -12856932 -11228588 -4903437 -5246119 -10556740 -9729750 -7446996 -21281822 -46363464
9877 -46363464 -49100661 -13112427 30017297 38764704 15438234 -3482014 -798117 6364412
9869 6364412 2791997 -2905627 -37063 4534046 1337295 -4147006 -2601490 2570027
9861 2570027 2968988 510533 2329661 6798886 6694620 2207677 -136909 1105053 1875150
9852 1875150 1828060 4538549 9127968 10456347 8109626 7265677 9410138 9472690 4352670
9843 4352670 -1961653 -4581064 -3978979 -3070262 -2063528 460080 3844701 5591068 4261922
9834 4261922 920586 -1454249 -171311 3910677 6129502 3491499 -740893 -1428587
9826 -1428587 585298 -96765 -4223893 -6064147 -2616692 1114322 -280112 -4383954
9818 -4383954 -5174704 -2412060 -1454587 -4906534 -9344733 -10586643 -8331304 -4624111 -708054
9809 -708054 2978623 5313294 4714473 934022 -3757385 -5697674 -3099589 1709518 4564304
9800 4564304 4290264 3666840 5027388 6967980 6698016 3725849 -446765 -4506082 -7251928
9791 -7251928 -7020605 -3585057 432855 2186256 1624078 55413 -2496244 -5662369 -6183373
9782 -6183373 -1181334 6349179 9712913 7122544 4074642 5247569 7879040 6560544
9774 6560544 1893770 -157002 3148422 7857186 9487884 8768663 8590612 8136531 4326802
9765 4326802 -1639388 -3990027 -309125 4120609 3044548 -2489848 -6660394 -7798233
9757 -7798233 -9542077 -13186567 -14560788 -10661255 -4791243 -1847770 -1835532 -1587129 -394784
9748 -394784 -159096 -1479596 -3010798 -3779430 -3544450 -2176320 -1117710 -3470152 -9482941
9739 -9482941 -14014415 -12464712 -7607347 -5875947 -7818656 -7519411 -1811981 5083536
9731 5083536 7596444 5190007 849394 -3177338 -5959508 -6962242 -6491663 -5164353
9723 -5164353 -2230004 3019989 7917634 8267082 4631058 2669680 5247543 8289433
9715 8289433 7284559 4001797 2873248 3785678 3104932 150072 -1996062 -1746413 -1143981
9706 -1143981 -2220145 -3987718 -3875080 -855778 2833230 2692331 -3582033 -11598051 -13129515
9697 -13129515 -5991097 1988333 2783585 -848445 11907 6257516 8661766 1764057
9689 1764057 -7141622 -7722352 -805373 3230515 -1418762 -9342603 -12054260 -7951477
9681 -7951477 -1755604 2741743 5702206 7945963 8376132 6198617 3483788 2977535 4098392
9672 4098392 3911845 2335433 3008450 7059642 9293629 4621417 -3510621 -6390944 -1908383
9663 -1908383 2523902 1089909 -2042463 -201495 4281245 3185888 -4331272 -9295625
9655 -9295625 -5447141 2457926 6532910 6443298 6893658 8421908 7520482 4396931 3465868
9646 3465868 5263587 4400760 -1697051 -7381689 -6159959 371351 5509046 6650171
9638 6650171 6547429 6911359 6122751 3501381 1160375 370542 -256905 -1602286 -2367665
9629 -2367665 -2150110 -2944642 -5377613 -6347099 -3399369 614906 678889 -3590557 -7598052
9620 -7598052 -8040820 -6342375 -5118275 -4092682 -1445914 2367595 4415513 2761625
9612 2761625 -1421528 -5564024 -8293731 -9443282 -8385164 -4204204 1943609 6199082
9604 6199082 5368212 618999 -3443702 -3316936 759654 6197767 10382942 11539312 9255290
9595 9255290 5186668 2104978 1362838 2006005 2629249 2853833 2603751 1556417 129061
9586 129061 -577627 -777087 -2140132 -4594212 -4974851 -1042029 4718108 7918527 7775588
9577 7775588 6853739 6136575 4064214 756655 -759384 770837 2215037 614972 -2192920
9568 -2192920 -2555992 -747265 -166112 -1735830 -2966798 -2748660 -3218362 -5582347 -7491400
9559 -7491400 -6750052 -4988378 -5062424 -6850837 -8362441 -9150619 -9443192 -7619427 -2681227
9550 -2681227 1813613 1310987 -2115650 -1322074 5073720 9344833 5877268 410938 2120576
9541 2120576 9808488 13081815 6538821 -3859569 -9618536 -9297932 -7178593 -6756029
9533 -6756029 -8224201 -9585278 -8298333 -4024348 -463830 -1411035 -4476981 -3029615
9525 -3029615 4156849 10035770 8818998 3634023 686233 116442 -1935754 -5333419
9517 -5333419 -6430370 -5239800 -5774622 -8944468 -10665925 -8273145 -4200648 -1743147
9509 -1743147 -1088819 -1201580 -2085359 -3335332 -3495873 -2630235 -2754656 -4137642 -4112909
9500 -4112909 -1470070 811910 -512394 -4654061 -8521217 -10418331 -9938227 -6806617
9492 -6806617 -2497174 -526960 -1999544 -2999965 92575 4643090 5185232 1397633
9484 1397633 -1967530 -2567611 -2889552 -4585085 -5296601 -3078231 -12147 1082303 491901
9475 491901 -282513 -1487707 -3425511 -4140965 -1977737 1049326 1499159 -695712 -2278698
9466 -2278698 -920906 2771299 6706556 8521545 6266294 582898 -4216729 -3945479
9458 -3945479 517223 4294415 4388988 2253196 784248 1402035 4143893 7850735 9794528
9449 9794528 7796712 3403459 516664 392427 746836 352584 1107523 4096933 6858606
9440 6858606 6699893 4119001 923804 -2311053 -4587897 -3214458 2489095 8212938
9432 8212938 8833383 4422046 -732224 -3770195 -4952963 -4925484 -3649276 -1733833 -194863
9423 -194863 818075 1177104 -120921 -2782937 -3866002 -1567570 1223351 639099 -2283058
9414 -2283058 -3387852 -2087980 -1873117 -4339102 -6919741 -6896013 -4073595 500762 4899789
9405 4899789 5910660 2482283 -989092 279542 3643103 2331044 -3246142 -4814937
9397 -4814937 1063246 7069015 5938270 616205 -1812627 -1031110 -1998051 -6106893 -9996302
9388 -9996302 -10998927 -8623939 -2774606 4618142 8483985 6265511 2510045 2505997 3798769
9379 3798769 601449 -5145362 -5253496 1599815 6363468 2389648 -4790672 -5228361 2136258
9370 2136258 9094493 9099078 3878593 -762142 -2065285 -1605608 -1177336 -13612 2728777
9361 2728777 4377616 916886 -6692418 -11936074 -10653889 -6220585 -3727039 -2504855
9353 -2504855 691934 3827193 1541805 -5587522 -10391195 -8816217 -4425805 -1522031
9345 -1522031 375252 2409838 2306514 -1282372 -4385221 -2529175 2386502 4443539
9337 4443539 1685167 -1911084 -1794779 2590787 7966561 9785232 5595169 -2112530
9329 -2112530 -7425383 -7173464 -4225709 -2860386 -2944855 -1630570 924553 1615269 -16396
9320 -16396 -222510 3601414 8909743 11368891 10525146 9841641 11470250 13031333 10617091
9311 10617091 4097907 -2179891 -4353451 -3210932 -2231345 -2860575 -3852419 -4336964 -4515756
9302 -4515756 -3391179 589036 5478261 6011820 283948 -6475184 -7729228 -3308811
9294 -3308811 1638117 3555551 2870845 711310 -2664864 -5954214 -6871134 -5172281 -3136310
9285 -3136310 -2263347 -1803076 -1167788 -1090956 -1133032 1256415 6925384 12094849 11953821
9276 11953821 6539758 726351 -1553513 -1045048 -860523 -2372063 -4414640 -5302475 -4377291
9267 -4377291 -2176701 -167937 60413 -1643454 -3574151 -4387640 -5246944 -8028072 -11555150
9258 -11555150 -12164332 -8957930 -5761514 -5669258 -6135843 -3066353 1795371 2400323 -2414225
9249 -2414225 -6310937 -4247421 415682 1295930 -1588581 -2558041 781636 4253689 3460441
9240 3460441 -581576 -3910374 -4779084 -4009554 -2139717 917822 3832321 4051840 913468
9231 913468 -2937231 -4494112 -4022521 -4218319 -5784155 -5776096 -1617082 4721760 8744152
9222 8744152 8947340 7616385 6094889 2718104 -2960967 -7144147 -6152499 -1913612 427651
9213 427651 -601824 -1960890 -1768365 -1597802 -2117428 -669579 4019485 7736351 5243692
9204 5243692 -2364663 -8527685 -9469863 -8078321 -8361469 -9279810 -7011152 -1736509 1580017
9195 1580017 -166750 -3746776 -3765091 342504 3929151 3213576 -663560 -3960048 -4608435
9186 -4608435 -3277111 -1722540 -1155046 -1268059 -340446 2495059 4887172 3266977 -2017018
9177 -2017018 -6175819 -6164036 -4441496 -3951850 -2660171 2220142 6827869 4072319 -5199962
9168 -5199962 -11154323 -7791848 -1082720 -53943 -4541741 -7631138 -7045296 -6928638 -9034487
9159 -9034487 -9480197 -6163366 -3228636 -4453935 -6658976 -4356026 1705997 5590834
9151 5590834 4798527 3153319 4518364 7587512 8764801 7540938 6571138 7616037 9587712
9142 9587712 10465446 9636538 8030215 6817713 6433628 6532829 6540207 6177832 5527618 4785474
9132 4785474 4216461 4307700 5552794 7748420 9574327 9245207 5993856 1068268 -3007970
9123 -3007970 -4507036 -3743469 -2102737 -399841 1062636 1443323 2160 -2038304 -2049422
9114 -2049422 717021 3940580 5469158 6130463 7620781 9116521 8485427 6054285 4351557
9105 4351557 4142677 3451557 993574 -2035823 -4460042 -6784664 -8867795 -8353022 -3858026
9096 -3858026 1652213 3353897 282258 -3523685 -4111243 -2351959 -2380053 -5715594 -8521635
9087 -8521635 -6028198 968158 6346465 6016219 2324882 -597867 -2644232 -5275324
9079 -5275324 -6207344 -2326822 3243153 3722025 -1023391 -3730245 -1430350 -570735 -6284569
9070 -6284569 -13436616 -14626126 -11669154 -11577942 -14894370 -16205304 -14106453 -12276032 -11302289
9061 -11302289 -7749168 -2189777 -371883 -4170288 -8008872 -7052696 -3320164 -771339
9053 -771339 598602 2571151 4829292 6339438 7268977 7267088 5102286 1600625 -714670
9044 -714670 -2037678 -4853171 -8014901 -6917009 -1584941 1685796 -86208 -1848103
9036 -1848103 351148 2209615 -836978 -4546925 -2527544 2470762 2470321 -3143213 -7541638
9027 -7541638 -7825191 -8071587 -10693430 -12491182 -10921006 -7831101 -5009451 -1504546 2708794
9018 2708794 5263950 5372853 4901966 4266342 1942093 -735408 332800 4995335 7239129
9009 7239129 3652894 -1228925 -1698323 1149731 2441299 1173522 98042 122911 -380661
9000 -380661 -1563113 -1623032 -384023 55148 -1256254 -2715593 -2985113 -3218759 -5309600
8991 -5309600 -8881713 -11115918 -9692651 -5533580 -2010455 -1231171 -2106616 -2792726 -3328736
8982 -3328736 -3916182 -2513812 2150977 6144440 3876505 -3130483 -6233843 -886083
8974 -886083 6904024 9074668 6305252 5128139 7174294 7765526 4649763 1747185 2478201
8965 2478201 4344366 3075807 -1092806 -4381016 -4739655 -3384035 -2159489 -1746100 -1887672
8956 -1887672 -1464507 1109041 5524739 7971231 4459169 -3486557 -8840789 -6720822
8948 -6720822 -539897 2069761 -1045889 -4202358 -2277723 1815741 1290613 -4528711
8940 -4528711 -8671899 -5709857 1155237 4478182 1753328 -2709677 -4139131 -2539980
8932 -2539980 -1147587 -1905617 -3763379 -4395594 -2449288 1484794 5246251 6638636 5438022
8923 5438022 4000794 5113888 8833821 12176792 12690202 11565693 11735083 13286526 13146115
8914 13146115 10082941 7420278 8538133 11604665 11992534 9073500 6933699 8031681
8906 8031681 9848208 9294429 7184238 5964194 5534035 4259894 2455338 1677063 1463156
8897 1463156 22001 -2007321 -1751750 1235955 3473711 2235830 -602039 -1520832 -521241
8888 -521241 -649384 -2874305 -4228593 -1947750 2484354 5016183 3888732 1277934 245259
8879 245259 1352367 2673332 2350436 583127 -776918 -581768 -281236 -2496887 -6843393
8870 -6843393 -8494155 -3315093 5892801 11414873 9849750 6057107 5710470 7203861
8862 7203861 5096829 -325741 -2446731 2079646 8012828 8318129 2959748 -2140247
8854 -2140247 -2857378 -338133 2400589 4141941 5012641 4334018 597625 -6140131 -12398845
8845 -12398845 -13203841 -7277760 338512 3017852 29213 -3168724 -2751108 -1471062
8837 -1471062 -3589878 -7679485 -8382950 -4472261 -1130343 -3238836 -9250393 -13415581
8829 -13415581 -12431828 -8166968 -4559377 -3386195 -3342999 -2625192 -1719459 -2883253 -6558395
8820 -6558395 -9454830 -7857214 -2632801 1073839 -4487 -3084247 -2911607 1548580
8812 1548580 6181268 7373771 6222156 5945227 6929438 6494378 3013646 -1856377 -5321037
8803 -5321037 -6070127 -4202301 -264285 4397947 7443487 7113863 3724118 -975732 -5162221
8794 -5162221 -7200429 -5971883 -2245896 1202616 2146224 949041 -732355 -2027802
8786 -2027802 -2528550 -1566955 329187 737757 -1617738 -4258983 -3768967 -229069 3534649
8777 3534649 5866968 6579149 4757045 139051 -4023608 -3772417 -231196 1499305 -489679
8768 -489679 -3189191 -4586957 -6266256 -8644088 -8828916 -5866965 -3478166 -4326682 -5658372
8759 -5658372 -4142977 -1276841 -206672 -743486 -1542219 -3664534 -7342879 -8514880 -3942295
8750 -3942295 2790550 5908619 5813152 6897985 8962386 7631053 2611317 -1387801 -2274231
8741 -2274231 -2554386 -3114510 -1885896 29408 -1739934 -6296053 -6315301 476078 5773162
8732 5773162 2514270 -3715752 -2492216 6328295 13435160 13858624 11464173 9695964
8724 9695964 6222933 -474866 -5833933 -4978552 140442 3518969 2699264 170799 -1148696
8715 -1148696 -578745 1344141 3729595 5257793 5174472 4297210 3709917 2951942 875917
8706 875917 -2337548 -5510960 -8038100 -9383181 -7997275 -3270797 1936932 3762742
8698 3762742 2469343 1790309 2555107 1077439 -4122632 -8271182 -6721594 -1928953 747514
8689 747514 1509991 4335370 8161391 7142507 632782 -4180924 -2476871 1570628 2399814
8680 2399814 1807629 4624808 9670587 11306822 7975842 3447581 605343 -862017
8672 -862017 -1202633 19110 1303191 354559 -1887491 -2035634 965776 5154619 8883900
8663 8883900 11153486 9924125 4838844 582376 1971575 6247568 6507334 2714274
8655 2714274 1830083 5689520 7102010 1700767 -4179544 -3192790 1834071 3316890 779616
8646 779616 -214950 2004705 3848981 3582005 2966710 2329418 153302 -2416753 -2303642
8637 -2303642 8859 958504 171959 931574 3725639 4742373 2136874 -1269675 -3168797
8628 -3168797 -4631472 -5838926 -4234123 46256 1852211 -1767732 -6085680 -5132978
8620 -5132978 -477603 1591531 -525423 -2657554 -2146944 -580321 954437 3817278
8612 3817278 7389291 7551300 2524461 -3294120 -4754686 -2758698 -1963202 -3346581 -3419564
8603 -3419564 -777122 933478 -1575575 -5996938 -7431307 -4989778 -2489304 -3120942
8595 -3120942 -6118515 -8853461 -9707514 -8201198 -4789652 -1953006 -3174768 -8479353
8587 -8479353 -12547735 -10178822 -2940143 2761004 4263798 5635455 10539214 15678193
8579 15678193 15001007 8784779 4113472 5715568 10114662 10949167 7149748 2507525
8571 2507525 -1093938 -5409617 -10369949 -11627905 -6607074 138638 1953324 -865329
8563 -865329 -1828821 1720218 4547112 1834396 -3081699 -3788907 -781263 -629312 -5603020
8554 -5603020 -9870822 -7940807 -2291257 759845 -286509 -1612679 -639557 1222936
8546 1222936 2354828 3473162 4988942 4872782 1564581 -2627575 -3544185 -168448 4299308
8537 4299308 6375346 5771635 4614288 4390895 4411446 2926178 -624320 -4596489 -6770055
8528 -6770055 -7072037 -7680206 -9678282 -10818144 -8218997 -2548091 2445064 4233526 3381234
8519 3381234 1575787 402497 1841346 6470509 10467980 8356635 573141 -5599661
8511 -5599661 -5307540 -2327141 -2336465 -4200499 -3460353 -1081176 -1500555 -3703094 -2432621
8502 -2432621 1545585 1007531 -5764674 -11031146 -9592825 -6734884 -8335403 -10319345
8494 -10319345 -6063760 1077651 2314317 -2299750 -4167194 -388796 2133434 -1084012
8486 -1084012 -4689648 -2666982 2009672 2596083 -1070326 -3356805 -1597066 1326844
8478 1326844 2530537 2856811 4280673 6362521 6718533 4197078 670142 -824438 262144
8469 262144 1406047 999935 1061359 3649245 6447924 5703734 2464015 1211109 2567397
8460 2567397 2814778 1352848 2321966 6455404 7823788 2998776 -2270022 -1267470 3419287
8451 3419287 4630415 2274708 2530350 6957365 10304209 9496012 7592812 7300848 6982201
8442 6982201 5351856 4369058 4679429 3374099 -535163 -3186049 -2013784 -353726 -1620040
8433 -1620040 -2928601 174210 5507727 6659788 2275245 -2561039 -3816898 -2202816
8425 -2202816 845487 5566006 10663547 12262477 8759859 3701292 1319416 1578291
8417 1578291 2016806 2278329 3777055 6077647 6741814 4808455 2046545 212621 -1120769
8408 -1120769 -3025031 -4680653 -3848685 5459 4053487 4601071 1339766 -1854057 -1058400
8399 -1058400 3485822 8176252 10155705 9184885 6322789 3087267 1748043 3648826
8391 3648826 6473760 5896745 1367407 -2317185 -1204050 2492453 3968506 2645443
8383 2645443 1859033 2963447 3794530 2965037 1781373 1026818 -634222 -3548198 -5473394
8374 -5473394 -5105621 -4617285 -6251669 -8393182 -7825574 -4718428 -2496559 -2960289 -4003561
8365 -4003561 -2889091 -369533 -438850 -5763953 -13515892 -16933730 -12642397 -5588942 -3748107
8356 -3748107 -7829057 -10285761 -6215257 -635980 -947356 -5846070 -7600902 -3676798
8348 -3676798 393665 115549 -2151412 -2556547 -1761107 -2362346 -4077414 -4902331 -4416946
8339 -4416946 -3010445 -342268 2547573 2356717 -1611640 -4082856 161895 8146969
8331 8146969 11413577 6934382 829273 2249 3858514 6487089 4563450 614329
8323 614329 -656899 2342865 6477060 7350033 4589127 2631711 4968706 9017201 9292464
8314 9292464 4763338 -339610 -2834642 -3715129 -4226752 -3175327 -300705 1485140 278864
8305 278864 -1412236 -744313 680689 -130134 -2062205 -1851515 131404 895345 619783
8296 619783 2110383 4596468 3838441 -424302 -2865702 -817268 1227971 -1065098 -4713200
8287 -4713200 -4221802 -20570 3104531 3629035 4018431 5297953 6151634 6679763 7907023
8278 7907023 7907258 3791358 -2208446 -4267144 -1583526 326604 -1181150 -1512033 2947523
8269 2947523 7968832 7903539 4631042 4236134 7649503 10650593 11408895 11819312 11974466
8260 11974466 9485218 4938464 2449262 3335198 4155060 2854056 2170890 4419677 7165523
8251 7165523 7457358 6950832 8880521 12193869 12720019 9047766 3670061 -1141312 -5145237
8242 -5145237 -7621669 -6315954 -501116 6508044 9542180 6238192 -836466 -6572735
8234 -6572735 -7818131 -5699749 -3667835 -3791610 -5529996 -7404520 -8420676 -7998954 -6120284
8225 -6120284 -3738620 -1627037 1075660 5319882 9360005 10156909 7918073 6225240
8217 6225240 6731601 7032214 5282819 3243607 2338340 574930 -2987586 -4419174 -735413
8208 -735413 3193867 108191 -8089031 -11251022 -4786150 3917712 5866032 1758536
8200 1758536 -1475802 -1263960 -861189 -2247430 -3383822 -2816403 -2185285 -2501396 -1562005
8191 -1562005 2385083 6764582 7543533 5005869 3413015 4470286 4345085 -551777 -7038837
8182 -7038837 -8181566 -2567946 3492277 4505187 2711518 3439041 6722807 8189380
8174 8189380 6589372 4944375 4231148 1785863 -2274359 -2841668 2203363 6609614 3827479
8165 3827479 -2678075 -3788690 1689967 5041484 751966 -5155931 -4115435 2535205
8157 2535205 6024916 2821900 -1431925 -811277 3736531 8052294 10775093 12225453
8149 12225453 10795275 5182160 -1201614 -2730836 1320463 5941291 7212798 6294168
8141 6294168 5487261 4229299 1506786 -749357 13828 2829198 4254354 2597998 -1113931
8132 -1113931 -5163361 -7776461 -6998414 -2706901 1918920 3392275 1759825 -646192
8124 -646192 -2995336 -5694395 -7585363 -6963239 -4878380 -3931407 -4117542 -3514782 -2784434
8115 -2784434 -4658860 -8566654 -10365674 -8600815 -6473214 -5832405 -3959095 841556
8107 841556 4905249 4530976 2296888 3380823 7566562 9623069 6969240 2778420 1099432
8098 1099432 2139828 3348493 3063318 2003525 2037443 4041473 6960304 9228492 10597582
8089 10597582 11295349 10137582 6123055 1820145 1640199 5733567 9197356 8964811 7682487
8080 7682487 8403399 9374486 7505263 3624244 348550 -2389247 -5466568 -6839839 -4417404
8071 -4417404 -690935 405439 -133224 1952299 7105633 11364618 12247968 10618380 7324427
8062 7324427 2888657 132910 1806458 5304353 4982838 537686 -2074502 548559
8054 548559 4388994 3932432 -1180603 -7459335 -11929615 -13275906 -11734616 -9506322 -8737795
8045 -8737795 -8457290 -6446758 -3978948 -4500067 -7470390 -8567101 -6850217 -6256843 -8429892
8036 -8429892 -9787289 -8048050 -5942043 -5424071 -3895729 85447 2887288 2073210 1387144
8027 1387144 4327911 7523882 6350823 3010526 2643277 4802412 5514712 5104110 6866198
8018 6866198 9745908 9497703 6275179 4250201 4128953 2823728 489621 754689 3080809
8009 3080809 2047645 -3672251 -8131466 -6773449 -2620011 -589672 -774073 -1052730 -1794862
8000 -1794862 -3562659 -3630318 596359 6890941 10913609 11892380 12052952 11958757 10122099
7991 10122099 6409910 2494341 -737859 -3460374 -4985143 -4252947 -2090269 -487068
7983 -487068 292318 1372014 2137468 656791 -1847355 -425635 6973946 14695730 15135991
7974 15135991 8652831 3384809 4186259 6289249 3185195 -2980228 -4330136 1031364
7966 1031364 6518985 6916544 4568710 3364097 2397118 -122376 -1422142 1641968 5851459
7957 5851459 5044959 -1043843 -6715110 -8371224 -7702849 -7229513 -7520629 -8842539 -10979892
7948 -10979892 -11377966 -8013250 -4044585 -4647617 -9039659 -10988708 -7783833 -2944943
7940 -2944943 861879 4908081 8292223 6030241 -2417397 -8943962 -6808507 -165120
7932 -165120 2423663 230727 -469140 3040000 7147960 8873401 9087391 8322991 5099102
7923 5099102 -31218 -3304116 -2646764 -516371 -132355 -1555777 -3059226 -3926153 -4045874
7914 -4045874 -2659347 323363 2767868 2220359 -594474 -1884605 602505 4033316
7906 4033316 3421153 -1602779 -5277176 -2843277 2852308 5128812 2438532 -950133
7898 -950133 -2820976 -5670402 -9853045 -10360660 -4646071 1409189 1008687 -3639774 -5219423
7889 -5219423 -2683546 -1581213 -3714288 -4030019 492706 5433735 5772981 3221271 2575871
7880 2575871 4114826 4232379 2118117 1358902 4484184 9127404 11096563 9468550 6758474
7871 6758474 4732574 2437575 -714352 -2180035 709169 6024350 8957930 8229657
7863 8229657 6895627 6141881 3193154 -2314367 -5163329 -2164850 1474355 -675787
7855 -675787 -5774018 -5315728 1943786 7596824 4674977 -4617869 -13171653 -15919122 -11738587
7846 -11738587 -3424976 3107888 3984223 2304423 3551353 6643315 5781685 1206083
7838 1206083 168281 5178280 9475547 7986159 4891302 4996746 5019941 526533 -4609993
7829 -4609993 -3958028 625565 2392492 840793 731337 1852448 -1184401 -8886894 -14734263
7820 -14734263 -14181516 -9056616 -2261940 5007394 9694448 7793832 1164287 -2965839
7812 -2965839 -1857055 -535346 -2495040 -3603630 634272 7443620 11391146 12117241
7804 12117241 12330514 11838614 9035796 5637989 4572509 4892518 3606631 1146600 340763
7795 340763 940203 -210947 -3770897 -6659287 -6375324 -3438625 271009 2740240 1957768
7786 1957768 -2063172 -5728374 -5225488 -1144895 2731387 4315658 4067050 2262123 -983729
7777 -983729 -3831531 -4555404 -4474156 -5312434 -5014393 -1120742 2798287 513045 -6672040
7768 -6672040 -10008742 -5531759 647389 2550431 3047094 7156713 12333494 12307178 7155836
7759 7155836 2549001 694969 -1379034 -5036397 -7502472 -6665682 -3681972 -333887
7751 -333887 2090243 1354236 -3660007 -9087979 -9108005 -3880386 122805 -899419 -3480961
7742 -3480961 -3399936 -2077546 -3026626 -5568423 -6252338 -4329403 -1858699 300132 2793489
7733 2793489 4510275 2550150 -3665972 -10346328 -12455445 -8280017 -878896 4455944
7725 4455944 4606884 1231362 -1213393 -54647 3784987 8174611 11835363 13426232
7717 13426232 11224013 5835236 1467994 1750140 4841877 5206749 435213 -5765317
7709 -5765317 -8142068 -5963954 -3256189 -3491408 -5445210 -5169686 -1514709 1989985 1581067
7700 1581067 -1877144 -4222309 -3235242 -328280 2397334 3918839 3000018 -1571300 -8081855
7691 -8081855 -11887605 -10225605 -5316279 -1268647 299747 251313 -345495 -669174 30975
7682 30975 1430778 2321862 2663212 3257930 2718708 -1551528 -7447931 -7803380 -60542
7673 -60542 7585809 5635701 -3412844 -8071144 -3680578 2135196 1540515 -3105298 -5095123
7664 -5095123 -4010009 -4313833 -6244085 -4952765 1110871 6678018 6655848 2752560 326944
7655 326944 1265933 3243919 4477744 5426633 5950147 4624161 2081979 1605741 4127540
7646 4127540 5491431 1822189 -4464988 -7653613 -6325021 -4058017 -3489765 -3992677 -4767700
7637 -4767700 -5415159 -3374337 3674228 11780280 12996122 6008243 -1147755 -2068264 43393
7628 43393 -569635 -3037362 -3469529 -2802066 -4065246 -5355942 -3072568 106187 -1606409
7619 -1606409 -6787961 -7580243 -1556460 4395778 4099046 -45046 -2002222 -281526 1907851
7610 1907851 1789332 -33183 -385653 3099904 8101938 8690673 2949990 -2964717 -2659691
7601 -2659691 1215286 1389005 -2534917 -4593940 -3562503 -4595792 -8497384 -8544819 -1816510
7592 -1816510 4328977 2538874 -3849053 -6221621 -2318579 3105663 5900908 5655066
7584 5655066 3564658 1580327 2081538 5221163 8178788 8963920 8411313 6993699 3586952
7575 3586952 -494326 -812201 3713755 7954913 7742952 5717815 6159081 8199280 8752786
7566 8752786 8420034 9327906 9982662 7409530 2460484 -1325894 -2350655 -1104936 1612879
7557 1612879 3409785 956617 -4142624 -4567060 2430335 8420996 4224647 -6664331
7549 -6664331 -12809741 -10471809 -5971092 -3608016 -675945 4056265 5723082 1217022
7541 1217022 -4679158 -5658416 -2268010 323445 141210 -179585 1274532 2515454 794554
7532 794554 -2681772 -3247929 1038677 5490472 4208929 -1348917 -4075725 -2113476 -1572765
7523 -1572765 -5413680 -7007080 -1047523 5582445 2993861 -5640830 -7717883 182316
7515 182316 7760519 6424809 -314880 -5047615 -6720859 -7931242 -8259631 -5823363 -1814539
7506 -1814539 1030161 2462273 4387223 8035832 12687834 15356269 11907568 1694992
7498 1694992 -9092514 -12613817 -8022888 -1126525 3856980 7080678 8194821 5330338
7490 5330338 49871 -3020839 -3216360 -4469327 -7418424 -7740216 -4650897 -3564887 -6605121
7481 -6605121 -8010911 -4116500 -674186 -3475650 -7932877 -6327384 -944887 -623966
7473 -623966 -6326457 -9618970 -5996957 -1230556 -1782415 -5548407 -6234734 -2672905 820325
7464 820325 1532142 1565053 3467127 5608846 4290192 -303411 -3272833 -1533852 1535821
7455 1535821 993309 -2256717 -3360161 -1597893 -957909 -2498838 -2503088 -33653 193403
7446 193403 -3965739 -6943663 -3623055 2086229 2828119 -1257140 -3494296 -983827 2040060
7437 2040060 1142143 -2795678 -5837730 -5693945 -3484048 -2441150 -4582587 -7906328 -8587599
7428 -8587599 -6672304 -6397031 -9224482 -10633590 -6891836 -1076134 1708118 1585487 1659334
7419 1659334 1610462 -918474 -4599374 -5732216 -4247907 -3373851 -4144088 -4916663 -5404550
7410 -5404550 -6385145 -6215315 -2627369 2387602 4299458 2472932 383884 -222100 -696231
7401 -696231 -1292875 -493657 1395948 2550385 3298950 4750221 4520732 -162483 -5294399
7392 -5294399 -3162670 6030920 12776345 11169731 6358774 5248462 6385608 4725244
7384 4725244 1214043 603398 2578455 2069754 -2241413 -5607578 -4075950 705929 4558648
7375 4558648 5363149 3604947 1007292 -259339 980813 3171511 3252918 643106 -1302290
7366 -1302290 822999 5786106 8549106 6190880 1634609 94712 2513170 4692997
7358 4692997 3308319 276441 -472815 1486255 3214411 2747020 744687 -1275802 -1812844
7349 -1812844 670532 5844862 10106240 9958211 6476212 3640221 2824125 2158798 761122
7340 761122 -338419 -1408841 -3879228 -6527321 -6313919 -4023850 -4295545 -8227086 -10744772
7331 -10744772 -8004072 -2959267 -327826 -235648 -709058 -2346763 -5555175 -6545832 -2034232
7322 -2034232 4168034 5480343 2410629 1563639 4756422 6205538 2598702 -916738
7314 -916738 772964 3727853 885941 -5856929 -6931063 1127636 9812589 9588935 1936522
7305 1936522 -3961781 -3589798 -748692 232350 74739 807620 1506986 1108409 1846841
7296 1846841 5711748 9829963 9891425 6690222 4393263 3110192 -1044672 -7651759 -9773512
7287 -9773512 -3209100 6502360 10483846 7224385 2944953 3067863 7163054 11446802
7279 11446802 12666564 9539409 3376702 -2064535 -3355893 -665165 2810430 4546746
7271 4546746 4671529 4552236 4770913 4705334 3496956 1425877 202496 1061175 2820647
7262 2820647 3393112 2881109 2649358 1516463 -3114764 -9344483 -11116907 -7450349 -5972997
7253 -5972997 -11983079 -18705463 -16146982 -6821348 -3170507 -9310632 -15336597 -12744723
7245 -12744723 -6024615 -3264604 -3522769 -1704140 180526 -3262424 -8975003 -8024745
7237 -8024745 8207 5124301 1486416 -4966262 -7015964 -6077798 -6450701 -6904919 -4943446
7228 -4943446 -3942892 -7951759 -12847816 -11143570 -3893080 665681 46370 457205 5393777
7219 5393777 9748485 8796745 5770899 5572167 6700690 5024065 1214502 -1320461 -2613331
7210 -2613331 -4504587 -5423961 -2725458 1396060 2072676 -1049488 -4090906 -5517119 -6771324
7201 -6771324 -6778233 -2170248 5920498 11091864 9697364 4831238 408011 -3811083 -8685142
7192 -8685142 -11881518 -11267783 -8787838 -7485644 -7260180 -6550847 -5577039 -4763463 -2446613
7183 -2446613 2423448 7327846 9287232 9097062 9097341 8626148 5713062 1975395 1293956
7174 1293956 3789157 5369643 3856167 1634562 983135 410896 -2081940 -4740314 -3957303
7165 -3957303 657174 5589260 7627877 6848855 5062510 2935880 -38681 -3349272
7157 -3349272 -4987002 -3866561 -1484182 174984 1507245 4109790 7051834 6891280
7149 6891280 2324460 -3209766 -4935252 -1450908 4786359 9998461 11160675 7710208
7141 7710208 2928947 1798552 5440965 9234350 8534563 4560103 1905728 1703688 810661
7132 810661 -2578181 -6117214 -6951996 -5459883 -4106712 -4343164 -5666965 -6565854 -5799067
7123 -5799067 -3744281 -2632037 -4348005 -8040251 -10986952 -11408982 -9117436 -4345732
7115 -4345732 1734734 5892972 5266433 1413648 -746167 1093087 4126259 4806686 3143119
7106 3143119 1340091 679378 1465631 3724437 5957571 5530843 2786499 2504150 7886341
7097 7886341 14657724 15257129 8643135 1889707 1125228 4391192 5311424 1247893 -4470282
7088 -4470282 -6943119 -4278737 1441322 6175183 7181049 5146286 2862422 1885987
7080 1885987 1679531 1838614 2807461 3657416 1953765 -2253277 -4833374 -2828065 576980
7071 576980 -170167 -5245705 -9247848 -8593830 -5386418 -3242116 -2704095 -2112116 -228731
7062 -228731 3330256 7745906 9927531 6673941 -478499 -5446839 -4811549 -2282494 -3484482
7053 -3484482 -8590107 -13057100 -13970232 -12586234 -11510256 -11868840 -12687938 -11546558 -7196621
7044 -7196621 -2640646 -2801529 -7112240 -8145997 -1351395 7381591 9132747 4232261
7036 4232261 658146 1549756 1759509 -2407802 -7203262 -7812367 -4953136 -1878393 509737
7027 509737 2219062 1959177 -40981 -399142 2684757 5902931 5419394 2349085 213491
7018 213491 -748289 -3031417 -7179389 -10961408 -12211044 -10026777 -4591258 1835965 5478730
7009 5478730 5174701 4278660 5930368 8383924 7982301 4843616 2100355 945092 150570
7000 150570 -454058 116893 987457 52779 -2046753 -1903208 1843161 6237859 7571268
6991 7571268 5411781 2300085 642508 438233 -366317 -2989847 -5363557 -4392538 -1210975
6982 -1210975 -1057622 -5730594 -9492198 -6401255 830389 4411745 2466065 438748
6974 438748 1377361 1372084 -2795577 -7189723 -6417475 -2065913 -246874 -2558537 -4738587
6965 -4738587 -4108745 -3284348 -4865805 -6592163 -4867952 -521224 2635161 3696921 5060071
6956 5060071 6947797 6009370 1233464 -2618976 -870093 4315032 6848697 4819367
6948 4819367 1695320 448658 815749 2247637 5200927 8687842 10164359 8726453
6940 8726453 5556913 1428723 -2685947 -3409954 1507475 7671901 8088742 3317625 945750
6931 945750 3699961 5749727 3449501 1437116 3541559 5679645 3854568 1833317
6923 1833317 3691182 5427674 2105018 -2685787 -3294534 -2369680 -5062468 -8018704 -5161122
6914 -5161122 -308443 -1789346 -7204377 -6734764 -512077 1327259 -3184667 -4153924 2166715
6905 2166715 5750558 -482913 -8499993 -7775955 -379803 4935653 5890504 5756832 5683041
6896 5683041 5588235 7449322 11091372 11787725 7815879 4714267 6348470 8243563 6178518
6887 6178518 4323600 7005836 9240980 4862029 -1659155 -1845585 2812748 4400765
6879 4400765 2737777 4332302 8748576 7948113 1409 -7312127 -8543008 -6667919
6871 -6667919 -4982158 -2236866 1054959 399216 -4294863 -5955178 -909793 4662850
6863 4662850 4242926 754870 567444 2713397 1345021 -3929214 -7362801 -6009626 -3237013
6854 -3237013 -2597126 -2996044 -1719735 913959 2085433 228602 -3320688 -5964742 -6192502
6845 -6192502 -4347513 -1762914 295183 1008875 257485 -1113788 -2054873 -2695000 -3897664
6836 -3897664 -5133129 -4641709 -2622793 -1905347 -3600474 -4508892 -1713878 2226463 2317437
6827 2317437 -1767702 -5457817 -5734105 -3984690 -2276190 -635128 928176 1000988 -913649
6818 -913649 -2778584 -2140029 1361388 6019793 9273209 9039504 5600180 2010145 961967
6809 961967 1772770 2260676 2358174 3140278 3552930 1896040 -42907 1241429 4713591
6800 4713591 4963680 171845 -4405118 -3555418 650540 2069145 -1112243 -4570894 -3913366
6791 -3913366 19133 2448956 211292 -4610651 -6888264 -4207416 799567 4497568
6783 4497568 6413644 7261983 5278702 -1317959 -9160726 -11762581 -7375353 -911458
6775 -911458 2737695 3350091 2369921 -228513 -3765110 -5359378 -3673318 -1489884 -1689293
6766 -1689293 -2775821 -1213395 3316707 7545678 8584353 6430600 3371812 2151850
6758 2151850 3722372 5982181 6037202 4133916 3373850 4901664 5782529 2865142 -3274987
6749 -3274987 -9296602 -12116876 -10488554 -6008981 -3006129 -4447645 -7452242 -6526372
6741 -6526372 -2075500 -1050327 -7035984 -14431971 -15841615 -11150934 -5309442 -806831
6733 -806831 2819487 4754693 3507559 515446 -1191671 -957853 351308 3312142 7931459
6724 7931459 10622308 8273323 4172753 4350491 8288696 9092200 3874221 -1692779 -1646534
6715 -1646534 2071515 3238062 272574 -2264325 -236861 4831258 7644997 5216323
6707 5216323 273261 -1973100 -150786 2092833 1926020 1388576 3126873 5034659 3478596
6698 3478596 13191 -497602 2024778 2483626 -794012 -3035756 -1126785 746510 -2261740
6689 -2261740 -7448000 -8116747 -3069660 2565978 5082370 5844707 6768841 6655182 4129672
6680 4129672 1201103 892371 2446211 1715507 -3220379 -8899157 -10471157 -7834849 -5578727
6671 -5578727 -6570388 -8050953 -5851065 -655129 2828506 2387314 782338 936801 1554804
6662 1554804 -316617 -3939533 -4813127 -341090 6058962 7931524 2938610 -4126162
6654 -4126162 -6660567 -3874977 -867126 -1018431 -1724359 294302 2813477 1329117 -3383404
6645 -3383404 -5792701 -3503591 -55162 887620 -115188 -1112082 -2001296 -2896638 -2547924
6636 -2547924 -674285 774936 690762 547371 1230739 1096570 -433734 -337037 3710830
6627 3710830 8631039 8895409 3007323 -5429548 -11623787 -12372377 -7192755 115407 2807365
6618 2807365 -2226546 -10005360 -12614347 -7945860 -548368 4694945 6059850 3414073
6610 3414073 -2168656 -6985158 -7117558 -3415682 -869592 -2099180 -4519823 -4939728 -3829644
6601 -3829644 -3460736 -4348537 -5283701 -5136047 -3458010 -963835 -71434 -2774729 -7080354
6592 -7080354 -8031591 -3798267 1406796 2368562 -829081 -3550850 -2547530 866519 3159209
6583 3159209 2427553 -376172 -3168678 -4972428 -6027548 -6001175 -3758040 -38575 1401964
6574 1401964 -2267652 -8918331 -14087436 -16701320 -18628176 -18999002 -13795622 -2742271
6566 -2742271 7449515 9605765 3615847 -4503504 -8755676 -6705296 219245 7315447
6558 7315447 9567378 6551221 2899247 2219088 2864452 1738701 -573403 -1504003 -950256
6549 -950256 -591878 -588602 -337619 -764633 -2235326 -1909517 2577410 8018867 8954638 5698487
6539 5698487 4213818 7485875 11655902 12023728 8711305 4536707 996174 -1253331
6531 -1253331 -957162 1886285 4684835 5200596 4482419 4857081 6168059 6000226 3103284
6522 3103284 -941344 -3439764 -3314638 -2175524 -2570861 -4897610 -6949568 -7371080 -7789353
6513 -7789353 -9328887 -8952209 -3249805 4911865 8451584 5582578 2375261 3817927
6505 3817927 6970137 6260543 1686535 -2434109 -4098529 -4554904 -4473610 -3724372 -3961506
6496 -3961506 -6921367 -10286560 -9468196 -4073912 1174821 2954919 3203964 4849373 6880180
6487 6880180 6275554 2886607 -338881 -1200655 -79241 1742699 3500237 4372061 3371530
6478 3371530 1052591 251035 3324201 8620168 11436869 9308975 4708380 1040850
6470 1040850 -2137595 -6904345 -11158005 -9720803 -2403587 3705507 3202770 -132243
6462 -132243 581847 4385694 3830393 -2970626 -8212738 -4944561 3322860 7767975 5820527
6453 5820527 2603943 2120415 2271846 -172737 -3746693 -4277628 -843699 3029018 3807849
6444 3807849 1726570 16722 1624063 6687189 12041147 13194648 8397138 1428332
6436 1428332 -1119893 3327293 10064566 12089576 7832371 2345772 936929 3431146
6428 3431146 5495111 4264071 1172909 -567940 73301 1461547 2282467 3331386 5258530
6419 5258530 6048940 3386458 -816504 -1668629 1930656 5378311 5303516 4521343 6419546
6410 6419546 8089460 4635004 -1936798 -4754976 -2370312 -125802 -741462 -863119 1019362
6401 1019362 831170 -2966250 -4525786 444072 6647395 6850914 3052859 2384961 4960188
6392 4960188 4251320 -1377065 -5719847 -4266530 303685 3971799 6634261 8987298
6384 8987298 9317119 6637386 3449938 2524536 3475870 4456525 4654880 3503260 210964
6375 210964 -4022432 -5814823 -3601346 127442 2185405 2385051 2374725 2650303 2484399
6366 2484399 1688630 1101838 1834684 4245255 6897420 7246254 4933027 3238214 4701545
6357 4701545 6543420 4220200 -1039540 -2868494 1478834 7601255 10517471 10187652
6349 10187652 8492092 5409310 1461155 -5465 2826204 6177574 5074008 238006
6341 238006 -3131883 -2521276 -594837 -680170 -2553542 -3392263 -1548654 1232844 1494808
6332 1494808 -1582864 -4444474 -3628714 -912006 -660262 -2612403 -2036509 2120606 4592048
6323 4592048 1731926 -2831712 -3887455 -1614026 1009342 3556991 6250739 6453243
6315 6453243 2583663 -1182135 222326 5128134 7802711 6973456 5956555 5665787 3756040
6306 3756040 436950 -860464 877047 3127273 4649853 6301380 6900033 3895435
6298 3895435 -1151308 -3418915 -2196181 -1657863 -2985695 -2012595 2941899 7142003 6751422
6289 6751422 4468960 3956038 3903619 2180991 991938 2474390 3188583 -968300 -7152241
6280 -7152241 -8882768 -5128481 -471687 2307900 4032474 4344125 1153520 -4564314
6272 -4564314 -8522623 -8777916 -7567969 -6767136 -5550275 -3515145 -2157717 -1823965 -645029
6263 -645029 1993551 3985986 3932643 3152963 2900888 2469612 1633358 2042814 4080447
6254 4080447 4845415 1841083 -2984667 -5347232 -3864501 -1154676 -108036 -656827 -502705
6245 -502705 1532205 3412159 2152263 -1433785 -2345323 2179012 7908446 8694322 4610313
6236 4610313 471993 -2478862 -7140168 -12519604 -12537598 -5668469 1040535 1975704 953020
6227 953020 3803963 8540226 9722171 8072855 7779400 7521206 3133997 -2493717 -1863503
6218 -1863503 4384912 6742474 1381566 -3290815 955114 10277764 14819924 11734122
6210 11734122 6685687 5481964 8806642 13261843 14303993 9861809 3067600 -794078
6202 -794078 -937144 -1031704 -1826731 533348 6477462 9609341 5732004 -197687 -1501944
6193 -1501944 500676 211719 -2750595 -4412574 -3992720 -3885387 -3889532 -1715657 1977332
6184 1977332 4648783 6520022 8699718 8654878 3785239 -2201595 -3305908 -383466 877611
6175 877611 51171 1853720 5964148 5953416 267560 -4212582 -2743567 830486 1987922
6166 1987922 2532888 4796310 5417993 1047901 -4564948 -5444263 -2140353 -67830 -1503242
6157 -1503242 -4169805 -5886558 -6202343 -4899002 -2662011 -1866863 -3536157 -5174682 -4498608
6148 -4498608 -3150512 -3520441 -4201105 -2434881 703918 1614271 -423916 -2885762 -4252073
6139 -4252073 -4950843 -4470157 -1358034 3250116 5292131 2519152 -2307488 -4686494 -4098608
6130 -4098608 -4561058 -8579042 -12083124 -8556630 1153831 7312344 3063336 -5639935
6122 -5639935 -7306611 -45368 7264663 8285833 5977432 4752573 3838334 1835441
6114 1835441 852731 1589084 379585 -3868375 -5428998 -201031 6461778 6729479 1376708
6105 1376708 -2446427 -1583124 1155165 3066491 3716161 2746303 714511 318465 2157125
6096 2157125 1824043 -3762806 -10060290 -10652653 -6511780 -3282405 -2084303 -171642 1473736
6087 1473736 -595237 -4227375 -3130880 3034785 7596826 7035140 5032062 4751808 4132195
6078 4132195 1498626 -361133 968998 3529032 4830026 5581666 6961241 7821219 6917160
6069 6917160 4788238 1887548 -1907007 -4896217 -4428122 -1316779 395050 -798412
6061 -798412 -2178218 -1786268 -799306 246417 2938628 6827251 8164962 5109200 426066
6052 426066 -2989843 -5458820 -7386589 -6938123 -3580094 -426995 -164916 -1441979 -1688718
6043 -1688718 -702719 753198 2880543 4948543 4399807 545266 -3338776 -4193122 -3173052
6034 -3173052 -2957180 -3318588 -2282883 -124373 695922 -1037527 -4022420 -6299042 -7025899
6025 -7025899 -6604886 -5768310 -4518629 -2269987 522622 1930927 869920 -1423785 -3496418
6016 -3496418 -5287372 -6039158 -3792582 86000 -243815 -6916349 -12761623 -10394870 -3677982
6007 -3677982 -1799751 -4199852 -1906678 6000656 9196645 2994565 -2944512 457851
5999 457851 7508439 7299080 470807 -3482942 -1409621 979072 68229 -1327714 -964142
5990 -964142 -807585 -1909431 -1541556 2114429 6486857 8114592 6874365 4783670 2514274
5981 2514274 -912318 -5548484 -9179583 -9381964 -6674456 -4222354 -3563834 -2465138 927072
5972 927072 3878718 2634638 -1218070 -2521639 -80461 2576841 3805629 5560360
5964 5560360 7929986 8046519 5915617 5310214 6991226 7247248 5315770 5376799 8199595
5955 8199595 8260042 3474952 290469 3295890 6829337 4123579 -1318752 -1894651 1293651
5946 1293651 1063015 -3189283 -4656633 -122239 6350052 10847728 13500692 14101061 10289886
5937 10289886 2133293 -5826823 -8728173 -5171524 2719670 10179064 11888554 6626939
5929 6626939 -905971 -5441182 -6520567 -6077069 -4029672 -441823 1172073 -1858099
5921 -1858099 -5906627 -5425060 -1190432 1361664 871168 1334708 4877942 8566855 9025241
5912 9025241 6115600 1594284 -2634684 -4973950 -5472352 -5971651 -6853858 -5688821 -1543075
5903 -1543075 2379616 3590085 4324911 6856498 8711271 7315690 5327666 5624571 5051579
5894 5051579 71691 -4888476 -2793165 4469450 8065128 4668750 -681372 -3380271
5886 -3380271 -3331649 -669729 4948058 10386683 11210419 8237934 5982395 5195324 3304100
5877 3304100 987151 1003880 1658145 -571908 -2954662 71249 6053682 6931321 2509412
5868 2509412 1004590 4774380 6569749 2882396 -70835 1912902 3918234 2166450
5860 2166450 1327692 4684850 6186962 562908 -6339248 -6359910 -2141621 -2041928 -6173290
5851 -6173290 -6928825 -1429339 4822646 6385280 3719331 483313 -620011 548460
5843 548460 1435693 -435918 -3050252 -1520312 4016113 7007571 4248540 1549061 4691496
5834 4691496 9790595 9202385 3440896 62238 2547126 7031016 9445327 9857189 9369944
5825 9369944 7730670 5039390 2371708 68843 -2120077 -3378894 -2664142 -785206
5817 -785206 441513 504234 -42078 -1030024 -2166195 -2342196 -1186621 -21113 222463
5808 222463 533456 1840569 3110969 2864778 1197237 -711705 -1766627 -1360379 -280694
5799 -280694 -708495 -2917366 -3229885 1005631 5845704 5433715 1288135 306548 3613464
5790 3613464 5223162 3032606 2446032 6026369 8296000 5462644 1924579 1221231 -1321422
5781 -1321422 -9322645 -15854363 -12316958 -1806595 5444007 6285659 5484493 5302261 3507144
5772 3507144 577559 321331 3036976 4845425 4034872 2405440 709045 -1823368 -3970412
5763 -3970412 -3630561 -1747309 -588456 546178 3412655 6590823 7893975 8533409 9759122
5754 9759122 8467796 2386217 -3427419 -2616008 2298553 3762034 1568236 2665872
$$ [...]
##END NTUPLES=NMR SPECTRUM
##END=
