##TITLE=31Pdec_LR-618-R3-CR18-2
 CDCl3, 124 sc
 1.07.2021
##JCAMPDX= 6.0         $$ Bruker NMR JCAMP-DX V2.0
##DATA TYPE= NMR SPECTRUM
##DATA CLASS= NTUPLES
##ORIGIN= UXNMR, Bruker Analytische Messtechnik GmbH
##OWNER= root
$$ XWIN-NMR		Version 3.5
$$ Thu Jul  1 13:48:56 2021 Russian Standard Time (UT+4h)  she@DPX200
##.OBSERVE FREQUENCY= 81.013821
##.OBSERVE NUCLEUS= ^31P
##.ACQUISITION MODE= SIMULTANEOUS
##.ACQUISITION SCHEME= undefined
##.AVERAGES= 124
##.DIGITISER RES= 16
##SPECTROMETER/DATA SYSTEM= spect
##.PULSE SEQUENCE= zgpg30
##.SOLVENT NAME= CDCl3
##.SHIFT REFERENCE= (INTERNAL, CDCl3, 0, 248.564)
##AUDIT TRAIL= $$ (NUMBER, WHEN, WHO, WHERE, WHAT)
$$ ##TITLE= Audit trail, XWIN-NMR		Version 3.5
$$ ##JCAMPDX= 5.01
$$ ##ORIGIN= Bruker BioSpin GmbH
$$ ##OWNER= she
$$ F:/spectra/data/she/nmr/P31/1/pdata/1/auditp.txt
$$ ##AUDIT TRAIL=  $$ (NUMBER, WHEN, WHO, WHERE, WHAT)
(   1,<2021-07-01 13:47:45.87 +0400>,<she>,<DPX200>,
      <continue with go, POWCHK disabled, PULCHK disabled
       configuration hash MD5:
       00 E9 B6 7A A2 85 ED C7 34 08 36 98 17 FE 4E 26
       data hash MD5: 32K
       D7 6E 41 0C 6A 94 AC 43 77 50 D4 7B D4 18 D4 60>)
(   2,<2021-07-01 13:47:47.59 +0400>,<she>,<DPX200>,
      <Start of raw data processing
       efp BC_mod = 2 LB = 1 FT_mod = 6 PKNL = 1 PHC0 = -7024.653 PHC1 = 57.28607 SI = 64K 
       data hash MD5: 64K
       BC B8 DA AE 43 E6 0D 79 72 32 37 1B D8 53 E9 9B>)
(   3,<2021-07-01 13:48:13.23 +0400>,<she>,<DPX200>,
      <pk PHC0 = -556.121 PHC1 = 528.4 
       data hash MD5: 64K
       DA D5 07 7A 2A 89 AF 06 72 63 2E 00 35 FD E2 91>)
(   4,<2021-07-01 13:48:15.79 +0400>,<she>,<DPX200>,
      <abs ABSG = 5 
       data hash MD5: 64K
       83 35 5C 5B BD 7B 20 4B D6 20 4A 64 89 97 BB F8>)
$$ ##END=
$$ 
$$ hash MD5
$$ D9 E9 5B B0 C0 5A 63 EC 92 49 DA A0 3B 38 8A E4
##$RELAX= 
##$RELAX= 
##$RELAX= 
##$RELAX= 
##$RELAX= 
##$RELAX= 
##$RELAX= 
##$RELAX= 
$$ Bruker specific parameters
$$ --------------------------
##$DU= <F:/spectra>
##$EXPNO= 1
##$NAME= <P31>
##$PROCNO= 1
##$TYPE= <nmr>
##$USER= <she>
##$AMP= (0..31)
100 100 100 100 100 100 100 100 100 100 100 100 100 100 100 100 100 100 
100 100 100 100 100 100 100 100 100 100 100 100 100 100 
##$AQSEQ= 0
##$AQ_mod= 1
##$AUNM= <au_zg>
##$AUTOPOS= <>
##$BF1= 81.014009
##$BF2= 200.13
##$BF3= 200.13
##$BF4= 200.13
##$BF5= 200.13
##$BF6= 200.13
##$BF7= 200.13
##$BF8= 200.13
##$BYTORDA= 1
##$CFDGTYP= 0
##$CFRGTYP= 5
##$CHEMSTR= <none>
##$CNST= (0..31)
1 1 145 1 1 1 1 1 1 1 1 1 1 1 1 1 1 1 1 1 1 1 1 1 1 1 1 1 1 1 1 1 
##$CPDPRG= <waltz16>
##$CPDPRG1= <>
##$CPDPRG2= <waltz16>
##$CPDPRG3= <>
##$CPDPRG4= <mlev>
##$CPDPRG5= <mlev>
##$CPDPRG6= <mlev>
##$CPDPRG7= <mlev>
##$CPDPRG8= <mlev>
##$CPDPRGB= <>
##$CPDPRGT= <>
##$D= (0..31)
0 1 0 0 0 0 0 0 0 0 0 0.03 2e-05 3e-06 0 0 0 0 0 0 0 0 0 0 0 0 0 0 0 0 
0 0 
##$DATE= 1625132697
##$DBL= (0..7)
120 120 120 11 120 120 24 19 
##$DBP= (0..7)
150 150 150 150 150 150 150 150 
##$DBP07= 0
##$DBPNAM0= <>
##$DBPNAM1= <>
$$ [...]
##$SUBNAM3= <"">
##$SUBNAM4= <"">
##$SUBNAM5= <"">
##$SUBNAM6= <"">
##$SUBNAM7= <"">
##$SUBNAM8= <"">
##$SUBNAM9= <"">
##$SW= 501.771253377433
##$SWIBOX= (0..15)
0 1 3 0 0 0 0 0 0 0 0 0 0 0 0 0 
##$SW_h= 40650.406504065
##$TD= 32768
##$TD0= 1
##$TE= 0
##$TE2= 300
##$TE3= 300
##$TEG= 300
##$TL= (0..7)
0 120 53 12 22 120 120 120 
##$TP= (0..7)
150 150 150 150 150 150 150 150 
##$TP07= 0
##$TPNAME0= <>
##$TPNAME1= <>
##$TPNAME2= <>
##$TPNAME3= <>
##$TPNAME4= <>
##$TPNAME5= <>
##$TPNAME6= <>
##$TPNAME7= <>
##$TPOAL= (0..7)
0.5 0.5 0.5 0.5 0.5 0.5 0.5 0.5 
##$TPOFFS= (0..7)
0 0 0 0 0 0 0 0 
##$TUNHIN= 0
##$TUNHOUT= 0
##$TUNXOUT= 0
##$USERA1= <user>
##$USERA2= <user>
##$USERA3= <user>
##$USERA4= <user>
##$USERA5= <user>
##$V9= 5
##$VALIST= <valist>
##$VCLIST= <CCCCCCCCCCCCCCC>
##$VD= 0
##$VDLIST= <DDDDDDDDDDDDDDD>
##$VPLIST= <PPPPPPPPPPPPPPP>
##$VTLIST= <TTTTTTTTTTTTTTT>
##$WBST= 1024
##$WBSW= 4
##$XGAIN= (0..3)
0 0 0 0 
##$XL= 0
##$YL= 0
##$YMAX_a= 40992
##$YMIN_a= -53434
##$ZGOPTNS= <>
##$ZL1= 120
##$ZL2= 120
##$ZL3= 120
##$ZL4= 120
##$ABSF1= 248.5645
##$ABSF2= -253.2056
##$ABSG= 5
##$ABSL= 3
##$ALPHA= 0
##$AQORDER= 0
##$ASSFAC= 0
##$ASSFACI= 0
##$ASSFACX= 0
##$ASSWID= 0
##$AUNMP= <proc_1d>
##$AZFE= 0.1
##$AZFW= 0.5
##$BCFW= 0
##$BC_mod= 2
##$BYTORDP= 0
##$COROFFS= 0
##$CY= -3
##$DATMOD= 1
##$DC= 0
##$DFILT= <>
##$DTYPP= 0
##$F1P= 0
##$F2P= 0
##$FCOR= 1
##$FTSIZE= 65536
##$FT_mod= 6
##$GAMMA= 0
##$GB= 0
##$INTBC= 1
##$INTSCL= 5.30512e-09
##$ISEN= 30
##$LB= 1
##$LEV0= 0
##$LPBIN= 0
##$MAXI= 10000
##$MC2= 0
##$MEAN= 0
##$ME_mod= 0
##$MI= 50
##$NCOEF= 0
##$NC_proc= -8
##$NLEV= 6
##$NOISF1= 182.463
##$NOISF2= 159.3651
##$NSP= 0
##$NTH_PI= 0
##$NZP= 0
##$OFFSET= 248.5645
##$PC= 4
##$PHC0= -7580.774
##$PHC1= 585.6861
##$PH_mod= 1
##$PKNL= yes
##$PPARMOD= 0
##$PSCAL= 0
##$PSIGN= 0
##$REVERSE= no
##$SF= 81.014009
##$SI= 65536
##$SIGF1= 159.3651
##$SIGF2= -187.1042
##$SINO= 113.3802
##$SIOLD= 16384
##$SREGLST= <1H.CDCl3>
##$SSB= 0
##$STSI= 65536
##$STSR= 0
##$SW_p= 40650.406504065
##$SYMM= 0
##$S_DEV= 0
##$TDeff= 32768
##$TDoff= 0
##$TI= <>
##$TILT= no
##$TM1= 0
##$TM2= 0
##$TOPLEV= 0
##$USERP1= <user>
##$USERP2= <user>
##$USERP3= <user>
##$USERP4= <user>
##$USERP5= <user>
##$WDW= 1
##$XDIM= 65536
##$YMAX_p= 434953299
##$YMIN_p= -117382207
$$ End of Bruker specific parameters
$$ ---------------------------------
##NTUPLES= NMR SPECTRUM
##VAR_NAME=  FREQUENCY,     SPECTRUM/REAL,   SPECTRUM/IMAG
##SYMBOL=    X,             R,               I
##VAR_TYPE=  INDEPENDENT,   DEPENDENT,       DEPENDENT
##VAR_FORM=  AFFN,          ASDF,            ASDF
##VAR_DIM=   65536,         65536,           65536
##UNITS=     HZ,            ARBITRARY UNITS, ARBITRARY UNITS
##FACTOR=    0.620285442955139, 1,           1
##FIRST=     20137.2065510759, 0,            0
##LAST=      -20513.1999529892, 0,           0
##MIN=       -20513.1999529892, -117382207,  0
##MAX=       20137.2065510759, 434953299,    0
$$ Real data points
##PAGE= N=1
##DATA TABLE= (X++(R..R)), XYDATA
$$ [...]
42544A496715o465755k713810L427522N776338K289162k798392k530937L972432
$$ 1496715 -4969040 -7682850 -4255328 1521010 3810172 1011780 -1519157 2453275
42536B453275Q252366L712224l157005j763678N127946N091021l322870p668282
$$ 2453275 10705641 14417865 11260860 9497182 14625128 19716149 16393279 8724997
42528H724997j928484M491552L519503O40128K339048L210535l920198j3420853
$$ 8724997 6796513 11288065 14807568 15447696 17786744 20997279 17077081 3656228
42520C656228j3198614j016246J3688073K0737622J6338373L807547p647951r444716
$$ 3656228 -9542386 -10558632 3129441 23867063 40205436 44012983 36365032 26920316
42512B6920316l301596K04726m335757j0738740j1463386o548930R00211R241606
$$ 26920316 23618720 23823446 19487689 8748949 -2714437 -9263367 -8363156 878450
42504H78450J4128955R595422j269801o719122l342725j411027n942437n757128
$$ 878450 15007405 24602827 23333026 16613904 13271179 11860152 5917715 160587
42496A60587O936319J8483565J1377299q354015j8501951j0872829K193261Q734189
$$ 160587 7096906 25580471 36957770 28603755 10101804 -771025 1422236 10156425
42488A0156425Q359998L345297n344430j1324984o643055M427321Q123153Q37874
$$ 10156425 18516423 21861720 16517290 5192306 -1450749 2976572 11099725 11937599
42480A1937599o175531m819297O5161L271747P934949J4521991J3921994J648346
$$ 11937599 5762068 942771 1007932 4279679 12214628 26736619 40658613 42306959
42472D2306959j1126906j2104165n833407n139268j0064054q681646K730167J3026401
$$ 42306959 31180053 19075888 13242481 8103213 -1960841 -10642487 -7912320 5114081
42464E114081J1900794K624560m497184m487855J55794M643978N677742L128728
$$ 5114081 17014875 19639435 15142251 10654396 10810190 15454168 21131910 24260638
42456B4260638J08427q53559j690079n171933q195482m961120K432902M580550
$$ 24260638 24369065 23515506 21825427 16653494 8458012 3496892 5929794 10510344
42448A0510344p48611l494846K762695Q425413K252554q317287o121761Q194275
$$ 10510344 9761733 6266887 9029582 17454995 19707549 11390262 5268501 13462776
42440A3462776J4510553L031316j0710978r768125k36313J855979k954579j661486
$$ 13462776 27973329 31004645 20293667 10525542 10289229 12145208 9190629 7529143
42432G529143O387211P748709j776461r414959n634959K082984K459383l617985
$$ 7529143 13916354 21665063 19888602 10473643 4838684 6921668 9381051 5763066
42424E763066p848234p017138l560812M24448L781766N297004N848997P106564
$$ 5763066 -2085168 -9102306 -12663118 -12238670 -8456904 -3159900 2689097 9795661
42416I795661O627661Q53068o067605n613980P66433J652699n787749r425322
$$ 9795661 16423322 17276390 11208785 5594805 6361238 8013937 2226188 -7199134
42408g199134j485529P968479P176028J445607K685388Q466839O599139l860752
$$ -7199134 -8684663 -716184 6459844 7905451 10590839 19057678 25656817 21796065
42400B1796065j0943947p833037J34302O222646Q673460O443239m05234n607471
$$ 21796065 10852118 3019081 3153383 9376029 18049489 24492728 24087494 18480023
42392A8480023k575764L955484K854306n766553r368542k224911N867135N305482
$$ 18480023 15904259 19859743 22714049 16947496 7578954 5354043 11221178 16526660
42384A6526660M62999K30626L209753J626289m832542q254804m313037K062252
$$ 16526660 16989659 17220285 20430038 22056327 17223785 8968981 4655944 6718196
42376F718196L492320j302486o481711n100104L297453J0788393R030878n67683
$$ 6718196 10210516 8908030 2426319 -2673785 623668 11412061 20442939 19875256
42368A9875256q281640q613492o291283o827831o929893q24156P484208P295480
$$ 19875256 11593616 2980124 -3311159 -10138990 -17068883 -17893039 -10408831 -3113351
42360c113351k846481j1040599p938613O56823M007744L211219P167164J4450649
$$ -3113351 -5959832 -17000431 -24939044 -24282221 -20274477 -17063258 -9896094 4554555
42352D554555J2867097R5443r028979m027871M692204L093267l262902j24990
$$ 4554555 17421652 17517095 8488116 4460245 9152449 12245716 8982814 8857824
42344H857824Q532120N796175p455743j0530432L255564J3631305N321282p733567
$$ 8857824 17389944 23186119 15730376 5199944 8455508 22086813 27408095 19674528
42336A9674528o157062M013124M211079n303649r006488l827297j261735m501699
$$ 19674528 13517466 17530590 21741669 16438020 7431532 3604235 2342500 -2159199
42328b159199m196740K232831N630701K197623p81417K28106m83983m345284l796781
$$ -2159199 -6355939 -4123108 1507593 3705216 2923799 3151905 2667922 -1677362 -5474143
42319e474143L320183P539313K650683l930502k713661M356815Q303093M775505
$$ -5474143 -2153960 5385353 8036036 4105534 1391873 5748688 14051781 18827286
42311A8827286l144031q679151o086355K775043P222592N62979q096164n396998
$$ 18827286 15683255 7004104 917749 3692792 10915384 11478363 3382199 -2014799
42303b014799N061266P060669k583498q817799k313545P437603R172136M980777
$$ -2014799 3046467 10107136 7523638 -1294161 -3607706 3829897 13002033 17982810
42295A7982810P34135m409512j0054200r398428j603981L106399J51234p34078
$$ 17982810 18716945 14307433 4253233 -5145195 -6749176 -3642777 -3491543 -4225621
42287d225621O219257J0301755L083493m709452j189166M931887m03880j0527076
$$ -4225621 1993636 12295391 15378884 10669432 9480266 14412153 14008273 3481197
42279C481197q907920J591970L747979l620607m432915N191162R962922K282453
$$ 3481197 -5426723 -3834753 -86774 -3707381 -8140296 -2949134 7013788 9296241
42271I296241n712797m201696k99553j538006k293639K460810N276591J78661
$$ 9296241 3583444 -618252 -917805 -2455811 -4749450 -2288640 2987951 3166612
42263C166612m717096j176183M185855K213228j944240J003110O130934K495242
$$ 3166612 -1550484 -2726667 1459188 3672416 1728176 2731286 8862220 11357462
42255A1357462o068546n688934M152993R108366L205912k436706J033157O052988
$$ 11357462 5288916 -400018 3752975 12861341 16067253 13630547 14663704 20716692
42247B0716692J822968q462404j2752216o604171L357795Q735821N928775l217412
$$ 20716692 22539660 14077256 1325040 -5279131 -1921336 6814485 12743260 9525848
42239I525848j1467670r798203K936513J5685588J6386911O433281j821539j426580
$$ 9525848 -1941822 -11740025 -8803512 6882076 23268987 29702268 27880729 26454149
42231B6454149K096338J435734j948620k706829j852631m835829j0759897j1139442
$$ 26454149 28550487 29986221 28037601 25330772 23478141 18642312 7882415 -3257027
42223c257027j962504Q654134R767342J669369m990016l550743J133081J450511
$$ -3257027 -5219531 3434603 13201945 14871314 9881298 6330555 7463636 8914147
42215H914147k133503l696371j954477j383013l630065m155368K62201N640506
$$ 8914147 6780644 3084273 1129796 -253217 -3883282 -8038650 -7776449 -2135943
42207b135943O212672K400190q75790j572399j487339j092970J277467M698959
$$ -2135943 4076729 6476919 5601129 4028730 2541391 1448421 2725888 7424847
42199G424847N225498K041881k77196J579163M296812K808708k003633m646003
$$ 7424847 12650345 14692226 14415030 15994193 20291005 23099713 21096080 16450077
42191A6450077k869323q9121q616k531215n681988q017200p524266j625887Q305084
$$ 16450077 13580754 13491633 13483017 10951802 5269814 -2747386 -10271652 -11897539 -3592455
42182c592455J4501599R701640k778715j0219243m683859O927471J1225740M986603
$$ -3592455 10909144 20610784 17832069 7612826 2928967 9856438 21082178 26068781
42174B6068781k175592k002591K181463K640873j225558l967181k702252J318345
$$ 26068781 23893189 21890598 24072061 26712934 25487376 21520195 18817943 20136288
42166B0136288O540235J0038162O017858o173204j4987713q397057P247075J2062868
$$ 20136288 26676523 36714685 42732543 36559339 21571626 13174569 20421644 32484512
42158C2484512n14053j3899703j1607722J213207Q925974Q251334P347217Q281438
$$ 32484512 31970459 18070756 6463034 7676241 16602215 24853549 32200766 40482204
42150D0482204M621272m802609j2073385j1646406o545587j855778L95271n62490
$$ 40482204 45103476 40300867 28227482 16581076 10035489 8179711 8574982 8012492
42142H012492l721220l911415K435725R333941P460831j559933o560674l631993
$$ 8012492 4291272 379857 2815582 12149523 19610354 18050421 11489747 7857754
42134G857754r69971l767711n276037P26708P981619P077407L66438j995283K322518
$$ 7857754 6887783 3120072 -2155965 -1429257 6552362 13629769 13996207 12000924 14323442
42125A4323442N257021J195374m917667m547639L170314R608062N838724o589832
$$ 14323442 19580463 20775837 15858170 11310531 14480845 24088907 29927631 23337799
42117B3337799j5433335j0838923K404359J0199387O578763l04558j198500K301195
$$ 23337799 7904464 -2934459 -530100 9669287 16248050 15943492 14744992 17046187
42109A7046187L054976m84367m419671o384938o107350k242326M826931R353779
$$ 17046187 20101163 19616796 15197125 8812187 2704837 462511 5289442 14643221
42101A4643221O210196p89622l383026r41685m12191l661808l856269J822060
$$ 14643221 20853417 20063795 16680769 15739084 15326893 11665085 7808816 9630876
42093I630876M609981k907214j2325271q703877P079777J6790199R015423n268334
$$ 9630876 14240857 11333643 -991628 -9695505 -2615728 14174471 23189894 17921560
42085A7921560q392182O27460Q338142P477192L282449M96503l161664q086386
$$ 17921560 9529378 10156838 18494980 25972172 29254621 29751124 26589460 18503074
42077A8503074r050541m980616j892586q43638N496572J6777260J8125594J474481
$$ 18503074 9452533 4471917 2579331 1735693 7232265 24009525 42135119 43609600
42069D3609600j6930297j6043216l5118Q352405O62417r064297q501103j594201
$$ 43609600 26679303 10636087 10600969 18953374 19615791 10551494 2050391 456190
42061D56190L940649P270768P664388J698952o884361p761817l63171L223270
$$ 456190 4396839 11667607 19331995 21030947 14146586 6384769 6021598 9244868
42053I244868k423904p455914m475625l47336j012111P82370J0104389J5598827
$$ 9244868 6820964 -634950 -5110575 -5457911 -6470022 -5687652 4416737 20015564
42045B0015564O180207q447790j1026816l058304o1675n129682n809874L162831
$$ 20015564 26195771 17747981 6721165 3662861 3601186 -1528496 -7338370 -4175539
42037d175539J1506525J0850354N988189L873031L149018K76621l018384m012479
$$ -4175539 7330986 18181340 24169529 28042560 31191578 31468199 28449815 24437336
42029B4437336m044275m720058m204799r23384K934849M076468J533425l025024
$$ 24437336 20393061 15673003 11468204 10544820 13479669 17556137 19089562 16064538
42021A6064538n731197k870611L414167M803910k165271q443088m039238N755883
$$ 16064538 10333341 7462730 10876897 15680807 13515536 5072448 1033210 6789093
42013F789093O650338k615200p092542J904619J2959818J0733316k506493j0885559
$$ 6789093 13439431 10824231 3731689 5636308 18596126 29329442 26822949 15937390
42005A5937390o026458M628048R215302M120879n147631j0644842q346926j095089
$$ 15937390 9910932 14538980 23754282 27875161 22727530 12082688 3735762 2640673
41997B640673L684884J220512n031535o782589n43217P858195R847919M056635
$$ 2640673 6325557 7546069 2514534 -4268055 -4811272 3046923 12894842 16951477
41989A6951477k749143m724121l488668l340472l420450R5063N390974N448322
$$ 16951477 14202334 9478213 5989545 2649073 -771377 -676314 4714660 10162982
41981A0162982j309587p060011m787170K461353O646010N077188J324821r37019
$$ 10162982 8853395 1793384 -2993786 -532433 6113577 11190765 12515586 11578567
41973A1578567o13735J647965L091643L68070m929536n611957J782748J0213034
$$ 11578567 10964832 12612797 15704440 16072510 11142974 5531017 7313765 17526799
41965A7526799R912575O81528q694811j1467593q243067k632525L012675P193058
$$ 17526799 27439374 28120902 19426091 7958498 -284569 -2917094 95581 7288639
41957G288639Q492713O403520J849853k619182l518293k14749K215174j326397
$$ 7288639 15781352 22184872 24034725 21415543 17897250 17682501 19897675 18571278
41949A8571278p222708o783005J6826K911666k889931q391096m401731M825846
$$ 18571278 11348570 4565565 4582391 7494057 4604126 -3786970 -8188701 -3362855
41941c362855R275378P374314M059699P65245l698443p048099o630908m468797
$$ -3362855 5912523 13286837 17346536 18111781 14413338 7365239 734331 -3734466
41933c734466k469594J835549Q320015J0482964O024280K314664K865489o12009
$$ -3734466 -6204060 -4368511 3951504 14434468 20458748 22773412 25638901 25026892
41925B5026892j1495654j6211633m341540J1007173J1712797K996414J531357
$$ 25026892 13531238 -2680395 -7021935 3985238 15698035 18694449 20225806
41918B0225806M808027j409891j1630260p167119P218913O250491j1523076j6376154
$$ 20225806 25033833 23623942 11993682 4826563 12045476 18295967 6772891 -9603263
41910i603263L788561K0175717P800252j5058825j6646345J295819J3247597J0294706
$$ -9603263 -5814702 14361015 22161267 7102442 -9543903 -8248084 4999513 15294219
41902A5294219L524750j686219q199343j0778164j852939J0179492J0329193J546540
$$ 15294219 18818969 17132750 8933407 -1844757 -3697696 6481796 16810989 18357529
41894A8357529r78138K983837o42584j2740035j6625330m984973Q550205J0599119
$$ 18357529 17379391 20363228 19720644 6980609 -9644721 -14629694 -6079489 4519630
41886D519630M084832k797841q198292j0464588m485142P873923J5155207J1433857
$$ 4519630 8604462 5806621 -2391671 -12856259 -17341401 -9467478 5687729 17121586
41878A7121586M016782J27836k981090p510535o283768N149924J6256355J3278413
$$ 17121586 21138368 21266204 18285114 10774579 4490811 9640735 25897090 39175503
41870C9175503j370772j2221552j0968661m009910k43980j05799Q55123L498202
$$ 39175503 37804731 25583179 14614518 10604608 10360628 10254829 11109952 14608154
41862A4608154M228794O56741m613196o316714k306874L582127N322045J211098
$$ 14608154 18836948 19493689 14880493 8563779 6256905 9839032 15161077 16372175
41854A6372175m455586o159791k524296K971518N705385M549906L087745N060550
$$ 16372175 11916589 5756798 3232502 6204020 11909405 16459311 19547056 24607606
41846B4607606Q577749P654841P67168n640355n152180q7782J677244k871834
$$ 24607606 33185355 40840196 41607364 35967009 30814829 30727047 32404291 29532457
41838B9532457q308577p408838O46617Q435359O715973m921887j4483067r764741
$$ 29532457 21223880 13815042 14461659 22897018 29612991 24691104 10208037 443296
41830D43296N336455J3767412P014726m415731p016067j898526J412720P40745
$$ 443296 5779751 19547163 26561889 22146158 15130091 13231565 14644285 15385030
41822A5385030J88733r10398n915837j0753916p746662J356935O807688M922562
$$ 15385030 15573763 14663365 8747528 -2006388 -9753050 -8396115 -1588427 3334135
41814C334135R18013j520765l273826l088020J196733M845537J181799n269016
$$ 3334135 4252148 2731383 -542443 -3630463 -2433730 2411807 3593606 -1675410
41806a675410l055505P441411J3033746Q342452K947097L048083J281279o984664
$$ -1675410 -4730915 2710496 15744242 24086694 27033791 30081874 31363153 24378489
41798B4378489j1919015n498791K810729N00260p460211p680080q73577J109357
$$ 24378489 12459474 6960683 9771412 10271672 2811461 -4868619 -5742196 -4632839
41790d632839k917500j645363Q119903J4482022Q467853k955883p641409l306557
$$ -4632839 -7550339 -9195702 -1075799 13406223 21874076 18918193 11276784 7970227
41782G970227L774914Q411557R200472O076110J30358o131755j0622199j1798497
$$ 7970227 11745141 20156698 29357170 35433280 35563638 29431883 18809684 7011187
41774G011187p290740K925582J1634364R224766l470503j2998098q936515K479961
$$ 7011187 -279553 2646029 14280393 23505159 20034656 7036558 -1899957 580004
41766E80004O611278O6210n324709L88694J0878800J1773597M60340r549064o100091
$$ 580004 7191282 7257492 1932783 2321477 13200277 24973874 25434214 15885150 9785059
41757I785059N589445J0020923J706462q906815j0288460l232020L996991P443598
$$ 9785059 15374504 25395427 27101889 18195074 7906614 4674594 8671585 16115183
41749A6115183Q326648O400785J88982p035951q487268k636439L971693M447875
$$ 16115183 24441831 30842616 31031598 23995647 15508379 12871940 16843633 21291508
41741B1291508j129040p211408q645128m226566K638085N908449K336904m109055
$$ 21291508 20162468 12951060 4305932 79366 2717451 8625900 10962804 6853749
41733F853749n893697q81929N176325O316325L412110J437997K340565L758070
$$ 6853749 960052 78123 5254448 11570773 14982883 16420880 18761445 22519515
41725B2519515L518937K113978N55266j501596m243153n966622m643791p34577
$$ 22519515 26038452 28152430 28707696 27206100 22962947 16996325 12352534 11617957
41717A1617957L106054N010814M928861K861931r26091k987294J478758R981230
$$ 11617957 14724011 19734825 24663686 27525617 26599526 23612232 25090990 35072220
41709C5072220J0598986l622840k0315905j8812579J982722J8197308J0698752
$$ 35072220 45671206 42048366 21732461 2919882 4902604 23099912 33798664
41702C3798664r587795j7119987n624190P445582P753661K31382l972356k853947
$$ 33798664 24210869 7090882 1466692 8912274 16665935 16897317 12924961 10071014
41694A0071014K58817M821501R375584Q084671m68570p365543m805953J780740
$$ 10071014 10329831 15151332 24526916 32611587 32143017 24777474 19971521 21752261
41686B1752261K108355k859147l511631J996849N061997J062735l847238l590534
$$ 21752261 23860616 21001469 17489838 19486687 24548684 25611419 21764181 18173647
41678A8173647j155203j805135l932400k816233N40680O88220l390246n838912
$$ 18173647 17018444 15213309 11280909 8464676 9005356 9693576 6303330 464418
41670D64418j420613P192993J1358385N868310m152497p675450m57862R091348
$$ 464418 -956195 6236798 17595183 23463493 19310996 11635546 11177684 20269032
41662B0269032R965279K301407m047690l547459o53244k10891K52236M213584
$$ 20269032 30234311 32535718 28488028 24940569 24287325 24076434 24328670 28542254
41654B8542254Q054643N619241k224693q422056q455033l448958L505169Q873223
$$ 28542254 36596897 42216138 39991445 31569389 23114356 19665398 23170567 32043790
41646C2043790Q142615Q2677q412256q000489R30882P252638L034278o161935
$$ 32043790 40186405 40269082 31856826 23856337 24787219 32039857 35074135 28912200
41638B8912200q968912l017506L039721J654667m320056o603160k823261J225368
$$ 28912200 19943288 16925782 19965503 21620170 17300114 10696954 7873693 9099061
41630I099061R42991K0205M057433R797920P943269k258505r378299n603296J357967
$$ 9099061 10042052 10062257 14119690 23917610 31860879 29602374 20224075 14620779 15978746
41621A5978746L89056n173314l571663M625886O390455j684524o605169p08898
$$ 15978746 16367802 11194488 7622825 12248711 18639166 16954642 10349473 9640575
41613I640575M433541k806131j2939972q933179O176561J2740134L807232n983135
$$ 9640575 14074116 11267985 -1671987 -10605166 -4428605 8311529 12118761 6135626
41605F135626l420490O245641J0708292O810103j157940r103711j2278046n999007
$$ 6135626 2715136 8960777 19669069 26479172 25321232 16217521 3939475 -2059532
41597b059532N550328R716388K041842n851367l239796L678159L024817l738023
$$ -2059532 3490796 13207184 15249026 9397659 6157863 9836022 12860839 9122816
41589I122816o725475n075190m942696m332300L913128J5052058J4951401K020520
$$ 9122816 2397341 -2677849 -7620545 -11952845 -8039717 7012341 21963742 23984262
41581B3984262q516362o367368J778533O565899P915110O468536j731003j2743738
$$ 23984262 15467900 9100532 10879065 17444964 25360074 31828610 30097607 17353869
41573A7353869j1499014O309622K1474536J5278777l635444j2643399p483829
$$ 17353869 5854855 12164477 33639013 48917790 45282346 32638947 25155118
41566B5155118k960543n999797p807153l154775R64566j19314j073418J352897
$$ 25155118 22194575 16194778 8387625 5232850 6197416 6078102 5004684 6357581
41558F357581J886318j912328l687522K30848L891498K301937o63060p29642l47793
$$ 6357581 8243899 6331571 2644049 2874897 6766395 9068332 8405272 7675630 7327837
41549G327837j603776j171822J772521J819929k319074l196684K839682Q105670
$$ 7327837 5724061 4552239 6324760 8144689 5825615 2628931 5468613 13574283
41541A3574283O054396J447535k06712k772250q906825j0196098p01994R218216
$$ 13574283 19628679 21076214 20869502 18097252 9190427 -1005671 -1707665 7510551
41533G510551P487274N16597K032807Q367030M621172p604891j0317446J029667
$$ 7510551 14997825 15514422 17547229 25914259 30535431 22930540 12613094 13642761
41525A3642761Q991728K294055o482637k284852Q897017J1689980N349293R25423
$$ 13642761 22634489 24928544 18445907 16161055 25058072 36748052 42097345 43022768
41517D3022768R68415k505988j1107110j4700211o373518O337282J0597003M020449
$$ 43022768 43991183 41485195 30378085 15677874 9304356 15641638 26238641 30259090
41509C0259090m081738n790125l480585l286599m209552n50933N973345O198664
$$ 30259090 26177352 20387227 16906642 13620043 9410491 8859558 14832903 21031567
41501B1031567j175684m843569J143645N577750j668149r719438k562799J2068967
$$ 21031567 19855883 15012314 16155959 21733709 20065560 10346122 7783323 19852290
41493A9852290J1944702l053885q699521M126729J3574213K751816j2200299q886076
$$ 19852290 31796992 28743107 20043586 24170315 37744528 40496344 28296045 19409969
41485A9409969N511545Q594659p0786j873323P149944J1010984J958297q457508
$$ 19409969 24921514 33516173 33445387 31572064 38722008 49732992 51691289 43233781
41477D3233781r990900o688010m547651k214582Q20255N91692k008571q76740
$$ 43233781 33242881 26554871 22007220 19792638 20612893 21204585 19196014 18319274
41469A8319274K800892J075213m334318j476716J0367224J4927826L651847r193085
$$ 18319274 21120166 22195379 17861061 16384345 26751569 41679395 45331242 36138157
41461C6138157q115238M71444J384476m092508l319181M243205O689944M78592
$$ 36138157 28022919 28494363 29878839 25786331 22467150 26710355 33400299 33878891
41453C3878891n031001m699482m536497q263180r549531l064892N973583R056078
$$ 33878891 28847890 24148408 19611911 11348731 1799200 -1265692 4707891 13763969
41445A3763969N207003K80645m32144L415342O879869L852017m484841p831246
$$ 13763969 18970972 19251617 18819473 22234815 29114684 32966701 28481860 20650614
41437B0650614j07014Q661377M207425r809165j4898630m728446N957851N158500
$$ 20650614 20543600 29204977 33412402 23603237 8704607 3976161 9934012 15092512
41429A5092512R85490M630434R709966M037291p410347r155777l75560M458062
$$ 15092512 16078002 20708436 30418402 34455693 27045346 17889569 17514009 21972071
41421B1972071o47909n933468m535729k007754k305277L71451Q119642J1341052
$$ 21972071 21324162 15390694 10854965 8847211 6541934 6913385 15033027 26374079
41413B6374079L995340m500746l560412J982463J575903k824791j789720L949973
$$ 26374079 30369419 25868673 22308261 24290724 25866627 23041836 21252116 25202089
41405B5202089N297080J350375j05341K032975N69610m568210l346571P017936
$$ 25202089 30499169 31849544 31744203 33777178 34346788 29778578 26432007 33449943
41397C3449943J3932880O296352r216922j6801172j0784890P12599P225455M989567
$$ 33449943 47382823 53679175 44462253 27661081 16876191 17588790 24814245 29803812
41389B9803812k350628o994650l280877N579530R735570M545233l481737n869191
$$ 29803812 27453184 20458534 17177657 22757187 32492757 37037990 33556253 27687062
41381B7687062l024226j335134l032788m486536k715595J409880N507731P114826
$$ 27687062 24662836 23327702 20294914 15808378 13092783 14502663 20010394 27125220
41373B7125220L798100l972145j0440674r171464q52046O487556O255029L14859
$$ 27125220 30923320 26951175 16510501 7339037 6486991 12974547 19229576 19544435
41365A9544435l998408k425610K541438O178836O995465N724242J499109n900532
$$ 19544435 15546027 13120417 15661855 21840691 28836156 34560398 36059507 30158975
41357C0158975j0701295n607811N703261R123522n77756r590797m321073P038525
$$ 30158975 19457680 13849869 19553130 28676652 28098896 18508099 14187026 21225551
41349B1225551O899989k885114l808090P384837J1267210k288904j5419578r676120
$$ 21225551 28125540 25240426 21432336 28817173 40084383 37795479 22375901 12699781
41341A2699781M804034O299911m283163p954247k38427L759653k647664o294724
$$ 12699781 17503815 23803726 19520563 11566316 11327889 15087542 12439878 6145154
41333F145154K608414J3198128J0575731j867509q271042k183441P521344J0179935
$$ 6145154 8753568 21951696 32527427 30659918 22388876 20205435 27726779 37906714
41325C7906714M984887j244422l315293k835895m673753r143748j0338897m182139
$$ 37906714 42891601 41647179 38331886 35495991 30822238 21678490 11339593 7157454
41317G157454M917387R111564O040764j216121r064422j2751153o089625R292376
$$ 7157454 12074841 21186405 27227169 26011048 16946626 4195473 -1894152 7398224
41309G398224J8753199J0428913n914033r468223J992188Q958005P77846p946989
$$ 7398224 26151423 36580336 30666303 21198080 23190268 32148273 32926119 24979130
41301B4979130j965904Q964388N555271r295278j3619090P86433J6538068J5335976
$$ 24979130 23013226 31977614 37532885 28237607 14618517 15404950 31943018 47278994
41293D7278994M05207j2047469j3306247o484224K171880P940059P415207R60455
$$ 47278994 47684201 35636732 22330485 15846261 18018141 25958200 33373407 34333862
41285C4333862n744908p230502m152176n99431J948592M098036M691240K527635
$$ 34333862 28588954 21358452 17206276 16606845 18555437 22653473 27344713 29872348
41277B9872348J78300P42760K026184j91358l905471k987451K045018L547141
$$ 29872348 30050648 30793408 32819592 32628234 28722763 25735312 27780330 31327471
41269C1327471n99307k786407R79729K750396m069861j1150865o646455N047427
$$ 31327471 30728164 27941757 28921486 31671882 27602021 16451156 9804701 14852128
41261A4852128Q781912K038472k158973K545430O057918K09755o998433n053444
$$ 14852128 23634040 25672512 23513539 26058969 32116887 32326642 25328209 20274765
41253B0274765K111531M108697J035758N66065L695069N183875M511546M991914
$$ 20274765 22386296 26494993 27530751 28096816 31791885 36975760 41487306 46479220
41245D6479220M517838j482394r234786j0009947m062247j68980q43720L61919
$$ 46479220 50997058 49514664 40279878 30269931 26207684 26038704 25194984 25556903
41237B5556903M940365N171399j646320o439752l070034N00768m432458j0849905
$$ 25556903 30497268 35668667 34022347 27582595 24512561 25013329 20580871 9730966
41229I730966n468322R153890J5623078O185894o056073o067565K661982N908311
$$ 9730966 4262644 13416534 29039612 35225506 29169433 23101868 25763850 31672161
41221C1672161J022692r17348N005681Q530501J055231r041526q301911J327707
$$ 31672161 32694853 31777505 36783186 45313687 46368918 37327392 29025481 30353188
41213C0353188O528718L618992J163120J839338k117173j0964521j1334618K400374
$$ 30353188 36881906 40500898 41664018 43503356 41386183 30421662 19087044 21487418
41205B1487418J4734037J0086715l718012q076266j352583K865462L8075j100109
$$ 21487418 36221455 46308170 42590158 34513892 33161309 36026771 36064846 34964737
41197C4964737K397874K313526l902899o500857N11593Q917098Q456471K44128
$$ 34964737 37362611 39676137 35773238 29272381 29783974 38701072 47157543 47401671
41189D7401671p590603j0082492o833848k33780M125797J780785l453253l561478
$$ 47401671 39811068 29728576 22894728 22660948 26786745 28567530 25114277 21552799
41181B1552799J189371K506946j521918k694862K872972P243076L725441j959142
$$ 21552799 22742170 25249116 23727198 21032336 23905308 31148384 34873825 32914683
41173C2914683j360637L242954L483882k027407p076217p134089l001807K400867
$$ 32914683 31554046 34797000 38280882 36253475 29177258 22043169 19041362 21442229
41165B1442229N959990N341549J881088K07704K213500M206833K288494k651532
$$ 21442229 27402219 32743768 34624856 34832560 37046060 41252893 43541387 40889855
41157D0889855p055644q235086m651101K888405R089413Q136439J249015m457305
$$ 40889855 33834211 25599125 20948024 23836429 32925842 41062281 42311296 37853991
41149C7853991n446895m720382m840046m357622k182937P77139M899558J0170000
$$ 37853991 32407096 27686714 22846668 18489046 16306109 17083248 21982806 32152806
41141C2152806J1769325N626942k298172k530400K310718Q62833o803647p233814
$$ 32152806 43922131 49549073 47250901 44720501 47031219 47894052 41090405 33856591
41133C3856591L698348J1712313N990524m179607n499034j027624j741314p476578
$$ 33856591 37554939 49267252 55257776 51078169 45579135 44551511 42810197 35333619
41125C5333619r617748n815632k1216O085273J0982843R342849R37520l743322
$$ 35333619 25715871 19900239 19879023 25964296 36947139 46289988 47227508 43484186
41117D3484186J817905P745700K978733n255825k916671O425734O810356l612599
$$ 43484186 45302091 53047791 56026524 50770699 47854028 54279762 61090118 57477519
41109E7477519r967005m747898K990398M826255L161049P60416m586864j0426053
$$ 57477519 47510514 42762616 45753014 50579269 53740318 54500734 49913870 39487817
41101C9487817r118496k159163p83979o300056m903187R096840J9636957J1209940
$$ 39487817 30369321 28210158 27426179 21126123 16222936 25319776 44956733 56166673
41093E6166673o836462j3350980m959926L284682K774286N57616L011965M932974
$$ 56166673 49330211 35979231 31019305 34303987 37078273 37635889 40647854 45580828
41085D5580828Q6146p543792r547478m246241L061664P070749O025384J720867
$$ 45580828 45666974 38123182 28575704 24329463 27391127 34461876 40487260 42208127
41077D2208127j238648M41732L369281Q57802n750524n766479N046557J3918910
$$ 42208127 40969479 41411211 44780492 45638294 39887770 34121291 39167848 53086758
41069E3086758O509786j0465517j5160377q36789J3385603Q981986o521010j2027042
$$ 53086758 59596544 49131027 33970650 33133861 46519464 55501450 48980440 36953398
41061C6953398k779798O702916O692054M027153O990234J0980358O310138o717229
$$ 36953398 34173600 40876516 47568570 51595723 58585957 69566315 75876453 69159224
41053F9159224j7222607j5753079l762910P499968P862309J03432k343687O002562
$$ 69159224 51936617 36183538 32420628 39920596 47782905 47886337 45542650 51545212
41045E1545212J2245877K651183j4478158j7524684k107585J2704476J1559614
$$ 51545212 63791089 66442272 51964114 34439430 32331845 45036321 56595935
41038E6595935Q75826n877543o185097l462571K656299J0560293J2035638M145473
$$ 56595935 57471761 51594218 45409121 41946550 44602849 55163142 67198780 71344253
41030G1344253l472393l215229j786189o854225j1368556m908103O949755R585562
$$ 71344253 67871860 64656631 62870442 56016217 44647661 39739558 46689313 56274875
41022E6274875J109913o946798p869346n440504l031658M95959M142991M672715
$$ 56274875 57384788 50437990 42568644 37128140 34096482 34592441 38735432 43408147
41014D3408147L243209L415858L842356J421923q15716J441717L740503j430243
$$ 43408147 46651356 50067214 53909570 55331493 54515777 55957494 59697997 58267754
41006E8267754j0425581j1472311k107857P379056R283358O903737N145484K423299
$$ 58267754 47842173 36369862 34262005 41641061 50924419 57828156 62973640 65396939
40998F5396939l453826q411019o706324O57245N888275K559398o733515j1618195
$$ 65396939 61943113 53532094 46825770 47483015 53371290 55930688 49197173 37578978
40990C7578978n463693M962386O829348j445246q225245n953085l75489J705135
$$ 37578978 32115285 37077671 43907019 42461773 34236528 28283443 27907954 29613089
40982B9613089K553007M709162L898425m75015J71117P851797R444853k614968
$$ 29613089 32166096 36875258 40773683 40298668 40469785 48321582 57766435 55151467
40974E5151467j3682630p798624O012531Q133586j00502j735052M911812N180077
$$ 55151467 41468837 33670213 39682744 47816330 47715828 45980776 50892588 56072665
40966E6072665l575751o882545P87092O904886L071564l096010m248849l937427
$$ 56072665 52496914 45614369 46401461 53306347 56377911 53281901 49033052 45095625
40958D5095625m754689k191145L132400K305347o038028j0702068n316286K231148
$$ 45095625 40340936 38149791 41282191 43587538 37549510 26847442 21531156 23762304
40950B3762304L803635K028720J609221J569436J514591M350852Q339618P460236
$$ 23762304 27565939 29594659 31203880 32773316 34287907 38638759 46978377 54438613
40942E4438613K741605J536260L636496J389333m763875n825378j288011l12272
$$ 54438613 57180218 58716478 62352974 63742307 58978432 53153054 51865043 51552771
40934E1552771l405418r38756O513285O199964k900676n258140M123893R526733
$$ 51552771 48147353 47208597 53721882 59921846 57021170 51763030 55886923 65413656
40926F5413656K233683l555296L079352Q639498j380856j5656271j4297235L35562
$$ 65413656 67647339 64092043 67171395 75810893 74430037 58773766 44476531 44812093
40918D4812093J0369533R539583M337206k843702j2298933j5624926m794400J1309035
$$ 44812093 55181626 64721209 69058415 66214713 53915780 38290854 33496454 44805489
40910D4805489J6061919P909265l01365j389695M22513Q85744J10842k217577
$$ 44805489 60867408 68776673 68475308 67085613 67508126 68393870 68504712 66287135
40902F6287135n486493n094924L31842L774349P31516j698905L172595Q355983
$$ 66287135 60800642 55705718 56037560 59811909 60543425 58844520 62017115 70373098
40894G0373098L964652n794449r408404n900782k816255j592954J838411N942171
$$ 70373098 74337750 68543301 59134897 53234115 50417860 48824906 50663317 56605488
40886E6605488N601074J955628o12907l003175o633625o156731J605296P796893
$$ 56605488 62206562 64162190 63549283 60546108 53912483 47755752 49361048 57157941
40878E7157941L377522m934490m119833M587275Q490085L213390l522033n184404
$$ 57157941 60535463 55600973 51481140 56068415 64558500 67771890 64249857 59065453
40870E9065453j809502M630382R752772O530048m221890j0005859m299085J210371
$$ 59065453 57255951 61886333 71639105 78169153 73947263 63941404 59642319 60852690
40862F0852690m444546j1156257m069135R499526J0905095J093844k770333K104579
$$ 60852690 56408144 45251887 41182752 50682278 61587373 62681217 59910884 62015463
40854F2015463J531866p663611j1326329l191790N614103P180179O539912N728655
$$ 62015463 63547329 55883718 44557389 41365599 46979702 54159881 60699793 66428448
40846F6428448j487980j2347369j2361095J604795J3283557J0841828K289597
$$ 66428448 64940468 52593099 40232004 41836799 55120356 65962184 68251781
40839F8251781j334023j498796j683413J936154Q400508O364412p028121j5929130
$$ 68251781 66917758 65418962 63735549 65671703 74072211 80436623 73408502 57479372
40831E7479372p825991O727617J0168506K489560m465562p075282q767026o791628
$$ 57479372 49653381 56380998 66549504 69039064 64573502 57498220 48731194 41939566
40823D1939566L200015J3731845J2342440O09241o939329l048980M546341O676664
$$ 41939566 45139581 58871426 71213866 71823107 64883778 61834798 66381139 73057803
40815G3057803L830126R57771q57460l244441n360917m040317J224637N327361
$$ 73057803 76887929 77845700 76988240 73743799 68382882 64342565 65567202 70894563
40807G0894563J828262q242197j4603758r258587K217230P342387L424105p04696
$$ 70894563 72722825 64480628 49876870 40618283 42835513 50177900 53602005 52897309
40799E2897309L40259J921214M95657Q66646O495995J1056962O993490l115129
$$ 52897309 53237568 55158782 55654439 56521085 63017080 74074042 81067532 77952403
40791G7952403j0178179r407841k709876N254720Q999583M845311l853845q136137
$$ 77952403 67774224 58366383 55656507 60911227 69910810 74756121 70902276 62766139
40783F2766139l967423K502228L400975j200361m983724l018185M198880J0646676
$$ 62766139 58798716 61300944 64701919 63501558 58517834 55499649 59698529 70345205
40775G0345205Q704195j612408q585697j883584J1266246J3538244J663456r467607
$$ 70345205 79049400 77436992 68851295 66967711 78233957 91772201 93435657 83968050
40767H3968050r556587n515392n355566m156302L742186J1158803R421858L610250
$$ 83968050 74411463 68896071 63540505 59384203 63126389 74285192 83707050 87317300
40759H7317300L074191M683234q9358p442584o247058K333992N932010J466285
$$ 87317300 90391491 95074725 94985367 87542783 81295725 83629717 89561727 91028012
40751I1028012o92406M131123N832401l683767j5379023j4053887Q74454J4034372
$$ 91028012 90335606 94466729 100299130 96615363 81236340 67182453 68056907 82091279
40743H2091279J2473483l91664j0291032q382975N35648N951470M701837K483689
$$ 82091279 94564762 94173098 83882066 75499091 76034739 81986209 86688046 89171735
40735H9171735L404949M049568M17248m624808n490984j951406J793983L631921
$$ 89171735 92576684 96626252 97043500 92418692 86927708 84976302 86770285 90402206
40727I0402206M442535M404866L047523J836080K551432L833743K891576j15736
$$ 90402206 94844741 99249607 102297130 104133210 106684642 110518385 113409961 113294225
40719A13294225k638092l757249m254063l289070J155518P732162J0816578O607081
$$ 113294225 110656133 106898884 102644821 99355751 100511269 108243431 119060009 125667090
40711A25667090r13749l238655J823844N494099r05239j1584773j1521309J318214
$$ 125667090 124753341 121514686 123338530 128832629 127927390 116342617 104821308 106139522
40703A06139522R687022J330653j0691326o256706J0201007J5404666L229959
$$ 106139522 115826544 117157197 106465871 100209165 110410172 125814838 129044797
40696A29044797o358158M42419J0908456Q922424M81448J54841N522389L719519
$$ 129044797 122686639 123129058 134037514 142959938 143441386 143596227 149118616 152838135
40688A52838135m756696p640258k514516O48085k173602l957102j213281N39434
$$ 152838135 148081439 140441181 137926665 138574750 136401148 132444046 131230765 131770199
40680A31770199j168663q49732L468512M837876r21759o951327n067962K674484
$$ 131770199 130601536 129751804 133220316 138058192 137136433 130185106 125117144 127791628
40672A27791628Q153656Q245566O046060M079324J735360j316084l313576l113214
$$ 127791628 135945284 144190850 150236910 154316234 156051594 154735510 151421934 148308720
40664A48308720k790317n532653j0391985j1154983l554753P156248J0625610
$$ 148308720 145518403 139985750 129593765 118438782 114884029 122040277 132665887
40657A32665887M434136k592660k426046K556658N621272N195386K917097k056031
$$ 132665887 137100023 134507363 132081317 134637975 140259247 145454633 148371730 146315699
40649A46315699r497187j3208730p957872J203717M660824J724459K53962L428822
$$ 146315699 136818512 123609782 115651910 116855627 121516451 123240910 123494872 126923694
40641A26923694N539964K522001j065418P09694N971574P224047O59450r278725
$$ 126923694 132463658 134985659 133920241 134629935 140601509 147825556 148485006 139206281
40633A39206281j4240686j0429365k772925N72829k039952m423409j747329L168563
$$ 139206281 124965595 114536230 111763305 112336134 110296182 105872773 104125444 107294007
40625A07294007M954596K766597o52347k883554k147660J532783L099123l127506
$$ 107294007 112248603 115015200 114362853 111479299 109331639 110864422 113963545 110836039
40617A10836039j2547621j2201821P62138J1624121P561965l872795o577900R91427
$$ 110836039 98288418 86086597 86848735 98472856 106034821 102162026 95584126 96575553
40609I6575553P326008P098263M648982J347736n505106j1630972q328576K203814
$$ 96575553 103901561 110999824 115648806 116996542 111491436 99860464 91531888 93735702
40601I3735702P515603L386208j163567k77303O91394j752172j345304N575597
$$ 93735702 101251305 104637513 103473946 103196643 103888037 102135865 100790561 106366158
40593A06366158J1157899P944202O63305k260829j345228j929196l878740l567617
$$ 106366158 117524057 125468259 126131564 123870735 122525507 120596311 116717571 113149954
40585A13149954j239400N29485J263857R4302n339481j1824402r600258L777365
$$ 113149954 111910554 112440039 113703896 113798198 108458717 96634315 87034057 90811422
40577I0811422J5249846J1595225j863538q289065k038018O428285P298119K319734
$$ 90811422 106061268 117656493 115792955 107503890 105465872 111894157 119192276 121512010
40569A21512010k472631n351202o645790n241247j802720n16027l309215n650534
$$ 121512010 119039379 113688177 107042387 101801140 99998420 99482393 96173178 90522644
40561I0522644k077193N884850J0691318P370970q96633o235530m367570J266930
$$ 90522644 88445451 94330301 105021619 112392589 111495956 105260426 100892856 102159786
40553A02159786M062896J919748j597007l145286l009122j822419J386435N011958
$$ 102159786 106222682 108142430 106545423 103400137 100391015 98568596 99955031 104966989
40545A04966989L573066m231516r986359n232723N105098P289110k339666j1399185
$$ 104966989 108540055 104308539 94322180 89089457 94194555 101483665 99143999 87744814
40537H7744814q154146K904115Q243327L386911l351441l365063K769218Q621332
$$ 87744814 79590668 82494783 90738110 94125021 90773580 87408517 90177735 98799067
40529I8799067R403985M963000q43324k786874O15726M512296L574314l16657
$$ 98799067 108203052 113166052 112322728 109535854 110151580 114663876 118238190 117921533
40521A17921533j081633J458216J311024k846742m618479r51596K104326J19463
$$ 117921533 116839900 118298116 119609140 116762398 112143919 111192323 113296649 113416112
40513A13416112j553237K057374N255689J675801k630604J123698P334719L933370
$$ 113416112 111862875 113920249 119175938 120851739 118221135 119344833 126679552 130612922
40505A30612922n926679p822155j205890n88184q118453o958904Q605676J8185671
$$ 130612922 124686243 116864088 115658198 115070014 106951561 99992657 108598333 126784004
40497A26784004O268248j0450002p841028P327654Q814656o759781j5727536n638400
$$ 126784004 133052252 122602250 114761222 122088876 130903532 124143751 108416215 102777815
40489A02777815P362957O082597l437893n870047J81645M862888L434789p29372
$$ 102777815 110140772 116223369 112785476 106915429 107097074 111959962 115394751 114665379
40481A14665379l949880m949208l153212L61101K658520K365796Q21483m49233
$$ 114665379 110715499 105766291 102613079 102974180 105632700 107998496 108819979 108370746
40473A08370746o6971L605014Q311675O837238k548006q792600j696343J0583444
$$ 108370746 108303775 111908789 120220464 127057702 124509696 115717096 114020753 124604197
40465A24604197J0880410j600045j0354165p074224j847570l707045o966382m157793
$$ 124604197 135484607 133884562 123530397 116456173 114608603 110901558 103935176 99777383
40457I9777383J438410M524795O629399Q022741L155840o865056r592178N62997
$$ 99777383 101215793 105740588 112369987 120392728 123548568 116683512 107091334 107654331
40449A07654331J0906851Q558433o87959l657500Q4472K530867K720011M054872
$$ 107654331 118561182 127119615 126431656 122774156 122858628 125389495 128109506 132164378
40441A32164378L714900j360543m753924o83634L185909j979830p949615p43758
$$ 132164378 135879278 134518735 129764811 129081177 132267086 130287256 122337641 121593883
40433A21593883J4502350J8553583O354060p619141j2493214j2053651j0778767
$$ 121593883 136096233 154649816 161003876 153384735 140891521 128837870 118059103
40426A18059103n930238J982335N764116L868399L505314P011778P448871K113638
$$ 118059103 112128865 114111200 119875316 123743715 127249029 134260807 141709678 143823316
40418A43823316j930698p25525J15123k866289m202341j82108M366659N522830
$$ 143823316 141892618 141167093 141282216 138415927 134213586 134031478 138398137 143920967
40410A43920967O187249P449475M782286j878336n364131l968121m968021r602530
$$ 143920967 150108216 157557691 162339977 160461641 155097510 151129389 146161368 136558838
40402A36558838q035627K675850R647395L943200l984992j656868M754549K588132
$$ 136558838 128523211 131199061 140846456 144789656 140804664 139147796 143902345 146490477
40394A46490477m372657k787397O535237R560526J261678q668839j1489929p378774
$$ 146490477 142117820 139330423 145865660 155426186 156687864 148019025 136529096 129150322
40386A29150322J084156J0466896J2746917L142179q833706q935578J488183P564706
$$ 129150322 130234478 140701374 153448291 156590470 147756764 138821186 140309369 147874075
40378A47874075L032322l487598n172643n330789o081474k861307M709936Q701966
$$ 147874075 150906397 147418799 142246156 136915367 130833893 127972586 132682522 141384488
40370A41384488N050183o57546l801003o292364p747665l250274N127121P169821
$$ 141384488 146434671 145777125 141976122 135683758 127936093 124685819 129812940 136982761
40362A36982761J100533j428333N592716J1497936O540280j958676k772738R05096
$$ 136982761 138083294 136654961 142247677 153745613 160285893 158327217 155554479 156459575
40354A56459575l01010m290303k434717M099569O825952M204860R38195k499810
$$ 156459575 156158565 151868262 149433545 153533114 160359066 164563926 165502121 163002311
40346A63002311p425788q867491k817400L095453l369n644781j350422Q871662
$$ 163002311 155576523 146709032 143891632 146987085 146983716 141338935 139988513 148860175
40338A48860175R096152k082109q423179k256720M358587Q03517o208743o402108
$$ 148860175 157956327 155874218 147451039 145194319 149552906 150356423 144147680 137745572
40330A37745572j640565J774328M814425R562335J0905644M670865l124697m144387
$$ 137745572 136105007 137879335 142693760 152256095 163161739 167832604 164707907 160563520
40322A60563520J076569O797785J0114938Q880086o7656j2628489j5862510m475281
$$ 160563520 161640089 168437874 178552812 187432898 187365242 174736753 158874243 154398962
40314A54398962Q400554P740317k117993m731451L994896J1331844O874713n065786
$$ 154398962 162799516 170539833 168421840 163690389 167685285 179017129 185891842 180826056
40306A80826056j3550909j2827477m392507N948119J1396396R355280M140115
$$ 180826056 167275147 154447670 150055163 156003282 167399678 176754958 180895073
40299A80895073J441880J504286J141554k95390j359897k027121k297513n24467
$$ 180895073 182336953 183841239 184982793 184687403 183327506 181300385 179002872 178478405
40291A78478405K600985K855329J28005J317995Q832621J2860246M875086o645279
$$ 178478405 181079390 183934719 184062724 185380719 194213340 207073586 211948672 205303393
40283B05303393o384913M583005R307188k95172j2112156j1826846j974265L851710
$$ 205303393 198918480 203501485 212808673 212513501 200401345 188574499 186600234 190451944
40275A90451944m03711p541824q052564j741007L113016J260066j873463J766915
$$ 190451944 190048233 182506409 174453845 172712838 175825854 177085920 175212457 176979372
40267A76979372Q952230Q127293j896082p791766k611156J918422m604850j1167132
$$ 176979372 185931602 194058895 192162813 184371047 181759891 183678313 179073463 167906331
40259A67906331k167934J4526923J7066614L163419p585221m867500Q22644J143368
$$ 167906331 165738397 180265320 197331934 200495353 192910132 188042632 188865276 190008644
40251A90008644K273587P136068O233855l136441p349240J080957Q434505J871542
$$ 190008644 192282231 199418299 205652154 202515713 195166473 196247430 204681935 206553477
40243B06553477q546988o739662K988300M823994k405348o659563m193614j588928
$$ 206553477 198006489 191266827 194255127 199079121 196673773 190014210 185820596 184231668
40235A84231668j19401M528852Q823961M452543m991633o040223L763180J0920279
$$ 184231668 184112267 188641119 197465080 201917623 196925990 190885767 194648947 205569226
40227B05569226N570438n632082j0582117o492489N17553L871267J775221j302747
$$ 205569226 211139664 205507582 194925465 188432976 188950529 192821796 194597017 193294270
40219A93294270J575152J0077403J3819382N918090n229702o932175l58657L836468
$$ 193294270 194869422 204946825 218766207 224684297 219454595 212522420 212163763 216000231
40211B16000231L860902O369990J0022680O253509k480945k795871O840812J0595047
$$ 216000231 219861133 226231123 236253803 242507312 240026367 237230496 244071308 254666355
40203B54666355M5890j1554868j0037983j117563J954766n04942r212K943873
$$ 254666355 254712245 243157377 233119394 232001831 233956597 233451655 233442443 236386316
40195B36386316K319667Q55269N683274J3095054J2073147J995152n894299m918003
$$ 236386316 238705983 239561252 245244526 258339580 270412727 272407879 266513580 261595577
40187B61595577M6253K421973J083630k499732n465612k840088N284585Q135227
$$ 261595577 261641830 264063803 265147433 262647701 257182089 254342001 259626586 267761813
40179B67761813k816940j7226528j6270825j37127J0645430M984258m156519k347866
$$ 267761813 264944873 247718345 231447520 231310393 241955823 246940081 242783562 240435696
40171B40435696N070688N933049J811040R19841P41541n644665j2518889q294720
$$ 240435696 245506384 251439433 253250473 254170314 254911855 249267190 236748301 228453581
40163B28453581L534998P281520q32881p397763l362834L807721M473139N07024
$$ 228453581 231988579 239270099 238437218 231039455 227676621 231484342 235957481 236464505
40155B36464505j883704k565254l613509l214765K5205L091315L737834L391036
$$ 236464505 234580801 232015547 228402038 225187273 225212478 228303793 232041627 235432663
40147B35432663J762128l387672q010987l528313Q210796J2856668L794489o455639
$$ 235432663 237194791 233807119 225796132 222267819 230478615 243335283 247129772 240674133
40139B40674133m534041M168934N671284j328112o992836o700983l326329J396417
$$ 240674133 236140092 240309026 245980310 244652198 237659362 230958379 227632050 229028467
40131B29028467N724829L812923m850060q591817l90144N998276m955436k1448830
$$ 229028467 234753296 238566219 233716159 225124342 224734198 230732474 225777038 204328208
40123B04328208j7181855P783430K3949518J4872999j835286n739675k309608
$$ 204328208 187146353 194929783 218879301 233752300 231917014 226177339 223867731
40116B23867731m860556p800529J099576J4737362J5247605K279758p394902o121644
$$ 223867731 219007175 211206646 212306222 227043584 242291189 244570947 237176045 231054401
40108B31054401l028891m922400o070473j179306M569197M583911Q79457j041211
$$ 231054401 228025510 223103110 217032637 215853331 220422528 225006439 225885896 224844685
40100B24844685j009477k057589l373677j087594M757676Q216046L967051n820694
$$ 224844685 223835208 221777619 218403942 217316348 222074024 230290070 234257121 228436427
40092B28436427j3316856j3510489q030753m0736R395105J6451497J3000741j668727
$$ 228436427 215119571 201609082 193578329 193537593 202932698 219384195 232384936 230716209
40084B30716209j2878257o387346R957267J4334708J505124j0074419o055607
$$ 230716209 217837952 211450606 221407873 235742581 237247705 227173286 221117679
40077B21117679M640306P136384K864230J940012L760607j48760r184292j2857812
$$ 221117679 225757985 232894369 235758599 237698611 241459218 241310458 232126166 219268354
40069B19268354n778049N742678J1714248P829626j359599n839171o41656O325519
$$ 219268354 213490305 219232983 230947231 238776857 237417258 231578087 230936431 237261950
40061B37261950M291010k898454j722804P060435O545016p855319j7260985q626878
$$ 237261950 241552960 238654506 236931702 243992137 250537153 242681834 225420849 216793971
40053B16793971L579728J787461n868059k562923N746362J546494j0808230j0565005
$$ 216793971 220373699 222161160 216293101 213730178 219476540 221023034 210214804 199649799
40045A99649799M025700J2773514P077428J182273N277427J0113956O135457j080116
$$ 199649799 203675499 216449013 223526441 224708714 229986141 240100097 246235554 245155438
40037B45155438l338468k661349l525927m480205l906330l966782m824472m174747
$$ 245155438 241816970 239155621 235629694 231149489 227243159 223276377 218451905 214277158
40029B14277158l465071m682776l060963M607780Q527139q38728j2254760p235935
$$ 214277158 210812087 206129311 203068348 207676128 216203267 215364539 203109779 195873844
40021A95873844Q046411Q907251q004496j7757954o881112O780514N698583r67401
$$ 195873844 203920255 212827506 204823010 187065056 180183944 186964458 192663041 191695640
40013A91695640J398767P051922L939322l796000n977409m879182o370616n742425
$$ 191695640 193094407 200146329 204085651 200289651 194312242 189433060 183062444 177320019
40005A77320019J099944N149401l66139m849448K163030J0862148P341489j597190
$$ 177320019 178419963 183569364 183203225 178353777 180516807 191378955 198720444 197123254
39997A97123254m70262P319565N851554n299888j0949855n524353J060635J870464
$$ 197123254 196652992 203972557 209824111 204524223 193574368 188050015 189110650 190981114
39989A90981114L27417n15894j421202o83032K700427K377054o046584j3421981
$$ 190981114 191308531 190792637 189371435 188688403 191388830 193765884 187719300 174297319
39981A74297319q726998K571244O982277M761889O286291J0869303P896300k677834
$$ 174297319 165570321 168141565 175123842 179885731 186172022 197041325 204937625 202259791
39973B02259791r418596q598242o625278l905159M914468J4095889J0339059l750458
$$ 202259791 192841195 184242953 177617675 173712516 178626984 192722873 203061932 199311474
39965A99311474r499159n96680P429215L065325m425296l462279J413018R94001
$$ 199311474 189812315 189215635 196644850 199710175 195284879 191822600 193235618 194229619
39957A94229619k466464k472746p29124j439684k356213j097007j583839n155826
$$ 194229619 191763155 189290409 188561285 187121601 184765388 183668381 182084542 176928716
39949A76928716m226872N418018J4029296J0114433k674907j0774972q584242
$$ 176928716 172701844 178119862 192149158 202263591 199588684 188813712 180229470
39942A80229470k366025P28547Q7259n01915K169431O598731O582558m79629o245026
$$ 180229470 177863445 178591992 178679251 178177336 180346767 186945498 193528056 193048427 186803401
39933A86803401p81691J0562244J1446869r61381r198317p65319J2447854J1462578
$$ 186803401 186021710 196583954 208030823 207069442 197871125 197105806 209553660 221016238
39925B21016238k617431j2299880r119223j808605m17309l679144m071802J589347
$$ 221016238 218398807 206098927 196979704 195171099 194753790 191074646 187002844 188592191
39917A88592191Q695589R332416J072093p969428p406065Q29492L757551l403178
$$ 188592191 197287780 206620196 207692289 199722861 192316796 193146288 196903839 193500661
39909A93500661q840836k009743R297255J0130456J31219p539252n320524J956651
$$ 193500661 184659825 182650082 191947337 202077793 202209012 194669760 189349236 191305887
39901A91305887P497527R064562N527297l020430j0476346q653763J781343J0831868
$$ 191305887 198803414 207867976 213395273 210374843 199898497 191244734 193026077 203857945
39893B03857945J1459953O826774L675062L548194L048475j59868l837912l546594
$$ 203857945 215317898 222144672 225819734 229367928 232416403 232256535 228418623 224872029
39885B24872029J021090L203308l112843j3212320j5346492o596005L116332O240900
$$ 224872029 225893119 229096427 225983584 212771264 197424772 190828767 193945099 200185999
39877B00185999O729381P722834K071294j3209756k3395544j3383667P302045
$$ 200185999 206915380 214638214 216709508 203499752 180104208 166720541 174022586
39870A74022586J4810263M291269n440947j887122N341529M485508K2971J036065
$$ 174022586 188832849 193124118 187683171 185796049 191137578 195623086 195646057 196682122
39862A96682122M650089K985200k523349m951725l500297j528715J403604O329807
$$ 196682122 201332211 204317411 201794062 196842337 193342040 191813325 193216929 199546736
39854A99546736Q552688L625706l854466n554610n78350N546799R356294R919873
$$ 199546736 208099424 211725130 207870664 202316054 201737704 207284503 216640797 226560670
39846B26560670N114024m405411j1038129q571993j723892J170001J535515O324565
$$ 226560670 231674694 227269283 216231154 207659161 205935269 207105270 208640785 214965350
39838B14965350J2922361J0766146j154217j0538712q982948k442178J43937p78444
$$ 214965350 227887711 238653857 237499640 226960928 217977980 215535802 215679739 214901295
39830B14901295l68097J160248J004789P3804N95155J721696K139048K252520
$$ 214901295 214533198 215693446 216698235 216772039 217367194 219088890 221227938 223480458
39822B23480458J31075p807414j7145779j5215678J123740J5497130J1411541
$$ 223480458 223611533 215804119 198658340 183442662 184566402 200063532 211475073
39815B11475073m083058r847851p26512P478269M059862j915221P69500P253334
$$ 211475073 207392015 197544164 196817652 204295921 208355783 206440562 207210062 214463396
39807B14463396O325114j216476n343743k436198K177698M102864L542409J514548
$$ 214463396 220788510 219572034 214228291 211792093 213969791 218072655 221615064 223129612
39799B23129612J5457L176063J0607717J2966490L352430r630835j1273419k277157
$$ 223129612 223145069 226321132 236928849 249895339 253247769 243616934 232343515 230066358
39791B30066358J719136n914455j2722265p035812M271349P572337K660011p45639
$$ 230066358 231785494 225871039 213148774 206112962 210384311 217956648 220616659 219871020
39783B19871020l10067j554873m130026j827846L260540R70613q399388r670321
$$ 219871020 219560953 218006080 213876054 212048208 215308748 216279361 207879973 198209652
39775A98209652M521078J8307446J2612406o877321j6793423q444112K690203
$$ 198209652 202730730 221038176 233650582 226773261 209979838 201535726 204225929
39768B04225929J996664m938134n340358P10116M243427L500354L886039N721488
$$ 204225929 206222593 201284459 195944101 196654217 200897644 204397998 208284037 214005525
39760B14005525L763463j875643m524537j473055K683325M037088L136118N50434
$$ 214005525 217768988 215893345 211368808 209895753 212579078 216616166 219752284 220302718
39752B20302718l261007l601859L644428J2070838J0102834j616992r525552p181520
$$ 220302718 217041711 213439852 217084280 229155118 239257952 237640960 228115408 220933888
39744B20933888l400103m906847m901313J801098N964295m12196p273388j651213
$$ 220933888 217533785 212626938 207725625 209526723 215491018 215078822 207805434 206154221
39736B06154221R285420Q789169j856711o492457k008083j263109o793224m402212
$$ 206154221 215439641 224228810 222372099 215879642 213871559 212608450 205815226 201413014
39728B01413014J0116141J9035218R227464o751774j0404228m226150k878526
$$ 201413014 211529155 230564373 239791837 233040063 222635835 218409685 215531159
39721B15531159p755868p791285j50628O202090N935854K938293Q84845n75554
$$ 215531159 207775291 199984006 199833378 206035468 211971322 214909615 215794460 215218906
39713B15218906m52937K805259N464992K721034j731879K43463P636354J0302552
$$ 215218906 214765969 217571228 223036220 225757254 224025375 224268838 231905192 242207744
39705B42207744L565170o069992j1114308j0497342n473330K735622Q814164O123197
$$ 242207744 245772914 239702922 228588614 218091272 212617942 215353564 224167728 230290925
39697B30290925k567220n743769P41904O733375L108916m199250m206855J628151
$$ 230290925 227723705 221979936 222721840 229455215 232564131 228364881 224158026 225786177
39689B25786177K977797j462588j825752O000464J2434829Q308443j298578m664556
$$ 225786177 228763974 227301386 225475634 231476098 243910927 252219370 250920792 246256236
39681B46256236l4556L540422L78484m813380n607552k900578j380153j343086
$$ 246256236 246221680 249762102 250140586 245327206 239719654 236819076 235438923 234095837
39673B34095837P41020N089208O968555L073771l468709o153191k357763L303406
$$ 234095837 234836857 239926065 246894620 249968391 246499682 240346491 237988728 241292134
39665B41292134L587249k540609o981409j796264Q916650J2094356K821029q216924
$$ 241292134 244879383 242338774 235357365 233561101 242477751 254572107 257393136 249176212
39657B49176212r418363l945961k662851o596720p427048l070046j75494j58760
$$ 249176212 239757849 235811888 233149037 226552317 219125269 216055223 215879729 215720969
39649B15720969M253382J4135962J8082001Q399604n743804j0204875m130089
$$ 215720969 219974351 234110313 252192314 260591918 254848114 244643239 240513150
39642B40513150K348675L315275J007370j880540n080346p134716n573260n16897
$$ 240513150 242861825 246177100 247184470 245303930 240223584 233088868 227515608 226998711
39634B26998711N479902R451277Q111225N76025o815214n283977L312493O655392
$$ 226998711 232478613 241929890 250041115 250617140 243801926 238517949 241830442 248485834
39626B48485834R8999n745057l009689r2480n293342q777386J828513J6225328
$$ 248485834 248584833 242839776 239830087 239737607 234444265 225666879 227495392 243720720
39618B43720720J2976789o584941j7897265q861825M865740O547244R99713K23398
$$ 243720720 256697509 250112568 232215303 223353478 228219218 234766462 235766175 235989573
39610B35989573K579954q5236n573366n390012P13014N589538N735808K684447
$$ 235989573 238569527 238484291 232910925 227520913 228233927 233823465 239559273 242243720
39602B42243720k285722p113155o991286o52287N423086N288690J378647j705181
$$ 242243720 239957998 232844843 225853557 225201270 230624356 235913046 237291693 235586512
39594B35586512n099993r972431j0136632j77635J2916278J6462597Q958817J087514
$$ 235586512 230486519 220514088 210377456 210199821 223116099 239578696 248537513 249625027
39586B49625027J88799K332633J150054k791230m391555j358556L375973M551471
$$ 249625027 249813826 252146459 253296513 250505283 246113728 244755172 248131145 252682616
39578B52682616o38283r042655j3527670j0147132k209925L999858N452711L226121
$$ 252682616 252044333 243001678 229474008 219326876 217116951 221116809 226569520 229795641
39570B29795641K46399k77858K447892M391120J113125m550583n111306j36907
$$ 229795641 230042040 229764182 232212074 236603194 237716319 233165736 228054430 227917523
39562B27917523K391024n76211j617393L807586P985479L402121l825108l646069
$$ 227917523 230308547 229732336 228114943 231922529 239908008 243310129 239485021 235838952
39554B35838952J386263J398618l499284m152655J414520N259852K925177j668217
$$ 235838952 237225215 238623833 235124549 230971894 232386414 237646266 240571443 238903226
39546B38903226n160913p999697q157444k242032N843634P508497K082790l038032
$$ 238903226 233742313 225742616 217585172 215343140 221186774 228695271 230778061 227740029
39538B27740029n230991q047942r096101q89212J2415679J4506519Q04502j1500335
$$ 227740029 222509038 214461096 205364995 204475783 216891462 231397981 232202483 220702148
39530B20702148q023193J230755r82353j0870819j0410444K618800J0639344L891559
$$ 220702148 212678955 213909710 212927357 202056538 191646094 194264894 204904238 208795797
39522B08795797n093833j686305Q866215J0210730r79376j0814633p712849K561793
$$ 208795797 203701964 202015659 210881874 221092604 220113228 209298595 201585746 204147539
39514B04147539N426069l296216j2609268j0948402J06086J0228173J3722881
$$ 204147539 209573608 206277392 193668124 182719722 182825808 193053981 206776862
39507B06776862J2023312N976483m847985j4707818j3822966j969229Q672628
$$ 206776862 218800174 224776657 219928672 205220854 191397888 189428659 198101287
39500A98101287R071993L504432q62448m609190q704931p107852J972265O746109
$$ 198101287 207173280 210677712 209815264 205206074 196501143 189393291 191365556 198111665
39492A98111665j856918j1977615o158153R803700J3314484k55320j0796593n773031
$$ 198111665 196254747 184277132 178118979 187922679 201237163 200981843 190185250 184412219
39484A84412219K309080J51563m829926j486859L816636Q42807l255922L120670
$$ 184412219 186721299 186872862 182042936 180556077 184372713 185215520 181959598 185080268
39476A85080268J1692272N826846r021757j0986088K251511Q288212l395006j3740298
$$ 185080268 196772540 202599386 193577629 182591541 184843052 193131264 189736258 175995960
39468A75995960n330858R112125P334808p414145j2573861p50127J1976902J1736429
$$ 175995960 170665102 179777227 187112035 179697890 167124029 166373902 178350804 190087233
39460A90087233L813911m5064J536759J897230k197102p506551r218453n408393
$$ 190087233 193901144 193856080 195392839 197290069 195092967 187586416 178367963 172959570
39452A72959570J376157N744918M520662J11814k733101j937718J914505P211457
$$ 172959570 174335727 180080645 184601307 184713121 181980020 180042302 181956807 189168264
39444A89168264R856306M748008o226018j2311069o707106L089421N831349K852305
$$ 189168264 199024570 203772578 197546560 185235491 178528385 181617806 187449155 190301460
39436A90301460L211042O168183K550151o545526q128299J207451P270365Q7875
$$ 190301460 193512502 199680685 202230836 195685310 187557011 188764462 196034827 196122702
39428A96122702r435053o258357N613225J0538672N304154Q97449K676243L343785
$$ 196122702 186687649 180429292 186042517 196581189 201885343 202782792 205459035 208802820
39420B08802820k442556q685168q057886k619959J142837K236781M199585P119065
$$ 208802820 206360264 197675096 189617210 186997251 188140088 190376869 194576454 201695519
39412B01695519O340888j32950o453938m525908M897007J0674735M939684m767052
$$ 201695519 208036407 207903457 201449519 196923611 201820618 212495353 217435037 212667985
39404B12667985m657143M653586P177075n138686j9151849j8463078n230841O480496
$$ 212667985 208010842 212664428 219841503 214702817 195550968 177087890 171857049 178337545
39396A78337545J1417973J4067338J4051198O019871o442995j1278141m987841
$$ 178337545 189755518 203822856 217874054 223893925 217450930 206172789 201184948
39389B01184948K536290L191199L184j762966k364275k609645p66198J718644
$$ 201184948 203721238 206912437 206915621 205152655 202788380 200178735 199412537 201131181
39381B01131181N59389k278344k00378M193200k86990j3317536j7714389m086533
$$ 201131181 201690570 199412226 199211848 203405048 203118058 189800522 172086133 167999600
39373A67999600J2072345J1443373j103410n498360L174496J0783691Q336189
$$ 167999600 180071945 191515318 190411908 184913548 188088044 198871735 207207924
39366B07207924K793597J596101J508030j772645m738261l497323j373869k455422
$$ 207207924 210001521 211597622 213105652 211333007 206594746 203097423 201723554 199268132
39358A99268132m101562k278315N70898n91635m552432m808918J211092Q094294
$$ 199268132 195166570 192888255 193459153 192867518 188315086 183506168 184717260 192811554
39350A92811554Q571563J972619m740189n102919j533066k240374q482364j0242272
$$ 192811554 201383117 203355736 198615547 193512628 191979562 189739188 181256824 171014552
39342A71014552l553J3461219J3906008m62500j3290593j0989788Q90940P211061
$$ 171014552 171010999 184472218 198378226 197915726 184625133 173635345 174526285 181737346
39334A81737346K811920m136529m906944M55814O044481P150001L296463k694300
$$ 181737346 184549266 180412737 175505793 175961607 182006088 189156089 192452552 189758252
39326A89758252o932906o601787j330149N882961Q556018P91969j4310245k2425296
$$ 189758252 182825346 176223559 174893410 180776371 189332389 190124358 175814113 153388817
39318A53388817j1566220J0684560K1601696J0091396q197595j1134280q0624
$$ 153388817 141822597 152507157 174108853 184200249 176002654 164868374 164787750
39311A64787750L357662r551193k0170322r461737J2671711J9888575N892253
$$ 164787750 168145412 158594219 138423897 128962160 141633871 161522446 167414699
39304A67414699r043801r449655m460985p461297j2082592m870471Q225226Q626240
$$ 167414699 158370898 148921243 144460258 136998961 124916369 120045898 128271124 136897364
39296A36897364m297532j0502086o07601R903470O298196l410757m788827m53671
$$ 136897364 132599832 122097746 121490145 131393615 137691811 134281054 129492227 129038556
39288A29038556j269881n220715k910723L170865L128045j134322N41555O332871
$$ 129038556 127768675 122547960 119637237 122808102 125936147 124801825 125343380 131676251
39280A31676251M516098m589988p993076l201669k258775q163299p648223M317261
$$ 131676251 136192349 131602361 123609285 120407616 118148841 109985542 102337319 106654580
39272A06654580J2479341N650815m405190k951558M081333L099512l179662l263480
$$ 106654580 119133921 124784736 120379546 117427988 121509321 124608833 121429171 118165691
39264A18165691J127698m0468m725293k780394L605938K826419m321100m905456
$$ 118165691 119293389 119252921 114527628 111747234 115353172 118179591 113858491 108953035
39256A08953035L045033O272718j278932q840047p237870j801777o0428R0917
$$ 108953035 111998068 118270786 116991854 108151807 100913937 99112160 99051732 99142649
39248I9142649K282816L115809n17774m876311o545358p285745o710778m39886
$$ 99142649 101425465 104541274 104023500 99147189 92601831 85316086 78605308 78165422
39240G8165422Q980523J0862139L051883k238386K002004M840612l921198j4102200
$$ 78165422 87145945 98008084 101059967 98821581 100823585 105664197 101742999 87640799
39232H7640799r747106M918519J1471153M948401j799544n53951K196540L07270
$$ 87640799 77893693 82812212 94283365 99231766 97432222 96878271 99074811 99382081
39224I9382081j676688J121400M559418L143617r58089k620708j753943j616902
$$ 99382081 97705393 98826793 103386211 106529828 105571739 102951031 101197088 99580186
39216I9580186l266897n225845n501174k230750M170728Q913295P194327J016001
$$ 99580186 96313289 91087444 85586270 83355520 87526248 96439543 103633870 104649871
39208A04649871l009970k620032j348314j191668j32469K236193K798949R5626
$$ 104649871 101639901 99019869 97671555 96479887 96347418 98583611 101382560 101478186
39200A01478186l636033o074402n691995m98981P521102R176386j167450j3132395
$$ 101478186 97842153 91767751 86075756 85576775 93097877 102274263 101106813 87974418
39192H7974418j0890766L199997R805220J110363p586554k751537O347373M393738
$$ 87974418 77083652 80283649 90088869 91199232 83612678 80861141 87208514 91602252
39184I1602252m721502n968277J372703M183259j605277n552317r48035O071535
$$ 91602252 86880750 80912473 82285176 86468435 84863158 79310841 78362806 84434341
39176H4434341Q477350P148277M136300k014436r664270j1953190o394783N82236
$$ 84434341 92911691 100059968 104196268 102181832 92517562 80564372 74169589 74751825
39168G4751825L169370L714646O125199P718776L437688n311362j1296336r926391
$$ 74751825 77921195 81635841 87761040 95479816 98917504 93606142 82309806 72383415
39160G2383415m047598l56537j904407m479699k019647M312549O818723K915453
$$ 72383415 68335817 67979280 66074873 61595174 59575527 63888076 70706799 73622252
39152G3622252m01293J617194K964060j636091m651896K493305J1610556P500708
$$ 73622252 73220959 74838153 77802213 76166122 71514226 74007531 85618087 93118795
39144I3118795p026495j3362235n284374L184811K344867P60832O293799J0341670
$$ 93118795 86092300 72730065 67445691 70630502 72975369 73736201 80030000 90371670
39136I0371670L243456q203900j2004500q918136o060339k450803N039759R859845
$$ 90371670 93615126 85411226 73406726 64488590 58428251 55977448 61017207 70877052
39128G0877052N004185k337457n65510O724281O398892k024972n708612K42258
$$ 70877052 75881237 73543780 72978270 79702551 86101443 84076471 78367859 78610117
39120G8610117N561914J327528p976250j2095260o676341M079939J0603930N585765
$$ 78610117 84172031 85499559 77523309 65428049 58751708 62831647 73435577 79021342
39112G9021342n970979r485762o32181O139894k88546p817670k22957J3414794
$$ 79021342 73050363 63564601 62932420 69072314 68783768 60966098 60743141 74157935
39104G4157935J1297941m151872q772041L128294R644525m12513q623683m31210
$$ 74157935 85455876 81304004 72531963 75660257 85304782 84892269 76268586 75837376
39096G5837376Q554182R94j4476715j2514117K143489Q104944K346357J077207
$$ 75837376 84391558 84392552 69915837 57401720 59545209 67650153 69996510 71073717
39088G1073717Q207309R029732k053575j0529677n770857K418064J189552n183036
$$ 71073717 79281026 88310758 86257183 75727506 69956649 72374713 73564265 68381229
39080F8381229m022333N356589J1192208O126163l922916q294497m450656K18558
$$ 68381229 64358896 69715485 80907693 87033856 83110940 74816443 70365787 70584345
39072G0584345p15105l068701J654755J0940557J1374888j493820j3294192j0071274
$$ 70584345 69869240 66800539 68455294 79395851 90770739 89276919 75982727 65911453
39064F5911453R68742K848942m819713o870020J498672P152807J298881o424279
$$ 65911453 66880195 69729137 64909424 58039404 59538076 66690883 67989764 61565485
39056F1565485m399858K762529L381488k120689l191634L195653P865739L172039
$$ 61565485 57165627 59928156 63309644 61188955 57997321 61192974 69058713 72230752
39048G2230752o389430j0144112l807446O449256J0929708N941886l075977p097453
$$ 72230752 65841322 55697210 51889764 58339020 69268728 75210614 72134637 65037184
39040F5037184k102306P115984J0992629M016674q687991j4812100q143841K984999
$$ 65037184 62934878 70050862 81043491 85060165 76372174 61560074 53416233 56401232
39032E6401232N931813J137690K42164N710816N073824p649992j7760491r985841
$$ 56401232 62333045 63470735 63712899 69423715 74497539 66847547 49087056 39101215
39024C9101215O958739J2297143L680829k620888L83251K335047k412531m600798
$$ 39101215 46059954 58357097 62037926 59417038 59800289 62135336 59722805 55122007
39016E5122007J186914N477990J543292j620677L827536Q389707P73324j0832059
$$ 55122007 56308921 61786911 63330203 61709526 65537062 73926769 74700093 63868034
39008F3868034r666597L558295J1930311P228971j348462l646270q40377J104003
$$ 63868034 54201437 57759732 69690043 76919014 75570552 71924282 71083905 72187908
39000G2187908K17865k261908m463509l916767l70358J812826l62539k207223
$$ 72187908 72405773 70143865 65680356 61763589 61393231 63206057 62843518 60636295
38992F0636295J772618P017864M265251n118751r585031m398531K220907K953706
$$ 60636295 62408913 69426777 73692028 68573277 58988246 54589715 56810622 59764328
38984E9764328J292578K628098M418541K022094k495490m429941m033909l454910
$$ 59764328 61056906 63685004 68103545 70125639 67630149 63200208 59166299 55711389
38976E5711389j187397L224381L888340l143449r904743n447089O381323R732445
$$ 55711389 54523992 57748373 61636713 58493264 48588521 43141432 49522755 59255200
38968E9255200m73418j0123867o097188N214132Q746469K802603j409275J280715
$$ 59255200 58781782 48657915 42560727 47774859 56521328 59323931 57914656 59195371
38960E9195371M131070J990404j173941j671310k679899o232810p623398m163265
$$ 59195371 63326441 65316845 64142904 62471594 59791695 53558885 45935487 41772222
38952D1772222j365994l117710l679702J664304N853910J211668n467923k763069
$$ 41772222 40406228 37288518 33608816 35273120 41127030 42338698 36870775 34107706
38944C4107706N420709N824489p84558o19616P714429R000113j393276o334868
$$ 34107706 39528415 45352904 44568346 43948730 51663159 60663272 59269996 52935128
38936E2935128N393115J8045183J1841348o471460j4687432p861830m14301k53748
$$ 52935128 58328243 76373426 88214774 81743314 67055882 59194052 58779751 58526003
38928E8526003l04534M413768Q594577Q069547N369315J375540n929491j2293742
$$ 58526003 58221469 62635237 71229814 79299361 84668676 86044216 80114725 67820983
38920F7820983r590689k32387L411759k421598p466539m940328j418431k888028
$$ 67820983 58230294 57997907 61409666 58988068 51521529 46581201 45162770 42274742
38912D2274742l721524J629483P034555N198895Q20599K087016O059977M205383
$$ 42274742 38553218 40182701 47217256 52416151 53236750 55323766 61383743 65589126
38904F5589126k463748n421659k813407n61125q34292O8758K446230J674750k643575
$$ 65589126 63125378 57703719 54890312 54329187 53494895 53563653 56009883 57684633 55041058
38895E5041058m659401j785737J129288J42092j565499L56011L980538M061935
$$ 55041058 50381657 48595920 49725208 49867300 48301801 48657812 52638350 56700285
38887E6700285m0145l343717j857043K190363K954243j231513m395350j52703
$$ 56700285 56660140 53316423 51459380 53649743 56603986 55372473 50977123 50824420
38879E0824420Q086106R409684L31853q345998n137388O017792J0787778L511077
$$ 50824420 58910526 68320210 68652063 60306065 55168677 61186469 71974247 75485324
38871G5485324o994565j0803945p950496l831245o92703J997951L425180K279898
$$ 75485324 68490759 57686814 49736318 45905073 45212370 47210321 50635501 52915399
38863E2915399n73054l287406n051982n115693k201740L195208P982928R444577
$$ 52915399 52342345 49054939 44002957 38887264 36685524 39880732 47863660 57308237
38855E7308237P292071K411586l631988p591971o871228l698708k800133l947491
$$ 57308237 64600308 67011894 63379906 55787935 48916707 45217999 42417866 38470375
38847C8470375j999374L955640P783855N907461L000927L087849J983616l933748
$$ 38470375 36471001 40426641 48210496 54117957 57118884 60206733 62190349 58256601
38839E8256601q060025l185373L978873J074768q851081r770459J614831Q935408
$$ 58256601 50196576 47011203 50990076 52064844 43213763 33443304 35058135 43993543
38831D3993543K240561m968461J910806J2259961N355254j4891893k2191727n927899
$$ 43993543 46234104 41265643 43176449 55436410 60791664 45899771 23708044 17780145
38823A7780145J3784009J6233964P248490M070208P338373M640155n752040j1988548
$$ 17780145 31564154 47798118 55046608 59116816 66455189 71095344 65343304 53354756
38815E3354756p998590j259118M54650j315806k033491r65726J083899L378583
$$ 53354756 45356166 44097048 44551698 43235892 41202401 40236675 41320574 44699157
38807D4699157K871038k375140o505252j421500R356554J2399754L349409o187500
$$ 44699157 47570195 45195055 38689803 37268303 46624857 59024611 62374020 56186520
38799E6186520n984982r63692n6653j301855J503687N096777K066401m842223
$$ 56186520 50201538 49237846 49181193 47879338 49383025 54479802 56546203 51703980
38791E1703980o201373j322783J584960l66392j824715n53314m53324k086964
$$ 51703980 45502607 44179824 45764784 45398392 43573677 43020363 42567039 40480075
38783D0480075j127482J829607R37358k760678n96646P933324J0826437K080164
$$ 40480075 39352593 41182200 42119558 39358880 38762234 46695558 57521995 59602159
38775E9602159o850113l823658N242383O216250j424727n686494j671162K694657
$$ 59602159 52752046 48928388 54170771 60387021 58962294 53275800 51604638 54299295
38767E4299295N76308m866887p286280m667786J586478Q306787J0239315M498905
$$ 54299295 54875603 50008716 42722436 38054650 39641128 47947915 58187230 62686135
38759F2686135l796993o493100l450461j949360m385152m408367J914946Q374644
$$ 62686135 58889142 52396042 48945581 46996221 42611069 38202702 40117648 48492292
38751D8492292O917026j105797p066852o018012j379165O90393j022039j824655
$$ 48492292 55409318 54303521 47236669 41218657 39839492 40529885 39507846 37683191
38743C7683191J776807N462926J996327o335408p535522K601624J0858000M445470
$$ 37683191 39459998 44922924 46919251 40583843 33048321 35649945 46507945 50953415
38735E0953415q082431q033598M443422R754451j030541j3177287j1803444k071867
$$ 50953415 42870984 34837386 39280808 49035259 48004718 34827431 23023987 20952120
38727B0952120L785856N057692O058381L887788k988260m655571N661017J5450616
$$ 20952120 24737976 29795668 35854049 39741837 36753577 32098006 37759023 53209639
38719E3209639Q896274p204486j2331637l371680L288433L17062j165024N022206
$$ 53209639 62105913 54901427 42569790 39198110 42486543 42803605 41638581 46660787
38711D6660787P709147j434970j2014018j1034933k423396J874762R11359K353284
$$ 46660787 54369934 52934964 40920946 29886013 27462617 29337379 30248738 32602022
38703C2602022P153529Q383699K982576l955371n738943k33088Q290195J1059944
$$ 32602022 39755551 48139250 51121826 47166455 41427512 41194424 49484619 60544563
38695F0544563L203696p983539j0029808k478801K211490j844599n353514r98983
$$ 60544563 63748259 55764720 45734912 43256111 45467601 43623002 38269488 37270505
38687C7270505L504199l97466o372773m508542J304626J811102N1293M141641
$$ 37270505 40774704 40377238 34004465 29495923 30800549 32611651 32662944 36804585
38679C6804585Q733227K448175r251391q820626M641001J1360277P60563j2863868
$$ 36804585 45537812 47985987 38734596 29913970 34554971 45915248 46675811 33811943
38671C3811943j2874826k707398M741935O893605Q317070P781895J651853n822003
$$ 33811943 20937117 18229719 22971654 29865259 38182329 45964224 47616077 41794074
38663D1794074p209641l065918Q07755L019378M713988K724265n431818j3036250
$$ 41794074 34584433 31518515 32326270 35345648 40059636 42783901 37352083 24315833
38655B4315833j0875573o40985P809172J0733041J1887127J1011044L241763q103990
$$ 24315833 13440260 12799275 20608447 31341488 43228615 54239659 57481422 49377432
38647D9377432j0742234j232340P017518K144181p865520o390332O702588J4026436
$$ 49377432 38635198 37402858 44420376 46564557 38699037 32308705 39011293 53037729
38639E3037729N652221p054624q626450j245286R17886n431431q223653k06822
$$ 53037729 58689950 51635326 43008876 41763590 42681476 37250045 29026392 28819570
38631B8819570Q480278N784167k771564k092924Q406666J2650336K262693j0107708
$$ 28819570 37299848 43084015 40312451 38219527 46626193 59276529 61539222 51431514
38623E1431514r573998o87581J509903m124734m051057O701699J5182140J0011370
$$ 51431514 41857516 41169935 42679838 38555104 34504047 41205746 56387886 66399256
38615F6399256j529981n454110k179543l451466j1301475j3611664l653296P430206
$$ 66399256 64869275 59415165 57235622 53784156 42482681 28871017 25217721 32647927
38607C2647927N470289o391453j1938942m053892O800930P656664j058466q506227
$$ 32647927 38118216 31726763 19787821 15733929 22534859 30191523 29133057 20626830
38599B0626830p265201L70538P141136P780952K495398l519800m728128j147595
$$ 20626830 13361629 13732167 20873303 28654255 31149653 27629853 22901725 21754130
38591B1754130J668429k40733m309702n220281j133804N541764J0695681J0129124
$$ 21754130 23422559 23181826 18872124 13651843 12518039 18059803 28755484 38884608
38583C8884608K671164n728205n893010K696192R261536O164058k61362r33431
$$ 38884608 41555772 35827567 29934557 32630749 41892285 48056343 47794981 46861550
38575D6861550O31396m081633j0447108n863007P133615J0282242k625644j3944179
$$ 46861550 47492946 43411313 32964205 27101198 34234813 44517055 41891411 27947232
38567B7947232q073171N233639P337194o77384l003249L806514P493215K594334
$$ 27947232 19874061 25107700 32444894 31767510 28764261 32570775 40063990 42658324
38559D2658324j793429M3572R67268l877447o279386J113487J0445001R278482
$$ 42658324 40864895 40908467 41875735 37998288 31718902 32832389 43277390 52555872
38551E2555872j032821q330206o982887k259588L03729M26320j347453m955749
$$ 52555872 51523051 43192845 36209958 33950370 34254099 34680419 33332966 28377217
38543B8377217p149330m101914J332410K059704k382964m708809j414109K487112
$$ 28377217 21227887 17125973 18458383 20518087 18135123 13426314 12012205 14499317
38535A4499317L360876N043251R555066J0011603J361320q020538o226344L880686
$$ 14499317 17860193 22903444 32458510 42470113 43831433 35810895 29584551 33465237
38527C3465237P797824N62827o777844m522921K714893N833810M883074N119412
$$ 33465237 41263061 41825888 35048044 30525123 33240016 39073826 43956900 49076312
38519D9076312N816083J957906n653383r823052o370434R11788M875044K006785
$$ 49076312 54892395 56850301 51196918 41373866 35003432 35915220 40790264 42797049
38511D2797049m158699n548362J461950R055233N857058o476416j2856528n275441
$$ 42797049 38638350 33089988 34551938 43607171 49464229 42987813 30131285 24855844
38503B4855844N796637P908328M543049N340341P360671J431527q318740q813617
$$ 24855844 30652481 38560809 43103858 48444199 55804870 57236397 48917657 40104040
38495D0104040m82778K352294m733514r481843m353319K106846K268329J912912
$$ 40104040 39621262 41973556 37240042 27758199 23404880 25511726 27780055 29692967
38487B9692967O346798Q447726K203148m076432j064516N121423L485194k954700
$$ 29692967 36039765 44487491 46690639 42614207 41549691 46671114 50156308 47201608
38479D7201608l295245K003398K626759l874087r322385q775341n533980k559694
$$ 47201608 43906363 45909761 48536520 44662433 35340048 26564707 21030727 18471033
38471A8471033J182019N564056Q164336P734535L482905n341825j3578786j0906101
$$ 18471033 19653052 25217108 33381444 41115979 44598884 39257059 25678273 14772172
38463A4772172L122999J2901785O910348m186792l725858M659981M988055k634462
$$ 14772172 17895171 30796956 37707304 33520512 29794654 34454635 39442690 36808228
38455C6808228l280230M416813M539375p518144j5219283p789399L286883N296797
$$ 36808228 33527998 37944811 42484186 34966042 19746759 11957360 15244243 20541040
38447B0541040L398412N814048O576422j371482r237622n407956M335832N877101
$$ 20541040 23939452 29753500 36329922 34958440 25720818 20312862 24648694 30525795
38439C0525795j428918p245965p950854o670633j514307J0125595J9383337J4299601
$$ 30525795 29096877 21850912 13900058 7229425 5715118 15840713 35224050 49523651
38431D9523651j013810j0372492p986875k878109j361449J82294L792939N277109
$$ 49523651 48509841 38137349 30150474 27272365 25910916 26093210 29886149 35163258
38423C5163258L718490L173736K799384k094008p502068l672357O363237P199791
$$ 35163258 38881748 42055484 44854868 42760860 35258792 31586435 37949672 45149463
38415D5149463m162304j0585627j270663J0075604O932696m062462n805328R40753
$$ 45149463 40987159 30401532 29130869 39206473 46139169 42076707 36271379 37212132
38407C7212132J491588o026496q338833q96352N150014L021516j11452P46943
$$ 37212132 38703720 32677224 24338391 23442039 28592053 31613569 31502117 32249060
38399C2249060q22373p196991p205236N617176J7460075J2104509l836917j0112891
$$ 32249060 31426687 24229696 17024460 22641636 40101711 52206220 48369303 38256412
38391C8256412k800995K583675k256514o801596k037509L864076K83219p569713
$$ 38256412 35455417 38039092 35782578 28980982 26943473 30807549 31090768 23521055
38383B3521055p668007n92229L192610R18520p36921M25062o08210m252947m030193
$$ 23521055 15853048 15260819 18453429 19371949 18635028 19060090 18451880 14198933 10168740
38374A0168740J341092M841304L656275L319449M573939j039331j4079698j8592276
$$ 10168740 11509832 16351136 20007411 23326860 27900799 26861468 12781770 -5810506
38366e810506l914927J4980137J5898761J963496l784548N512948J1687601L325829
$$ -5810506 -9725433 5254704 21153465 23116961 19332413 24845361 36532962 39858791
38358C9858791n535739l03633R027248M933499q291899j2193128l837841K629865
$$ 39858791 34323052 34019419 43046667 47980166 39688267 27495139 23657298 26287163
38350B6287163J286990R26018N124504N555954J6477j351200M375599M454345
$$ 26287163 27574153 28500171 33624675 39180629 39197106 37845906 42221505 46675850
38342D6675850p560378j7228519j0653494K835829N931808M63667L39176N150537
$$ 46675850 39115472 21886953 11233459 14069288 20001096 20464763 20803939 25954476
38334B5954476K342300p252754q363534K113169Q491461K287657m396235o94346
$$ 25954476 28296776 21044022 12680488 14793657 23285118 25572775 21176540 20482194
38326B0482194M912193N40792q833807j0875017n266342J70644M396507J0156024
$$ 20482194 25394387 25935179 17101372 6226355 960013 1130657 5527164 15683188
38318A5683188J2618208N719689m051189m456897L645845P447827J727277n274973
$$ 15683188 28301396 34021085 29969896 25512999 29158844 36606671 38333948 33058975
38310C3058975o474584m675474m058708l127838k8660K812291L041325J876845
$$ 33058975 26584391 21908917 17850209 14722371 14693711 17506002 20547327 22424172
38302B2424172J138695J266807K544207L719094R68129n990228r445752l085229
$$ 22424172 23562867 24829674 27373881 31092975 32061104 26070876 16625124 13539895
38294A3539895O799008Q885672L487706O07459K583000J770524l363865m075004
$$ 13539895 20338903 29224575 32712281 33319740 35902740 37673264 34309399 30234395
38286C0234395K463105O379718J318445m718360l168366J130389l65502n035088
$$ 30234395 32697500 39077218 40395663 35677303 32508937 33639326 33273824 28238736
38278B8238736m639859P64310M825487N704585N082998J023486p843782j4440519
$$ 28238736 23598877 24363187 29188674 34893259 39976257 40999743 33155961 18715442
38270A8715442j0360649M68660N316427P4886n774327k995343O210901J3031485
$$ 18715442 8354793 8823453 14139880 14214766 8440439 5445096 11655997 24687482
38262B4687482J2022802L940837o544817j3333355j2376702n191602K323730N291890
$$ 24687482 36710284 40651121 34106304 20772949 8396247 3204645 5528375 10820265
38254A0820265L242997j066981m338732m511650j448091L617050Q826378J1296029
$$ 10820265 14063262 12996281 8657549 4145899 2697808 6314858 15141236 26437265
38246B6437265P930927l28113o576490m663714K848982P996340P406293L395223
$$ 26437265 34368192 34040079 27463589 22799875 25648857 33645197 41051490 44446713
38238D4446713k724269j0070773j2347120l658214Q766532R863495j958462j1368311
$$ 44446713 41722444 31651671 19304551 15646337 24412869 34276364 32317902 20949591
38230B0949591q685147k072212q6115K719380J1224392J4985293L931923j1541968
$$ 20949591 12264444 10192232 10106117 12825497 24049889 39035182 42967105 31425137
38222C1425137j3480986k425469O225215O323313M225374K152569l541897r247492
$$ 31425137 17944151 15518682 21743897 28067210 32292584 34445153 30903256 21655764
38214B1655764o985295l32381o07494o897020p106254J80190L307743m17744K58336
$$ 21655764 14670469 14338088 13730594 6833574 -272680 -92490 3215253 2797509 3055845
38205C055845Q262816J0545633J098096o922106l120536L004501Q1854n123397
$$ 3055845 11318661 21864294 22962390 16040284 12919748 15924249 16006103 10882706
38197A0882706j225810O652089O285088k05011j532848K450070K706424o49790
$$ 10882706 9656896 16308985 22594073 22389062 20856214 23306284 26012708 25362918
38189B5362918J078871P331683P123187k380112j0107697p730078n67144K691678
$$ 25362918 26441789 33773472 40896659 38516547 28408850 20678772 20111628 22803306
38181B2803306J547364j78475j839775l761404l359411O26302L801781J478067
$$ 22803306 24350670 24172195 22332420 18571016 15211605 15837907 19639688 21117755
38173B1117755l783328m893221J86633N916244O925044M447078K571171J159519
$$ 21117755 17334427 12441206 12627839 18544083 25469127 29916205 32487376 33646895
38165C3646895k611726o626390m614751L037539O611030R48391m842559n94246
$$ 33646895 31035169 24408779 19794028 22831567 29442597 30390988 25548429 24954183
38157B4954183P707282O399829l220217o102065J643146N673031k751960j1580044
$$ 24954183 32661465 39061294 35841077 29739012 31382158 37055189 34303229 22723185
38149B2723185p097043M335782O703710k076439j0091811r404820k317177O088673
$$ 22723185 15626142 19961924 26665634 24589195 14497384 5092564 2775387 8864060
38141H864060J1057912P683872k765467r835806o341762R54997K422630P06878
$$ 8864060 19921972 27605844 24840377 15004571 8662809 9617806 12040436 12747314
38133A2747314K986658M971020j893554j1669908j0098248J466940O572377K17394
$$ 12747314 15733972 20704992 18811438 7141530 -2956718 -1489778 5082599 5299993
38125E299993l616849L369408R518506L519811o097306m835053N125297J0041420
$$ 5299993 1683144 5052552 14571058 18090869 11993563 7158510 12283807 22325227
38117B2325227N707063J77733j150774j221982k672725l076400k4162N158818
$$ 22325227 28032290 28210023 27059249 25837267 23164542 20088142 20063980 25222798
38109B5222798R161568Q104233q49019j4177728k0513794j1203634P598369J9254392
$$ 25222798 34384366 42488599 41639580 27461852 6948058 -4255576 3342793 22597185
38101B2597185J4427420L92225q557274o189132J992184P056555N491546K89710
$$ 22597185 37024605 37416830 28859556 22670424 24662608 31719163 37210709 37500419
38093C7500419m152890o291549o757403n654983k552929J574539M470283M594333
$$ 37500419 33347529 27055980 20298577 14643594 12090665 13665204 18135487 22729820
38085B2729820J796090k842218o105165l833349L462961Q143631L774987m756559
$$ 22729820 24525910 21683692 15578527 11745178 15208139 23351770 27126757 22370198
38077B2370198n610543M358099J4356369J2978317J833609p971136r249192m281294
$$ 22370198 16759655 21117754 35474123 48452440 50286049 42314913 33065721 28784427
38069B8784427P59082K380919R30617j590350l432704l423827o28901M355301
$$ 28784427 29543509 31924428 32855045 31264695 27831991 24408164 23779263 28134564
38061B8134564P244616K674626p826287j3774687p208889N666847J1030630N009308
$$ 28134564 35379180 38053806 30227519 16452832 9243943 14910790 25941420 30950728
38053C0950728k869318m404647k194723j356562n33962K801556M809700P23337
$$ 30950728 28081410 23676763 21482040 20125478 19591516 22393072 27202772 27926109
38045B7926109o007602p397746k054812L533030M148629J168394j285284j482983
$$ 27926109 21918507 14520761 12465949 15998979 20147608 21316002 20030718 18547735
38037A8547735p20337j092884k932600l892403j921439P55831k02148m205939
$$ 18547735 17827398 16734514 13801914 9909511 7988072 8743903 8541755 4335816
38029D335816n027789N74770P591725R344613N957873K751284K819205M490905
$$ 4335816 -691973 -117203 7474522 16819135 22777008 25528292 28347497 32838402
38021C2838402M342330O82365m037192m104243K196662O674911l39780j4478100
$$ 32838402 37180732 37863097 33825905 29721662 31918324 38593235 38253455 23775355
38013B3775355j9457667q746691M693240O934760J428711o88244P99394n69190
$$ 23775355 4317688 -4429003 264237 7198997 8627708 7939464 8738858 8169668
38005H169668k023463M131196J3158404J1479832j295061r596339n060086J932362
$$ 8169668 6146205 10277401 23435805 34915637 33620576 24024237 18964151 20896513
37997B0896513J74418n782196n709203k67962K475384K95205k742250m385110
$$ 20896513 21070931 15288735 9579532 9311570 11786954 12082159 9339909 4954799
37989D954799m627638j720280M891546J0390854R653384M147428j262897n240430
$$ 4954799 327161 -1393119 3498427 13889281 23542665 27690093 26427196 21186766
37981B1186766q533562r087406m509271K949313Q829391J1305128R608931K140537
$$ 21186766 12653204 3565798 -943473 2005840 10835231 22140359 31749290 33889827
37973C3889827q338938j2628594n769114L983475N094881j428504n128289k419139
$$ 33889827 25550889 12922295 7153181 11136656 16231537 14803033 9674744 7255605
37965G255605O83628J308842L648619Q275638Q608652K199264l965618m477823
$$ 7255605 7939233 9248075 12896694 21172332 29780984 31980248 28014630 23536807
37957B3536807l247789m535226m562442N18074N347978L043101k597835k053506
$$ 23536807 20289018 15753792 11191350 11709424 17057402 20100503 17502668 15449162
37949A5449162M968664Q484879K326988p760693j1538700n315930N273096J0813758
$$ 15449162 20417826 28902705 31229693 23469000 11930300 6614370 11887466 22701224
37941B2701224O886931j060849l877536o88105O97628k341511j746737O175803
$$ 22701224 29588155 28527306 24649770 23961665 24659293 22317782 20571045 26746848
37933B6746848R877425j118158j6161453j5816791j254454O762253l31432p086384
$$ 26746848 36624273 35506115 19344662 3527871 2273417 9035670 8704238 1617854
37925A617854m61427R902476R142512K44379m348406l053038k129766j045479
$$ 1617854 1156427 11058903 20201415 20445794 16097388 13044350 10914584 9869105
37917I869105L367657M780167l712897j2855223p436044Q087621J2827143N88024
$$ 9869105 13236762 18016929 14304032 1448809 -5987235 2100386 14927529 15515553
37909A5515553j0571373n981333N361968Q011786L346224K346564M811333J017249
$$ 15515553 4944180 -1037153 4324815 12336601 15682825 18029389 22840722 23857971
37901B3857971r399837j4106331n555045P647805J1343394L249469m932953k740549
$$ 23857971 14458134 351803 -5203242 2444563 13787957 17037426 12104473 9363924
37893I363924N345018N809060m442117j2024624n751117O119810P713885m75269
$$ 9363924 14708942 20518002 16075885 4051261 -1699856 4419954 12133839 11658570
37885A1658570l559121L191502Q001365L738523j088906O24765K050824k959511
$$ 11658570 8099449 11290951 19292316 23030839 21941933 22566698 24617522 21658011
37877B1658011o617465j332809M582253J94127q035592n661200O079396J2123461
$$ 21658011 15040546 13707737 18289990 18484117 10448525 4787325 10866721 22990182
37869B2990182O252630k878303o999917n948381r15858O914049J0868295M271351
$$ 22990182 29242812 26364509 19364592 13416211 12500353 19414402 30282697 34554048
37861C4554048p799608j3328261r840785m801081o99012O416128J2929388P982116
$$ 34554048 26754440 13426179 3585394 -1215687 -1914699 4501429 17430817 25412933
37853B5412933p389601j5739565n780362J1357917J6969950P991201k723391m072787
$$ 25412933 18023332 2283767 -3496595 7861322 24831272 32822473 30099082 26026295
37845B6026295K237034N931407L7935j0104406j1193810O04706J1198473O361248
$$ 26026295 28263329 34194736 34232671 24128265 12934455 13539161 24737634 31098882
37837C1098882o850611r979118j507740K287110m223104p030707J464906P638419
$$ 31098882 24248271 14269153 12761413 15048523 10825419 3794712 5259618 12898037
37829A2898037O1186r704857n895624N217576O099077l868611r440590m257171
$$ 12898037 12959223 3254366 -2641258 2576318 8675395 4806784 -4633806 -8890977
37821h890977K349887K114160k423460n066754k503756N289643J2843735J0849096
$$ -8890977 -6541090 -4426930 -6850390 -11917144 -14420900 -9131257 3712478 14561574
$$ [...]
##END NTUPLES=NMR SPECTRUM
##END=
