##TITLE=31Pdec_LR-618-R3-CR-OST
 CDCl3, 124 sc
 28.06.2021
##JCAMPDX= 6.0         $$ Bruker NMR JCAMP-DX V2.0
##DATA TYPE= NMR SPECTRUM
##DATA CLASS= NTUPLES
##ORIGIN= UXNMR, Bruker Analytische Messtechnik GmbH
##OWNER= root
$$ XWIN-NMR		Version 3.5
$$ Mon Jun 28 12:19:46 2021 Russian Standard Time (UT+4h)  she@DPX200
##.OBSERVE FREQUENCY= 81.013821
##.OBSERVE NUCLEUS= ^31P
##.ACQUISITION MODE= SIMULTANEOUS
##.ACQUISITION SCHEME= undefined
##.AVERAGES= 124
##.DIGITISER RES= 16
##SPECTROMETER/DATA SYSTEM= spect
##.PULSE SEQUENCE= zgpg30
##.SOLVENT NAME= DMSO
##.SHIFT REFERENCE= (INTERNAL, DMSO, 0, 248.564)
##AUDIT TRAIL= $$ (NUMBER, WHEN, WHO, WHERE, WHAT)
$$ ##TITLE= Audit trail, XWIN-NMR		Version 3.5
$$ ##JCAMPDX= 5.01
$$ ##ORIGIN= Bruker BioSpin GmbH
$$ ##OWNER= she
$$ F:/spectra/data/she/nmr/P31/1/pdata/1/auditp.txt
$$ ##AUDIT TRAIL=  $$ (NUMBER, WHEN, WHO, WHERE, WHAT)
(   1,<2021-06-28 12:17:42.84 +0400>,<she>,<DPX200>,
      <continue with go, POWCHK disabled, PULCHK disabled
       configuration hash MD5:
       00 E9 B6 7A A2 85 ED C7 34 08 36 98 17 FE 4E 26
       data hash MD5: 32K
       D5 A8 DC D6 AA DA 9C D0 25 6E D2 C0 45 C1 14 DD>)
(   2,<2021-06-28 12:18:20.12 +0400>,<she>,<DPX200>,
      <Start of raw data processing
       efp BC_mod = 2 LB = 1 FT_mod = 6 PKNL = 1 PHC0 = -8493.485 PHC1 = 3898.087 SI = 64K 
       data hash MD5: 64K
       13 01 B4 40 32 48 B3 FD A6 BA 51 2C A6 08 09 E9>)
(   3,<2021-06-28 12:18:37.03 +0400>,<she>,<DPX200>,
      <pk PHC0 = 121.0865 PHC1 = 0 
       data hash MD5: 64K
       09 13 39 7B 10 9A 5D 62 6C E6 54 DA 3C 13 D4 0B>)
(   4,<2021-06-28 12:18:40.84 +0400>,<she>,<DPX200>,
      <abs ABSG = 5 
       data hash MD5: 64K
       39 CD EC C1 F1 78 24 E4 D2 36 72 59 70 27 E9 83>)
$$ ##END=
$$ 
$$ hash MD5
$$ EE 96 CB CC BF 07 DD E8 7A 88 09 31 04 D9 6E 2B
##$RELAX= 
##$RELAX= 
##$RELAX= 
##$RELAX= 
##$RELAX= 
##$RELAX= 
##$RELAX= 
##$RELAX= 
$$ Bruker specific parameters
$$ --------------------------
##$DU= <F:/spectra>
##$EXPNO= 1
##$NAME= <P31>
##$PROCNO= 1
##$TYPE= <nmr>
##$USER= <she>
##$AMP= (0..31)
100 100 100 100 100 100 100 100 100 100 100 100 100 100 100 100 100 100 
100 100 100 100 100 100 100 100 100 100 100 100 100 100 
##$AQSEQ= 0
##$AQ_mod= 1
##$AUNM= <au_zg>
##$AUTOPOS= <>
##$BF1= 81.014009
##$BF2= 200.13
##$BF3= 200.13
##$BF4= 200.13
##$BF5= 200.13
##$BF6= 200.13
##$BF7= 200.13
##$BF8= 200.13
##$BYTORDA= 1
##$CFDGTYP= 0
##$CFRGTYP= 5
##$CHEMSTR= <none>
##$CNST= (0..31)
1 1 145 1 1 1 1 1 1 1 1 1 1 1 1 1 1 1 1 1 1 1 1 1 1 1 1 1 1 1 1 1 
##$CPDPRG= <waltz16>
##$CPDPRG1= <>
##$CPDPRG2= <waltz16>
##$CPDPRG3= <>
##$CPDPRG4= <mlev>
##$CPDPRG5= <mlev>
##$CPDPRG6= <mlev>
##$CPDPRG7= <mlev>
##$CPDPRG8= <mlev>
##$CPDPRGB= <>
##$CPDPRGT= <>
##$D= (0..31)
0 1 0 0 0 0 0 0 0 0 0 0.03 2e-05 3e-06 0 0 0 0 0 0 0 0 0 0 0 0 0 0 0 0 
0 0 
##$DATE= 1624868098
##$DBL= (0..7)
120 120 120 11 120 120 24 19 
##$DBP= (0..7)
150 150 150 150 150 150 150 150 
##$DBP07= 0
##$DBPNAM0= <>
##$DBPNAM1= <>
$$ [...]
##$SUBNAM3= <"">
##$SUBNAM4= <"">
##$SUBNAM5= <"">
##$SUBNAM6= <"">
##$SUBNAM7= <"">
##$SUBNAM8= <"">
##$SUBNAM9= <"">
##$SW= 501.771253377433
##$SWIBOX= (0..15)
0 1 3 0 0 0 0 0 0 0 0 0 0 0 0 0 
##$SW_h= 40650.406504065
##$TD= 32768
##$TD0= 1
##$TE= 0
##$TE2= 300
##$TE3= 300
##$TEG= 300
##$TL= (0..7)
0 120 53 12 22 120 120 120 
##$TP= (0..7)
150 150 150 150 150 150 150 150 
##$TP07= 0
##$TPNAME0= <>
##$TPNAME1= <>
##$TPNAME2= <>
##$TPNAME3= <>
##$TPNAME4= <>
##$TPNAME5= <>
##$TPNAME6= <>
##$TPNAME7= <>
##$TPOAL= (0..7)
0.5 0.5 0.5 0.5 0.5 0.5 0.5 0.5 
##$TPOFFS= (0..7)
0 0 0 0 0 0 0 0 
##$TUNHIN= 0
##$TUNHOUT= 0
##$TUNXOUT= 0
##$USERA1= <user>
##$USERA2= <user>
##$USERA3= <user>
##$USERA4= <user>
##$USERA5= <user>
##$V9= 5
##$VALIST= <valist>
##$VCLIST= <CCCCCCCCCCCCCCC>
##$VD= 0
##$VDLIST= <DDDDDDDDDDDDDDD>
##$VPLIST= <PPPPPPPPPPPPPPP>
##$VTLIST= <TTTTTTTTTTTTTTT>
##$WBST= 1024
##$WBSW= 4
##$XGAIN= (0..3)
0 0 0 0 
##$XL= 0
##$YL= 0
##$YMAX_a= 3183
##$YMIN_a= -2671
##$ZGOPTNS= <>
##$ZL1= 120
##$ZL2= 120
##$ZL3= 120
##$ZL4= 120
##$ABSF1= 248.5645
##$ABSF2= -253.2056
##$ABSG= 5
##$ABSL= 3
##$ALPHA= 0
##$AQORDER= 0
##$ASSFAC= 0
##$ASSFACI= 0
##$ASSFACX= 0
##$ASSWID= 0
##$AUNMP= <proc_1d>
##$AZFE= 0.1
##$AZFW= 0.5
##$BCFW= 0
##$BC_mod= 2
##$BYTORDP= 0
##$COROFFS= 0
##$CY= -3
##$DATMOD= 1
##$DC= 0
##$DFILT= <>
##$DTYPP= 0
##$F1P= 0
##$F2P= 0
##$FCOR= 1
##$FTSIZE= 65536
##$FT_mod= 6
##$GAMMA= 0
##$GB= 0
##$INTBC= 1
##$INTSCL= 5.30512e-09
##$ISEN= 30
##$LB= 1
##$LEV0= 0
##$LPBIN= 0
##$MAXI= 10000
##$MC2= 0
##$MEAN= 0
##$ME_mod= 0
##$MI= 50
##$NCOEF= 0
##$NC_proc= -6
##$NLEV= 6
##$NOISF1= 182.463
##$NOISF2= 159.3651
##$NSP= 0
##$NTH_PI= 0
##$NZP= 0
##$OFFSET= 248.5645
##$PC= 4
##$PHC0= -8372.398
##$PHC1= 3898.087
##$PH_mod= 1
##$PKNL= yes
##$PPARMOD= 0
##$PSCAL= 0
##$PSIGN= 0
##$REVERSE= no
##$SF= 81.014009
##$SI= 65536
##$SIGF1= 159.3651
##$SIGF2= -187.1042
##$SINO= 113.3802
##$SIOLD= 16384
##$SREGLST= <1H.CDCl3>
##$SSB= 0
##$STSI= 65536
##$STSR= 0
##$SW_p= 40650.406504065
##$SYMM= 0
##$S_DEV= 0
##$TDeff= 32768
##$TDoff= 0
##$TI= <>
##$TILT= no
##$TM1= 0
##$TM2= 0
##$TOPLEV= 0
##$USERP1= <user>
##$USERP2= <user>
##$USERP3= <user>
##$USERP4= <user>
##$USERP5= <user>
##$WDW= 1
##$XDIM= 65536
##$YMAX_p= 334243807
##$YMIN_p= -15278533
$$ End of Bruker specific parameters
$$ ---------------------------------
##NTUPLES= NMR SPECTRUM
##VAR_NAME=  FREQUENCY,     SPECTRUM/REAL,   SPECTRUM/IMAG
##SYMBOL=    X,             R,               I
##VAR_TYPE=  INDEPENDENT,   DEPENDENT,       DEPENDENT
##VAR_FORM=  AFFN,          ASDF,            ASDF
##VAR_DIM=   65536,         65536,           65536
##UNITS=     HZ,            ARBITRARY UNITS, ARBITRARY UNITS
##FACTOR=    0.620285442955139, 1,           1
##FIRST=     20137.2065510759, 0,            0
##LAST=      -20513.1999529892, 0,           0
##MIN=       -20513.1999529892, -15278533,   0
##MAX=       20137.2065510759, 334243807,    0
$$ Real data points
##PAGE= N=1
##DATA TABLE= (X++(R..R)), XYDATA
$$ [...]
##PAGE= N=2
##DATA TABLE= (X++(I..I)), XYDATA
13114a785628P43323J637907N62930j449587j262394J065459K235302R34043n98590
13105B082765o17270j00133k20532n62951o95842r81625j153061m29799N53517
13096b124931L68847m69209j24189J050334Q11140p57008r66142O06527R46398
13087f58233j024040j986210K33336K503102J354035j108718o60422J936572K209614
13078B799036o83784k878374k208116j024040j426093j774651r3221K149110K287753
13069b852380N46324o67495m28688M5090p6777o9072Q12801K038306K504246J771511
13059C623866K80384j168700j865040j447258j23129J270430J668506O66403q51111
13050B054351j388727n06861N65058M71248n13455j031926p07049o12351j459556
$$ y = [-1785628, -1042305, 595602, 1158532, -291055, -1553449, -487990, 1747312, 2681355, 2082765, 1465495, 1365362, 1144830, 581879, -113963, -1095588, -2248649, -2678448, -2124931, -1756084, -2225293, -2349482, -1299148, -488008, -1245016, -2211158, -1604631, -658233, -1682273, -3668483, -3435147, -932045, 421990, -686728, -1347150, 589422, 2799036, 2115252, -763122, -2971238, -3995278, -5421371, -7196022, -7289243, -5140133, -2852380, -2306056, -2973551, -3402239, -3357149, -3433926, -3502998, -2690197, -651891, 1852355, 3623866, 3904250, 2735550, 870510, -576748, -699877, 570553, 2239059, 2905462, 2054351, 665624, 158763, 723821, 1195069, 681614, -350312, -1057361, -1669712, -3129268]
13041c129268k294482j698555K32732J911210K166228J442599Q42578N13436l11472
13032c24994j688611k283193j067849Q14440J133505l40769j171114N05588L108730
13023a314267L314284K40439l348715m095267j353314K625657M891890M021820
13015D982527J072585j291667j283070J41220N64182o44789j513048m74046J101427
13006B655321Q06441j090944j758971J48052K383268K151724k7913j158375Q2694
12997D191297J861563K049791Q08173n15288j530968k402924k382419p13701J305206
12988B670730J236161j089356k905391k184839l89874j34489j322500j563159
12980e682717M5276J677607J699505R23493Q40991J019025Q533j725842j821549
$$ y = [-3129268, -5423750, -7122305, -6889573, -4978363, -2812135, -1369536, -526958, -13522, -324994, -2013605, -4296798, -5364647, -4550207, -3416702, -3757471, -4928585, -4422997, -1314267, 2000017, 2240456, -1108259, -5203526, -6556840, -3931183, 960707, 4982527, 6055112, 4763445, 3480375, 3621595, 4185777, 3540988, 2027940, 1553894, 2655321, 3461762, 2370818, 611847, 759899, 3143167, 5294891, 5266978, 4108603, 4191297, 6052860, 8102651, 8910824, 8395536, 6864568, 4461644, 2079225, 1365524, 2670730, 3906891, 2817535, -87856, -2272695, -2662569, -2797058, -4119558, -5682717, -5637441, -3959834, -2260329, -1336836, -495845, 523180, 531713, -1194129, -3015678]
12971c015678N27722K825045K290683l97139k084104j428392j92069J4142L2978
12962a426812R58141J616861M29834j461559j585346j93603n3843j866181k815092
12953f397600r22924J729927K089498N01641l04250O73649J997741K437587K008512
12944C813781P60466j179098k413991j404913Q82249J577274k12424k074284j715903
12935a966843J09011J261501J173010O81458K34549p7777L37045J635168K368608
12926E755730J058824j382760k577863j903974r55198o74886r8328J332240K171340
12917B725125J059872r95400j986472j599189j031322q64204o99730m16707k07202
12908d015229K99568J390736K079249J284988l6762O0335J337895J478913k37060
$$ y = [-3015678, -2487956, 337089, 2627772, 2230633, 146529, -1281863, -1473932, -1459790, -1426812, -468671, 1148190, 1578024, 116465, -1468881, -1662484, -1716327, -3582508, -6397600, -7320524, -5590597, -3501099, -2999458, -3303708, -2630059, -632318, 1805269, 3813781, 4574247, 3395149, 981158, -423755, 458494, 2035768, 1823344, -250940, -1966843, -1857832, -596331, 576679, 1258137, 1492686, 1414909, 1751954, 3387122, 5755730, 6814554, 5431794, 2853931, 949957, -5241, -680127, -778455, 553785, 2725125, 3784997, 2789597, 803125, -796064, -1827386, -2691590, -3391320, -3808027, -4015229, -3715661, -2324925, -245676, 1039312, 1002550, 1062885, 2400780, 3879693, 3642633]
12899C642633j733188j459438n60975m32423l45820P53219K011101K147501J512152
12890E534762P89608n86473k624174l258162j233327J188889J317674K31369N52640
12881A912806J531045M38675k037019k431591m68724M24220p38562p83347J590353
12872e62144K930354Q73599j438710l53574K266930K059710j091515l355112k659278
12863a329740m83528J277979K057853J631239J44489j006076m95276R31109J484237
12854D212286Q07507j90248j126328j973026j962521o03968R09275J173492P57243
12845B003712J046430J625424Q82278j139521k480304j908941l43591N00933o9092
12836A17328j238336j536277m64956Q10663J225828J610885K845492L053924l7700
$$ y = [3642633, 1909445, 450007, -110968, -543391, -889211, -135992, 1875109, 4022610, 5534762, 6324370, 5737897, 3113723, -144439, -1377766, -188877, 1128797, 1360166, 1912806, 3443851, 3882526, 1845507, -586084, -1054808, -630588, -1369150, -2152497, -562144, 2368210, 3241809, 1803099, 1449525, 3716455, 5776165, 4684650, 1329538, -1329740, -1813268, -535289, 1522564, 3153803, 3298292, 2292216, 1796940, 2728049, 4212286, 5019793, 4829545, 3703217, 1730191, -232330, -836298, 72977, 1246469, 2003712, 3050142, 4675566, 5557844, 4418323, 1938019, 29078, -314513, 186420, 117328, -1121008, -2657285, -3122241, -2311578, -1085750, 525135, 3370627, 6424551, 6386851]
12827F386851m104587m028505K49607K633816r8727l313536k093977J215112J860938
12818a293008O11046R06159J696056j30304k665158j480615K211718L033385M28220
12809C317499r20762L63915O01253j374373k003220N824J153282k48263j246266
12800c51111m23197o79724k936851l152975O99629M221176L304705L97128l10724
12791G68056M46147j77023j362655n65317J448627J901190L93388j444048k662922
12782a254557k646493o23393J996590J975471n80431j300410J321959K580505
12774A469241o97410m023388k246386J776284K025600p08795j059196J128090
12766b335960J188959j118620q76898K794858M398531J044332k746284k259271
$$ y = [6386851, 2282264, -1746241, -1496634, 1137182, 1038455, -2275081, -4369058, -3153946, -1293008, -681962, 224197, 1920253, 1789949, -875209, -2355824, -144106, 2889279, 3317499, 2396737, 2760652, 3361905, 1987532, -15688, -9864, 1143418, 895155, -351111, -774308, -1454032, -4390883, -7543858, -6844229, -2623053, 681652, 1078780, 768056, 1214203, 1037180, -325475, -890792, 557835, 2459025, 2852413, 1408365, -1254557, -3901050, -4524443, -2527853, -552382, -1132813, -2433223, -1111264, 1469241, 771831, -3251557, -5497943, -3721659, -1696059, -2404854, -3464050, -2335960, -1147001, -2265621, -3142519, -347661, 4050870, 5095202, 2348918, 89647]
12758H9647O99369J782090O11345l85363o31363j221395j875356j244004N29794
12749a645236J840976J861662J229021O92570J32307r01601k040225j970276j38545
12740i39347J679986J126570j119599j730205K45068J518215k83824k520005j637038
12731c660179J174191K230976J270416Q19215J116516L54332q41645r0876J763058
12722D136004J332157j252070j965040L76751J954468K89556j900554j622779
12714A348493k37441k30224q96562n29353k3174q10954j446010J49676K555638
12705a19911K557324K03267j208572j29688J259983O85389j036465j622075n42093
12696D7159P73019J140924O58289l02430j703716k839392k015213J191821M000198
$$ y = [89647, 789016, 2571106, 3182451, 2797088, 2165725, 944330, -931026, -2175030, -1645236, 195740, 2057402, 3286423, 3978993, 4111300, 3209699, 1169474, -800802, -939347, 740639, 1867209, 747610, -982595, -737527, 780688, 496864, -2023141, -3660179, -2485988, -255012, 1015404, 1834619, 2951135, 3305467, 2463822, 2372946, 4136004, 5468161, 4216091, 2251051, 2627802, 4582270, 4871826, 2971272, 1348493, 1111052, 880828, -15734, -545087, -568261, -1379215, -2825225, -2675549, -119911, 2437413, 2640680, 1432108, 1302420, 2562403, 3247792, 2211327, 589252, 47159, 820178, 1961102, 2619391, 2316961, 613245, -2226147, -4241360, -3049539, 950659]
12687I50659K983072j151731l707689j955300J393579K324132Q71077p3022M78860
12678B113637R34390K40694j002844j986755k084376o43734J548692J859109p44508
12669B34305l277258k554328J08900J259351P86730J068505J865712P46234j751443
12660a513292k171713J77789K014281J341879j73009r23182j378821j404800L02328
12651c728540K784834K823174p8289k396123j759953J87004J377903J857989J380041
12642B448040j172384m129883l402531J022754L520766Q83597k503284j461867
12634d794792J989805K263743j039564l145570j485291J478956K427266Q07271
12626a498176j529371k046702M56078L915438M518584J649407q89826m46695N62805
$$ y = [950659, 3933731, 2782000, -925689, -2880989, -1487410, 836722, 1707799, 1634777, 2113637, 3048027, 3288721, 2285877, 299122, -1785254, -2428988, -880296, 978813, 234305, -3042953, -5597281, -5488381, -4229030, -3442300, -2373795, -508083, 238151, -1513292, -3685005, -3507216, -1492935, -151056, -324065, -1247247, -2626068, -4030868, -3728540, -943706, 1879468, 1801179, -594944, -2354897, -2167893, -789990, 1067999, 2448040, 1275656, -2854227, -6256758, -5234004, -1713238, -829641, -3332925, -4794792, -2804987, -541244, -1580808, -4726378, -6211669, -4732713, -2305447, -1498176, -3027547, -5074249, -4618171, -702733, 3815851, 5465258, 4575432, 4128737, 4691542]
12617D691542r28917l207326k618216K02767J275532m33093j722229k38148K415074
12608e63014L240457J372113j422506k582966j262807M65207J5044j769145j341284
12599c848901J997780M322897K715385m44022j431965n05583p9040k14849L37217
12590B848919O53015q67002k877051k655216l27493J675342K304131K059374Q41862
12581C655881j242035k322063j172737K90653N4177l40381J223242K861919J458924
12572D467580j653268k546681j038146k10790n01515L71566J912535R45236k267045
12563e20528l494908j312437P98539O98346Q09993K771941L704218J122176k226205
12554B351135k214386M92306J727235j46428k565051k560850l6594K623025K985468
$$ y = [4691542, 3762625, 555299, -2062917, -1860150, -584618, -1017711, -2739940, -2978088, -563014, 2677443, 4049556, 2627050, 44084, -1218723, -753516, -738472, -2507617, -3848901, -1851121, 2471776, 5187161, 4743139, 3311174, 2805591, 2726551, 2511702, 2848919, 3501934, 2634932, -242119, -2897335, -3224828, -1549486, 754645, 2814019, 3655881, 2413846, 91783, -1080954, -790301, -736124, -1076505, 146737, 3008656, 4467580, 2814312, 267631, -770515, -981305, -1482820, -1111254, 801281, 1746517, -520528, -4015436, -5327873, -4529334, -3830988, -3020995, -249054, 3455164, 4577340, 2351135, 136749, 629055, 2356290, 2209862, -355189, -2916039, -2952633, -329608, 2655860]
12545B655860P75928j856022k609298j449591j10114K23260l43900j138331j025858
12536d878066J068211M080236M782153K035736p43560k72645J418859L27367k724942
12527E093349l411622j090446N65041M67m82243J14401l509p43395N35409L383009
12517C960461L462289l07676l149276j888289J17970q59232k612404j339871J582844
12508a033184K136923K63079q53143k77719K17898o3987l09426n62571j255390
12499a737520j300554L87314K343945K190122N368k116244k798053j767316R02519
12490c890419L828557M328228J665134j389879k321461k091015k336932k002362
12482d210149J22564J960783J069983q49881l94354J955009K754157J169611m34050
$$ y = [2655860, 3431788, 1575766, -1033532, -2483123, -2593237, -2369977, -2713877, -3852208, -4878066, -3809855, 270381, 5052534, 7088270, 6344710, 6072065, 7490924, 7818291, 5093349, 1681727, 591281, 1156322, 1156789, 674546, 788947, 785438, 42043, 577452, 3960461, 7422750, 7115074, 3965798, 2077509, 2195479, 1336247, -1276157, -2616028, -1033184, 1103739, 1366818, 513675, 235956, 453854, 389867, 80441, -482130, -1737520, -3038074, -2650760, -306815, 1883307, 1888675, -227569, -3025622, -4792938, -3890419, -61862, 4266366, 5931500, 4541621, 2220160, 129145, -2207787, -4210149, -4087585, -2126802, -1056819, -1906700, -2301054, -346045, 2408112, 3577723, 3143673]
12473C143673q96013j237137j513118o58544M85801j16328j656461j059493J715664
12464a791956K894934P46481j459989m36077K147963K271649p13051l512573l262186
12455c114805n50785J776349J712084j21545j422700q71419N42808J159961P66521
12446a23531J94550k99775r41045j384131j133736m59718K99099J450798K611906
12437B14417J964542j093420l707987k627156J071938L079135J576225q49881
12429c72187j307103j633J193990J341338N99664n34429j229786p77536L60257
12420g27425R28814M76722m07414j258075j937344k005738j223878l01065J32152
12411f323251N71462J256762J014697m77722q06213J806061M488803K997541j459025
$$ y = [3143673, 2247660, 1010523, -502595, -1161139, -675338, -791666, -2448127, -3507620, -1791956, 1102978, 1849459, 389470, -46607, 2101356, 4373005, 3659954, 147381, -3114805, -3665590, -1889241, -177157, -298702, -1721402, -2592821, -2050013, -890052, -123531, 71019, -228756, -1169801, -2553932, -3687668, -4147386, -3848287, -2397489, 214417, 2178959, 1085539, -2622448, -5249604, -4177666, -1098531, 477694, -372187, -1679290, -1680923, -486933, 854405, 1454069, 919640, -310146, -1087682, -727425, 201389, 678111, 270697, -987378, -2924722, -4930460, -6154338, -6455403, -6323251, -5751789, -4495027, -3480330, -3958052, -4764265, -2958204, 1530599, 4528140, 3069115]
12402C069115l122732m3337K998833J696941j744172k509404L6395K612651K962455
12393E956745J514015n32553k136472k302242j145654l52260r66679j696688r37400
12384b599188O75055J412040J080028P45356P26178N71661L20632K14707j78101
12375B968368j141226j825263j404620m16133L02700R61039J680272J289541p92496
12366A622182k510355j378550J714326L262839J723444q20093j867596j341574
12358D04623n22236J06219Q01861J389483J264634K87742q86873j337035p57367
12349G51051J9020j86262j165330j142463P60995K689809K228363j1185r59596
12340B984402M97947J807403N63890j774732j969441J66234J434092o7630k209669
$$ y = [3069115, -53617, -96954, 2901879, 4598820, 2854648, 345244, 381639, 2994290, 5956745, 7470760, 6938207, 4801735, 2499493, 1353839, 1001579, 34900, -1661788, -2599188, -1924133, -512093, 567935, 1313291, 2039469, 2611130, 2931762, 3146469, 2968368, 1827142, 1879, -1402741, -1818874, -1516174, -555135, 1125137, 2414678, 1622182, -888173, -2266723, -552397, 2710442, 4433886, 3613793, 1746197, 404623, -117613, -11394, 790467, 2179950, 3444584, 3732326, 2845453, 1508418, 751051, 770071, 583809, -581521, -1723984, -962989, 1726820, 3955183, 3943998, 2984402, 3482349, 5289752, 5853642, 4078910, 2109469, 2275703, 3709795, 3642165, 1432496]
12331A432496k012009J08485J255389M39356l05995N78443J833571J613377J91974
12322E135087j127367k267275l546781l815906j881631Q74082J955844J560288
12314c113659K032685L411569K882224k83936k635928j479865R05776P49991j577550
12305H91307k520781p11480J660879K334977J156902r80255k929834l103755q28407
12296e030447J944181K381473M72447r59830j93466J421355J879409J020477j20494
12287B815105r28301j375247j629017j924022j982551q08689J621477L011562
12279a199683J240200j944683k425601N18554K806628J282804j859417k565660
12271d146858o58585P57594L57582o5725Q28615J827537J423011J92283k43869
$$ y = [1432496, -579513, -471028, 784361, 1223717, 917722, 1496165, 3329736, 4943113, 5135087, 4007720, 1740445, -1806336, -5622242, -7503873, -6629791, -4673947, -3113659, -1080974, 2330595, 5212819, 4928883, 2292955, 813090, 1718866, 2468857, 891307, -1629474, -2340954, -680075, 1654902, 2811804, 1831549, -1098285, -4202040, -5030447, -3086266, -704793, -232346, -1192176, -1385642, 35713, 1915122, 2935599, 2815105, 1886804, 511557, -1117460, -3041482, -5024033, -5832722, -4211245, -1199683, 40517, -1904166, -4329767, -3811213, -1004585, 278219, -1581198, -4146858, -4805443, -4047849, -3690267, -3755992, -2927377, -1099840, 323171, 515454, 271585]
12262B71585M97409J401595J573790R72912j40819j584101k778721k596920n72541
12253b955811J819544K220330K63531j660817j426065J72640J142516J416438
12245I92306K068440K395330Q28923j460134j421119P32200J005960k082109m430540
12236a370743k325307J743313K839488P39181p44422j9841R58201R02079O42396
12227C364345M62165l46621j167361o75272K77334j64969j059965k6998J750982
12218B413640P05897k410650k547327J182388K902523q55586m860210k910877
12210f380202K503900M199611J071177j490409o18354R00388O64335J33851P38796
12201A723093J110600P5865j044879r22910l16889k07275j38079L22300M62829
$$ y = [271585, 768994, 2170589, 3744379, 4717291, 4576472, 2992371, 213650, -2383270, -2955811, -1136267, 1084063, 1347594, -313223, -1739288, -1566648, -424132, 992306, 3060746, 5456076, 6284999, 4824865, 3403746, 4135946, 5141906, 3059797, -1370743, -3696050, -1952737, 886751, 1625932, 881510, 861669, 1819870, 2721949, 3364345, 3826510, 3479889, 2312528, 1637256, 1914590, 1749621, 689656, 662658, 2413640, 3119537, 708887, -1838440, -656052, 2246471, 1390885, -3469325, -6380202, -3876302, 323309, 1394486, -95923, -714277, 186111, 850446, 984297, 1723093, 2833693, 2909558, 1864679, 941769, 624880, 417605, 279526, 601826, 1064655]
12192A064655j94082j077038j702700k006141j499762o1222P20573n23392j986759
12183g265868p19216K495754L840126K293496Q10749R58658P57258o97818j093344
12174A379795K95477K38824k760970m671640j937842K348500L043453Q02368Q7500
12165a174535J437155J403863p47979j862689n21533J040360J177758P19990J30987
12156A603377j112900j878989l40517J880987J046509k358472l458335o28584
12148e246924J820663R45512r1173J815052L637139J295492k808506l140506J88626
12139a584625J963161M21032o60376Q83064J890857m16787l336492k640616R08469
12130b572313K553646K16390k841502k545669P86149L131525J974516q17595j990185
$$ y = [1064655, 870573, -206465, -1909165, -3915306, -5415068, -5476290, -4755717, -5279109, -7265868, -7985084, -5489330, -1649204, 644292, 1455041, 2413699, 3170957, 2473139, 1379795, 1675272, 1914096, -846874, -5518514, -7456356, -5107856, -2064403, -1262035, -1174535, 262620, 1666483, 918504, -944185, -1465718, -425358, 752400, 1472390, 1603377, 490477, -1388512, -1729029, 151958, 1198467, -1160005, -4618340, -5246924, -3426261, -2480749, -2571922, -756870, 2880269, 4175761, 1367255, -1773251, -1584625, 378536, 799568, 139192, 1022256, 2913113, 2496326, -840166, -3480782, -2572313, -18667, 197723, -2643779, -5189448, -4403299, -1271774, 702742, -114853, -2105038]
12121b105038j327397j076932j574380n33204K395619L652676Q22748k967791
12113b713699l089122n087K063685J822370J682041K206165R16943k273185l414858
12104b804747o33155K408521K154264M57034N87260J330272l33297l062976k895824
12095b792648k5526J396413J51193m91993R99704J610833p11201k967622j593877
12086d424724J971604L521410J984253k5430m58131J67540N77943L41340l11185
12077C344620q50335q21603o06885r94619j413717k35980K109395K495468m74602
12068B551742l493527k771501M14158J733559K83256q04717K4177O66777k65215
12059a661291r01082K31962J268897K08823j402608q61923J175548J533315p02793
$$ y = [-2105038, -3432435, -4509367, -6083747, -6616951, -4221332, -568656, 254092, -2713699, -5802821, -5807908, -3744223, -1921853, -239812, 1966353, 2883296, 610111, -2804747, -3437902, -1029381, 1124883, 1581917, 2169177, 3499449, 3166152, 103176, -2792648, -2818174, -1421761, -1270568, -1762561, -762857, 847976, 136775, -2830847, -4424724, -2453120, 1068290, 3052543, 3027113, 2568982, 2736522, 3314465, 3655805, 3344620, 2494285, 1672682, 1065797, 71178, -1342539, -1578519, 530876, 3026344, 2551742, -941785, -3713286, -3299128, -1565569, -1282313, -2087030, -2062853, -1396076, -1661291, -2562373, -2330411, -1061514, -852691, -2255299, -3117222, -1941674, -408359, -1111152]
12050a111152k867956k410807N6602K018064K055542P86053n05907j195504j123599
12041d298664R5209K400672L945761K222153k279956n206875l271791J189198
12033e204293L316502K383863J725827K355750J319548k313294m525365k284525
12025c225987J429877K197782P33535O91191K151547K022258j95348j726299j383591
12016B694965p83077m57755R96315L026408K485173j383356m751596m195334j200861
12007c569118N87425M23772K60510J032040J743210J617193R75013R9050j082545
11998B086550k006294j511403N32470K331189J728387j170465l520340k693415
11990d223321M40561K393217J429658n55807j221739p81191l66283L73427J678923
$$ y = [-1111152, -3979108, -6389915, -6333313, -4315249, -2259707, -1473654, -1979561, -3175065, -4298664, -4203455, -1802783, 2142978, 4365131, 2085175, -3121700, -6393491, -5204293, -1887791, 496072, 2221899, 4577649, 5897197, 3583903, -941462, -3225987, -1796110, 401672, 1135207, 1826398, 3977945, 6000203, 5804855, 4078556, 2694965, 1911888, 1454133, 2450448, 5476856, 7962029, 6578673, 1827077, -2368257, -3569118, -2981693, -2557921, -2297411, -1265371, 477839, 2095032, 3070045, 3169095, 2086550, 80256, -1431147, -898677, 1432512, 3160899, 1990434, -1529906, -4223321, -3782760, -1389543, 40115, -515692, -1737431, -2518622, -2884905, -2511478, -832555]
11981h32555J757685l89195j958220p4120K762890J706979k441649l740382l41761
11972c550328K524475R57640j748138j151904J225711J463798K40302R80363L295641
11963D237560L584701J117668j261848k047271k344143k433964j272840L60817
11955e9320K54485j091716n72550K249954L730495J656382j163151j126088R25935
11946D804426J398874p05944k822798k673674r11995L37347J99500l66157k33549
11937i73970M03146O90929P91444J566734K427366J427767j392416k877191j021578
11928A042231J550211J242281r45759j194949O99359J085424j142466k543527
11920b07195r96228P29175k38992k068781j398476J254675K641973J709718K41909
$$ y = [-832555, 925130, 535935, -1422285, -1496405, 1266485, 2973464, 531815, -3208567, -3550328, -1025853, -68213, -1816351, -2968255, -1742544, -278746, -38444, 941919, 4237560, 7822261, 8939929, 7678081, 5630810, 3286667, 852703, -420137, -59320, 195165, -896551, -1469101, 780853, 4511348, 6167730, 5004579, 3878491, 4804426, 6203300, 5497356, 2674558, 884, -911111, -573764, -374264, -740421, -973970, -570824, 120105, 911549, 2478283, 4905649, 6333416, 4941000, 2063809, 1042231, 2592442, 3834723, 2888964, 1694015, 2393374, 3478798, 2336332, -207195, -1203423, -474248, -713240, -2782021, -4180497, -2925822, -283849, 1425869, 1667778]
11911A667778m00497l97119K7597P87518J014735l8180j503826j866335q97978
11902a606307N92608J951762K372288Q70358j783924k758375q17572J408601J202644
11893A432083n3767M51333J824913R66580j742091k648033p49837Q85462L13241
11884F79884p71067q40640q88092j347934m90680J950096L032858J036407j458311
11875I02521j612172n03924k95038j56918J356846K427883O99558j948059j864021
11866i93324L01232O94855j088074j423526Q16249K061580l0514k665676k277912
11857d605110M07585K171714J769164L13408r21513j127395m4233J002090n7533
11848a091823k712226l543160r32374K276779L025910K451905L034939L566683
$$ y = [1667778, 1267281, 870162, 897759, 1685277, 2700012, 2661832, 1158006, -708329, -1606307, -1013699, 938063, 3310351, 4180709, 2396785, -361590, -1179162, 229439, 1432083, 1378316, 1829649, 3654562, 4621142, 2879051, 231018, -518819, 366643, 679884, -91183, -931823, -1819915, -3167849, -3658529, -1708433, 1324425, 2360832, 902521, -709651, -1213575, -1508613, -1665531, -308685, 2119198, 2818756, 870697, -993324, -692092, 2763, -1085311, -2508837, -1692588, 368992, 338478, -2327198, -4605110, -4197525, -2025811, -256647, 56761, -864752, -1992147, -2036380, -1034290, -1091823, -3804049, -7347209, -8279583, -6002804, -2976894, -524989, 2509950, 6076633]
11840F076633J072283l262227m576963j264282K474450K441626k61565j737495
11832I62460q21376L09792q0661j201590j398862l83138O85045P29651j0578l24482
11822a533739L95072J231143Q63461n88243j538292q49822P95605J671426Q45083
11813A291694q94133j872561j365343m22826l48164o14730M20858K515429L096826
11804A807050R85511j263400q15378J020858O57516k048371l244373q77771K105143
11795a673215K084019j40089j017977M34753J767565J207524J8094k4319M63729
11786C120084k96608k008216k242062p946K210448J410947j674365l200001j278932
11777c966651J575386K143766Q08514K64295J191069J706649P58729m61690q42142
$$ y = [6076633, 7148916, 3886689, -690274, -1954556, 519894, 2961520, 2699955, 962460, 141084, 450876, 370215, -831375, -2230237, -2613375, -1928330, -1198679, -1209257, -1533739, -1138667, 92476, 955937, 367694, -1170598, -2020420, -1224815, 446611, 1291694, 397561, -1475000, -2840343, -3263169, -3611333, -4226063, -3805205, -1289776, 1807050, 2792561, 1529161, 713783, 1734641, 2392157, 343786, -2900587, -3778358, -1673215, 410804, 270715, -747262, -312509, 1455056, 2662580, 2680674, 2656355, 3120084, 2823476, 815260, -1426802, -1434748, 775700, 2186647, 512282, -2687719, -3966651, -2391265, -247499, 561015, 825310, 2016379, 3723028, 4481757, 4020067, 3177925]
11768C177925q51850r86826o84709J78463M28570m87753j149820k08640J293198
11759G08558J262381m32991j866913j691516m25689Q76571J851672K313796J681600
11750D277469j87008k106908k458705j048878N60190Q53939P569o79532m89139
11741a271003K72197J127245J724987J498902K59530r06940p77940j01482p19140
11732A106356k264009k148820J36664J453153k96727k497922j666147J190497
11724d986955K514389J900862J870259K798970K349181J1752j783411j636369
11716C038678o54075N08772K334502L591876J934763j569436k781602q94805k3943
11707E484730k259496l880640j747901J018253J78988k399094j882169J506398
$$ y = [3177925, 2326075, 1339249, 654540, 833003, 1261573, 773820, -376000, -584640, 708558, 1970939, 1537948, -328965, -2020481, -2446170, -1569599, 282073, 2595869, 4277469, 4090461, 1983553, -475152, -1524030, -963840, -109901, -102332, -781864, -1271003, -998806, 128439, 1853426, 3352328, 3611858, 2704918, 1926978, 1825496, 1106356, -1157653, -3306473, -3169809, -1716656, -2013383, -4511305, -6177452, -4986955, -2472566, -571704, 1298555, 4097525, 6446706, 6458458, 4675047, 3038678, 2384603, 2893375, 5227877, 8819753, 10754516, 9185080, 6403478, 5508673, 5484730, 3225234, -655406, -2403307, -1385054, -1206066, -3605160, -5487329, -3980931]
11699c980931L041929J038057j242484j150061K47809J075470J040125L32295
11691D02209q63461j341546j8528J746391J592703j15660q18012o490J85162r48034
11681a85266j291742K87157J647477N75973j834951k800989j487950M77383J340216
11672c272692R33893L87319O26164J123353N49093r88972j480770J32247J954854
11663c5511J749245L33251O0298Q73141O89103p38731j408081o55693j96262r92441
11653c21681j777110j465719n81675M58303J956263K988657J581933j820981l638851
11644b620861j707873J557874K522207J050311k74253k65861q0415o54797j356955
11635a830623j298164n38878L35913J025013J595510K049622K007337J121986
$$ y = [-3980931, -939002, 99055, -1143429, -2293490, -2045681, -970211, 69914, 402209, -461252, -1802798, -1821326, -74935, 1517768, 1402108, 584096, 577606, 762768, -185266, -1477008, -1189851, 457626, 1033599, -801352, -3602341, -5090291, -4612908, -3272692, -2338799, -1951480, -1325316, -201963, 347130, -641842, -2122612, -1990365, -35511, 1713734, 2046985, 2107283, 2980424, 3669527, 2930796, 1522715, 867022, 670760, -321681, -2098791, -3564510, -4146185, -3687882, -1731619, 1257038, 2838971, 1017990, -2620861, -4328734, -2770860, -248653, 801658, 527405, 261544, 181129, -473668, -1830623, -3128787, -3667665, -3331752, -2306739, -711229, 1338393, 3345730, 4467716]
11627D467716j6144j52209O98853N80603j655029l819199k832904O69213K803535
11618G44435J753979j15255k87309N03876M13343l16910k99707N08689J194971
11609D100112J527523J514966N18854j472461k767949j991865l20194J31480n34457
11600G06009m16868R37611J752075Q02873o94568q20169M23319J227927M85762
11591D403971p30699p28661K51255K97129r99138j290344J015876L355865J840152
11582G415406k832222n421710k939993J467427K996382J106634j085278j372865
11574f66219k955J978648L381327K643341n89576l887245m150215j344460J596628
11565a040726K534207J998623J198785J22605j523018k847682k476536l35866
$$ y = [4467716, 4451572, 4299363, 4998216, 5578819, 3923790, 104591, -2728313, -2059100, 744435, 2498414, 2383159, 2095850, 2599726, 3013069, 2696159, 2396452, 2905141, 4100112, 5627635, 7142601, 7661455, 6188994, 3421045, 1429180, 1108986, 1240466, 706009, 289141, 1226752, 2978827, 3781700, 3087132, 2266963, 2690282, 3918209, 4403971, 3673272, 2944611, 3195866, 3492995, 2493857, 1203513, 2219389, 5575254, 7415406, 4583184, -838526, -3778519, -2311092, 685290, 1791924, 706646, -666219, -669174, 1309474, 4690801, 7334142, 6744566, 2857321, -1292894, -2637354, -1040726, 1493481, 3492104, 4690889, 4813494, 3290476, 442794, -2033742, -2369608]
11557b369608J986721K690407J412911n30176j593133j581048j368460j169766
11549b522152j45310J759051K732342J153483j774972k924938j012962J669556
11541a065902K015065k4187j383657N1696K372433J998868j092932k634144J55747
11532C92987M005598L529513j189628m449960k791111O21779J232167n48822j249199
11523d46676l28291l28527j768639j894595O47185L149368K658893K26963q94012
11514A021669j2578N49248m85034j369316m03438J018086M71229j366411j332969
11505a909514J176721K616592M17043k657249k170405J295363K741324R5884k731814
11496a126055j618375J922689L103838L61196l078624l554329q68681K209982
$$ y = [-2369608, -382887, 2307520, 3720431, 3190255, 1597122, 16074, -1352386, -2522152, -2667462, -908411, 1823931, 2977414, 1202442, -1722496, -2735458, -1065902, 949163, 924976, -458681, -406985, 1965448, 3964316, 2871384, 237240, 392987, 4398585, 7928098, 6738470, 2288510, -502601, 119178, 1351345, 802523, -446676, -774967, -1103494, -2872133, -4766728, -4119543, -970175, 1688718, 1915681, 1021669, 1009091, 1558339, 1073305, -296011, -699449, 318637, 789866, -576545, -1909514, -732793, 1883799, 2300842, -356407, -2526812, -1231449, 1509875, 1605759, -1126055, -2744430, -821741, 2282097, 2643293, -435331, -3989660, -4858341, -2648359]
11488b648359L027868J349607q71576j859787j834009j824090j343004Q76921
11480e126429L757687L980502M86212l231006l294280m67274J237959J82144j094542
11471c569027J20177K875747L825890J558096j505332j994801J18482J411863
11463B841095k48608k483305j788434J079560K066822p4721k057571j262858O28480
11454a299540Q80830k90936j111179j239940j036522R7002K130983K939361J045142
11445B115201j579677k022701n04054N83160N23251M73022P12063M55378r1273
11436F64370j2290L11732k52160j351052j545148o20973L99181J094225J643383
11427C31268J589647M84728q36561j354508j401583j467399q07010P77408J419461
$$ y = [-2648359, 379509, 1729116, 857540, -1002247, -2836256, -4660346, -6003350, -5126429, -1368742, 2611760, 3097972, -133034, -3427314, -3894588, -2656629, -2474485, -3569027, -3448850, -573103, 3252787, 4810883, 3305551, 1310750, 1429232, 2841095, 2592487, 109182, -1679252, -599692, 1467130, 1392409, -665162, -1928020, -1299540, -418710, -709646, -1820825, -3060765, -4097287, -4000285, -1869302, 1070059, 2115201, 535524, -1487177, -1991231, -1408071, -884820, -411798, 300265, 755643, 664370, 652080, 963812, 711652, -639400, -2184548, -2805521, -2406340, -1312115, 331268, 1920915, 2405643, 1569082, 214574, -1187009, -2654408, -3461418, -2684010, -1264549]
11418a264549k3632j362184k86238J458039P30268j541833j767473K69612J320612
11409b467378L79020k30807K26373k33523j554609o88574K761364M522072J813471
11400D527409k366181l841140k653838j024869O91574K629779K871676J43989
11392I78399k879831k676115L3996J656258J144147O97354J580921K404714J667067
11383D606910m15841k704976l852045k541501R41699L704771L003114l3108j549283
11374A159740o57K092333J951128N8376j266275j284958j207815j717656j760433
11365a976217k93794J739508K289283R44786l88879j16101R09701J001756L02913
11356D412956K8626j82509j692817l690773l374492j94998K568605J968193p97087
$$ y = [-1264549, -1288181, -2650365, -2936603, -1478564, -748296, -2290129, -4057602, -3787990, -2467378, -2088358, -2319165, -2092792, -2326315, -3880924, -4569498, -1808134, 2713938, 4527409, 2161228, -1679912, -4333750, -5358619, -4667045, -2037266, 834410, 978399, -1901432, -4577547, -4543551, -2887293, -1743146, -1045792, 535129, 2939843, 4606910, 4191069, 1486093, -2365952, -4907453, -3965754, -260983, 2742131, 2709023, 1159740, 1159083, 3251416, 5202544, 5260920, 3994645, 2709687, 1501872, -215784, -1976217, -2270011, -530503, 1758780, 2703566, 2314687, 2198586, 3108287, 4110043, 4412956, 4441582, 4259073, 2566256, -1124517, -4499009, -4694007, -2125402, -157209, -954296]
11347i54296k344741j366849O91155J994334J830929O61449j67953L86494J467195
11338B197717J186835l68028r38688K46910J039161O7202p41479M30505J829600
11329D949735R90626r93651j439707p04205j054412j988652r25259J664152K203305
11320B701932j48716j741851j51799J968048J145100j590372k507510n93141J635651
11311G17342J973336Q01883l64542p93184o41872k34436K79623P96968R60451
11302C495569K98702q94911j268798Q306J659919J626854q4672j431698j342047
11293B067224q74380q82002n37490P02248J477068M86091j214067j570278l42309
11284f87895R80970J371971R17141p4812j124947j275269k46175N34288l47113
$$ y = [-954296, -3299037, -4665886, -3974731, -1980397, -149468, 511981, 344028, 730522, 2197717, 3384552, 3016524, 2077836, 2324746, 3363907, 3431109, 2689630, 3120135, 4949735, 5940361, 4946710, 3507003, 2802798, 1748386, -240266, -1165525, 498627, 2701932, 2553216, 811365, 659566, 2627614, 3772714, 2182342, -325168, -918309, 717342, 2690678, 3492561, 3128019, 2334835, 1692963, 1458527, 1738150, 2535118, 3495569, 3794271, 2899360, 1630562, 1638868, 3298787, 4925641, 4840969, 3409271, 2067224, 1192844, 310842, -226648, 475600, 1952668, 2438759, 1224692, -345586, -687895, 293075, 1665046, 2582187, 2507375, 1382428, 107159, -139016, 395272, 48159]
11275D8159j866718j659689M50669J906513R49121r50588j230894K88758J344255
11266g20414L19293j628044j933225J47350K318160J927381m38385j476333K72950
11257a211267K230855J577311n57044j140410j72623k74236j782063k039030j92619
11248c561126J135990M95264J87441J846322K948076J030248j597272j389560
11240A095383N39641O79562m51517N25626L009757K630784j093201l195833j225796
11231B514406P94729o51467k731118j490155J301898J493689l74644p34237L36213
11222D59314k33515k123429j659541J442538K759702P0339k974866k305320R91397
11213c573381L019948K376820O44381o06728j109105j204649j307922j376248
$$ y = [48159, -1818559, -3478248, -3027579, -1121066, -171945, -1122533, -2353427, -2064669, -720414, -401121, -2029165, -3962390, -3815040, -1496880, 430501, -7884, -1484217, -1211267, 1019588, 2596899, 2039855, 899445, 726822, 452586, -1329477, -3368507, -3561126, -2425136, -1929872, -1742431, 103891, 3051967, 4082215, 2484943, 1095383, 1635024, 2314586, 1863069, 2388695, 5398452, 8029236, 6936035, 3740202, 2514406, 3309135, 2657668, -73450, -1563605, -261707, 1231982, 857338, 123101, 459314, 225799, -1897630, -3557171, -2114633, 645069, 715408, -2259458, -4564778, -3573381, -553433, 1823387, 2467768, 1861040, 751935, -452714, -1760636, -3136884]
11205c136884m97330J757358L630846K928095O01784r7410J377123J840024m34535
11196G969071k821706k667874j308403j003526p51684J271103L290559K122532
11188F100072j338515k961547j434212L85229M22417k1212M71438R37184K81866
11179B842720o76271j051750j527631k434914k189636L36875L314150L891240
11171B504783J855561l83298r62031k28475M50077K57081o44297j414850j372441
11162F2110r31355j177223k097025k170339n12460J531618K046198J051245J43133
11153b054098K17042P70917R90357L59375j203430k545231j505008K177912M938994
11144B146830L026275j944110m105895r91341K950293K506324j224560l013738
$$ y = [-3136884, -3634214, -1876856, 1753990, 4682085, 5283869, 5186459, 6563582, 8403606, 7969071, 5147365, 2479491, 1171088, 167562, -584122, 686981, 3977540, 6100072, 4761557, 1800010, 365798, 751027, 1173444, 1152232, 1623670, 2560854, 2842720, 2166449, 1114699, -412932, -2847846, -5037482, -4700607, -1386457, 2504783, 4360344, 3977046, 3015015, 2786540, 3236617, 3493698, 2849401, 1434551, 62110, -869245, -2046468, -4143493, -6313832, -6826292, -5294674, -3248476, -2197231, -2054098, -1837056, -1066139, -75782, 283593, -919837, -3465068, -4970076, -2792164, 2146830, 5173105, 3228995, -876900, -1868241, 1082052, 3588376, 2363816, -649922]
11136f49922j177711P76156J74472r47487L11830K747234K735675j47336k150786
11127A672125n94646K177440J935393j428109l556366j670766J648752K527657
11119B711480J407413J358644K106646L26674l651669m587504l40339L529214
11111B860559J493999l205704l211606J710820M580455K002375j562815j700537
11103B967546p6234J86080j08383P94187J365683k42414k045292j244724Q37487
11094B433936R02934r43959j880145j172411n16053m18268J52078R92312Q60456
11085D10880J33922K34901P25301j4547j445609j279328O97093K083470J446682
11076B992765j14616j233528j697976j385681r7554J239237J251852J66424o46938
$$ y = [-649922, -1827633, -1051477, -877005, -1824492, -1512662, 1234572, 3970247, 3822911, 1672125, 1077479, 3254919, 5190312, 3762203, 205837, -1464929, 183823, 2711480, 4118893, 5477537, 7584183, 7910857, 4259188, -328316, -668655, 2860559, 4354558, 1148854, -2062752, -351932, 4228523, 6230898, 4668083, 2967546, 2891312, 3077392, 2969009, 3763196, 5128879, 4886465, 2841173, 1596449, 2433936, 3336870, 2392911, 512766, -659645, -1175698, -1593966, -1441888, -449576, 410880, 544802, 779703, 1505004, 1490457, 44848, -1234480, -537387, 1546083, 2992765, 2878149, 1644621, -53355, -1439036, -1536590, -297353, 954499, 1120923, 473985]
11067D73985r12322j246478j255518j87643J023828R49108L63919Q90798J497465
11058A597142j75408l102736l397966k51393K444895J756497m53293j119432l37914
11049c039608Q3031M024M72853J413608J820982J302664J68997j019860j297766
11040i1075o0443J470298J265170m40101j079695M08001J797999Q69180j403925
11031B735409k445772j448462K73472J265949J092847K27373m20209l61738j17935
11022H00934l55421p86059q66257r04147j152868p44827P33982J739630J039219
11013d95814K14108J140440K286537J004790j529441j788113K21242J004276m84897
11004A573128j612999j206160j085414j566401l92495K378867L309720J272379
$$ y = [473985, -438337, -1684815, -2940333, -3127976, -2104148, -1155040, -791121, 99677, 1597142, 1421734, -1681002, -5078968, -5330361, -2885466, -1128969, -1582262, -2701694, -3039608, -2956577, -2952553, -2479700, -1066092, 754890, 2057554, 2226551, 1206691, -91075, -151518, 1318780, 2583950, 2143849, 1064154, 1472155, 3270154, 4139334, 2735409, 289637, -1158825, -885353, 380596, 1473443, 1700816, 1280607, 918869, 800934, 445513, -340546, -1206803, -2110950, -3263818, -4008645, -3274663, -1535033, -495814, -281706, 858734, 3145271, 4150061, 2620620, 832507, 1053749, 2058025, 1573128, -39871, -1246031, -2331445, -3897846, -4290341, -1911474, 1398246, 2670625]
10996B670625n09324j35932Q2254j243695j599203L21522J460593j15874j291763
10987c60797N09949K279892N83595k184919j799315P42789J370691k70771j175673
10978c04559l29351P47459J270474J219796q0856j994058j599580J739430L757622
10969D426377J263645k462681k869327j323675j576139k307464P3482L550598
10961a225184K893904j140146k554264n0130J238525j023396k643931o34498J808575
10952c330545J233956m75641o9248J638198J951135Q90968K31766L4754r18946
10943A186397k458337k974809j502116J196084L131213K654440L59358j190831
10935D01399p72301k06638j074366j742832m07975J043516L061j826507r54842
$$ y = [2670625, 2161301, 2025369, 2107623, 863928, -735275, -413753, 1046840, 930966, -360797, 149152, 2429044, 3012639, 827720, -971595, -228806, 1141885, 871114, -304559, -633910, 113549, 1384023, 2603819, 2522963, 528905, -1070675, 668755, 4426377, 5690022, 3227341, 358014, -965661, -2541800, -4849264, -4775782, -1225184, 1668720, 528574, -2025690, -2075820, -837295, -1860691, -4504622, -5139120, -3330545, -2096589, -2572230, -2641478, -1003280, 947855, 1838823, 2070589, 2105343, 1186397, -1271940, -4246749, -5748865, -4552781, -1421568, 1232872, 1592230, 401399, -370902, -577540, -1651906, -3394738, -3802713, -2759197, -2756136, -4582643, -5537485]
10926e537485J573618J573893j027089j836862O75076K876735K120460J92057
10918F10403q07993j267706j138456J049968M217004M293753J97323l765945l866204
10909d77853j532393K67417J195770J511045k8906k987769l641084j65435L624303
10900b234905L352743J96842j705632j430495r33954o36367M72262J619780J149428
10891a50298o2533L20911K024334K502715J158490n1239l80343j383535l351233
10882F27269l643848m79091L541497M072701O21929k692909k474807k22525M47167
10873b02617o25105l20088J987419K613629n14596l649244k504640R40126J584849
10864f90267o06864j124127R90372J767905r9398o90441J730308K825996m00523
$$ y = [-5537485, -3963867, -2389974, -3417063, -5253925, -4578849, -1702114, 418346, 610403, -197590, -1465296, -2603752, -1553784, 2663220, 6956973, 7154296, 3388351, -477853, -2010246, -1742829, -547059, 963986, 935080, -2052689, -5693773, -5859208, -2234905, 1117838, 1314680, -390952, -1821447, -2755401, -3391768, -2919506, -1299726, -150298, -212831, 108080, 2132414, 4635129, 5793619, 5742380, 5362037, 3978502, 627269, -3016579, -3495670, 45827, 4118528, 4740457, 2047548, -427259, -649784, -202617, -827722, -1147810, 839609, 3453238, 2938642, -710602, -3215242, -2275116, -690267, -1297131, -2421258, -1430886, 337019, 237621, -452820, 1277488, 4103484, 3702961]
10855C702961l614209j720710K624247L054786n24303k325174o2006K252494J493340
10846D881426j21366K75915J389546M91574j854841k838829j737205m95640l97693
10837d07113m47219M23424J191456J36311k157483k825181m08819K737697L177047
10828A420120Q37553j161135r95101j56455l21556o00329L71462J433902M66949
10819A295410j854358k451849j81614K430722K655859J037859M1983M19850P74472
10810D168334L39168Q0778M95771K78804j432504l012457k443832l87052R94279
10801i18711J360692J750159J575192n49007l104043k725877L12123J766785m0625
10792e73312j650745n21433Q60315J213q91529O54766K190812N46718k034709
$$ y = [3702961, 88752, -1631958, 992289, 4047075, 3522772, 1197598, 1135592, 3388086, 4881426, 4760060, 5035975, 6425521, 6917095, 5062254, 2223425, 486220, -9420, -407113, -854332, -430908, 760548, 896859, -1260624, -4085805, -4494624, -1756927, 1420120, 2257673, 1096538, 101437, -55018, -376574, -976903, -605441, 828461, 1295410, -558948, -3010797, -3192411, -761689, 1894170, 2932029, 2974012, 3393862, 4168334, 4507502, 4588280, 5084051, 5362855, 3930351, 917894, -1525938, -1912990, -918711, 441981, 2192140, 3767332, 3218325, 114282, -2611595, -2299472, -532687, -573312, -2224057, -2745490, -1885175, -1883962, -2775491, -2120725, 70087, 616805, -1417904]
10783a417904j454960J093773J376510l55199k13963J972553K313760k71216k495963
10774E47391k347478j231202k05079J161147K018786R66319n09526R8555J483583
10765A982496N11551j727468j542455L45833j14985k386065j616580K475732M354113
10756B282172J817072q07462o53246l22205j384908j098856J199501J462174j587454
10747I06788l119415m56354K002171P21390p07050J353884L439119J168098k652827
10738B655804k705485K35828J730807J195085R82817J044862J40674m97166J24421
10729D907647m40365l444307m736354q97562L946905L773384J2337j472535j00790
10720A548360j8175j651024j383909R62105J592757k59P0081K875375M302690
$$ y = [-1417904, -2872864, -1779091, -402581, -757780, -971743, 1000810, 3314570, 3043354, 547391, -1800087, -3031289, -3236368, -2075221, -56435, 909884, 400358, 498913, 1982496, 2494047, 766579, -775876, -430043, -545028, -2931093, -4547673, -2071941, 2282172, 4099244, 3291782, 2638536, 2316331, 931423, -167433, 1032068, 2494242, 906788, -2212627, -2668981, -666810, 54580, -652470, 701414, 4140533, 5308631, 2655804, -49681, 186147, 1916954, 3112039, 4094856, 5139718, 5280392, 4783226, 4907647, 4467282, 1022975, -3713379, -4610941, -664036, 3109348, 3121685, 1649150, 1548360, 1530185, -120839, -1504748, -542643, 1050114, 1049855, 1119936, 3995311, 8298001]
10711H298001J571320k729369m797898l892328j198136J990886L843192K911162
10703E996830M49659p93000m23768l67379j057030q34285N38159R50888n87361
10694C872713k168120j757137J00645J268370N47700j250427k119398q92084J166023
10685a231715J625584J01743j231210q33205L59063J012333J212145J313808J169440
10676C497986J254918K127671K322178o8940l299460l478041r28904j81184k215347
10667i69123k420756J158256L620655J224650k123911j466203J192292J283903
10659A499763k24451M29113K314800J773521l99412k73688K022465K465223o3218
10650I544116k355495k105598l44885J091525J239618j21428j725232j490485
$$ y = [8298001, 9869321, 7139952, 2342054, -1550274, -2748410, -757524, 3085668, 5996830, 6446489, 5653489, 5229721, 4862342, 3805312, 2971027, 3509186, 4460074, 3872713, 1704593, -52544, 48101, 1316471, 1864171, 613744, -1505654, -2397738, -1231715, 393869, 495612, -735598, -1568803, -1209740, -197407, 1014738, 2328546, 3497986, 4752904, 6880575, 9202753, 9133813, 5834353, 2356312, 1427408, 1246224, -969123, -3389879, -2231623, 1389032, 2613682, 489771, -976432, 215860, 1499763, 1275312, 1704425, 4019225, 5792746, 5393334, 5119646, 7142111, 9607334, 9544116, 7188621, 5083023, 4738138, 5829663, 7069281, 6947853, 5222621, 3732136]
10642C732136L5651k80857k523858k348033J570268L740369K40240m053693k688864
10633b576641K136307L500611O75852j215870l04964M85293j83295p15387q59066
10624I42840j530881j304166J446721M075779K826410p35395j893677j81319Q56157
10615D502469J87720R7527J161239J445987K40862j483997l228204m117658k200588
10606c394643J784023L194042K26688k118581K20091L250274J695767j736327
10598C121334j234993J979385K518812N69447L08277J186262n48263l532851l062037
10589A305373K07359J529077P47219J568345L369847K027880j775329l032566
10581E947205q01139J130941J191245P77018m72617l180441m046994n11856K901332
$$ y = [3732136, 3767787, 3486930, 963072, -1384961, 185307, 3925676, 4165916, 112223, -2576641, -440334, 3060277, 3736129, 2520259, 2215295, 2700588, 2517293, 1801906, 942840, -588041, -1892207, -445486, 3630293, 6456703, 5721308, 3827631, 3646312, 4502469, 4690189, 4787716, 5948955, 7394942, 7635804, 6151807, 2923603, -1194055, -3394643, -1610620, 1583422, 1810110, -308471, -88380, 3161894, 4857661, 3121334, 1886341, 3865726, 6384538, 6953985, 7262262, 8448524, 7900261, 4367410, 1305373, 1512732, 3041809, 3789028, 5357373, 8727220, 10755100, 8979771, 5947205, 5146066, 6277007, 7468252, 8245270, 7772653, 4592212, 545218, 33362, 2934694]
10572B934694Q17279l273820k326110K075631K642255p39078j527246J316317
10564A919922K208600l54701j919711r08337j41132J58854K054354L464850R25631
10555G408330k607775j801907J175976M84875k086236k90252M275002M381980
10547A0939993J06344j831952k63643J46015q51587Q7369R41992k061645m531514
10538B681372j07884O359734N205371j467011l642441o60703K30426q65922J382474
10529I115416L676851o28871n931723k193218N366240L938463l323163k824269
10521G195726L900453L534876k788751j812102M946993L394233m704093l840454
10513I826881M448516L137168o629842n760130O063902Q186752k006071m080520
$$ y = [2934694, 3751973, 478153, -1847957, 227674, 2869929, 2130851, 603605, 1919922, 4128522, 3773821, 1854110, 945773, 804641, 963495, 3017849, 6482699, 7408330, 4800555, 2998648, 4174624, 4659499, 2573263, 2283011, 6558013, 10939993, 11046337, 9214385, 8950742, 9096757, 8245170, 8332539, 9274531, 7212886, 2681372, 2573488, 8933222, 14138593, 12671582, 9029141, 8368438, 8598864, 7732942, 9115416, 12792267, 12163396, 6231673, 4038455, 9404695, 13343158, 10019995, 7195726, 11096179, 14631055, 11842304, 10030202, 14977195, 18371428, 13667335, 9826881, 14275397, 17412565, 10782723, 5022593, 11086495, 19273247, 17267176, 13186656]
10505A3186656N431049O435943l726655l783028P800008P113230o293647m091826
10497B2071730J3706164J2225468r491650p604074K2349469K5190802r204654
10490F9243255o509012N9494651Q1716352k9305799j74639226j77251131l3548963
10483b10799873Q1767869O4196642k699531j0441279K1109143K0563616n591893
10476d1895306p022312J1896004J1539156m648606m052308R682886Q037333n265070
10468b1728223m068815Q440952P660609m649598n825333L949574M869971l194883
10460a4545746k981728M869029M405482l040341k177191N035262L253192n257948
10452a0439989m219754N134063N889725k965944n431144J467460L841075j911166
$$ y = [13186656, 18617705, 25053648, 21326993, 17543965, 25343973, 32457203, 26163556, 22071730, 35777894, 48003362, 38511712, 30907638, 53257107, 78447909, 69243255, 62734243, 122228894, 203945246, 174639447, 221, -177250910, -210799873, -129032004, -64835362, -67534893, -77976172, -56867029, -36303413, -41895306, -48917618, -37021614, -25482458, -30131064, -34183372, -24500486, -16463153, -21728223, -25797038, -17356086, -9695477, -14345075, -20170408, -16220834, -11350863, -14545746, -17527474, -12658445, -8252963, -11293304, -13470495, -8435233, -5182041, -10439989, -14659743, -9525680, -3635955, -6601899, -12033043, -10565583, -6724508, -8635674]
10444h635674l823049J640717M014683J5842j380673K180599K472843j931257
10436e445969k954219M02528M83876k819060j706581K933303K031755l781599
10428a0855966m281926J392181L357766j61253k21869M640390N182128o33816
10420a582365l507641k18566J224452k051881k345535K740892M460983j054645
10412b334306n262421k291657J513991J02216k110488J02519L229028K389355
10404d661763k30232o69658K54507O81712J388672K055552M18185k233370j613590
10395d609985J624246J998597j155404k210848P85584K918485J254020j121998
10387e17303j893059k457822k415235P64493M896317M272016n00015k348716O11208
$$ y = [-8635674, -12458723, -10818006, -6803323, -6787481, -8168154, -5987555, -3514712, -5445969, -8400188, -7997660, -7513784, -10332844, -12039425, -9106122, -7074367, -10855966, -15137892, -13745711, -10387945, -10549198, -10771067, -6130677, -948549, -1582365, -5090006, -5308572, -4084120, -6136001, -8481536, -5740644, -1279661, -2334306, -7596727, -9888384, -8374393, -8272177, -10382665, -10280146, -7051118, -4661763, -4891995, -5561653, -5307146, -4625434, -3236762, -1181210, -763025, -2996395, -4609985, -2985739, -987142, -2142546, -4353394, -3567810, -649325, 604695, -517303, -2410362, -4868184, -7283419, -6518926, -1622609, 2649407, 2149392, -199324, 411884]
10378D11884K071577j311604m490515l059454K31935J499860J232308P02038o56012
10369c367983j867099o41507J470705O35369j827220r43837K505732K597019q40340
10360b279161j376721K166816L013468j363374m249139j209312K630812J931621
10352g34990n90008p30193j01362j166878j672909L01581J666249K4116j443264
10343d447658J42457J836675K57434k330071k240972m30147K31703p4608R0332
10334f964855K34814j1754P77057K533800K543276K27863r86066P77655K541942
10325A673732J382822j262715k614726k216758p28842J244966J919487n6292k194600
10316b852926j029045J675152J331066j090299k95420L367410L607179o07393
$$ y = [411884, 2483461, 1171857, -3318658, -6378112, -6146177, -4646317, -3414009, -2711971, -3367983, -5235082, -5876589, -4405884, -3770515, -5597735, -6541572, -4035840, -1438821, -2279161, -3655882, -1489066, 1524402, 161028, -4088111, -5297423, -2666611, -734990, -1324998, -2055191, -2156553, -3323431, -4996340, -4694759, -3028510, -3004394, -4447658, -4305201, -2468526, -2211092, -4541163, -6782135, -7212282, -6980579, -7055187, -6964855, -6730041, -6741795, -5964738, -3430938, -887662, -659799, -1645865, -868210, 1673732, 3056554, 1793839, -820887, -3037645, -3766487, -2521521, -602034, -658326, -2852926, -3881971, -2206819, -875753, -1966052, -2261472, 1105938, 4713117, 4105724]
10308D105724k623801K22196J781878j740920m766370k149829K040440K028136
10300a102546l86564p86275j99934j330583k151761j57518J700047j0820k486045
10291f911999j344500J827739K697275J375556O17449L23416o46013o94902J147574
10282a608405J788906p67690k849978j147362J030218m45690k798954j182649
10274g981604K631610L595501K114924K004972K518521J63342l545096l880123
10266b377953j167603J01782n99947R6595J979458J347358j379815j519966J533355
10257a986736K749801j74425l073494k008943J469897L783287L658991J399856
10249E818234k133956m453049l155436J98569J583182N03261L86972K266544K747443
$$ y = [4105724, 1481923, 1704119, 3485997, 1745077, -3021293, -5171122, -3130682, -1102546, -1489110, -2275385, -2475319, -3805902, -5957663, -6115181, -4415134, -4425954, -6911999, -8256499, -6428760, -3731485, -2355929, -1738480, -1415064, -2061077, -2755979, -1608405, 180501, -587189, -3437167, -4584529, -3554311, -4000001, -6798955, -7981604, -5349994, -1754493, 360431, 2365403, 4883924, 5047266, 1502170, -2377953, -3545556, -3443774, -4043721, -3947126, -1967668, -620310, -2000125, -3520091, -1986736, 763065, 588640, -2484854, -4493797, -3023900, 759387, 4418378, 5818234, 3684278, -768771, -3924207, -3725638, -2142456, -1639195, -1252223, 1014321, 3761764]
10240C761764m9919k917946k433838M0057R12082n95498k413612k863890j919964
10231h480764m29374N76291O72907O52194J314340J887590J287424M41770J013077
10222a064545K121116J227130j518093k890228j333886Q49127J255902N90031
10214g63446M90851N64681l32079j560900j615567n57044L33473O85244J162651
10205a592136J806705J768786P82717k53847n14877k98057l74751p54486p41909
10196a71855j68598J58589l23488q46887k73089J131846J874292J180898k26240
10187B335468j385106k004725j868683n94721J328628K275968J184390r62548
10179C08671k057293j131872O00900R74537o82908k378440j599539J116151K333659
$$ y = [3761764, 3711845, 793899, -1639939, -1599882, -687800, -1283298, -3696910, -6560800, -8480764, -8910138, -8333847, -7660940, -7008746, -5694406, -3806816, -2519392, -2077622, -1064545, 1056571, 2283701, 765608, -2124620, -3458506, -2609379, -1353477, -763446, -272595, 292086, -39993, -1600893, -3216460, -3773504, -3440031, -2754787, -1592136, 214569, 1983355, 2766072, 2512225, 1997348, 1699291, 1324540, 570054, -171855, -340453, -181864, -505352, -1352239, -1625328, -493482, 1380810, 2561708, 2335468, 950362, -1054363, -2923046, -3517767, -2189139, 86829, 1271219, 308671, -1748622, -2880494, -2279594, -1305057, -1987965, -4366405, -5965944, -4849793, -2516134]
10170b516134M71977j548891m79356K257777K793707Q26631l34731N91722J183325
10161C246027j04365j460326j204593n34896j030614j947454j749413m38393R70886
10152d253141J706806J232518l44574j574620j241158m22493o86952r23407Q71371
10143e635650L341684L296113J089979q7642r8291j571279l427076j206353M457419
10134A58904O551557K007399l155891l093700m20879k39653j584805r11789N86332
10125a02525j50050j451110N696K277138J142396k022732k218707O00923J708701
10116b10270j23482j099719M97965J753822P34297o08288n55343k06871n46668
10107c64557o97828l30265n11594j172283p13287J031505K099379J308238l45442
$$ y = [-2516134, -2044157, -3593048, -4072404, -1814627, 979080, 1805711, 1470980, 2062702, 3246027, 3141662, 1681336, 476743, -58153, -1088767, -3036221, -4785634, -5224027, -4253141, -2546335, -1313817, -1658391, -3233011, -4474169, -4896662, -5583614, -6507021, -5635650, -2293966, 1002147, 2092126, 2004484, 1906193, 334914, -3092162, -4298515, 158904, 6710461, 8717860, 5561969, 2468269, 2047390, 1807737, 222932, -688857, -102525, -252575, -1703685, -1697989, 579149, 1721545, -301187, -2519894, -1918971, -210270, -333752, -1433471, -935506, 818316, 1552613, 944325, 388982, 182111, -364557, -1062385, -1392650, -1904244, -3076527, -3789814, -2758309, -658930, 649308, 303866]
10098C03866j391819j105741M94057J998097J185577j591839k552030J63340K728475
10089B31983J063067k489674k830127k99953P03308j15325J004066L845368L470792
10080D583505j099112m268653k486918N49273N49507q78011k92856J481742J678173
10071a83350O88388O16364J125259N50892o85805j161364j316475k086036k180191
10062d632318j3589K701981K610711l39785k518500j474939J115988K048029N21349
10053A8927j409994j568385m1246J208443Q00625n54424j284739r10847P2043
10044c669597J431128K863876L011468P50896k472834l517368j354495J422078
10036a534848J635027q72006l267944k875180k771K290809J623971o79044j260571
$$ y = [303866, -1087953, -2193694, -1699637, 298460, 1484037, -107802, -2659832, -2496492, 231983, 1295050, -1194624, -4024751, -4324704, -3621396, -3736721, -2732655, 1112713, 4583505, 3484393, -784260, -3271178, -2721905, -2172398, -3050409, -3343265, -1861523, -183350, 505038, 1121402, 2246661, 2797553, 2111748, 950384, -366091, -2452127, -4632318, -4645907, -1943926, 666785, 327000, -2191500, -3666439, -2550451, -502422, 18927, -1391067, -2959452, -3000698, -1792255, -991630, -1546054, -2830793, -3741640, -3669597, -2238469, 625407, 3636875, 4387771, 1914937, -1602431, -2956926, -1534848, 100179, -771827, -4039771, -6914951, -6917722, -4626913, -3002942, -3681986, -4942557]
10027d942557N23717J791012Q66693j19676O89551J347349k12351j795175m34050
10018b285487J945272J304038j458946j761275P78565J557402j159134l300322
10010d379887j763712R57733J488659O02574O32875J395680J621368J548759J450281
10001C554330K42159j993606k771028r58521Q48541L02814r25372k25214J460682
9992d65215J438522k16569j166419o44789J14454M05810M66017J13946p86451
9983g40694j246523n30129K24361l42242j428883j250254K10460J414192J502106
9974b187606P76613k05647o62232J97807J680999J745170J9018j106637j31947
9965A25538R34027j2756j310626l14835J696121J368813q50121j065278J605138
$$ y = [-4942557, -4418840, -2627828, -1761135, -1880811, -1191260, 156089, -56262, -1851437, -2285487, -340215, 963823, -495123, -2256398, -1477833, 79569, -1079565, -4379887, -6143599, -5185866, -3697207, -3094633, -2461758, -1066078, 555290, 2104049, 3554330, 3796489, 1802883, -968145, -1926666, -1078125, -775311, -1700683, -1925897, -465215, 973307, 756738, -409681, -1054470, -940016, -534206, -68189, 45757, -740694, -1987217, -2517346, -2292985, -2635227, -4064110, -5314364, -5103904, -3689712, -2187606, -1410993, -1616640, -2278872, -2081065, -400066, 1345104, 1364122, 257485, 125538, 1059565, 1046809, -263817, -578652, 1117469, 2486282, 1636161, 570883, 2176021]
9956B176021L226658J090779k156629k674823q89479k9532r87512j590649m13804
9947b248970J233045J462197K23582j096957j463708q81835J46833J132916J572333
9938G9436R43277p88074k636835l059320j420539J100028K519309K047160P35761
9929d79797M9417K11883L35974q1892m53625r1619O58900Q80416M18066K7672
9919A475395K24906P47456J205944J374054P39843j011952k710625k402876j67614
9910e25469J381353O73819m36338K73539J630667J031522j010320j588634k91445
9901A138694K14638j077731j806687n43124N82777l73587j646851o29815J804307
9892b337379K668103J220680o39823j395844r46208N37144K401632K825754P71756
$$ y = [2176021, 5402679, 6493458, 4336829, 1662006, 772527, 742995, -244517, -1835166, -2248970, -1015925, 446272, 669854, -427103, -1890811, -2772646, -2625813, -1492897, 79436, 1022713, 234639, -2402196, -5461516, -6882055, -5782027, -3262718, -1215558, -479797, -430380, -218497, 117477, 35585, -418040, -509659, 149241, 1029657, 1447723, 1475395, 1700301, 2447757, 3653701, 5027755, 5767598, 4755646, 2045021, -357855, -525469, 855884, 1529703, 1093365, 1366904, 2997571, 4029093, 3018773, 1430139, 1138694, 1353332, 275601, -1531086, -2074210, -1491433, -1865020, -3511871, -4141686, -2337379, 330724, 1551404, 911581, -484263, -1430471, -893327, 1508305, 4334059, 5105815]
9883E105815j784812j937300K05998K145401L179614M829337O715892N526554
9875B3986499j62643o691863r209355p040850l193683j90337J288995J056608
9867a56629m21311j154885L21617K285746J897736k37750p11593J153950J993574
9858D970455p6413k236060j605577J31205m7263j328578j036774J95133l04600
9849a338472j916836j439835J128946K337450J229637O72868J653205J249575
9841C576538j689747l640900k041302M00388L70958q28330m08543Q95064Q81304
9832b484570Q0644k1199k04672j055351l51736K652873L658358m90544n103262
9823c319459l770715J141636J894625j826765k286015L154931P099442L655397
$$ y = [5105815, 3321003, 1383703, 1589701, 3735102, 6914716, 11744053, 18459945, 23986499, 23823856, 17131993, 7922638, 881788, -2311895, -2502232, -1213237, -156629, -577940, -1732825, -1411208, 874538, 2772274, 2534524, 1822931, 2976881, 4970455, 4894042, 2657982, 1052405, 1183610, 1136347, -192231, -1229005, -1033872, -1338472, -3255308, -4695143, -3566197, -1228747, 890, 673758, 2326963, 3576538, 1886791, -1754109, -3795411, -3395023, -3024065, -3852395, -4260938, -3365874, -2484570, -2403926, -2425125, -2629797, -3685148, -4036884, -1384011, 2274347, 1783803, -3319459, -7090174, -5948538, -4053913, -5880678, -8166693, -5011762, 2087680, 5743077]
9815E743077k659065m312595j187703J639751K082966J613304P72942p63019j587995
9806A341663l49920J257515P75389j156824k232663k168199k039411j595752k01049
9797f369251J041008Q97696K65892K95253J21554q45556o58608J803030L483232
9788C4250J286500k263240k246478R33613K332250O98122J73262K597252L814898
9779G360429N99412l389028k787243J299641K979642J53994l061812k708448N1482
9770D98069J713296J326908M75448M5195n39919j347486j410529n67740j62797
9761C0445j078264k240861k063600n51156J031300J922111K202196J859705P21934
9752A833810q06447j895863k125818j520622j33671J629768K737344K468027J267135
$$ y = [5743077, 3084012, -1228583, -2416286, -776535, 1306431, 2919735, 3692677, 2929658, 1341663, 991743, 2249258, 3024647, 1867823, -364840, -2533039, -4572450, -6168202, -6369251, -5328243, -4430547, -4164655, -3869402, -3747848, -4593404, -5252012, -3448982, 34250, 1320750, -942490, -3188968, -2255355, 76895, 775017, 948279, 3545531, 7360429, 7959841, 4570813, 1783570, 3083211, 6062853, 6216847, 3155035, 446587, 498069, 2211365, 3538273, 4013721, 4058916, 3518997, 2171511, 760982, 193242, 30445, -1047819, -3288680, -5352280, -5903436, -4872136, -2950025, -747829, 1111876, 1833810, 1027363, -868500, -2994318, -4514940, -4648611, -3018843, -281499, 2186528, 3453663]
9743C453663K2937q37951r70449p1059Q62142j18289k809230l961405j631863
9734f061504J428189J584539j93183l05401J261901J144113j225762k367988n53306
9725e288402J515784J397533M25490N59437J080887O19015l22417r00302j483560
9716b396535j908087p69972J775713L114466J856099j39209j018778j334155j496535
9707b316993k03662K318775K946390L96902j895563r07557J081407M88094j548034
9698C59759j540456J86638N53233m62179k9382J965741K291702k12340k582875
9689E29841k087647L83719K187323J897913p8236j969841j722694O12303K103444
9680A856125N24257k212075k657058q51446K80077j78139l31781N63515R37787
$$ y = [3453663, 3476600, 2638649, 1668200, 1597141, 2459283, 2340994, -468236, -4429641, -6061504, -4633315, -3048776, -3241959, -3547360, -2285459, -1141346, -2367108, -4735096, -5288402, -3772618, -2375085, -1949595, -1390158, -309271, 309744, -12673, -912975, -2396535, -4304622, -5074594, -3298881, -184415, 1671684, 1532475, 513697, -820458, -2316993, -2520655, -201880, 2744510, 3141412, 1245849, 338292, 1419699, 1907793, 359759, -1180697, -994059, -440826, -903005, -932387, 1033354, 3325056, 3112716, 529841, -1557806, -1174087, 1013236, 2911149, 2832913, 863072, -859622, -247319, 1856125, 2380382, 168307, -2488751, -3340197, -3060120, -3238259, -3570040, -3006525, -2068738]
9671b068738K52515J96787J502313K375682J340682o12442j769559j628738l90727
9662h02225J408316K140142L09666k570855k771446O45566L847227L022649o79590
9653D549450l039597k248623k64906O28146L48210q1531l38417o79102j016236
9644b142606j038729q41192o37149m0112J397162K751558K097728p20203k786643
9635a960186j353177K099025L200529L39526l212936l636511j018820J722408
9627c820142K599202J712294M8538j228223j166719j9294Q56384Q42643O96954
9618E21637P45861J45410j090477j280436K48505J532761P77546q89770j380801
9609f69764p96831n28619n76380k2613Q08974Q21792J42675r6572N57564J600263
$$ y = [-2068738, -1816223, -1619436, -117123, 2258559, 3599241, 2986799, 1217240, -411498, -802225, 606091, 2746233, 3055899, 485044, -2286402, -1640836, 2206391, 5229040, 4549450, 1509853, -738770, -1003676, -375530, -27320, -108851, -447268, -1126370, -2142606, -3181335, -4022527, -4659676, -4699788, -3302626, -551068, 1546660, 826457, -1960186, -3313363, -1214338, 1986191, 2325717, -887219, -4523730, -5542550, -3820142, -1220940, 491354, 539892, -688331, -1855050, -1874344, -1017960, -175317, 521637, 1267498, 1412908, 322431, -958005, -709500, 823261, 1600807, 711037, -669764, -1466595, -1995214, -2571594, -2594207, -1785233, -963441, -820766, -917338, -359774, 1240489]
9599A240489K151362J138325j553156l533648j978916J738616K666616o96804
9591A172884l602778k008664J439801K206965J050237J365525K237191K51249
9583D112410l314279l630238m49685J264621k92729r61614J757599L948579J592942
9574D027606k679434l349882K6689K662045J343992j890560l088093j272171Q92767
9565c327041P26387j040415j302141J008216L207293K616696K90717q82842l45526
9556I51344J95257q9050m97234n30751j44253Q09931J506817J09143l007132m190694
9546d886622j601332J165400L84292j482234J64441L807450L845215l8156k249533
9537h91079m20716J437773L25380j435008j450717j131508j655463j220623P97449
$$ y = [1240489, 3391851, 4530176, 2977020, -556628, -2535544, -796928, 1869688, 1172884, -2429894, -4438558, -2998757, -791792, 258445, 1623970, 3861161, 4112410, 798131, -2832107, -3281792, -2017171, -2309900, -3271514, -1513915, 2434664, 4027606, 1348172, -2001710, -1975021, 687024, 2031016, 140456, -2947637, -4219808, -3327041, -2600654, -3641069, -4943210, -3934994, -727701, 1888995, 2179712, 1296870, 951344, 1146601, 1057551, 560317, 29566, -114687, 695244, 2202061, 2311204, -695928, -4886622, -6487954, -5322554, -4938262, -6420496, -6256055, -2448605, 1396610, 1358454, -891079, -1311795, 125978, 451358, -983650, -2434367, -3565875, -5221338, -6441961, -5644512]
9528e644512J681438K74054n45527P42208J165425j036579k350538J35996L116940
9519b461095K207600r01231j682646k77109j85763j472054r93428J462385K625396
9510a677945J328225j8219L9684J46980l65456J26714K270024L788831K508022
9501H146860n79487k716850k665743j505889q77183j232465j683102j281456k07287
9492d602602O89772J155444J354960Q05207q74622k258413j348741J109800J989593
9483a979602K53124j497631j100156K61766Q34982J163400J966439J818609k19894
9474A501037j859363o74345J720229J945849R3071q69116k20732k49453j702779
9465c15602k152808j47318J970699J404030q60234j533786J5670P60961j396236
$$ y = [-5644512, -3963074, -3689020, -4234547, -3492339, -2326914, -3363493, -5714031, -5578035, -2461095, -253495, -1154726, -2837372, -3114481, -3300244, -4772298, -5765726, -4303341, -1677945, -349720, -367939, -328255, -181275, -546731, -420017, 1850007, 5638838, 8146860, 7567373, 4850523, 2184780, 678891, -198292, -1430757, -3113859, -4395315, -4602602, -3912830, -2757386, -1402426, -597219, -1471841, -3730254, -5078995, -3969195, -1979602, -1726478, -3224109, -4324265, -4062499, -3227517, -2064117, -97678, 1720931, 1501037, -358326, -1032671, 687558, 2633407, 2726478, 1857362, 1636630, 1387177, -315602, -2468410, -2615728, -645029, 759001, -101233, -1635019, -1619349, -858388, -2254624]
9456b254624m002971l021106J273185M024726K219239j273338k049913j94001
9448e278803J095799J006660J193772J396576k78648k627759j874742J970172
9440c396973M091381K026711p75619r19839j1493n61679j267488k33518Q07375
9431b41142k43327j494618m22766J138149P6674k174079j862376O50723J676963
9422b895799L88749o15939l30143k42497m80338M38326J926518J685303M009m02518
9412e24329P77094Q98370p38739j546798k46901J095665J003099Q85611J697108
9403C300180J665057m65098k625682k190125L39985K338791K298077O28249j395296
9394C894138k296405j298401N01417J053258j8567j120170j296335j280304j489623
$$ y = [-2254624, -6257595, -9278701, -8005516, -3980790, -1761551, -3034889, -5084802, -5278803, -4183004, -3176344, -1982572, -585996, -864644, -3492403, -5367145, -3396973, 694408, 2721119, 1945500, 1025661, 1014168, 452489, -814999, -1048517, -241142, -484469, -1979087, -2401853, -1263704, -1187030, -3361109, -5223485, -4572762, -2895799, -2507050, -3122989, -3453132, -3695629, -4175967, -3737641, -1811123, -125820, -121811, -524329, 252765, 1151135, 412396, -1134402, -1381303, -285638, 717461, 1603072, 3300180, 4965237, 4500139, 1874457, -315668, 24317, 2363108, 4661185, 5289434, 3894138, 1597733, 299332, 800749, 1854007, 1835440, 715270, -581065, -1861369, -3350992]
9385c350992j089683R3306P24174J06604n70271k26939M77524O08021N27763Q67410
9375a833083J255156J142484O93686j0015j312133k668228k509624n16366J429798
9366d328325J785917J380249J482803J380042j25740j940611j867672j66448O27006
9357a772779k67334n78550J112248K498175Q43310k281539k610379N79469L077848
9348F00469J816416o80284m63618J550629J223323j863889l409348r38159K564839
9339D00378L193627J081224j177204k261907k028378k08178K220220K561246J0255
9330C791283k266814j466251M85026J31919j844012k016756L3994J485345J125099
9321e41167L83661j95170j414150k288075o86087K265309K600989m64075k871185
$$ y = [-3350992, -4440675, -4347369, -3623195, -3516591, -4086862, -4313801, -3836277, -3228256, -2700493, -1833083, -577927, 564557, 1258243, 1248228, -63905, -2732133, -5241757, -5758123, -4328325, -2542408, -1162159, 320644, 1700686, 1574946, -365665, -2233337, -2399785, -1772779, -2040113, -2618663, -1506415, 991760, 1835070, -446469, -3056848, -2477379, 600469, 2416885, 1736601, 1272983, 2823612, 4046935, 2183046, -1226302, -2164461, 400378, 3594005, 4675229, 3498025, 1236118, -792260, -1000438, 1219782, 3781028, 3791283, 1524469, 58218, 543244, 675163, -1168849, -3185605, -3151611, -1666266, -541167, -157506, -352676, -1766826, -4054901, -4740988, -2475679, 125310, -338765, -3209950]
9312c209950j715686P60278J260433K29702L4233R82290J781366J989269J687113
9303C799048M28738j414050j979720o38590L32030j019264l015849k699675k11015
9294f418347J688099J642704Q77558P94755J471090K292220K412509R90666j496687
9285D254567k796288j429342Q90148J234300n81271j956796j203858O63634J839672
9276I14766J563091q7629k354619l402149j645219J775000L439304J528634j950094
9267b18915l667992k601265k89569J463171K031861J770143J374030J190672P60733
9258A812869l97141j455399r72258O47157J056645n99562j950934q69852R80434
9249a748041O11377j457656k019900m14765O25899j53225m66118J274160L009393
$$ y = [-3209950, -4925636, -4165358, -2904925, -2675223, -2640990, -1658700, 122666, 2111935, 3799048, 4227786, 2813736, 834016, 195426, 527456, -491808, -3507657, -6207332, -6418347, -4730248, -3087544, -2209986, -1415231, 55859, 2348079, 4760588, 5751254, 4254567, 1458279, 28937, 919085, 2153385, 1572114, -384682, -1588540, -924906, 914766, 2477857, 2390228, 35609, -3366540, -5011759, -3236759, 202545, 1731179, -218915, -3886907, -6488172, -6777741, -5314570, -3282709, -1512566, -138536, 1052136, 1812869, 1415728, -39671, -1011929, -364772, 691873, 92311, -1858623, -2728475, -1748041, -1136664, -2594320, -4614220, -5028985, -4403086, -4556311, -5022429, -3748269, -738876]
9240g38876K530688J075910P73583Q58022n32376k578774k971412j608325j43326
9231c334886R57988J918780J524599j048012l319312k237722Q02209J671899p3527
9222c137984q12965Q70774K087566Q70775p62869o61270K61213N14502M92698
9213b77560P02521M83229l0585L95102J281175O03976j159851r90710J307214
9204B314511J962571o16330k960760k270234o27175n57287p05438O51103J848935
9195i60104J230685M02457N16511n05085l170147l549032R3558K710345K93338
9186b937474k537818J10424M672295L328203k743566m723076o5613M150770K815723
9177B069868o75570j700472q88640l03215P64562K799508L555599J606992j122180
$$ y = [-738876, 1791812, 2867722, 3641305, 4499327, 3966951, 1388177, -1583235, -3191560, -3334886, -2376898, -458118, 1066481, 18469, -3300843, -5538565, -4736356, -3064457, -3137984, -3950949, -3080175, -992609, -121834, -884703, -1545973, -1284760, -770258, -277560, 424961, 908190, 877605, 1272707, 2553882, 3157858, 1998007, 1007297, 2314511, 4277082, 3660752, 699992, -1570242, -2197417, -2754704, -3460142, -2809039, -960104, 270581, 673038, 1189549, 684464, -2485683, -6034715, -5941157, -3230812, -2937474, -5475292, -5364868, -692573, 2635630, -107936, -4831012, -4896625, -745855, 2069868, 1394298, -306174, -1194814, -1498029, -733467, 2066041, 5621640, 7228632, 6106452]
9168F106452k446444k356847j277590O01906J604605N3161k104140j378796J351183
9159A53490J826941m36261j428360K30464J325245M70226L78880J817592J475626
9150E813843j581526l377128j943022p86094j963669j804600K028926M981197
9142A367927K561853j918567k498357K92272J456548j12537j249350o76903r9222
9133h76336j83745m6586J18878k51805O7956J956176L123645J218256j652342
9124C474097j484802J486646L060431J004370k576811m512936l584125p98724
9116c931854J256424L84996k143267k313679R79615L688156K559653J40479K67093
9107H87616J741666J143251p10876o08743N55602q13866l797052l402779J156968
$$ y = [6106452, 3660008, 1303161, 25571, 627477, 2232082, 2285243, 181103, -1197693, 153490, 1980431, 1544170, 115810, 346274, 1671519, 2141745, 2520625, 4338217, 5813843, 4232317, 855189, -1087833, -1873927, -3837596, -5642196, -3613270, 1367927, 3929780, 2011213, -487144, -194872, 1261676, 1149139, -100211, -777114, -876336, -1060081, -1106667, -987789, -1239594, -1171638, 784538, 3908183, 5126439, 3474097, 1989295, 3475941, 6536372, 7540742, 4963931, 450995, -3133130, -3931854, -2675430, -2290434, -4433701, -6747380, -5767765, -2079609, 480044, 620523, 887616, 2629282, 3772533, 3061657, 2452914, 3008516, 2194650, -1602402, -5005181, -3848213]
9098c848213M504114L064429j36389r60312J1954Q2471o81009n81313R155n70647
9088H94240j983081k226121q40726M36052L23099l16845L8119J297259J743299
9079f34705K61742k016156k922261j864904k50641P27060J338848J905506J752902
9070a702609O22337k95928j8826P59734J081417J238824J502174R17562p81575
9061C323110j602855k2855J884064Q74668k408969l805917j400533J821880K230618
9052H93211L28771n51638P58823J733727j8155l007495l556052q61931J698001
9043b582738J247688n94296m60191J509152K099551J58493j898252j954727o03318
9034c078638Q46177J925354J949011K69506j689716j552215J95669O23382q16073
$$ y = [-3848213, 655901, 3720330, 3583941, 2623629, 2635583, 2718054, 2037045, 1455732, 1464887, 894240, -1088841, -3314962, -4155688, -3719636, -3396537, -3713382, -3675263, -2378004, -634705, -372963, -2389119, -5311380, -7176284, -7426925, -6699865, -5361017, -3455511, -1702609, -1080272, -1376200, -1395026, -635292, 446125, 1684949, 3187123, 4104685, 3323110, 1720255, 1697400, 3581464, 4456132, 2047163, -1758754, -3159287, -1337407, 893211, 1221982, 670344, 1429167, 3162894, 3144739, 137244, -3418808, -4280739, -2582738, -1335050, -1929346, -2389537, -880385, 1219166, 1377659, -520593, -2475320, -3078638, -2232461, -307107, 1641904, 1911410, 221694, -1330521, -1134852, -511470, -1327543]
9025a327543j489311m01950L22520j7942O91325K434846J785573j700846k985377
9016b688705P46020M665236L289726j201829k861285q64856R34314Q11682J50482
9007B980785n50553j723563k278619j333398n76499j096267n50565K306231L728850
8998I06402Q22892k379624j047155J740878P0400l857818k874824K464124M166353
8989A1628K06025k281333N68424L194823Q21367k581012j747633J327003K019034
8980A538326Q08042O01042O46976j185979l309971k886623r29781k43573m21352
8971e382893O75998K306439K023117J31886r47647p48082o31435n24798P67069
8962b330346K568975K875370J638871O81167M67858k91427j656703j729766K14280
$$ y = [-1327543, -2816854, -3218804, -2896284, -2914226, -2222901, 211945, 1997518, 296672, -2688705, -1942685, 2722551, 6012277, 4810448, 1949163, 1084307, 2018621, 2830303, 2980785, 2430232, 706669, -1571950, -2905348, -3481847, -4578114, -5128679, -2822448, 906402, 1729294, -650330, -1697485, 43393, 113793, -3744025, -6618849, -4154725, 11628, 217653, -2063680, -1495256, 1699567, 2520934, -60078, -1807711, -480708, 1538326, 2346368, 2947410, 3594386, 2408407, -901564, -3788187, -4717968, -4961541, -5382893, -4706895, -2400456, -377339, -245453, -1193100, -1941182, -2572617, -3097415, -2330346, 238629, 3113999, 4752870, 5434037, 5901895, 5610468, 3953765, 2223999, 2438279]
8953B438279J917203R05921j948782l193772j170257J647709J741071p09794k068122
8944d40544m84475J519317J119697o13093j095157o87417j347352k288071j046976
8935e364071J685624K524018Q61678j73680J057252K361194J678092q4640j382774
8926C162693k014685j685155K35688K433589K309209j873j461963r27822n72469
8917A477212j402580j297768P40642K220285J248317m40627q11866o39695j009343
8908H4577r06827K92855R77928L12955M4741R55630Q30844j341987k549013l79777
8898a678074K568587K468341j30146j979811k091209j510493l51332J343580J725020
8889C64463k66333k143373j215850J003574J313021P1582M7401J339028J543933
$$ y = [2438279, 4355482, 5261403, 3312621, 118849, -1051408, 596301, 2337372, 1627578, -440544, -925019, 594298, 1713995, 1100902, 5745, -681672, -2029024, -4317095, -5364071, -3678447, -1154429, -292751, -466431, 590821, 2952015, 4630107, 4545467, 3162693, 1148008, -537147, -301459, 2132130, 4441339, 4439466, 2977503, 2049681, 1477212, 74632, -1223136, -482494, 1737791, 2986108, 2545481, 1733615, 1093920, 84577, -822250, -529395, 448533, 761488, 806229, 1761859, 2592703, 1250716, -1298297, -1678074, 890513, 3358854, 3228708, 1248897, -842312, -2352805, -2704137, -1360557, 364463, 98130, -2045243, -3261093, -2257519, -944498, -872916, -825515, 513513, 2057446]
8880B057446K69825m80838k00014n04222j724016k056902n67113J464554K480558
8871G39278K016170L40489j493121j841189m88190M85543k90542j008453M41481
8862a098534K610373K406986k05558k406562k586657j342762O84884K834405L067629
8853C964204J02370l359927l064449Q69626L728348K527304m58987j494775j45827
8844B667887J116375L82752j795846l159646k039325N67047J804025O17329p30597
8835e69999j57162J040326O87662m05434j52658O77937k78805k372253k520779
8826d051165l25052J262885P57900j04416j01514k61344p88277K066K027848K256039
8816F74970n90226l195849k166024J100295K873724K427497J817682J693832O55570
$$ y = [2057446, 2327271, 1846433, 1646419, 1142197, -581819, -2638721, -3205834, -1741280, 739278, 2755448, 3095937, 1602816, -238373, -726563, -241020, -531562, -1540015, -1098534, 1511839, 3918825, 3713267, 1306705, -1279952, -2622714, -1937830, 896575, 3964204, 4066574, 706647, -2357802, -1488176, 2240172, 4767476, 4308489, 2813714, 2667887, 3784262, 4167014, 2371168, -788478, -2827803, -2260756, -456731, 160598, -569999, -727161, 313165, 1000827, 595393, 442735, 1120672, 841867, -1530386, -4051165, -4376217, -3113332, -2355432, -2459848, -2561362, -2822706, -3610983, -3608917, -1581069, 674970, 84744, -3111105, -5277129, -4176834, -1303110, 1124387, 2942069, 4635901, 5291471]
8807E291471j503153k820590j987850j49020Q05600M27046l67346o22171j46798
8798a072811M28300K18736q31738j556054q94788N51380J209033P68282N49819
8789f29841J201348J366919j47987j938706j656189K74076R63441m78637j446435
8780b492011j80374J124955Q2474j437302l20950J973218J321971j797849k305648
8771d031516J143524L250155K30971l910205l376530P28964K575286L63574k038819
8762e064596j506449P06683K018752J798262R44617N10773J051356J793505J029895
8753C282798j139374j890282L33460K688551J790553r40308j550585K1610K21628
8744B818051j772045k727375j108815M01936k27061j015803J89484J810867J268198
$$ y = [5291471, 3788318, 967728, -1020122, -1169142, -363542, 63504, -303842, -926013, -1072811, -644511, -425775, -1257513, -2813567, -3708355, -3156975, -1947942, -1179660, -629841, 571507, 1938426, 1790439, -148267, -1804456, -1530380, -566939, -1045576, -2492011, -2672385, -1547430, -1464956, -2902258, -3223208, -1249990, 71981, -1725868, -4031516, -2887992, 362163, 593134, -3317071, -6693601, -5964637, -3389351, -3025777, -5064596, -6571045, -5864362, -3845610, -2047348, -1102731, -591958, 459398, 2252903, 3282798, 2143424, 253142, 586602, 3275153, 5065706, 4125398, 2574813, 2596423, 2818051, 1046006, -1681369, -2790184, -2388248, -2615309, -3631112, -3441628, -1630761, -362563]
8735c62563p36174j470872k01823J492968K373429K334029J329755m45167j668154
8726B645428j008021P85891J361679k61045k229507k081278J01216J751602J193255
8717B259220j94034k63897M13275m63265k610963k791551R3681K535307J416602
8708C94375j063103q10986J595215J873465j015427l188178j855352P62698J262664
8699b044629o4309m54058R52376K238293J668901j41969j215746o24605M52093
8690G66347J79134j599529l080135k665553o14860J610444K591996J539207p82751
8681b055700j711426M38499L009992J718523k576472l986520k64365L432716K618661
8672F23908K68591P40406J762270q29916m140704k224312K978226L666931j034841
$$ y = [-362563, -1098737, -2569609, -2771432, -1278464, 1094965, 3428994, 4758749, 4313582, 2645428, 1637407, 2423298, 3784977, 3523932, 1294425, -786853, -685637, 1065965, 2259220, 2065186, 1801289, 2214564, 1751299, -859664, -3651215, -3557534, -1022227, 394375, -668728, -1479714, 115501, 1988966, 973539, -2214639, -4069991, -3307293, -2044629, -2108938, -2562996, -1610620, 627673, 2296574, 2154605, 938859, 314254, 766347, 945481, -654048, -3734183, -6399736, -7014596, -5404152, -2812156, -1272949, -2055700, -3767126, -3328627, -318635, 1399888, -1176584, -5163104, -5427469, -1994753, 623908, 892499, 1632905, 3395175, 2565259, -1575445, -3799757, -821531, 2845400, 1810559]
8663A810559l441217j7292L175685J136169k049491q16852K772314L331781P30321
8654F631977j394099k135008k879424k990805r83111J730938K490519J370878
8646A841865J76820p54030j644157j324236N51664J542438M2691j434650k42834
8637a244429J536552N30385j660142o79880L080700M432492J129879k981961l750814
8628C92782j872881n58137q54983j300152o25911Q77906K101946K281327J542780
8619A984677M97497n79169j605011j832379m35275J680513K235954N56149j296211
8610A206745j260539K96852J716540K041291J118004n77134j537232n67860R63576
8601C400243N58092j351199j807752l94219m3840j541387j641345J071067K979069
$$ y = [1810559, -1630658, -1647950, 1527735, 2663904, 614413, -202439, 2569875, 5901656, 6631977, 5237878, 3102870, 223446, -2767359, -3750470, -2019532, 470987, 1841865, 2018685, 1264655, -379502, -1703738, -1152074, 390364, 433055, -1001595, -1244429, 292123, 822508, -837634, -1517514, 1563186, 5995678, 7125557, 4143596, 392782, -1480099, -2038236, -2893219, -4193371, -4819282, -3941376, -1839430, 441897, 1984677, 2482174, 1903005, 297994, -1534385, -1969660, -289147, 1946807, 2502956, 1206745, -53794, 243058, 1959598, 4000889, 5118893, 4541759, 3004527, 2436667, 3400243, 3958335, 2607136, 799384, 405165, 361325, -1180062, -2821407, -1750340, 1228729]
8592A228729J288635j231428j233979l79602j361145k256828k98702K059128R74078
8583a211114j502655o15615K504482K589884l57363r60666J911360L006053j24604
8574E239762k902718j636473N69550k99001k431642j817216J061740K643527K014522
8565B442051J182390J061451O29830n67508j666932j990601j682384j130396o09938
8556b332037l858J260095K984437L304534R00766k186636k500102n2808J549546
8547B923937L78306j434957j542290n86224p8281K27799J010291J558782J047779
8538C505142K1819o83815j012956r20215k99795j13801j376404k711007j726434
8529e317466P24420J104928j039849j800591Q46702L537609K922976Q11516M88215
$$ y = [1228729, 2517364, 1285936, 51957, -327645, -1688790, -3945618, -4244320, -2185192, -1211114, -2713769, -3329384, -824902, 1764982, 1407619, 446953, 2358313, 5364366, 5239762, 2337044, 700571, 1270121, 971120, -1460522, -3277738, -2215998, 427529, 2442051, 3624441, 4685892, 5315722, 4748214, 3081282, 1090681, -591703, -1722099, -2332037, -2335895, -1075800, 1908637, 5213171, 6113937, 3927301, 1427199, 1374391, 2923937, 3302243, 1867286, 324996, -261228, -339509, -111710, 898581, 2457363, 3505142, 3526961, 2843146, 1830190, 909975, 610180, 496379, -880025, -3591032, -5317466, -4593046, -3488118, -4527967, -6328558, -5481856, -1944247, 978729, 1790245, 2278460]
8520B278460J168111K09410j642279j666598k08311Q8150q58998p23389O10813
8511g44631P28569p78812j317986K94346J752378R14112j091892j875207r50235
8502c069358M50814J281332J235069M27103n80698j072591q94750l34141N56294
8493b000926J619509J934081Q11868p07157q54603L10974R19887J50789n94928
8484A589494j02064O31726N4906j299707j452679M5624J364894J023351o9610
8475A785935k15802L81193J54380r29374j120884n6962J78695j331163k015694
8466c169676K44090K778291J506217k315548l269497j0704K523734Q49703j773298
8457b636688r03838K056446K556120J06232j654703q94431N19622P24797o864
$$ y = [2278460, 3446571, 3655981, 2013702, 347104, 138793, 226943, -632055, -1355444, -744631, -16062, -794874, -2112860, -1818514, -66136, 847976, -243916, -2119123, -3069358, -2618544, -1337212, -102143, 324960, -255738, -1328329, -2223079, -2557220, -2000926, -381417, 1552664, 2364532, 1657375, 802772, 1113746, 2033633, 2184422, 1589494, 1487430, 2119156, 2174062, 874355, -578324, -532700, 832194, 1855545, 1785935, 1570133, 1951326, 2105706, 1176332, 55448, -1514, 177181, -1153982, -3169676, -2925586, -147295, 1358922, -956626, -4226123, -4236827, -1713093, -863390, -2636688, -3540526, -1484080, 1072040, 1178272, -476431, -1370862, -851240, -126443, -133307]
8448a33307r08517j649516j538352k07131R92002N49874m61316M12049L091334
8439A47120M514167K396866k145966n719401n324412q54769L812564L898094l08107
8430D16156k839513n3059L595210J940578l262312m885856j351912J684857R25850
8421c830001k44646J008629K055924N70926n88637J239329L021445J016269k473548
8412A775690k779641n04472J50694j205573j165662R37017K043364R70574j9387
8403B02604J72732j00941j247824j147705P24719J750587M92850q72626m20696
8394d46300L98576j92738r70359j77944R70273L78197r25487k27281K118716K717945
8384C643598K33067k422424k112230M29207K096169J602572L10723n03785j160858
$$ y = [-133307, -1041824, -2691340, -4229692, -4436823, -3444821, -2894947, -3356263, -2944214, 147120, 4661287, 7058153, 4912187, -807214, -6131626, -6986395, -3173831, 724263, 416156, -2423357, -2476416, 1118794, 3059372, -202940, -5088796, -6440708, -4755851, -3830001, -4074647, -3066018, -1010094, -439168, -1027805, 211524, 3232969, 4249238, 1775690, -1003951, -1508423, -1357729, -2563302, -3728964, -2791947, -748583, 221991, 202604, 375336, 274395, -973429, -2121134, -1396415, 354172, 847022, -25604, -446300, -47724, -240462, -1210821, -1388765, -418492, -40295, -965782, -1193063, 925653, 3643598, 3876665, 1454241, -657989, -228782, 1867387, 3469959, 3780682, 3276897, 2116039]
8375B116039j976513j966554m52155J140631Q52808q07308j347186K2581J218222
8366a199435O59041k08842N62362J957377J393211j135190k751548j697588M03816
8357b016796R59881l49565j582783j027373R41276K277759J503995m19825j089611
8348h03042K04854J497138J050765k18414n92424l13852n03511o09881N39544
8339B51177J994702J754994J33060p39741m53261m05280o00064K35013J247381
8330C417981M3777k613596k842826J49153K114059L41138j894110p15256K103892
8321A04212K347181J10536j117721l48400M03900M31384Q20390J189493J03326
8312D044301j450999j054245O38649N42986j296971j220108J781688L701760J628185
$$ y = [2116039, 139526, -1827028, -2279183, -1138552, -285744, -1093052, -2440238, -2417657, -1199435, -540394, -749236, -186874, 1770503, 3163714, 2028524, -723024, -2420612, -2016796, -1056915, -1406480, -2989263, -4016636, -3075360, -797601, 706394, 286569, -803042, -598188, 898950, 1949715, 1731301, 1138877, 825025, 321514, -288367, 251177, 2245879, 4000873, 4133933, 3394192, 2940931, 2535651, 1935587, 2170600, 3417981, 3461758, 848162, -1994664, -1845511, 268548, 609686, -1284424, -1999680, 104212, 2451393, 2561929, 1444208, 1095808, 1499708, 1931092, 2751482, 3940975, 4044301, 2593302, 1539057, 2177706, 2720692, 1423721, 203613, 1985301, 5687061, 7315246]
8303G315246j615712j894142J80179J001693k96542j442158j257850q88254j004651
8294I7809p37275J55852M15689n39258j252018j75553J933061K630315O43990
8285C172612k445372l592097j428428K079987L553499J896966n49887r81378M79250
8276B185152J305993J43217j468788j405866R5047R83050M54733j01812L55870
8267B546596O89452l27468j394428m66662J417255J061210j648216k680359K26376
8258e76244L582478K944548n74779k239909p87078N48218j52446r09918o3678
8249A771192P48760j94967j438971p75076J007956J331731k52866j604415j148353
8240e55009K17086O07210l84633j163843j37247J885809K211043r4315k331347
$$ y = [7315246, 5699534, 3805392, 3985571, 4987264, 4690722, 3248564, 1990714, 1102460, 97809, -639466, -483614, -67925, -607183, -1859201, -2034754, -101693, 2528622, 3172612, 727240, -2864857, -4293285, -2213298, 1340201, 3237167, 2687280, 1705902, 2185152, 3491145, 3634362, 2165574, 759708, 854755, 1837805, 2292538, 2190726, 2546596, 3236048, 2908580, 1514152, 1047490, 2464745, 3525955, 1877739, -802620, -576244, 3006234, 5950782, 5376003, 3136094, 2349016, 2897234, 2744788, 1834870, 1771192, 2519952, 2324985, 886014, 110938, 1118894, 2450625, 2197759, 593344, -555009, -337923, 269287, -115346, -1279189, -1416436, 469373, 2680416, 2586101, 254754]
8231B54754j662290O23973R22239j162612k280044o13191J590559J809571N66258
8222D9217m46129p87467k83828J600819L613119K798412r91364l454879j508461
8213E89439J893920J912199j222989l135882j903005J49833Q17254N75689M68921
8204A45379L63872m2338n41840j078163j527392j090069M79489J697428J284128
8195c09506M41574J016324K261119J975016J91839j009586r08163n68009k86973
8186B803635M30634P02978p08240k375992j702041M96304P50326j211117j636507
8177b450020R16068K773314J012102j744404j511724J123728K648024J871717
8169D638805J70196j633535l196777k978081k15268K382109J496007j697895k786907
$$ y = [254754, -1407536, -783563, 138676, -1023936, -3303980, -3917171, -2326612, -517041, 49217, -396912, -1184379, -1468207, 132612, 3745731, 6544143, 5552779, 2097900, 589439, 2483359, 4395558, 3172569, 36687, -1866318, -1716485, -899231, -323542, 145379, 509251, 466913, -74927, -1153090, -2680482, -3770551, -3291062, -1593634, -309506, 132068, 1148392, 3409511, 5384527, 5576366, 4566780, 3658617, 3090608, 2803635, 3234269, 3937247, 3229007, 853015, -849026, -352722, 397604, -813513, -2450020, -1533952, 1239362, 2251464, 507060, -1004664, 119064, 2767088, 4638805, 4809001, 3175466, -21311, -2999392, -3214660, -832551, 663456, -1034439, -3821346]
8160c821346m82987J741315J018759j148662j847466q43101J27734L59356N12109
8151d384289Q63634Q91106L73890j19731J21499J189984K307667K344486J004482
8142D592728o28901j295918j032642o78413l88955J23712K52978q52772k251699
8133b159882j846647L23423J511819J80659j488227q11653J320679J975730O84006
8124c10093l71401k70186m25929j275667q78684J729984M151394L595790O94388
8115F639596j645758k065008j460660p56185o7581L29420J38350o5955K23124
8106A269343N7326j419267k484498n36607L498128N317853K895361o04364j273508
8097F719767L49202Q47090q14670k342549k016128r80883j029680j853591j667536
$$ y = [-3821346, -4304333, -2563018, -1544259, -2692921, -4540387, -5383488, -5255754, -4896398, -4384289, -3520655, -2629549, -2255659, -2375390, -2253891, -1063907, 1243760, 3588246, 4592728, 3963827, 2667909, 1635267, 956854, 567899, 691611, 944589, 91817, -2159882, -4006529, -3683106, -2171287, -1990628, -3478855, -4290508, -2969829, -994099, -310093, -681494, -951680, -1377609, -2653276, -3531960, -1801976, 2349418, 5945208, 6639596, 4993838, 2928830, 1468170, 711985, 644404, 973824, 1112174, 1046219, 1269343, 1326669, -92598, -2577096, -3113703, 384425, 5702278, 8597639, 7993275, 6719767, 7068969, 7916059, 7101389, 4758840, 2742712, 1761829, 732149, -1121442, -2788978]
8088b788978J04554J848592J724449R7133q00134K00497J664085J788672R96172
8079D835042O66245L68542j101812k477682j131980K132820L019764m9049l103984
8070C157906k365804K87215P18942j104574j898229n78561R08098J476504J877493
8061B478990K017863Q28824r71809j223100M8760L17515j341379k572464j296716
8052a713516J312156K679483J953912J61965j412306k009968j485791l31214Q12804
8043c2475J629024J711935N18210j369455k109029j076574q6037m35981n25413
8034a775795J151709K576504J203240j172670q08178J574291J612188j364638
8026B996651k939984p72423J710765R90995j330032j766841r9648J548420K167081
$$ y = [-2788978, -2684424, -835832, 888617, 985750, 185616, 386113, 2050198, 3838870, 4835042, 5501287, 5869829, 4768017, 2290335, 1158355, 3291175, 6310939, 6261890, 3157906, 792102, 1079317, 1798259, 693685, -1204544, -1783105, -875007, 601497, 2478990, 4496853, 5325677, 4353868, 3130768, 3179528, 3497043, 2155664, -416800, -1713516, -401360, 2278123, 4232035, 4394000, 2981694, 971726, -514065, -845279, -32475, 1596549, 3308484, 3826694, 2457239, 348210, -728364, -814401, -1250382, -1775795, -624086, 1952418, 3155658, 1982988, 1174810, 2749101, 4361289, 2996651, 56667, -715756, 995009, 1986004, 655972, -1110869, -1210517, 337903, 2504984]
8017B504984J784541J94592j852002k213981k70452J653319J601153N79441N3349
8008D034944o45803k184841k908847j297401J143077J965847J176152L29897q4295
7999A528730k17687M20133J602423J492995o22737k412804j594099O67835J683439
7990B548228R49407k13404j037177j207025j61717J475914J732106M19355n1159
7981D454528J012415P18933k196772m001203j652204J716835J806753L34730J348696
7972C542711L112593P89089m123496m810308k2646L595569J910401r78104m80046
7963B535763J296068M07752j821623j617271O06953J388281J06723p09178p0401
7954B123067K98257o04434j418789p13152R79560J960542J304680j86718p70177
$$ y = [2504984, 4289525, 4484117, 2632115, 418134, 147682, 1801001, 3402154, 3981595, 4034944, 3389141, 1204300, -1704547, -3001948, -1858871, 106976, 1283128, 1613025, 1528730, 1311043, 1731176, 3333599, 4826594, 4203857, 1791053, 196954, 864789, 2548228, 3497635, 3284231, 2247054, 1040029, 878312, 2354226, 4086332, 4505687, 4454528, 5466943, 6185876, 3989104, -12099, -1664303, 52532, 1859285, 2194015, 3542711, 6655304, 7444393, 3320897, -1489411, -1512057, 2083512, 3993913, 3015809, 2535763, 3831831, 4239583, 2417960, 800689, 1407642, 2795923, 2902646, 2193468, 2123067, 2421324, 1816890, 398101, -315051, 664509, 2625051, 3929731, 3743013, 2972836]
7945B972836J56750R91795k9308k044109k485326p71399Q93608P28219o06285
7936a93219j659800j864532j006056R24608K677858K521714P20482o63301p95351
7927F62403o67989m71291P39250K153842J350008j386419k338551O3165K280749
7918B385167R68026j754860j682671J096501K942765K376142J269286Q67655J49197
7909H617208j489176k689523k122040k95322J200256J175731m84366k634800l464382
7900b186414k113315M77811K704730L567245K584825o8361k642564k786134o23687
7891a085864Q67868n1633j334968n27519J268128J356253j11058o15112N86507
7882C52602J722730J689303J250243Q72973j73636j927898k881370j875731L24731
$$ y = [2972836, 3129586, 4121381, 4092073, 2047964, -437362, -1208761, -315153, 413066, -193219, -1853019, -3717551, -4723607, -3798999, -1121141, 1400573, 2121055, 1457754, 662403, -5586, -476877, 262373, 2416215, 3766223, 2379804, 41253, 104418, 2385167, 3353193, 1598333, -84338, 1012163, 3954928, 6331070, 7600356, 8468011, 8617208, 7128032, 4438509, 2316469, 2021147, 3221403, 4397134, 3912768, 1277968, -2186414, -4299729, -3821918, -1117188, 2450057, 5034882, 4966521, 2323957, -462177, -1085864, -217996, -269629, -1604597, -2132116, -863988, 492265, 381207, -233905, 352602, 2075332, 3764635, 5014878, 5887851, 5714215, 3786317, 904947, -970784, -646053]
7873f46053J905199J731558J83399j109965p13360Q18108J318149j05134j706888
7864A675013j658067n54291Q7116L39590R17984J069078j92398j693231j481940
7855a491146R595O85807K33949K94825J349536J929868J088960m71755j828652
7846A800987k491123j828685J66297J820614J492564o1402r89820j157416j319972
7837b567956p20715J351912K702933Q03367k401866k596613J58520J561601L26063
7828a382754l0647J998626K848642K13583k606518k065306K64755J300961J412005
7819A953347J895111J370748r34387j918357N20130K672012N11510l026741k483804
7810E59569Q31685J095033j815816k114139J663483M021588J872226p58159l74301
$$ y = [-646053, 1259146, 2990704, 3174103, 2064138, 1350778, 2168886, 3487035, 3381901, 1675013, 16946, -537345, -450229, -110639, 807345, 1876423, 1684025, -9206, -1491146, -1481551, -795744, -561795, -266970, 1082566, 3012434, 4101394, 3629639, 1800987, -690136, -2518821, -2352524, -531910, 960654, 899252, -90568, -1247984, -2567956, -3288671, -1936759, 766174, 1569541, -832325, -3428938, -3270418, -1708817, -1382754, -1413401, 585225, 3433867, 3647450, 1040932, -1024374, -759619, 541342, 1953347, 3848458, 5219206, 4284819, 2366462, 2886592, 5558604, 6070114, 3043373, 559569, 1391254, 2486287, 670471, -1443668, 219815, 4241403, 6113629, 5355470, 4981169]
$$ [...]
##END NTUPLES=NMR SPECTRUM
##END=
