##TITLE=31Pdec_LR-618-C2-Tol
 CDCl3, 124 sc
 9.11.2021
##JCAMPDX= 6.0         $$ Bruker NMR JCAMP-DX V2.0
##DATA TYPE= NMR SPECTRUM
##DATA CLASS= NTUPLES
##ORIGIN= UXNMR, Bruker Analytische Messtechnik GmbH
##OWNER= root
$$ XWIN-NMR		Version 3.5
$$ Tue Nov  9 12:22:17 2021 Russian Standard Time (UT+4h)  she@DPX200
##.OBSERVE FREQUENCY= 81.013821
##.OBSERVE NUCLEUS= ^31P
##.ACQUISITION MODE= SIMULTANEOUS
##.ACQUISITION SCHEME= undefined
##.AVERAGES= 124
##.DIGITISER RES= 16
##SPECTROMETER/DATA SYSTEM= spect
##.PULSE SEQUENCE= zgpg30
##.SOLVENT NAME= CDCl3
##.SHIFT REFERENCE= (INTERNAL, CDCl3, 0, 248.564)
##AUDIT TRAIL= $$ (NUMBER, WHEN, WHO, WHERE, WHAT)
$$ ##TITLE= Audit trail, XWIN-NMR		Version 3.5
$$ ##JCAMPDX= 5.01
$$ ##ORIGIN= Bruker BioSpin GmbH
$$ ##OWNER= she
$$ F:/spectra/data/she/nmr/P31/1/pdata/1/auditp.txt
$$ ##AUDIT TRAIL=  $$ (NUMBER, WHEN, WHO, WHERE, WHAT)
(   1,<2021-11-09 12:21:09.67 +0400>,<she>,<DPX200>,
      <continue with go, POWCHK disabled, PULCHK disabled
       configuration hash MD5:
       00 E9 B6 7A A2 85 ED C7 34 08 36 98 17 FE 4E 26
       data hash MD5: 32K
       00 81 88 23 48 A2 98 20 A5 4A AB D3 CF 45 6A 82>)
(   2,<2021-11-09 12:21:13.00 +0400>,<she>,<DPX200>,
      <Start of raw data processing
       efp BC_mod = 2 LB = 1 FT_mod = 6 PKNL = 1 PHC0 = -8880.662 PHC1 = 219.4694 SI = 64K 
       data hash MD5: 64K
       9F 20 85 41 88 B2 B6 81 88 4F BD 3F 8D 49 0E 83>)
(   3,<2021-11-09 12:21:28.32 +0400>,<she>,<DPX200>,
      <pk PHC0 = 24.77242 PHC1 = 0 
       data hash MD5: 64K
       AA DF 87 B6 80 25 B2 E2 E2 5F 91 04 0E 04 D1 C3>)
(   4,<2021-11-09 12:21:45.62 +0400>,<she>,<DPX200>,
      <abs ABSG = 5 
       data hash MD5: 64K
       46 BD DF 70 E0 EE 7F 9D DA 0C 95 FF C6 0D 6C 56>)
$$ ##END=
$$ 
$$ hash MD5
$$ 41 68 80 78 4B AA 0F 8A FE 32 72 56 BF 4F 87 DB
##$RELAX= 
##$RELAX= 
##$RELAX= 
##$RELAX= 
##$RELAX= 
##$RELAX= 
##$RELAX= 
##$RELAX= 
$$ Bruker specific parameters
$$ --------------------------
##$DU= <F:/spectra>
##$EXPNO= 1
##$NAME= <P31>
##$PROCNO= 1
##$TYPE= <nmr>
##$USER= <she>
##$AMP= (0..31)
100 100 100 100 100 100 100 100 100 100 100 100 100 100 100 100 100 100 
100 100 100 100 100 100 100 100 100 100 100 100 100 100 
##$AQSEQ= 0
##$AQ_mod= 1
##$AUNM= <au_zg>
##$AUTOPOS= <>
##$BF1= 81.014009
##$BF2= 200.13
##$BF3= 200.13
##$BF4= 200.13
##$BF5= 200.13
##$BF6= 200.13
##$BF7= 200.13
##$BF8= 200.13
##$BYTORDA= 1
##$CFDGTYP= 0
##$CFRGTYP= 5
##$CHEMSTR= <none>
##$CNST= (0..31)
1 1 145 1 1 1 1 1 1 1 1 1 1 1 1 1 1 1 1 1 1 1 1 1 1 1 1 1 1 1 1 1 
##$CPDPRG= <waltz16>
##$CPDPRG1= <>
##$CPDPRG2= <waltz16>
##$CPDPRG3= <>
##$CPDPRG4= <mlev>
##$CPDPRG5= <mlev>
##$CPDPRG6= <mlev>
##$CPDPRG7= <mlev>
##$CPDPRG8= <mlev>
##$CPDPRGB= <>
##$CPDPRGT= <>
##$D= (0..31)
0 1 0 0 0 0 0 0 0 0 0 0.03 2e-05 3e-06 0 0 0 0 0 0 0 0 0 0 0 0 0 0 0 0 
0 0 
##$DATE= 1636445899
##$DBL= (0..7)
120 120 120 11 120 120 24 19 
##$DBP= (0..7)
150 150 150 150 150 150 150 150 
##$DBP07= 0
##$DBPNAM0= <>
##$DBPNAM1= <>
$$ [...]
##$SUBNAM3= <"">
##$SUBNAM4= <"">
##$SUBNAM5= <"">
##$SUBNAM6= <"">
##$SUBNAM7= <"">
##$SUBNAM8= <"">
##$SUBNAM9= <"">
##$SW= 501.771253377433
##$SWIBOX= (0..15)
0 1 3 0 0 0 0 0 0 0 0 0 0 0 0 0 
##$SW_h= 40650.406504065
##$TD= 32768
##$TD0= 1
##$TE= 0
##$TE2= 300
##$TE3= 300
##$TEG= 300
##$TL= (0..7)
0 120 53 12 22 120 120 120 
##$TP= (0..7)
150 150 150 150 150 150 150 150 
##$TP07= 0
##$TPNAME0= <>
##$TPNAME1= <>
##$TPNAME2= <>
##$TPNAME3= <>
##$TPNAME4= <>
##$TPNAME5= <>
##$TPNAME6= <>
##$TPNAME7= <>
##$TPOAL= (0..7)
0.5 0.5 0.5 0.5 0.5 0.5 0.5 0.5 
##$TPOFFS= (0..7)
0 0 0 0 0 0 0 0 
##$TUNHIN= 0
##$TUNHOUT= 0
##$TUNXOUT= 0
##$USERA1= <user>
##$USERA2= <user>
##$USERA3= <user>
##$USERA4= <user>
##$USERA5= <user>
##$V9= 5
##$VALIST= <valist>
##$VCLIST= <CCCCCCCCCCCCCCC>
##$VD= 0
##$VDLIST= <DDDDDDDDDDDDDDD>
##$VPLIST= <PPPPPPPPPPPPPPP>
##$VTLIST= <TTTTTTTTTTTTTTT>
##$WBST= 1024
##$WBSW= 4
##$XGAIN= (0..3)
0 0 0 0 
##$XL= 0
##$YL= 0
##$YMAX_a= 5017
##$YMIN_a= -10758
##$ZGOPTNS= <>
##$ZL1= 120
##$ZL2= 120
##$ZL3= 120
##$ZL4= 120
##$ABSF1= 248.5645
##$ABSF2= -253.2056
##$ABSG= 5
##$ABSL= 3
##$ALPHA= 0
##$AQORDER= 0
##$ASSFAC= 0
##$ASSFACI= 0
##$ASSFACX= 0
##$ASSWID= 0
##$AUNMP= <proc_1d>
##$AZFE= 0.1
##$AZFW= 0.5
##$BCFW= 0
##$BC_mod= 2
##$BYTORDP= 0
##$COROFFS= 0
##$CY= -3
##$DATMOD= 1
##$DC= 0
##$DFILT= <>
##$DTYPP= 0
##$F1P= 0
##$F2P= 0
##$FCOR= 1
##$FTSIZE= 65536
##$FT_mod= 6
##$GAMMA= 0
##$GB= 0
##$INTBC= 1
##$INTSCL= 5.30512e-09
##$ISEN= 30
##$LB= 1
##$LEV0= 0
##$LPBIN= 0
##$MAXI= 10000
##$MC2= 0
##$MEAN= 0
##$ME_mod= 0
##$MI= 50
##$NCOEF= 0
##$NC_proc= -7
##$NLEV= 6
##$NOISF1= 182.463
##$NOISF2= 159.3651
##$NSP= 0
##$NTH_PI= 0
##$NZP= 0
##$OFFSET= 248.5645
##$PC= 4
##$PHC0= -8855.89
##$PHC1= 219.4694
##$PH_mod= 1
##$PKNL= yes
##$PPARMOD= 0
##$PSCAL= 0
##$PSIGN= 0
##$REVERSE= no
##$SF= 81.014009
##$SI= 65536
##$SIGF1= 159.3651
##$SIGF2= -187.1042
##$SINO= 113.3802
##$SIOLD= 16384
##$SREGLST= <1H.CDCl3>
##$SSB= 0
##$STSI= 65536
##$STSR= 0
##$SW_p= 40650.406504065
##$SYMM= 0
##$S_DEV= 0
##$TDeff= 32768
##$TDoff= 0
##$TI= <>
##$TILT= no
##$TM1= 0
##$TM2= 0
##$TOPLEV= 0
##$USERP1= <user>
##$USERP2= <user>
##$USERP3= <user>
##$USERP4= <user>
##$USERP5= <user>
##$WDW= 1
##$XDIM= 65536
##$YMAX_p= 252693280
##$YMIN_p= -96935033
$$ End of Bruker specific parameters
$$ ---------------------------------
##NTUPLES= NMR SPECTRUM
##VAR_NAME=  FREQUENCY,     SPECTRUM/REAL,   SPECTRUM/IMAG
##SYMBOL=    X,             R,               I
##VAR_TYPE=  INDEPENDENT,   DEPENDENT,       DEPENDENT
##VAR_FORM=  AFFN,          ASDF,            ASDF
##VAR_DIM=   65536,         65536,           65536
##UNITS=     HZ,            ARBITRARY UNITS, ARBITRARY UNITS
##FACTOR=    0.620285442955139, 1,           1
##FIRST=     20137.2065510759, 0,            0
##LAST=      -20513.1999529892, 0,           0
##MIN=       -20513.1999529892, -96935033,   0
##MAX=       20137.2065510759, 252693280,    0
$$ Real data points
##PAGE= N=1
##DATA TABLE= (X++(R..R)), XYDATA
$$ [...]
##PAGE= N=2
##DATA TABLE= (X++(I..I)), XYDATA
12997I78352k34429J565724R85089j387696j547972P06214O79670k896077m807259
12988e958384k218533q3021k402015m180164O22955P785910Q216403K086589j733411
12979B136329J26890J445765j621240l618974M94950N876078M544449k616107
12971F768140p183655m626359J287095M855938M266412Q63282k946471m072189
12963g87807q67034L561720L555007j496844m921444j194740N937984P903100
12955A1689942K561484l694027n197564l377197k182678j904968r37142p3138
12947c115288p41354j297445M42507K560317J587069j320270j750389P02882J820278
12938a111693l7478j496784m66437M40539o82945j157958J188594L260638J419174
$$ y = [978352, 743923, 2309647, 3294736, 1907040, 359068, 1065282, 1744952, -1151125, -5958384, -8176917, -8259938, -10661953, -14842117, -14219162, -6433252, 1783151, 3869740, 2136329, 2263219, 3708984, 2087744, -1531230, -1036280, 4839798, 9384247, 6768140, -415515, -5041874, -3754779, 1101159, 5367571, 6230853, 3284382, -787807, -1654841, 1906879, 5461886, 3965042, -956402, -2151142, 3786842, 11689942, 14251426, 10557399, 5359835, 1982638, -200040, -2105008, -3042150, -3115288, -3856642, -5154087, -4711580, -2151263, -564194, -1884464, -3634853, -2931971, -1111693, -1149171, -2645955, -3112392, -2671853, -3354798, -4512756, -3324162, -63524, 1355650]
12929A355650k096994k227340J224014L474522J641766k043796l832933k437772
12921d942883N75278K401752J362429j071844j771922m32642j39187j859800j880661
12912g759480K075992N746912M186609q0311r40722R55644p03646o017986o496673
12903i033661J728458R576518O526218l958799q430570j728831O541770N755572
12895F976675j938472o087526k374232L206748L934091P55039r04015P92893K474606
12886F835807Q23119l277014n947282m260989Q07559M510448K537942l440809
12878a411219o099546j005031O522490P149119j2845n629036k694464L929127
12870G48595M649104j389877n631738k431754L472875M056956j165317n202621
$$ y = [1355650, -741344, -2968684, -1744670, 1729852, 3371618, 1327822, -2505111, -4942883, -4367605, -1965853, -603424, -1675268, -3447190, -3879832, -4019019, -5878819, -7759480, -5683488, 63424, 4250033, 4169722, 3229000, 4184644, 3480998, -2536988, -9033661, -7305203, 2271315, 8797533, 4838734, -3591836, -5320667, 1221103, 6976675, 5038203, -1049323, -3423555, -216807, 3717284, 4472323, 3568308, 4361201, 6835807, 7658926, 4381912, -1565370, -5826359, -5018800, -508352, 2029590, -1411219, -7510765, -8515796, -1993306, 5155813, 5142968, -486068, -3180532, 748595, 5397699, 4007822, -1623916, -4055670, -582795, 3474161, 2308844, -2893777]
12862b893777l261958J570547L478305J707267J55565N22608J32564k414049l697437
12853d700365q20888K871407K076518k129728l539692k00185K886532J639963
12845a916438j551003k396023n90974J487347K393428J380608j913675m885989
12837g992719k859443M069506Q729018N592269j326521m055202j541363O23593
12829A239138j71746m85344K097071M385933K420088k650809o011217m733436
12821c910322k30575L814374M884423L274829O58868k308851n455957o563107
12813e836318k784973M001391P108258L354545j949539k388887M04898M00477
12805B309852k558628l121506l54281N00339k184081k438450L448813R305627
$$ y = [-2893777, -6155735, -4585188, -1106883, 600384, 755949, 1278557, 1411121, -1002928, -4700365, -5521253, -2649846, -573328, -2703056, -6242748, -6442933, -3556401, -1916438, -3467441, -5863464, -6454438, -4967091, -2573663, -1193055, -3106730, -7992719, -10852162, -6782656, 1946362, 7538631, 6212110, 2156908, 615545, 1239138, 1067392, 582048, 2679119, 7065052, 9485140, 6834331, 823114, -3910322, -4140897, -326523, 4557900, 7832729, 8491597, 6182746, 726789, -5836318, -8621291, -4619900, 2488358, 5842903, 3893364, 1504477, 1909375, 2309852, -248776, -3370282, -3724563, -3224224, -5408305, -7846755, -4397942, 4907685]
12797D907685P185235q66843n710344l932974j120030k060180m017405k437871
12789h052727J383843K615883L81953j619799j298345n62579q01006j13338K751115
12780e315000N052025L864866Q59648l68679m699r31659l106622l690094k447198
12771f087412k031619k483055p17599L274816N168345L294604J430274J795060
12763C643414R71102l151019n878573k673010K883416M347523K161003J380977
12755C684833K316394R53714k407074k688619J056222L171895p2266m924251n695814
12746d604966j888493K504055L809564J134273l353103n353394k118932L767131
12738f103865O500440L658788j398882m132802l501088j362225O76911K516275
$$ y = [4907685, 12092920, 11226077, 5515733, 1582759, 462729, -1597451, -5614856, -8052727, -6668884, -4053001, -3671048, -5290847, -6589192, -7151771, -7952777, -8066115, -5315000, -262975, 3601891, 4461539, 4092860, 4088161, 3156502, 49880, -3640214, -6087412, -8119031, -10602086, -11319685, -8044869, -2876524, 418080, 1848354, 3643414, 4614516, 1463497, -4415076, -7088086, -4204670, 142853, 2303856, 3684833, 6001227, 6954941, 4547867, 1859248, 2915470, 6087365, 6015099, 1090848, -4604966, -6493459, -3989404, -179840, 954433, -2398670, -7752064, -9870996, -6103865, 396575, 4055363, 2656481, -1476321, -4977409, -6339634, -5662723, -3146448]
12730c146448M391856N213016K870345k493506o345433m193713J580561L740887
12722A617565L58421k440694m75332K096242R10350o77017J497210L546152J43442
12713F576339m818997m069030P1338m76846m814614m132131K575289O116137K440574
12704e31941j330431K30436K858080K132741R84330K170212K352639m31910j821676
12695F612480L32296P64111l367148n710794j330678L696986J885268l266182
12687c83661l792619m75505K82058j699837j649748L27768M76673n4475K432280
12678d537066N135973K023928m605551n799168J73761M990230L043417j502867
12670a077343k956300j729696n21664N92807J708397J035724j383634k303387
$$ y = [-3146448, 1245408, 6458424, 9328769, 6835263, 489830, -3703883, -2123322, 1617565, 1975986, -464708, -940040, 1156202, 2066552, 1389535, 2886745, 6432897, 6576339, 1757342, -2311688, -2240350, -2717196, -7531810, -11663941, -9088652, -2972515, -531941, -1862372, -1631936, 1226144, 3358885, 4343215, 6513427, 8866066, 8434156, 6612480, 6944776, 7708887, 4341739, -1369055, -2699733, 997253, 2882521, -383661, -4176280, -4651785, -4369727, -6069564, -7719312, -7391544, -6914871, -6969346, -4537066, 598907, 2622835, -1982716, -7781884, -7608123, -2617893, 425524, -1077343, -4033643, -5763339, -6285003, -5692196, -3983799, -2948075, -4331709, -6635096]
12662f635096l50125J611121J503906J200169K171681K216408l78126k991234
12654a651296k406880K48318J516939O28394l73728j85714N23633O77305q9318
12645a112347j255927j459276L02924K844908L454915J116980k198086m111550
12637b417459m299799l575255k020981M66363K540350K130781n91218k126928
12629i894146P32765N987943P403648K326614l586364l113026K362057M662278
12621F881769R78275k296555l66528K124785p80301n966974o051047j031871K509297
12612c999150K027806J110393J410434J92471k940054l874533q76253K195033
12604d753853K271745J589354K713778L513820Q99327l511642n302521l283041
$$ y = [-6635096, -6985221, -5374100, -3870194, -2670025, -498344, 1718064, 1339938, -1651296, -4058176, -3809858, -2292919, -1664525, -2038253, -2223967, -1700334, -1023029, -1112347, -2368274, -3827550, -3524626, -679718, 2775197, 3892177, 1694091, -2417459, -6717258, -10292513, -12313494, -11847131, -9306781, -7176000, -7767218, -9894146, -9161381, -3173438, 4230210, 6556824, 2970460, -142566, 2219491, 6881769, 7860044, 5563489, 5196961, 7321746, 6541445, 574471, -5476576, -6508447, -3999150, -1971344, -860951, 549483, 741954, -2198100, -6072633, -6948886, -4753853, -2482108, -892754, 1821024, 5334844, 6234171, 2722529, -2579992, -5863033]
12596e863033o09660m14464k124930k254237J312991N812582O009493J366592
12588C235334j998310L33116L871963J738373l884188m251472K058230O049207
12580G152253J768630m628920m079797K702522P369706N234125q58468n836278
12572H823773p108823n152959k656502k126519k554002n00434M032875O141761
12564a100830K769248k567566m730420l243683m79906K688627N442342M782389
12556C560201m27677n873821o900335m629763k455089K37026N078687Q672997
12548b737774O740707K174240J045425J976037j444620p733148p433543J456491
12540e956185Q342947N459733r60558k024903j80811k372677n846467k642156
$$ y = [-5863033, -6472693, -6887157, -9012087, -11266324, -9953333, -4140751, 1868742, 3235334, 1237024, 1570140, 5442103, 7180476, 3296288, -955184, 1103046, 7152253, 8920883, 4291963, 212166, 2914688, 10284394, 15518519, 14660051, 8823773, 1714950, -3438009, -6094511, -8221030, -10775032, -11275466, -7242591, -1100830, 1668418, -899148, -5629568, -8873251, -9353157, -6664530, -1222188, 3560201, 3132524, -2741297, -9641632, -14271395, -16726484, -16489458, -11410771, -2737774, 4002933, 6177173, 7222598, 9198635, 7754015, 20867, -7412676, -5956185, 2386762, 7846495, 6885937, 4861034, 4680223, 2307546, -3538921, -6181077]
12532f181077N010850O365891o56107n937073l486061L7764j639889l253103J774077
12523g964728P915257N150479m215852p692218r32738O577326O197810J181201
12515F216537j236089j092148k740274n713767n633416j985038J281986K277620
12507h624589L025513M627326N099300K900629q57866m419211o550634n554562
12499a0354094q34722L936283L473569j641814m348642n55787M886741N414298
12491b4168K219066J190808K862183K050983k639950n681728l053192J725177
12483a350821L225142J429894k68719p68278p88915L47481K899782L923814J077580
12474I726960k628907k955046j595654l256465o663169n594510O96667N514912
$$ y = [-6181077, -1170227, 5195664, 4539557, -1397516, -4883577, -4845813, -6485702, -9738805, -7964728, -49471, 5101008, 885156, -6807062, -7739800, -1162474, 5035336, 6216537, 4980448, 3888300, 1148026, -4565741, -10199157, -12184195, -10902209, -8624589, -5599076, -971750, 4127550, 7028179, 6170313, 1751102, -4799532, -10354094, -11188816, -7252533, -3778964, -5420778, -9769420, -10325207, -5438466, -24168, 2194898, 3385706, 6247889, 8298872, 5658922, -22806, -3075998, -1350821, 1874321, 3304215, 3035496, 2267218, 1478303, 1825784, 4725566, 8649380, 9726960, 7098053, 4143007, 2547353, -709112, -7372281, -12966791, -12270124, -6755212]
12466f755212M943380K687959K001078M53134l084975l964233j05319K331931
12458a492257j202561m763001j448456M201765L633202q71730q12952K448422
12450c07568J00672o528882n972641L305577Q029670J156872o315925l347005
12442i879230L775325L425225j888286j451222M592178O039063j27484n902533
12434a416964n500038j825796J099490L053093L558284Q21862l479605m805200
12426h494874k493621k58436N84074K433042N365127N957890L387667J041005
12418G521874N97298l05238k993769n103465m535466k071409Q62255L265351L361227
12409E98658O23392j348990R74864M372190K394955m141554o955830k198183M022918
$$ y = [-6755212, -1811832, 876127, 2877205, 3330339, 245364, -3718869, -3824188, -1492257, -2694818, -7457819, -8906275, -4704510, -1071308, -1943038, -2755990, -307568, -206896, -6735778, -12708419, -9402842, -1373172, -216300, -6532225, -9879230, -6103905, -2678680, -4566966, -6018188, -1426010, 4613053, 4485569, -1416964, -6917002, -8742798, -7643308, -4590215, -1031931, -210069, -3689674, -8494874, -10988495, -11246931, -10662857, -8229815, -2864688, 3093202, 6480869, 7521874, 8119172, 7813934, 4820165, -283300, -4818766, -6890175, -6027920, -2762569, 598658, 1222050, -126940, 847924, 5220114, 7615069, 3473515, -3482315, -5680498, -1657580]
12400a657580M787541J246620j124123m11943J331344K078672R40072k103508
12392E087095n138469n201405j816472K336516M725204M542764J597122k889139
12384C243216n209360l162659r7616j19382j016107J527726M484095J109490o261847
12375e502444p438547l83020M780205J880584j873134J056555N907590M547983
12367B975772q53246k653377n40128L8875j715975k128993r47615r68749j740630
12358h534066p12139J168719J171568j37873j036985k596265m799132l089407
12350a8565580M232368R685718N997616k104118m584735j118870O66030q16915
12342f608486k15453K806896K537846j127476j358272L258151N669963K404937
$$ y = [-1657580, 3129961, 4376581, 3252458, 2840515, 4171859, 6250531, 7190603, 5087095, -51374, -5252779, -7069251, -4732735, -7531, 4535233, 6132355, 3243216, -1966144, -5128803, -5226419, -5345801, -6361908, -4834182, -350087, 759403, -5502444, -12940991, -13324011, -8543806, -6663222, -8536356, -7479801, -1572211, 2975772, 2122526, -530851, -1070979, -1032104, -2748079, -4877072, -5824687, -6793436, -8534066, -9246205, -8077486, -6905918, -7043791, -8080776, -10677041, -15476173, -18565580, -14333212, -4647494, 1350122, -753996, -5338731, -6457601, -5791571, -6608486, -6823939, -4017043, -1479197, -2606673, -3964945, -706794, 4963169, 7368106]
12334G368106j423999k247364l120217m971094l030431L008708N112961n73703
12326A22967o201624m056773K136566M947114M521705M173276K023878l715616
12318C951493p216519k809580M251869M860606K95070r58504K055960K329217
12310F759612j688780l524880q17767N48547k476629m295578n18325M141505L463389
12301A591094o00240j830404N40200J821307l58409l162272l084592j64994K600264
12292b648046K602564L98301p58294R75602L119427K127887j255147l032550j979957
12283d50213q18461j088571j095060n6956k744j625090k205404l8545K631645
12274d749399L554463L770960M186462K608454k048693n872265m840141j310076
$$ y = [7368106, 5944107, 3696743, 576526, -4394568, -7424999, -4416291, 696670, 122967, -6078657, -10135430, -7998864, -3051750, 1469955, 5643231, 7667109, 3951493, -3265026, -6074606, -1822737, 3037869, 3332939, 2374435, 4430395, 6759612, 5070832, 1545952, 728185, 1276732, -1199897, -5495475, -6013800, -1872295, 1591094, 990854, -839550, -299350, 1521957, 1163548, -1998724, -5083316, -5248310, -2648046, -45482, 352819, -405475, 570127, 3689554, 5817441, 4562294, 1529744, -450213, -1268674, -2357245, -3452305, -3509261, -3512005, -5137095, -7342499, -7381044, -4749399, -1194936, 2576024, 6762486, 9370940, 7322247, 1449982, -3390159, -4700235]
12266d700235o78120k844812k274729L181735Q315956P239534Q87231m473735
12258D652825m788256k210708j434916l237995l419211Q51367N631640M630098
12250F74844j498661n033585j678432L811934N273655L409071K103845J024953
12242H087624k152231n266944m102747K31132K594703J605620K71377k41347j306754
12233b79567k037388l94992J266054j115718n017535l587565K850593N977592
12225b338526K367628j370155J61029L076665K093329j127136k871307l655912
12217c664385m096885j402986M057918N713850R55258k782965L80874M456648
12209C617327J809048l481877l194783M20725j05301k668299K28152N836139M480049
$$ y = [-4700235, -5378355, -8223167, -10497896, -7316161, 999795, 8239329, 9126560, 4652825, -135431, -2346139, -3781055, -7019050, -10438261, -9586894, -3955254, 674844, -823817, -5857402, -7535834, -3723900, 1549755, 4958826, 7062671, 8087624, 5935393, 668449, -3434298, -3203166, -608463, 997157, 1268534, 1027187, -279567, -2316955, -2711947, -1445893, -2561611, -7579146, -11166711, -8316118, -2338526, 29102, -1341053, -1180024, 1896641, 3989970, 2862834, -8473, -3664385, -7761270, -9164256, -5106338, 607512, 1562770, -1220195, -839321, 3617327, 5426375, 1944498, -1250285, -829560, -934861, -3603160, -3375008, 2461131, 6941180]
12200F941180k796760n101976o84452N86246l878115m169128L302583P510900
12192A710478J314412n854134l759390K344720K452780j377355j087600K569990
12184a686099L492457K143741K235649J008318n287333j0821036p324156J513780
12176a4724679M801983J156193j283814K76895Q39367m62310J395940N882134
12168b118291N648538o42678n062475l238824m09881j006448j781042L13730K268636
12159f028735J799794J793564L190917J609491l588315n099037Q36463O287547
12151H01689K800511n443718q075153l449295J494385K937578L073854L069634
12143b790515J326692j411946j972697r9296J397479J580343J632526J033185
$$ y = [6941180, 4144420, -957556, -1642008, -1055762, -4933877, -9103005, -5800422, 1710478, 3024890, -2829244, -6588634, -4243914, -1791134, -3168489, -4256089, -1686099, 1806358, 3950099, 6185748, 7194066, 1906733, -8914303, -16238459, -14724679, -9922696, -8766503, -10050317, -9773422, -8934055, -9396365, -8000425, -2118291, 3530247, 2887569, -2174906, -5413730, -5823611, -6830059, -8611101, -8297371, -6028735, -4228941, -2435377, 755540, 2365031, -1223284, -6322321, -5485858, 801689, 3602200, -1841518, -9916671, -13365966, -11871581, -8934003, -5860149, -2790515, -1463823, -2875769, -4848466, -4947762, -3550283, -1969940, -337414, 695771]
12135F95771j330148l137915j366909J567724N14415l573082m091900Q07093M926792
12126d988159L533824m7276q92204M3732l15459m10134K940749P278866O607138
12117A3751077M31520m862942m781095k181031j723949k652416q12124L921630
12109A090670O422738L122779l023557o244494m876632k238558j290946j202038
12101h240038O42J740426J854118R0674j496341j429968l42236M39637L27405
12092g055681o63489j970288k070472L86616M286395O321621M659394J242585
12084E136681p66526q48055q74351j652997j757490j78872J551193J085247j544778
12075A50052l562829k440672J167507L782868K606590j280574l670925j664548
$$ y = [695771, -634377, -3772292, -5139201, -3571477, -3057062, -6630144, -10722044, -9914951, -4988159, -1454335, -1501611, -2393815, -2350083, -2665542, -3075676, -134927, 7143939, 13751077, 14182597, 9319655, 4538560, 2357529, 633580, -2018836, -2830960, 1090670, 7513408, 10636187, 7612630, 1368136, -3508496, -5747054, -7038000, -8240038, -8239396, -6498970, -4644852, -4554178, -6050519, -7480487, -7822723, -7383086, -7055681, -7719170, -9689458, -11759930, -11373314, -7086919, -765298, 3894096, 5136681, 4370155, 3522100, 2647749, 994752, -762738, -941610, 609583, 1694830, 150052, -3412777, -5853449, -4685942, -903074, 1703516, 422942, -3247983, -4912531]
12067d912531K972839N548421L344502j865993n867319n695415j744779K516367
12059e703908L283851N00973j193225K051757P091590O672472m57114o674048
12051E572348n607879r03748l3910k762350k605300J645747L843107J029395j796996
12042a619586o92202P21041j204953k585376R79464M825650J466325o202875p624743
12033a1937255o02768N053353K663116j497302R30160O746351O398703q66281
12025F888077n694976k436096L189993K952838k558089n802708l092577J130866
12017e422672J281487j694613k334593J025672L636841J308477l119551l620291
12009h939243K80905L033225J525807p41375J376J677609L81832k685244l173696
$$ y = [-4912531, -1939692, 3608729, 6953231, 5087238, -780081, -6475496, -8220275, -5703908, -2420057, -1919084, -3112309, -1060552, 6031038, 12703510, 12246396, 5572348, -35531, -939279, -973189, -3735539, -6340839, -4695092, -851985, 177410, -1619586, -2311788, -1590747, -2795700, -5381076, -4401612, 424038, 1890363, -4312512, -11937255, -12540023, -7486670, -4823554, -6320856, -5390696, 1355655, 7754358, 6888077, 1193101, -1242995, 1946998, 4899836, 2341747, -3460961, -6553538, -5422672, -4141185, -5835798, -8170391, -7144719, -3507878, -2199401, -5318952, -8939243, -8658338, -5625113, -4099306, -4840681, -4839305, -3161696, -2779864, -5465108, -8638804]
12000h638804q07256N46330l68279o41792Q42676J176293q32615j682768P43575
11991i662640K552895j00251l748635k193138L485324N846737K000044k540644
11983d360308k321099J288109M181943N286415M882634J713070l790501o836993
11975D3270l854410J514279K936902K21514j541137m85055J86534j043625j298518
11966c320246R88783K681845R10850k224818k701384J22732L403758M184619J614739
11957E660878k237889l218478O56708N349216M577271j763983o845833n923218
11949c745328j883656L12376L32394M07911M37612p68217j984692j216144R37404
11940g170340K625498L523190L615729J754463j594764k979379q44535J016350
$$ y = [-8638804, -9446060, -8899730, -9268009, -9909801, -9067125, -7890832, -8723447, -10406215, -9662640, -7109745, -7209996, -10958631, -13151769, -9666445, -3819708, -1819664, -4360308, -6681407, -5393298, -1211355, 4075060, 8957694, 10670764, 6880263, 43270, -3811140, -2296861, 640041, 861555, -679582, -1164637, -978103, -2021728, -3320246, -2331463, 350382, 1261232, -963586, -3664970, -3542238, -138480, 4046139, 5660878, 3422989, 204511, 861219, 6210435, 10787706, 9023723, 2177890, -3745328, -5628984, -5316608, -4984214, -4576303, -4138691, -4906908, -6891600, -8107744, -7170340, -4544842, -1021652, 2594077, 4348540, 2753776, -225603, -1070138, -53788]
11932e3788j067659m401678l879232k8797K172050J277698P68846K683750M772660
11923B243850M523333K056625j416932m620117n612498l445210l41858P97181
11915e815626N12373J185760K316184J407794r96702j574095L30786J635537M03843
11906e94146j897894l476473m018715l074944k18408K681010K809875O74066j89262
11897g304891J638898L589157K994513K86656k095460k048291N14798K672414
11889B47794R30950l261167l604996J959815O307145K835347l770680m167375
11881b523167J060853K865500j109694l250578N37603M149794J916087k651971
11873I94427l564734r20860J832764L268184K627617j078157n076331m059500
$$ y = [-53788, -1121447, -5523125, -9402357, -9431154, -7259104, -5981406, -5212560, -2528810, 2243850, 6767183, 8823808, 7406876, 2786759, -2825739, -6270949, -6612807, -5815626, -5303253, -4117493, -1801309, -393515, -1390217, -2964312, -2633526, -997989, -594146, -2492040, -5968513, -9987228, -13062172, -13280580, -10599570, -7789695, -7115629, -7304891, -5665993, -2076836, 917677, 1204333, -891127, -2939418, -2424620, 247794, 1178744, -2082423, -5687419, -3727604, 2579541, 5414888, 1644208, -2523167, -1462314, 1403186, 293492, -2957086, -2419483, 1730311, 3646398, 994427, -2570307, -3491167, -1658403, 1609781, 4237398, 3159241, -1917090, -5976590]
11865e976590J222481L349450k72898l038503o41578J678131n88600k549440N38052
11856f279495L388168J50499l556104L64582P042912N167318m136845q309525
11848f168490k696402L839792M000794R07772r51522k707919m777181l111945
11840a1665101K933670O882644M655800R76832R48761J761286j070384m897723
11832E25785m529766j608541j845193m976697m854833M18614M805523K715894
11824i349214l194809n407074q83056N326970N961826K3948n812653m947923J226754
11815a7055231N317719L341423r69862k080422L51817K608641K738417K218627
11807c528871K527327K786601J493957q50191j970013o34496J475724J645772
$$ y = [-5976590, -4754109, -1404659, -1677557, -4716060, -5357638, -3679507, -4268107, -6817547, -6279495, -2891327, -2740828, -6296932, -5932350, 1110562, 6277880, 2141035, -6168490, -8864892, -5025100, -1024306, -116534, -1068056, -3775975, -8553156, -11665101, -8731431, -1848787, 2807013, 3783845, 4732606, 6493892, 5423508, 525785, -4003981, -5612522, -7457715, -12434412, -17289245, -16870631, -12065108, -9349214, -12544023, -17951097, -18834153, -13507183, -7545357, -7521409, -13334062, -18281985, -17055231, -11737512, -8396089, -9365951, -11446373, -11094556, -8485915, -5747498, -3528871, -1001544, 1785057, 3279014, 2428823, 458810, -175686, 1300038, 2945810]
11799B945810k11710j383801n74802j37197k133884m312319l261938j14349J077695
11790h106495L8933M07126K613833K217663k227288n027094j504370L875866L474716
11781d237110j823767l780131N32260M439616K426346j389240m88967L150434
11773a170559K369839l040778n328810q76568L931139K368201l011637n412376
11765a0171549l896003k262593j008212K353770O290087O199075K755031J840301
11757B099907M477389M316079j563133o442034l674379K982472M747117k68222
11749F675196o243034q010029n089211K85918M445273L787670o95597k882353
11741g726167M37983M271051K831003j574661k897152r27077L21997O45328K393789
$$ y = [2945810, 2734100, 1350299, 775497, 638300, -1495584, -5807903, -9069841, -9184190, -8106495, -8067562, -7660436, -5046603, -2828940, -5056228, -10083322, -11587692, -7711826, -4237110, -6060877, -9841008, -9308748, -4869132, -2442786, -3832026, -4320993, -1170559, 1199280, -1841498, -7170308, -8046876, -4115737, -1747536, -4759173, -10171549, -14067552, -16330145, -17338357, -14984587, -8694500, -2495425, 259606, 2099907, 6577296, 10893375, 9330242, 2888208, -786171, 2196301, 6943418, 6675196, 432162, -7577867, -12667078, -12381160, -7935887, -4148217, -4843814, -7726167, -7288184, -3017133, -186130, -1760791, -4657943, -5585020, -5263023, -4617695, -2223906]
11732b223906L733435J488287j223957P90017M323206J557564n912052p798278
11724e265684j363059M215822K845011j89438L59075Q23091k263981m103469p82843
11715e725475K132620p45780l875863J62970O938899O589722j68233l797678j400283
11706A10899P31990o12853j416866M35900J440890k4345o63883R08204J488145
11697B398081k73297j347445m00649l3749r12644j53317K193150J828427j767070
11688A531487k911190R26633M071082J638516k641227l113558j055153n20956
11680b074366l32170K469885N024099K611434k121489k319540J509011J639910
11672F406774m113034p982992l737318M101332O993804L614298n11524j585842
$$ y = [-2223906, 1509529, 2997816, 1773859, 2563876, 6887082, 8444646, 2532594, -5265684, -6628743, -2412921, 432090, 242652, 601727, 1424818, -839163, -4942632, -5725475, -3592855, -4338635, -8214498, -8051528, -1112629, 5477093, 5308860, 1511182, 110899, 842889, 230036, -1186830, -750930, 689960, 665615, 1732, 909936, 2398081, 2124784, 777339, 376690, 342941, -569703, -723020, 1470130, 3298557, 1531487, -1379703, -453070, 3618012, 5256528, 2615301, -498257, -1553410, -2074366, -2406536, 63349, 5087448, 7698882, 5577393, 3257853, 4766864, 6406774, 2293740, -5689252, -9426570, -5325238, 1668566, 5282864, 4771340, 3185498]
11664C185498r18050r61980k040284l154116l426848k283696K72842L147314M586597
11655a592723L394111N395l144254l086741L73630L429649K443912j050596k238326
11646a465943J23169K118164P32936k113952l247629k463509q41783J739011M457414
11637i62122M137988k59708m336957l590989N3373J485895L07593L18671K273244
11628e73012K930338J355865L71473P27973m93301l734642m613404p17298L745105
11619a000903L602231m42170l957547m724729l277848l39503K899837M261892
11611b978740L345414K495709K518974P50669l383506m889441j97818N680472
11603C341733N081087j264403n557590m267878j370684k35074O72316K431721
$$ y = [3185498, 2267448, 1305468, -734816, -3888932, -7315780, -9599476, -9326634, -6179320, -1592723, 1801388, 1806783, -1337471, -4424212, -4050582, -620933, 1822979, 772383, -1465943, -1342774, 775390, 1508326, -605626, -3853255, -6316764, -7158547, -5419536, -962122, 3175866, 2916158, -1420799, -5011788, -4958415, -3472520, -3164927, -2846256, -573012, 2357326, 3713191, 4084664, 4812637, 4319336, 584694, -4028710, -4746008, -1000903, 2601328, 2159158, -1798389, -6523118, -9800966, -10140469, -7240632, -2978740, 366674, 2862383, 5381357, 6132026, 2748520, -2140921, -2338739, 3341733, 8422820, 7158417, 1600827, -2667051, -4037735, -4272809, -3600493, -1168772]
11595a168772K599174K76136j295733l45024K46271j292545j820854M89780J229703
11586a081864l113703p294019m003782L966163O667217J876513j810446R49098
11578c844823L879859K00887n288674l595755L439199N436331k84316m979145
11570e036437k943428K57938j007017k088039K868798Q391766N082793m036476
11562A489898o602577q9953M335083Q8921m547041q03872N987563N371711j714570
11553C515163n694426l471966n90937k34062K16180J776080J770481J35286K25422
11544b352779K052847J695566j224179k430434r67081j065667l701500l714847
11536a1708074J034975M708123K495458j618598j745621O08651N39135j330261
$$ y = [-1168772, 1430402, 1706538, 410805, 65781, 312052, -980493, -2801347, -2311567, -1081864, -4195567, -11489586, -15493368, -11527205, -4859988, -2983475, -4793921, -3844823, 35036, 235923, -5052751, -8648506, -5209307, 227024, -57292, -5036437, -7979865, -7721927, -8728944, -10816983, -7948185, 443581, 5526374, 1489898, -5112679, -5202632, -867549, -778628, -5325669, -6129541, -141978, 5229733, 3515163, -2179263, -5651229, -6242166, -6476228, -6260048, -4483968, -2713487, -2578201, -2352779, -299932, 1395634, 171455, -2258979, -3226060, -4291727, -7993227, -11708074, -10673099, -5964976, -3469518, -5088116, -6833737, -6225086, -5685951, -7016212]
11528g016212j045473O17507j22442j906122L06278N537855O378409M81440m452208
11519a220968j472361M965866N026796k276174p364889l422221M065391M797045
11511C098485k299859p759958m512838K938114N302599R70805l094761j682162
11503g039575K664835M857506L978155K412001J369668J73327j506200k953700
11495C956017l327300k307182p62919q79350l670603o219567m254113J674455
11487a5790562N787423M435561O37459r43197k50348J79874O24477L085760O110149
11478C876596N434488L43120m357407m229126n82296J860278J198244M6089R70826
11469D560812K317710O42190l202058l738824J333990O087046L479003m041923
$$ y = [-7016212, -8061685, -7444178, -7566620, -9472742, -9166464, -3628609, 2749800, 3231240, -1220968, -2693329, 2272537, 7299333, 5023159, -2341730, -5763951, -1698560, 3098485, 798626, -6961332, -11474170, -8536056, -3233457, -2262652, -5357413, -7039575, -4374740, 482766, 4460921, 6872922, 8242590, 8415917, 6909717, 3956017, 628717, -1678465, -2441384, -3320734, -6991337, -13210904, -17465017, -15790562, -10003139, -5567578, -4930119, -5873316, -6123664, -5943790, -5319313, -2233553, 3876596, 9311084, 9654204, 5296797, 1067671, 485375, 2345653, 3543897, 3589986, 4560812, 6878522, 7520712, 4318654, 579830, 1913820, 8000866, 11479869, 7437946]
11461G437946o941125k091613K679141M30888m700049m492873P43422L539374
11453c394889J159543j199662M88348L244343K664134m01720j880794k83567K422762
11444B818498L982294L452369P96906k840134m850888l121766J226194M142079
11436E605552K566846k045177m795130k451653K799343N494085K745334k930452
11428F988748o681254o053720k333290J547271L562622L741941L386014K964882
11420G123214J316110k087462n028622m832780k257040m05777M4073J170332L014217
11411a943735K591263p36976l018872j449177J338804J893199J326078K093226
11403B093810K577359n9046l710844l595640J03581K251960N51861j753528j773395
$$ y = [7437946, 496821, -1594792, 1084349, 1515237, -3184812, -7677685, -6934263, -3394889, -2235346, -3435008, -2946660, 297683, 2961817, 2560097, 679303, 395736, 2818498, 6800792, 10253161, 11050067, 8209933, 3359045, 237279, 1463473, 5605552, 8172398, 6127221, 1332091, -1119562, 1679781, 7173866, 9919200, 6988748, 307494, -5746226, -8079516, -6532245, -2969623, 772318, 4158332, 7123214, 8439324, 6351862, 1323240, -3509540, -5766580, -6172357, -6128284, -4957952, -1943735, 647528, -89448, -3108320, -4557497, -3218693, -1325494, 584, 2093810, 4671169, 4612123, 901279, -2694361, -2590780, -338820, 213041, -1540487, -3313882]
11394c313882p45176l60734L24414K087279L264454K732561K057656K128241O80244
11385H855057l551856o735313m216994K166807N408313K359687k420668l391431
11377a526398j303126q74289l143819l926094j39965N428029P347972L913586
11369E775896j351030l756309j847079J637461K465801n90348l740632k503015
11361c909255J619464K223777k374568n048173P8040P286439O176511k609893
11353C442342p160683j293025O627092O173141p60058m390176j373257K357143
11345C622519J406945k461888l925907o76666M162321M890812m95548o567923
11337d5335o051597K38802L903284J078740k346610j272722J89027k723321n274550
$$ y = [-3313882, -4059058, -4419792, -4095378, -2008099, 1256355, 3988916, 6046572, 8174813, 8855057, 5303201, -1432112, -5649106, -3482299, 1926014, 4285701, 1865033, -1526398, -2829524, -3703813, -6847632, -10773726, -10913691, -5485662, 1862310, 5775896, 4424866, 668557, -1178522, 458939, 2924740, 2334392, -1406240, -3909255, -2289791, -66014, -2440582, -7488755, -7410715, -124276, 6052235, 3442342, -3718341, -5011366, 1615726, 7788867, 7028809, 2638633, 1265376, 3622519, 5029464, 2567576, -1358331, -2034997, 2127324, 7018136, 6522588, -45335, -6096932, -5858130, -1954846, -876106, -3222716, -4495438, -4306411, -7029732, -12304282]
11328a2304282q19694O395700O796448J095601j156739K161307L048683j586085
11320C630939m430004j277840J467843j031992k739980K246762Q067003O259982
11312A2192713K3061j423117J673151J163695l907006n465930n85505L334203
11304G005265R35129k850160k146751j19323k607651o927073n140161L306603
11296h544122R643057P261708m19547n413955m383942q7671L375561L986453K099605
11287G517147k21518q10538J58893K13425j734018l280931k055736J87847j32198
11278a57627k809343l845338j260144K262390L393358K019718j9519j413386j262164
11269c092055R65313L723254L909398P41038k991530m874470n448237n293187
$$ y = [-12304282, -13123976, -6728276, 68172, 1163773, 7034, 2168341, 5217024, 3630939, -799065, -2076905, -609062, -1641054, -4381034, -2134272, 5932731, 12192713, 12215774, 10792657, 12465808, 13629503, 9722497, 4256567, 3671062, 7005265, 7940394, 5090234, 2943483, 2824160, 216509, -6710564, -11850725, -8544122, 1098935, 8360643, 7941096, 2527141, -1856801, -1944472, 1431089, 5417542, 7517147, 7295629, 6485091, 6643984, 6857409, 5123391, 1842460, -213276, -25429, -157627, -2966970, -6812308, -8072452, -5810062, -2416704, -396986, -416505, -1829891, -3092055, -2126742, 1596512, 5505910, 6246948, 3255418, -1619052, -7067289, -12360476]
11261a2360476k861592K092313N909646N335909K291432Q88164J457729J031746
11253C784871j623785m784853o445851n353197q54915N335452Q844874P089814
11245E992410K357396k005340n548525p764014n410357J919181P304620M472302
11237A317673k264938l593157J018838L570791R73993j086124R21115K785838
11229C644029J056437j120337q11364o22973k480879k771911Q68673L794466J414033
11220B970174k797983k659777J093363K832394R76273j077050j226530n82098
11212d71234j67990K4348l38630j050306o68478P73031J017386R6147J618637
11203H32911N954350O875001M41179p017983o745026l85023K713851n86541m070526
$$ y = [-12360476, -15222068, -13129755, -7220109, -1884200, 407232, 1295396, 2753125, 3784871, 2161086, -2623767, -9069618, -14422815, -15277730, -9942278, -1097404, 5992410, 8349806, 6344466, 795941, -6968073, -12378430, -10459249, -3154629, 1317673, -947265, -4540422, -3521584, 49207, 1023200, -62924, 858191, 3644029, 4700466, 3580129, 2768765, 2145792, -335087, -3106998, -2238325, 1556141, 2970174, 172191, -2487586, -1394223, 1438171, 2414444, 1337394, 110864, -471234, -639224, -614876, -953506, -2003812, -2672290, -1899259, -881873, -785726, 832911, 6787261, 13662262, 14103441, 7085458, 340432, -44591, 2669260, 2082719, -1987807]
11194a987807k924550J86254J358119R99106P28971K33941l21171N99734K247459
11185A120056J505080j498760k327575P29229L169323J055600k884124l855756
11177b986927k225034j589988k106101q23014K238380L236820L80780l173458
11169g048542l696252j360110J340594L391721N082727N284789K021567l588390
11161A428104o535347l253863L332093O523298L503941j953984m667674l413543
11153e036975l08260K452507L473260K010913q50309k410767j539848j9763P20576
11144a508666J676507L066518K310187j526512m452093l088444o05135j644468
11136e772106l751802q56636N687944P485475J595443m967219n675289k303858
$$ y = [-1987807, -4912357, -4726103, -3367984, -2368878, -1639907, -1405966, -1727137, -1127403, 1120056, 2625136, 1126376, -1201199, -471970, 2697353, 3752953, 868829, -2986927, -5211961, -6801949, -8908050, -9731064, -7492684, -4255864, -3875084, -7048542, -10744794, -12104904, -10764310, -7372589, -2289862, 2994927, 5016494, 1428104, -5107243, -8361106, -5029013, 1494285, 4998226, 3044242, -1623432, -5036975, -5345235, -2892728, 580532, 2591445, 1741136, -669631, -2209479, -2229242, -1508666, 167841, 3234359, 5544546, 4018034, -434059, -3522503, -4127638, -5772106, -9523908, -10380544, -4692600, 2792875, 4388318, -578901, -6254190, -8558048]
11128h558048R45909L917522O424653M626142k119614o515219k936669K790996
11120a424328J631058m193975m767547J064316L672493j427607o022084k035946
11112a3503620O402918R774522O111032Q66873j973683k583944j872501q33277
11104B388320j414178l542457l397736J013832N069262L318896k146264m688607
11096c398932k760142m48858M68454K200483M592187M079457M14259j905389q69087
11087B372432L44299q0594K63553J598222l58525o081763q400874k814944M242421
11078h915773M430726j15235j387843J368736K212518j8505n47430J179560l1235
11069a824481m510700m766126K736421J0293885Q909249L24905o272187o047693
$$ y = [-8558048, -7612139, -3694617, 2730036, 7356178, 5236564, -1278655, -4215324, -1424328, 206730, -3987245, -8754792, -7690476, -4017983, -5445590, -11467674, -13503620, -7100702, 2673820, 8784852, 9651725, 7678042, 5094098, 3221597, 2388320, 974142, -2568315, -5966051, -4952219, 117043, 3435939, 1289675, -3398932, -6159074, -6607932, -6139478, -3938995, 653192, 4732649, 5146908, 3241519, 2372432, 2716731, 2636137, 2899690, 4497912, 4139387, -1942376, -10343250, -13158194, -8915773, -4485047, -4600282, -5988125, -4619389, -2406871, -2425376, -2972806, -1793246, -1824481, -6335181, -11101307, -8364886, 1928999, 10838248, 11163153, 4890966, -1156727]
11061a156727k109547M44928j44228j947169j766244J275375L880415K481956
11053I58759r94100j167846K464694M397826J964802n49168K83101J150655j406602
11044G102121m062796k376937J106254J250271o86116P7900K436999R87471l840216
11035A994951n329281r09065M128496M811749K081522j296590m261753n143965
11027c923936j972144K672683L099064p76292k432490O78732K625287o45649l781256
11018d456001j187370K917919J811904j717826n13129L337847J310987o043274
11010d538943q236092j482953N047337L938852N7587k8973L69001l991011q273081
11001a7138276m453438M299055P551804L781211J202640K826200K608605j457816
$$ y = [-1156727, -3266274, -2821346, -2965574, -4912743, -6678987, -5403612, -1523197, 958759, -35341, -1203187, 1261507, 5659333, 7624135, 7074967, 7358068, 8508723, 7102121, 3039325, 662388, 1768642, 3018913, 2332797, 2410697, 4847696, 5835167, 1994951, -3334330, -4243395, -114899, 4696850, 6778372, 5481782, 1220029, -3923936, -5896080, -3223397, -124333, -900625, -3333115, -2654383, -29096, -674745, -4456001, -5643371, -2725452, -913548, -2631374, -3144503, 193344, 1504331, -4538943, -12775035, -14257988, -9210651, -5271799, -5214212, -5243185, -4874184, -8865195, -17138276, -21591714, -17292659, -9740855, -5959644, -4757004, -1930804, 677801, -780015]
10993g80015k432985K450893M782385j288179p535244l770271N223479O285693
10985B935756k093721q057940m350276K821905N053610K640468K84330q65987
10977a631855j966452k192780m42591J658840J958757P15287q96545k535326l098863
10968h431528o38751L822932N558339J917231l766607o456063m963721j039320
10960a3997488L804717P525367O829804J328469l759801l326193N69283J576295
10952E50453j850927m771197l464184m34863Q0005j628725j776164J013980L652789
10943h628833K975272M51582O05906M578530P437364M136166k953375n983297
10935B619315j778064L622660K971698k556439n507693k513736J836084J996898
$$ y = [-780015, -3213000, -762107, 4020278, 2732099, -4803145, -8573416, -3349937, 2935756, 842035, -7215905, -11566181, -8744276, -3690666, -1050198, -765868, -1631855, -3598307, -5791087, -6233678, -4574838, -2616081, -1900794, -2797339, -5332665, -8431528, -9070279, -5247347, 310992, 2228223, -1538384, -7994447, -12958168, -13997488, -10192771, -2667404, 4162400, 5490869, 1731068, -1595125, -1025842, 550453, -1300474, -6071671, -9535855, -9970718, -9890713, -11519438, -13295602, -12281622, -8628833, -5653561, -5201979, -4596073, -17543, 7419821, 11555987, 8602612, 2619315, 841251, 4463911, 7435609, 4879170, -628523, -3142259, -1306175, 690723]
10927F90723j549187m461520m939607m534701l567349R0351O131920R250165N234912
10918B345707j986993m174509J12505L346602L5779n222562m801082R19368N063499
10909d361686M246896J156104j366647k793072k202479P50315K359036j242665
10901c454198o455286n498138J536138N577302K191514j525741J615545P412723
10893A399859O722213j155152q226838q506625l399019K094845M129894K108388
10885d832435q18414p41114J686310J862309j049618j721292K724527O841184
10877C951457M650613j043966l132677o48021J641685J618428J116985K54077
10869H408581k837656o636884o487633j238158M618949O249624K991081k180197
$$ y = [690723, -858464, -5319984, -10259591, -14794292, -18361641, -18271290, -12139370, -2889205, 2345707, 358714, -3815795, -3703290, -356688, -320909, -5543471, -10344553, -9425185, -4361686, -114790, 1041314, -325333, -3118405, -5320884, -4570569, -2211533, -3454198, -9909484, -15407622, -13871484, -8294182, -6102668, -7628409, -6012864, 1399859, 8122072, 6966920, -1259918, -9766543, -13165562, -11070717, -6940823, -4832435, -5650849, -6391963, -4705653, -2843344, -3892962, -5614254, -2889727, 3951457, 8602070, 7558104, 4425427, 3777406, 5419091, 7037519, 8154504, 8408581, 5570925, -1065959, -7553592, -8791750, -4172801, 2076823, 5067904, 2887707]
10861B887707n061366l143260J325916K927427J63192j990778K26168L150544
10853D85550J995472o96681N28884M172029L925011q23243m336710m024785l078257
10844a852730l104264j467286K368698M382746K293684r16103j982178j420270
10836a697703q03347l6794J017791J579179J525759R91643j177011m914371o224439
10827i739293k054670L310090K985946j883524l332399J131149N085973L861483
10819f35245J018574R33034J743580Q000k992247l926591k283797P52079M224204
10810a158409N573080J698546n171660p816059l784243L97780r30053l776379
10802a4967397j252493N061076P291456K865610k385804k612419J352960M396422
$$ y = [2887707, -2173659, -5316919, -3991003, -1063576, -900384, -2891162, -2664994, 485550, 2481022, 1784341, 2313225, 6485254, 10410265, 9587022, 5250312, 1225527, -1852730, -4956994, -6424280, -4055582, 327164, 2620848, 1704745, -277433, -1697703, -2501050, -2537844, -1520053, 59126, 1584885, 2576528, 1399517, -3514854, -9739293, -11793963, -8483873, -5497927, -7381451, -10713850, -9582701, -4496728, -635245, 383329, 1316363, 3059943, 3067943, 75696, -3850895, -6134692, -5382613, -1158409, 4414671, 6113217, 941557, -6874502, -10658745, -10260965, -11191018, -14967397, -16219890, -11158814, -3867358, -1001748, -3387552, -5999971, -4647011, -250589]
10794b50589L167966r75241l608789j927356J816383K953293O10952j381337m48684
10785d3402J247644P63932j486121l389117l925021k703143Q0269J856876k38293
10776g836376l889726k847826L890126R069191O798663M94630k975066k657124
10768D6492j981337j622144K74683L043045M121009L318904K046794N1918k783696
10759F515668l581556l06516L408678K550806j548223l221326j243484J92062
10751B766109q70427j452036L03161J698042K74590j961002j560601J606650M398825
10742E203311L682479r65599o278012p418781l204497J610423J946988q44824
10734f268512j476226R81296K065947n09727l277818k660092J26708K102761K799745
$$ y = [-250589, 2917377, 1942136, -1666653, -3594009, -1777626, 1175667, 1786619, 405282, -43402, 1204242, 1968174, 482053, -2907064, -6832085, -9535228, -9454959, -7598083, -7836376, -11726102, -14573928, -10683802, -1614611, 5184052, 5678682, 2703616, 46492, -1934845, -3556989, -3282306, -239261, 3881748, 7200652, 9247446, 9299364, 6515668, 2934112, 2627596, 6036274, 8587080, 7038857, 3817531, 2574047, 2766109, 1895682, 443646, 746807, 2444849, 2719439, 758437, -802164, 804486, 5203311, 8885790, 7920191, 1642179, -5776602, -8981099, -7370676, -5423688, -6268512, -7744738, -6763442, -4697495, -5207222, -8485040, -11145132, -11018424, -8915663, -6115918]
10725f115918K873632J602764j151931k822978j160502K026514K920203O24492
10717a203724k145541k591494l26312K851160M250187K384489r32196j924840
10709C61729L74456K460205J190885j757076k708620j296195J68165R42013J710385
10700A445947J456613j091535l504795k141697J305508J387580j956662k280046
10692e379087K701048O159235K712621k385952j525639K860587K798301j607113
10684F334001k913880L69931J625844j557377l152136q0389J751461k037618o159892
10675e820055m463810J67752J804618J275881K295896L032878P0583l232325j380633
10666f249215K970902K571897k137012l658914j10361K111064l58445k688927
$$ y = [-6115918, -3242286, -1639522, -2791453, -5614431, -6774933, -4748419, -1828216, -1203724, -3349265, -5940759, -6267071, -3415911, 834276, 3218765, 2286569, 361729, 736185, 3196390, 4387275, 2630199, -78421, -1374616, -1206451, -264438, 1445947, 2902560, 1811025, -1693770, -3835467, -2529959, -1142379, -3099041, -5379087, -2678039, 3481196, 6193817, 3807865, 2282226, 5142813, 7941114, 6334001, 3420121, 3790052, 5415896, 3858519, 706383, 625994, 2377455, 339837, -5820055, -10283865, -10116113, -8311495, -7035614, -4739718, -1706840, -1636257, -4868582, -6249215, -3278313, -706416, -2843428, -6502342, -6612703, -4501639, -4860084, -7549011]
10658g549011q05445K190434K323302J129465J473057K014096L81519j739865
10650e82448j097716J645726K564713k45765m357530n693036k619857K256300
10642h129613M560879L030076P43134M16247P46697l25580j397426j65341J991408
10633A470481K067526M06039m20046q9734Q6683L92666J169371L13363l149338
10624B247011n544561l605071j55403P81523J035113L678055N111355L36235o610191
10615b725934p128584j475522K209069J468493J606859M120764M174087J116810
10607C366042N12395L122545K641335k221974m068547L95641M065590J240876
10599I053903l518048l940841j045359J752705M313705N432130J377451n766414
$$ y = [-7549011, -8354456, -6164022, -3840720, -2711255, -1238198, 775898, 1157417, -582448, -1680164, -34438, 2530275, 2284510, -2073020, -7766056, -10385913, -8129613, -3568734, -538658, 204476, 620723, 1367420, 1041840, -355586, -520927, 1470481, 3538007, 3944046, 3524000, 3434266, 3520949, 3913615, 5082986, 5396349, 2247011, -3297550, -6902621, -7058024, -6276501, -5241388, -1563333, 3548022, 3884257, -2725934, -9854518, -11330040, -9120971, -7652478, -6045619, -1924855, 2249232, 3366042, 3878437, 7000982, 9642317, 7420343, 3351796, 3747437, 7813027, 9053903, 5535855, 1595014, 549655, 2302360, 6616065, 12048195, 13425646, 7659232]
10591G659232p135831n13067M318833N10086m837079k896536K495669K716329
10583B317636q04205q31896J942652R94535l332719m209644k17083K842998J999415
10574G01689N61387P91240M41189j750125k913093p58243K331562K258743j424800
10565B39549m733333l850452J32551K636093K238380K607639N320293N372525
10557I963245p40514o949870n510804N26475K220987o31280q24112K113822J742499
10548A910448j604442n37891M748947N525629N06843j578416J493553J449789
10540A1914460l783447n237209l16644J211518m351215o694445m30897M479768
10532c208111J055697k197352J787780N070758M67383m174335p50957M008229
$$ y = [7659232, 523401, 10334, 4329167, 4839253, 2174, -2894362, -398693, 2317636, 1513431, 681535, 2624187, 3618722, 286003, -3923641, -4140724, -1297726, 701689, 1263076, 2054316, 2495505, 745380, -2167713, -2925956, -594394, 1664349, 239549, -4493784, -8344236, -8211685, -5575592, -3337212, -729573, 4590720, 9963245, 9222731, 2272861, -3237943, -2711468, -490481, -1121761, -1945873, 167949, 1910448, 306006, -231885, 4517062, 10042691, 10549534, 8971118, 10464671, 11914460, 8131013, 2893804, 2577160, 3788678, -562537, -7256982, -7687879, -3208111, -2152414, -4349766, -2561986, 2508772, 2976155, -1198180, -1949137, 2059092]
10524B059092J627463l081310k880129r17198p55347K270145Q173553O682950
10516A3179219l516483p633803K07273M710892l108861q309053L71721Q556956
10508D457861K851896m126123J046775O300016q60905o625452J834061Q083222
10500A2961351k342078r834759L496291J5321060L043009r261103N042303J7612509
10492C6038583m388549k3466087R394681M4913557j0005656j26026373j55890814
10485b29430658m1557150R0753136J04654683L0589758j1823769O587418K1411139
10478b8815443M656460o206430N329025R966614k238675m834858Q319212J0435710
10470c388385m550273r852557K433269P196773m573718r029768M265970J2094056
$$ y = [2059092, 3686555, 605245, -2274884, -3192082, -3947429, -1677284, 6496269, 13179219, 9662736, 2028933, 2236206, 6947098, 3838237, -4470816, -4099095, 4457861, 7309757, 3183634, 4230409, 10530425, 9669520, 3044068, 4878129, 12961351, 10619273, 784514, 4280805, 19601865, 22644874, 13383771, 18426074, 36038583, 31650034, 8183947, 17578628, 62492185, 52486529, -73539844, -229430658, -270987808, -180234672, -75579989, -44990231, -56814000, -50226582, -28815443, -24158983, -30365413, -25036388, -15069774, -17308449, -22143307, -13824095, -3388385, -7938658, -17791215, -15357946, -8161173, -12734891, -21764659, -17498689, -5404633]
10462e404633J49499j2084806o938620L874078M960945J739940K505525J604024
10454i594048m011652m482771K991824N588636j702297n648432Q23484N648677
10446a0386579Q82185k822645K094016M952010k365606q827330l567497N359720
10438a4681726O352781K829324K190708R71604m675805p237092q85036N777752
10430i357490L551883k001631j809883J111491K687k201600m26873J448123n73059
10421a0256352m79691O351766J1244773N316738m133208m669632J138843J606564
10413F119801l563951m194978J682456M847802P26046m266424l955274l23654
10405b928176J838415J052136j455972l234556j439223L482658O236552L083868
$$ y = [-5404633, -5255134, -17339940, -24278560, -20404482, -15443537, -13703597, -11198072, -9594048, -13605700, -18088471, -15096647, -9508011, -11210308, -16858740, -16035256, -10386579, -9504394, -12327039, -10233023, -5281013, -7646619, -16473949, -20041446, -14681726, -8328945, -5499621, -3308913, -2337309, -7013114, -14250206, -15135242, -9357490, -5805607, -7807238, -9617121, -8505630, -8502943, -10704543, -11131416, -9683293, -10256352, -10736043, -4384277, 6860496, 12177234, 8044026, 3374394, 4513237, 6119801, 2555850, -1639128, 43328, 4891130, 5617176, 1350752, -2604522, -2928176, -1089761, -37625, -1493597, -4728153, -6167376, -2684718, 3551834, 6635702]
10397F635702k319911l926990j461865J168279K478918K886902P09737m679205
10389A491567p916392l330131M986318O316355j977309r564574o389749M087571
10381a2296344R672353M917010l516327o900634m466642p31488K542690O158797
10373d620585P752489L688107l009470m388032N09525L349498k00931l446541
10365c65940o42851K868657P58242k357439K73345L849963r3756p247614o222776
10356i180169K066915N555695J010658k076359Q16789K303574k184789n976313
10348g663999l148722J990884L247011J282135r21365l012711l597046J26121
10340a1697692N482559N504072J69172k414570Q71042L470555J140978j488944
$$ y = [6635702, 4315791, 388801, -1073064, 95215, 2574133, 5461035, 6170772, 1491567, -6424825, -9754956, -4768638, 1547717, -429592, -9994166, -16383915, -12296344, -2623991, 2293019, -1223308, -8123942, -12590584, -13322072, -10779382, -4620585, 3131904, 6820011, 3810541, -577491, -67966, 3281532, 3080601, -365940, -1008791, 1859866, 2618108, 260669, 534014, 4383977, 4290221, -2957393, -9180169, -7113254, -1557559, -546901, -2623260, -1806471, 497103, -1687686, -7663999, -10812721, -8821837, -5574826, -4292691, -5214056, -8226767, -11823813, -11697692, -6215133, -711061, -541889, -2956459, -2085417, 1385138, 2526116, 1037172]
10332A037172p71390l90024k697817l413198n23884R28957j352791j892959J730013
10323g345921K939578j820073m951091j81423N715353L532091l225790m267619
10315i604895J386580N313474K969684j449258k380848Q13699M280962L415898
10307D745296j981527n710810k650128K400427Q18599n223851m815019L460667
10299h956346P999677L176054j618001J035797L982914l33255n526739l184455
10291c424354J537832j64524m029169p06562O142902N218619k868434o535562
10283d829252k190812J781642L46076j487030P10910L908027M184848K307182
10275D731591L62558j292190k392296k470613k136930j425656R49589L586078
$$ y = [1037172, 265782, -124242, -2822059, -6235257, -6759141, -5830184, -7182975, -9075934, -7345921, -4406343, -6226416, -11177507, -11358930, -5643577, -2111486, -5337276, -9604895, -8218315, -2904841, 64843, -1384415, -3765263, -2951564, 1329398, 4745296, 2763769, -2947041, -5597169, -3196742, -2378143, -7601994, -12417013, -8956346, -956669, 2219385, 601384, 1637181, 5620095, 5286840, -239899, -3424354, -1886522, -2051046, -6080215, -6786777, -643875, 4574744, 1706310, -4829252, -7020064, -5238422, -4892346, -6379376, -5668466, -1760439, 2424409, 4731591, 5094149, 3801959, 1409663, -1060950, -3197880, -4623536, -3673947, -87869]
10267h7869K068149l147796m533350Q58570M342308j581303r773749q127905K113470
10258a7869475Q900903P152557K774301O36601n83950j944258k275109k567774
10250e776204m002791k901811L727823R708438O706139j874089m858228l96068
10242C33209K530384J12472j142151K136028L608929r17270n306864l101613K158743
10233D11867L114243o84221m054328l962406j243696K142865L881224K168698
10225A774246j442061k731864k39959K727358K805030L95501k181744l466013
10217b359506l059287j718175j421535k804072l152661O9616M716491O334574
10209c394555L954158K12741k689034l655253j540044K621033M648374K693350
$$ y = [-87869, 1980280, -1167516, -5700866, -4842296, -499988, -2081291, -11855040, -19982945, -17869475, -8968572, -1816015, 958286, 1594887, 1010937, -933321, -3208430, -5776204, -9778995, -12680806, -8952983, 755455, 7461594, 5587505, 729277, 333209, 2863593, 2976065, 1833914, 3969942, 7578871, 6661601, 1354737, -1746876, 411867, 3526110, 2841889, -1212439, -5174845, -6418541, -4275676, -394452, 1774246, 332185, -2399679, -2639638, 87720, 2892750, 3288251, 1106507, -2359506, -5418793, -7136968, -8558503, -11362575, -14515236, -14445620, -9729129, -3394555, 559603, 772344, -1916690, -5571943, -7111987, -4490954, 157420, 2850770]
10201B850770N78683J099125M35169m376985p329838j750048O946327P495065
10193E948268J19173l780840M12650M514169K015476k410511k544647m59533q44669
10184B969536k653343k410541n97428N39587J429583L003516L576229J665857
10176G522996r43176j867082j364558r88889j436086k706271l818841k487611
10168h089518J625022M284398J729271k896648l637268q79302L55049O4881K652122
10159d791993O536281M347340l960055q049819k038672O237832O829756J213304
10151F323974k645610k712060k630568l150745j626189J718847L509038K662743
10143A449430J390858J243385J763080K355282K533214J222240j599366l547580
$$ y = [2850770, 3429453, 4528578, 4963747, 586762, -6743076, -8493124, -1546797, 5948268, 6067441, 2286601, 2699251, 7213420, 9228896, 6818385, 4273738, 3814205, 2969536, 316193, -2094348, -2691776, -2152189, -722606, 2280910, 5857139, 7522996, 6579820, 4712738, 3348180, 2359291, 923205, -1783066, -5601907, -8089518, -6464496, -2180098, -450827, -3347475, -6984743, -7864045, -7508996, -7444115, -4791993, 1744288, 6091628, 2131573, -5918246, -7956918, -1719086, 5110670, 6323974, 3678364, 966304, -1664264, -4815009, -6441198, -4722351, -1213313, 1449430, 2840288, 4083673, 5846753, 8202035, 10735249, 11957489, 10358123, 6810543]
10135F810543k432506N36240J897213k53125m436546o981535n034014K14691L810743
10126e868296K536611q36279j501237N64638J571513M67633l69693m23178j561815
10117e420103l134605k213748N36381J004220j155761j303973K421945N781376
10109c484268N027904J589898j837761m528024n105471j532590L766826M556708
10101a546778n38640n530510n884981l749432j494736K718531Q369962Q871382
10093A214798J084687p161914o584934N49092M446010J938209j107557k57652
10085e879261K055054K257905Q98901L21050Q04295Q34056n77566k676349l448399
10076e410314j745440R00345K048808J843040K213079K785124J395295j009132
$$ y = [6810543, 4378037, 4914277, 6811490, 6558365, 2121819, -4859716, -9893730, -9679039, -5868296, -3331685, -4167964, -5669201, -5104563, -3533050, -3065417, -3435110, -3858288, -5420103, -8554708, -10768456, -10232075, -9227855, -10383616, -11687589, -9265644, -3484268, 1543636, 3133534, 1295773, -3232251, -8337722, -9870312, -6103486, -1546778, -2085418, -7615928, -13500909, -17250341, -18745077, -16026546, -7656584, 1214798, 2299485, -4862429, -11447363, -10898271, -6452261, -4514052, -5621609, -5879261, -3824207, -1566302, -667401, -346351, 457944, 1292000, 714434, -1961915, -5410314, -7155754, -6255409, -4206601, -2363561, -150482, 2634642, 4029937, 3020805]
10068C020805q49747J550611J503793j862522l157325J46746K661990K07289k274835
10059I46805J187226O651360N731354j140350n699096m765940l436441m982350
10051e507432n974393l711311j190507j059223m94958L426642P660566P393138
10043E42522L356841q548j714180m073535o102071l414295L409814O416354R44352
10034f42746n725733l268314O265344J0330420L939806l290611k192516K559904
10026G975554J499578m028518n253323j110809Q70063k113267m346142k289989
10018h796853L01683K93886j18364N74472O1073j908921j679737J221156K182789
10009g868816k77757j745308n80937j261930m749755m115156L943068J0953086
$$ y = [3020805, 2171058, 3721669, 5225462, 3362940, 205615, 352361, 3014351, 3221640, 946805, 2134031, 8785391, 14516745, 13376395, 7677299, 2911359, -525082, -5507432, -11481825, -15193136, -16383643, -17442866, -17937824, -14511182, -6850616, 542522, 3899363, 3890815, 2176635, -1896900, -7998971, -11413266, -8003452, -1587098, -642746, -6368479, -9636793, -3371449, 6958971, 10898777, 7608166, 5415650, 7975554, 9475132, 5446614, 193291, -917518, -47455, -2160722, -6506864, -8796853, -8495170, -8201284, -8319648, -7745176, -7684103, -9593024, -11272761, -10051605, -7868816, -8146573, -9891881, -10472818, -11734748, -16484503, -20599659, -16656591, -5703505]
10001e703505P893071j345979n920034l114923O21491Q02297o44056p70271P26058
9992g455851K757473L669805J963825j090615k004881l76161J73953j531320k046887
9983e940659k38687J01701j747272l55055N630870Q087919J546872o535004o342059
9974e791374l25518K298123L78556k16387J538460J727272N98440J447922K392092
9965D047586p24055m913966l630145J618623L438391J173858O85221K322799P41678
9956D759990k983082j435914M899714N939342j473079p191275l735795K097776
9948H77677J084081l963901m357154K94190L079304J206998j469853j511250N89119
9939d170789K883446L710984K126157n25766j289370O6750K55690j871638k621058
$$ y = [-5703505, 2189566, 843587, -5076447, -8191370, -7569879, -6767582, -7411638, -8181909, -7455851, -4698378, -1028573, 935252, -155363, -2160244, -2536405, -2362452, -3893772, -5940659, -6179346, -6077645, -7824917, -8179972, -2549102, 5538817, 7085689, 550685, -5791374, -6116892, -3818769, -3440213, -3656600, -2118140, -390868, 207572, 1655494, 4047586, 3323531, -1590435, -5220580, -3601957, -163566, 1010292, 1695513, 4018312, 4759990, 1776908, 340994, 5240708, 11180050, 9706971, 2515696, -1220099, 877677, 1961758, -2002143, -6359297, -6065107, -2985803, -1778805, -3248658, -4759908, -4170789, -1287343, 2423641, 4549798, 4024032, 2734662, 2801412, 3057102, 1185464, -1435594]
9930a435594N59723M069832L096018j171186l455593j867192M50511M89417j038945
9921c03009j580445k33149J373862J339628K16061L60538J987866J953908j573138
9912C542122n503592n858186l168311k58283K681178O009298O504534J868212
9904E816972k735089n43267N321148N142013k159589o826857l612534O99248m53856
9895F48189l198040j768952R97154j93589k823921j226521K929312L547383N95599
9886d93386o54932Q80026J284193m33410r70973N51690J120711j36574j90775
9877I56570K471622N464196O483837N442988K179860l400103q171323p532102
9869C895545j876324K750627K209968j131142l033815k879492k182050r79771
$$ y = [-1435594, -875871, 3193961, 6289979, 5118793, 1663200, -203992, 246519, 735936, -303009, -1883454, -2116603, -742741, 596887, 812948, 1173486, 3161352, 5115260, 3542122, -1961470, -7819656, -10987967, -11246250, -8565072, -2555774, 3948760, 5816972, 3081883, 2538616, 7859764, 13001777, 10842188, 4015331, 402797, 1102045, 648189, -2549851, -4318803, -3321649, -3515238, -6339159, -7565680, -4636368, -1088985, -493386, -1148318, -268292, 1015901, 582491, -388482, 163208, 1283919, 1147345, 956570, 3428192, 8892388, 15376225, 20819213, 22999073, 19598970, 11427647, 3895545, 2019221, 4769848, 6979816, 5848674, 2814859, -64633, -2246683, -3226454]
9861c226454J091633K303410O82559k636158m506174l675448j569692K69454J532206
9852i734664K215309K244296K054459J981853J192242j012343k951520k079918
9844f090286P35316J411359j283234l058901n09697K875348J905694j292732j44696
9835e451829M752962M895513k677114r164625o465586J012940L978090J873197
9827g246452L22080l22995l411185n703059n37100Q692870J0280872J837308n381565
9818a469226l811959J91183n85094k186674R33673M236448J612292k376400n76614
9809d032371K801229o00741o732809m389766M955215P982276J255455l309072
9801b070584J169969N551584J466162m183757j907562L781107K866284k519295
$$ y = [-3226454, -2134821, 168589, 851148, -1785010, -6291184, -9966632, -11536324, -11266870, -9734664, -7519355, -5275059, -3220600, -1238747, -46505, -1058848, -4010368, -6090286, -5354970, -3943611, -5226845, -8285746, -8795443, -5920095, -4014401, -5307133, -5451829, -698867, 4196646, 1519532, -7645093, -14110679, -13097739, -9119649, -7246452, -6924372, -7247367, -10658552, -16361611, -16898711, -8205841, 2075031, 3912339, -1469226, -5281185, -5090002, -5675096, -7861770, -6928097, -2691649, -1079357, -3455757, -4032371, -1231142, -1831883, -8564692, -12954458, -7999243, -16967, 1238488, -2070584, -900615, 4650969, 6117131, 1933374, 25812, 3806919, 6673203, 4153908]
9793D153908k392088L314433M828489o91430n197061l931646k002379l414155
9785e331929l769956Q43802N857885N259111O47081k582755l252525l053584j585386
9776f968256J430299K665374j19264l011816j635213J073468m21750m196371l492365
9767a4675894J548231L405338n00526l435689l56821M127470L455831r46994k849793
9758a0228847n00963K487646L194631J904972Q1197p77819M29633K667963L200183
9749B458596J588496N70831J021842j79685m225201o464365k978690K334799K833726
9740c039651q88829k101995J710037N386269L788990j585846n270228m274003
9732f275256o28454J210748n70316k425815J73839N215074N362281j004006n586541
$$ y = [4153908, 1761820, 5076253, 9904742, 9213312, 4016251, 84605, -1917774, -5331929, -9101885, -8258083, -2400198, 2858913, 3505994, 923239, -2329286, -5382870, -6968256, -5537957, -2872583, -2991847, -6003663, -7638876, -6565408, -6987158, -11183529, -14675894, -13127663, -9722325, -10222851, -13658540, -14015361, -9887891, -6432060, -7379054, -10228847, -10729810, -8242164, -5047533, -3142561, -3061364, -3839183, -3409550, -741587, 2458596, 4047092, 4617923, 5639765, 5460080, 1234879, -5229486, -8208176, -5873377, -3039651, -3928480, -6030475, -4320438, 1065831, 4854821, 3268975, -2001253, -6275256, -6903710, -5692962, -6263278, -8689093, -8515254, -3300180, 2062101, 1058095, -4528446]
9723d528446j887289M371027L876686j615718k757186J584427K897310k008072
9715f7261n549456k307382K271224J509422k004432k050424J010245K508652J804540
9706b874872J658080J913114K6267l364100m625829k503922N75980K190376J919838
9697e085068L54508j298854j350475N01188K319819K540175J971640J697073R95739
9688B645745p12358j878098r67622J107806K576790K979261K178883l24969l213683
9679D391755l392462p11166M50367k436670n169988k654775K800421M347517P19906
9670a655095k123623l7688L775448M247389J426066q68829p55290M02008J090452
9661E500838J252282J006212k4034j614241k631874k494373j911961j496523p16309
$$ y = [-4528446, -6415735, -2044708, 1831978, 216260, -2540926, -956499, 1940811, -67261, -5616717, -7924099, -5652875, -4143453, -6147885, -8198309, -7188064, -4679412, -2874872, -1216792, 696322, 722589, -2641511, -7267340, -9771262, -9195282, -7004906, -5085068, -4730560, -6029414, -7379889, -6878701, -4558882, -2018707, -47067, 1650006, 2645745, 1933387, 55289, -912333, 195473, 2772263, 5751524, 7930407, 7605438, 4391755, 999293, 288127, 738494, -1698176, -6868164, -9522939, -6722518, -2375001, -1655095, -3778718, -3816406, -40958, 4206431, 5632497, 4763668, 4008378, 4410386, 5500838, 6753120, 7759332, 7735298, 6121057, 3489183, 994810, -917151, -2413674, -3129983]
9652c129983O11466Q61361j274370l560014j894953L880104Q451881P112067J370269
9643A2427828l487894m572653k821367j07018K115974K407910N09375j670668
9635D801487k457365k755835l906233m955432m652487m009909l715565j570972
9627b3222311L342656O613746M046626p73157p95514L747069N803902K549648
9619A312665j256957j876833j372534j809564j403265P23487J762211J87121j448283
9610e181952j090685J51737J477048L177077K968720j752650o708037m042858
9602a1001600M591468P622515O87719n700414k448433L826058K432848l614218
9594c604057l679968J784514K162176n001656r505235m406999M273181P709480
$$ y = [-3129983, -2518517, -1657156, -2931526, -6491540, -8386493, -4506389, 3945492, 11057559, 12427828, 8939934, 4367281, 1545914, 1438896, 3554870, 5962780, 6472155, 4801487, 2344122, -411713, -4317946, -9273378, -13925865, -17935774, -21651339, -23222311, -19879655, -13265909, -9219283, -9992440, -10787954, -7040885, -1236983, 1312665, 55708, -1821125, -3193659, -5003223, -6406488, -5683001, -3920790, -3733669, -5181952, -6272637, -6120900, -4643852, -1466775, 1501945, -250705, -6958742, -11001600, -6410132, 1212383, 1900102, -3800312, -6248745, -2422687, 10161, -3604057, -7284025, -5499511, -3337335, -8338991, -17844226, -22251225, -17978044, -10268564]
9586a0268564N769754L503593K350825L94818k125221k619554m32698J997636
9578a429411K352543J024527n7557m03570j385298l057111k617854J218478M142005
9569b13248J348306l994950l766437K708063O556824K388138m051196n459752
9561d484252k800007o5190L219084P119154O167218j847909q070657l948746M411518
9552b99787M743794k070208m104396J509848M440205q82369o210942l448057K950889
9543c371023M151304j84398l785275l261851k02082K461945K306032r69205l411894
9534f266447m40568N654603P011872J144571n159429n756193k995948j779256
9526h586795j502896Q67356M068649M499434K156205j91579j586042k458460j755383
$$ y = [-10268564, -4498810, -995217, 1355608, 1750426, -374795, -2994349, -3427047, -1429411, 923132, 1947659, 1890102, 1486532, 101234, -2955877, -5573731, -4355253, -213248, 1135058, -2859892, -6626329, -3918266, 2638558, 5026696, 975500, -4484252, -7284259, -7349449, -4130365, 2988789, 9156007, 7308098, -762559, -4711305, -299787, 4444007, 2373799, -1730597, -220749, 4219456, 3337087, -2873855, -6321912, -3371023, 780281, 595883, -3189392, -6451243, -6653325, -4191380, -1885348, -2854553, -6266447, -6707015, -1052412, 5959460, 7104031, 1944602, -3811591, -6807539, -8586795, -10089691, -9222335, -5153686, -654252, 1501953, 1310374, -275668, -2734128, -4489511]
9517d489511J250033L830252K616783j264120l427894k170955n1557L82195l73926
9508c698700o25236k78780n36297j542158j638647L68664K874503L083651J138802
9499h54198K30706J474005J776170o99602k330994M55237M197345K663002l148674
9490C762997n647515j716583L017045K779444q39516k714555j353679Q31376J584237
9481b96749N02505j446729k387730j043673J375222K346193J178765p73486k357026
9472b902708k788189r03393K592526L681816j4832m185883k722913L097050N816452
9463A669926K163160l299065n384783l842102r26156J585468K157247P17375J25685
9454e033245K034095K747942r93827m413503r95686N396478N035939j356625k943269
$$ y = [-4489511, -3239478, 590774, 3207557, 1943437, -1484457, -3655412, -3706969, -3324774, -3698700, -4323936, -4602716, -5139013, -6681171, -8319818, -7951154, -5076651, -1993000, -854198, -623492, 850513, 2626683, 1927081, -403913, 51324, 4248669, 6911671, 3762997, -1884518, -3601101, -584056, 2195388, 1355872, -1358683, -2712362, -1880986, -296749, 205756, -1240973, -3628703, -4672376, -3297154, -950961, 227804, -545682, -2902708, -5690897, -6594290, -4001764, -319948, -334780, -4520663, -7243576, -4146526, 1669926, 3833086, 534021, -4850762, -8692864, -9619020, -8033552, -5876305, -5158930, -5033245, -2999150, -251208, -1245035, -5658538, -6654224, -1257746, 3778193, 2421568, -521701]
9445e21701K686103M665389k517879q909007n587603Q85077Q24460k358550n06429
9436a1340140L367784J291718l676601k165709M386456N725322M01811k642112
9428d651471l44612M38891k695971k761026K739289N319626m01106o504527l949530
9419a2810437L072638M210490j053688m076379j068304K660935K509972R51069
9411e603704J852805L907449L261510r7514k161993o26271J911669J526877j785718
9402B185110m381812m083634k553271j780855q56074J683506M397369M694637
9394f95024K777236R67821M7837p98666j229663k57527Q85764p9968k328494k529401
9384c240085k52887Q77566j101962l022342j291843K378478L131865j02017k935871
$$ y = [-521701, 2164402, 6829791, 4311912, -4597095, -10184698, -9299621, -8475161, -10833711, -11340140, -7972356, -6680638, -10357239, -12522948, -8136492, -2411170, -2009359, -4651471, -4996083, -4557192, -7253163, -10014189, -7274900, -1955274, -2356380, -8860907, -12810437, -9737799, -5527309, -6580997, -10657376, -11725680, -9064745, -6554773, -5603704, -3750899, 156550, 3418060, 3320546, 1158553, 532282, 2443951, 3970828, 2185110, -2196702, -6280336, -8833607, -10614462, -11470536, -9787030, -5389661, -695024, 2082212, 3050033, 3097870, 2299204, 1069541, 812014, 1697778, 1617810, -710684, -3240085, -3492972, -2615406, -3717368, -6739710, -8031553, -5653075, -2521210, -2623227, -5559098]
9375e559098j423576K601742L965050J170014j534336k28563K823684K377614
9367D192531j808236m314218j982781J812161K738204J188462n18485k497409
9359a189771m690075l674144K269063P511018N130560k479507n976170k213574
9351e312600K111755J517999q86188o33232J66082k210162m961587k515421L796767
9342h926587O570850K763943k466951l561047j386745m7514n47461p69541K54089
9333h116964J198680J063088N85909Q39257J854092K835549K731630O91859k785108
9324H97992n140361l857794J0942K105365O0484k814393j568092L243155N594744
9315a467958K105379k989515l484843L60394K740611R72329j114028J66391K291538
$$ y = [-5559098, -6982674, -4380932, -415882, 754132, -780204, -1008767, 1814917, 4192531, 2384295, -1929923, -3912704, -2100543, 637661, 1826123, 1307638, -1189771, -5879846, -9553990, -7284927, 226091, 5356651, 2877144, -3099026, -5312600, -3200845, -1682846, -2569034, -3202266, -3036184, -5246346, -10207933, -12723354, -8926587, -2355737, 408206, -2058745, -5619792, -7006537, -7054051, -7601512, -8371053, -8116964, -6918284, -5855196, -5269287, -4430030, -2575938, 259611, 2991241, 3683100, 897992, -4242369, -8100163, -8089221, -5983856, -5923372, -8737765, -10305857, -7062702, -1467958, 637421, -2352094, -5836937, -5476543, -2735932, -1763603, -2877631, -2711240, -419702]
9306d19702O36449l666145m624029j11190M749143M638549Q37927j844761k049467
9297a853226j879312j725439J64619L025775L187399k00081k925385j457639K034225
9288a629064K961889M83986k146105k074323L30010K326881J463841j595959k961522
9279b840366l14988K854016J627387k134595j719031L301181N047385k37855n257437
9270C25697k855306K675791L103598n11059j108347J825399K689753K97397j667531
9261D775392l003400n882944o616612M76720J0625589J1520523J120658q120944
9253D894982o501903J158021N217964L585529n04153m841284p145074m688673
9245h824591M43434K376424R11246J999976N829612M568110l279857p414753j807100
$$ y = [-419702, 216747, -3449398, -8073427, -8184617, -3435474, 1203075, 2041002, 196241, -1853226, -3732538, -5457977, -5293358, -2267583, 919816, 719735, -2205650, -3663289, -1629064, 1332825, 1816811, -329294, -2403617, -2073607, 253274, 1717115, 121156, -2840366, -3155354, -301338, 1326049, -808546, -2527577, 773604, 5820989, 5583134, 325697, -2529609, 146182, 3249780, 2738721, 1630374, 3455773, 6145526, 6442923, 4775392, 1771992, -4110952, -10727564, -10250844, 374745, 11895268, 13015926, 4894982, -1606921, -448900, 4769064, 8354593, 7850440, 3009156, -4135918, -8824591, -8381157, -6004733, -5093487, -3093511, 2736101, 7304211, 4024354, -3390399, -5197499]
9236e197499M526139J974449m229983l869471J311781K575536l61931j255699
9228d526678J17861n15224j712583M27186K222994j980770o961282k765032P486169
9219h207359R910262J042250o904197n135719L1099j32208l328603k612886J848289
9210a3489072M835742M702033L552276K197356O0433j982053k338903r63211J069038
9201b356361K729409K917010J099614j420943k656723k231442r88066N87534J759645
9192e60323J216805n50561r30951O41265J413305L53620J3693Q17088n15381l295671
9182a397111j304165N596363P134917j788814j0108247o279474L092328L952408
9174a101795k483070l705599J629384K858950k255369m129362J37794K118483
$$ y = [-5197499, -671360, 1303089, -2926894, -6796365, -5484584, -2909048, -3270979, -4526678, -4408817, -4924041, -6636624, -6209438, -3986444, -5967214, -12928496, -15693528, -8207359, 1702903, 2745153, -4159044, -9294763, -9263664, -9395872, -12724475, -15337361, -13489072, -8653330, -3951297, -399021, 1798335, 1858768, -123285, -2462188, -3425399, -2356361, 373048, 3290058, 4389672, 2968729, 312006, -1919436, -2907502, -2319968, -560323, 656482, 105921, -825030, -183765, 1229540, 1583160, 1596853, 2413941, 1898560, -1397111, -2701276, 2895087, 10030004, 8241190, -1867057, -8146531, -5054203, -1101795, -3584865, -7290464, -5661080, -2802130, -5057499, -9186861, -9049067, -6930584]
9166f930584q76964q64573M066248M624637j832976m491497J941372O896914K156661
9157D689238m096083k514204J449309o59149m314855j561708L296469J860136
9149a850847k427648r15484L933967L180020k287755l984148j048963K3971j620523
9140f997410j335257k32821l416676p831786m853032M398406Q863758M631428
9132f773390L35010K193174M863356K338818j664737r20044K760573L276994J06140
9123F515894k075211j242143J6912l33775r31778k6126J330271P28478j736622
9114B245900k966259j203033Q77734R096k032231q08227L020996L706781n16215
9105B334542m075045k414926J730921L752747L487062K279187p46980m787314
$$ y = [-6930584, -7807548, -8672121, -4605873, 18764, -1814212, -6305709, -4364337, 2532577, 4689238, 593155, -1921049, -471740, -1130889, -5445744, -7007452, -3710983, -1850847, -4278495, -5193979, -1260012, 1920008, -367747, -4351895, -5400858, -5376887, -6997410, -8332667, -8565488, -11982164, -19813950, -24666982, -20268576, -11404818, -6773390, -6438380, -4245206, 618150, 2956968, 1292231, 372187, 3132760, 6409754, 6515894, 4440683, 3198540, 3215452, 2881677, 1949899, 1923773, 3254044, 3982522, 2245900, -720359, -1923392, -1045658, -1036562, -3068793, -3877020, -856024, 2850757, 2334542, -1740503, -4155429, -2424508, 1328239, 4815301, 7094488, 6347508, 1560194]
9097A560194n099930q8584M333528L182531J02554K61440R85602k499331o602472
9088c864468m160593K984052N954664K493657o44680N88197K130158R1972k910367
9079B662592k830399m60959M24021j745494m833638n217973j538954K877572L337093
9070g326139N42056N4870L037485L343787k163267o939458m586370Q42774K157655
9061a1036607R92433L083327O204923L593754l268505o168780l240820k65150
9053a0105425L58674J759856L961791L287338Q01217J474861M312538L187506
9045I038356j673839l216526J38848K004976l20626k011160q38223q30807k980148
9036f89149k531129J184411K350976m57125j349838J276325J185408l227541m459602
$$ y = [1560194, -3539736, -3628320, 705208, 3887739, 3990293, 4251733, 5237335, 2738004, -3864468, -8025061, -5041009, 913655, 3407312, 2762632, 3350829, 5480987, 5572959, 2662592, -167807, -628766, -204745, -1950239, -6783877, -12001850, -13540804, -10663232, -7326139, -6784083, -6729213, -3691728, -347941, -2511208, -9450666, -14037036, -13194262, -11036607, -10044174, -6960847, -755924, 2837830, -430675, -6599455, -9840275, -10105425, -9746751, -7986895, -4025104, -737766, 63451, 1538312, 5850850, 9038356, 7364517, 4147991, 4286839, 6291815, 5971189, 3960029, 3121806, 2290999, -689149, -3220278, -2035867, 315109, -142016, -1491854, -215529, 969879, -2257662, -6717264]
9027f717264M14256L259666q24894m213898l02563M574838K777559j063571N77851
9018a518020L810970Q16645n142606n041573M10811K954744R04957o28189p52711
9009d184972k552968m005867m35175N264915N654509J157435r68342N87859K2931
9000E40325l952789n914625m082208k791084l214198j345110L045139N000669
8992a2713881L842871M313836O078355K691344n346541p585316L51540P874100
8984d93692M537486m298942o256415k15989M309673K529685q92120j548527r30576
8975c259417j165244r14761J145681L235748L076600R38947j233187j959918j025840
8966a161391L43682J98861j813684l358736k224098M22649J423722r7032j689936
$$ y = [-6717264, -6303008, -3043342, -3868236, -8082134, -8384697, -3809859, -1032300, -2095871, -1518020, 2292950, 3109595, -2033011, -7074584, -6663773, -3709029, -2804072, -3432261, -4184972, -6737940, -10743807, -11178982, -5914067, -259558, 897877, -70465, 517394, 540325, -3412464, -9327089, -13409297, -16200381, -19414579, -20759689, -17714550, -12713881, -8871010, -4557174, 1521181, 4212525, -1134016, -8719332, -8367792, -493692, 4043794, -255148, -6511563, -6727552, -2417879, 111806, -780314, -2328841, -3259417, -4424661, -5339422, -4193741, -957993, 2118607, 3057554, 1824367, -135551, -1161391, -817709, -618848, -2432532, -5791268, -8015366, -7592717, -6168995, -6266027, -7955963]
8957g955963r22921J617492L122793J791338j072853k445240j233830M15250N03261
8948f180673M09191K299648M486599L186072j124012l546188k111140n96411j681484
8939d858398k136327J150411M511958K473327l128189n219423j909096J337451
8931g778286O36887j060654P6052K503924K632399J097042J477223M102422M964112
8922H651121J150379n062185q512321o595517j728002J572755J749551J448430
8914g325789L133302N108351M233145J418531N61563J839827Q56652l487217n312629
8905A025736l86782N533320L449596n467635j0414493n576703K686816N825718
8897c324427L913953K082042J354462p71640l572518l561514r07640N03774l30196
$$ y = [-7955963, -8878884, -7261392, -4138599, -2347261, -3420114, -5865354, -7099184, -6683934, -6180673, -5771482, -3471834, 1014765, 4200837, 3076825, -469363, -2580503, -3176914, -4858398, -6994725, -5844314, -1332356, 1140971, -1987218, -7206641, -9115737, -7778286, -7141399, -8202053, -8126001, -5622077, -2989678, -1892636, -415413, 3687009, 8651121, 9801500, 4739315, -3773006, -10368523, -12096525, -10523770, -8774219, -7325789, -4192487, 915864, 5149009, 6567540, 7129103, 8968930, 9825582, 6338365, 1025736, 638954, 6172274, 9621870, 4154235, -6260258, -11836961, -9150145, -3324427, 589526, 2671568, 4026030, 3254390, -318128, -3879642, -4787282, -4283508, -4613704]
8888d613704k53073J799903K502407K2741k498892k078653m05025L0671N95508
8879d898117L145578M941609K020099l810912o490341l958232n7547K176551L997580
8870b933732O090396N377877K47840m854337m730130j117848n5353k491427l066706
8861g533420Q30688M285453K302017k126316k210115K389407M879845J185174
8853D002733m353166n257634j395476K010260J900507K85014j45517K2736j099108
8844d029651k688334j702752K348619N160250K251981m510110p774225l623088
8836a4567310K816837L818049n12216k838531L51109L808224K081522j946709
8828f989025j639144L399828P159254N752147J314377k200161k832821l84472
$$ y = [-4613704, -4866777, -3066874, -564467, -541726, -3040618, -5119271, -5524296, -5493625, -4898117, -1752539, 3189070, 5209169, 1398257, -5092084, -9050316, -9107863, -6931312, -2933732, 3156664, 8534541, 8782381, 3928044, -802086, -1919934, -1975287, -4466714, -7533420, -6702732, -2417279, -115262, -2241578, -4451693, -2062286, 2817559, 4002733, -350433, -5608067, -7003543, -4993283, -3092776, -2807762, -2953279, -2930543, -4029651, -6717985, -8420737, -6072118, -911868, 1340113, -3169997, -10944222, -14567310, -11750473, -7932424, -8444640, -11283171, -10932062, -7123838, -5042316, -6989025, -8628169, -5228341, 1930913, 7683060, 8997437, 6797276, 3964455, 3579983]
8820C579983L448656M607426N78453m882238n426609j215712P65604k741443n874955
8811g160835k476521M173231N628966n2915o129124o192974j146108L471045M045936
8802e839299J503686j092806k220298k813111l459001k166156K612564P501863
8794e972558O973276J532307j700624Q14542L310092k76717o089312n833981K30598
8785g012377L699893J088352j591087O20208L758393J813351l817234o769666
8777h210167m399047N27119M646196O381127N015196J241478k095991k812096
8769B93815k119166k080163j900512M0809K010381R71853j755693j485953K491838
8760c532791M894866J669155m161093o320105k646595L615360P952298P669351
$$ y = [3579983, 7028639, 11636065, 12214518, 7332280, 1905671, 689959, 1455563, -1285880, -7160835, -9637356, -5464125, 164841, 111926, -6017198, -12210172, -13356280, -9885235, -5839299, -4335613, -5428419, -7648717, -10461828, -13920829, -16086985, -13474421, -5972558, 1000718, 2533025, 832401, 1646943, 4957035, 4680318, -1408994, -7242975, -7012377, -3312484, -2224132, -3815219, -3195011, 563382, 2376733, -1440501, -8210167, -12609214, -12082095, -7435899, -1054772, 3960424, 5201902, 3105911, 293815, -1825351, -3905514, -5806026, -5765217, -3754836, -2782983, -4538676, -6024629, -3532791, 1362075, 3031230, -1129863, -7449968, -10096563, -6481203, 1471095, 9140446]
8752I140446K499254m950218r789703q463265k438941K983489M016604J845838
8744e156496N34562K009718L736680J930565l045283o081971l451839K045137
8736g478927M641563L162255J318875R00384l20761k745858k714793O62376J857074
8727g17812k710715p094919l500567N175387Q372050K830764l430214l400597
8719d476623J34373J079400j013927k580362j990950J44049L071894M947859L205314
8710B521027j115974l091294r92409N47110j934764m666881k994754N72119Q61168
8701a0294652q57129M94014M114170M149560q8864k482372l7216K621153J344056
8692a037280j143128p57451R55511M9366k802542l366249m81229K617732L361639
$$ y = [9140446, 11639700, 6689482, -3100221, -11563486, -14002427, -11018938, -7002334, -5156496, -4621934, -2612216, 1124464, 3055029, 9746, -6072225, -9524064, -7478927, -2837364, 324891, 1643766, 2544150, 2223389, -522469, -3237262, -2574886, -717812, -3428527, -10523446, -14024013, -8848626, -476576, 2354188, -1076026, -4476623, -4342250, -3262850, -4276777, -6857139, -8848089, -8704040, -5632146, -684287, 2521027, 1405053, -1686241, -2678650, -2131540, -4066304, -8733185, -11727939, -11155820, -10294652, -11151781, -10657767, -6543597, -2394037, -2482901, -4965273, -5002489, -2381336, -1037280, -2180408, -2937859, -1982348, -1932982, -4735524, -8101773, -8583002, -5965270, -2603631]
8683b603631K685246K152919J188063j036800k760479j394595K045471L201008
8675C477202M29355k261621j218403O50809j426806n024551l265765L027513M474583
8666a137684k234433p451141k608297O310368P862989J942199k528651k641438
8658b486088l009204m177177j481769L965243M722964j18864k319605J629914
8650c274586M371042M81794m314343l373579o3862o02474k830795q03937M241370
8641f169370O045873L432343O67369k06309p18618j180553l95712R51019J289779
8632C715821J072071R38199m20293k821260k719070P36868K193567j683769n211321
8623d199187k136029L354100L068810j087536j61752N958662P371868M15266o222656
$$ y = [-2603631, 81615, 2234534, 3422597, 2385797, -374682, -1769277, 276194, 3477202, 3906557, 1644936, 426533, 1077342, -349464, -5374015, -8639780, -5612267, -1137684, -3372117, -10823258, -13431555, -7121187, 741802, 2684001, 155350, -2486088, -5495292, -9672469, -11154238, -7188995, -2466031, -2584895, -4904500, -3274586, 1096456, 1578250, -2736093, -6109672, -6173534, -6776008, -9606803, -10410740, -6169370, -123497, 3308846, 3976215, 3769906, 3051288, 1870735, 1475023, 2426042, 3715821, 4787892, 5726091, 5305798, 2484538, -234532, 502336, 2695903, 1012134, -4199187, -6335216, -2981116, 87694, -999842, -1161594, 4797068, 12168936, 12584202, 6361546]
8614F361546n625751k631616l684374n552897k207511L483459M090793J00887
8606e665464r72370L100569O060584L324813j476977k724157m91568J357380J364136
8597C876946J064502J180456P77096j92303n12773l27166j530073m322058n614990
8588e600363l049090R23108J899783j10439o90350K024822M192518K254972j237471
8579F07490j418397J383942K344520k88271k929855k786318j883969k690641l296887
8570a0958386o44424L456423L888916k88393l926582k696327J385980L648724
8562f134069L242023K497074J659417j117016m637816m482103L19378M625582
8554d027530L864596q8171k605084k468460r30795J835093M935396M660690m43878
$$ y = [6361546, 735795, -1895821, -5580195, -11133092, -13340603, -9857144, -5766351, -5665464, -6637834, -3537265, 2523319, 5848132, 4371155, 1646998, 1155430, 2512810, 3876946, 4941448, 6121904, 6899000, 6706697, 6193924, 5866758, 4336685, 14627, -5600363, -8649453, -7726345, -5826562, -5937001, -6627351, -4602529, -410011, 1844961, 607490, -810907, 573035, 2917555, 2629284, -300571, -3086889, -4970858, -7661499, -10958386, -11602810, -8146387, -4257471, -4545864, -8472446, -11168773, -9782793, -6134069, -2892046, -394972, 1264445, 147429, -4490387, -8972490, -8653112, -4027530, -162934, -251105, -2856189, -5324649, -6255444, -4420351, 515045, 5175735, 4731857]
8545D731857n070757l697937O14184P21914l160620m377500j282362R87297N13711
8536a0020213R77461K408305l20784o189051n542002M989495J4187953J0776972
8528A1268136q80930q030063o702485k801984m04936J696820L879468M267713
8520B291739K761304O98178j994653m663402m060743L06215K995053O29572j635868
8511b672605J340413M821180J731217m446621m847206j85267J084685j855297
8503e029501j053021N144399Q161316L477540k171090k423789m89379j230853
8495D385622k315981L75184M657569N425740J929069k771110n802241m929326
8487I54526L94690N661825M227991l290956p973481m409688K017742L698743J008348
$$ y = [4731857, -338900, -4036837, -3422653, -2700739, -5861359, -10238859, -11521221, -10533924, -10020213, -9042752, -6634447, -6955231, -13144282, -18686284, -13696789, 491164, 11268136, 10387206, 2357143, -4345342, -7147326, -7552262, -5855442, -1975974, 2291739, 5053043, 5751221, 3756568, -906834, -4967577, -4661362, -1666309, -1036737, -2672605, -1332192, 3488988, 5220205, 773584, -4073622, -4258889, -3174204, -5029501, -6082522, -938123, 7223193, 10700733, 8529643, 6105854, 5616475, 4385622, 2069641, 2444825, 7102394, 12528134, 14457203, 11686093, 5883852, 954526, 1349216, 7011041, 11239032, 7948076, -25405, -4435093, -2417351, 1281392, 2289740]
8478B289740j069949j500747k382901l135919j539539J406939K668678J819951
8470a443747N96419n23940j714421j630210M95853K208606R03755j710339j714201
8461d532225J230182L382588K064762j202211k970392j763317O35450J394521
8453a760642J37495n31477J027345K551783J274405j256790j402469M97158Q19021
8444A355829p74065o28783K139212L391828M72235l545547m521643k438355K58861
8435d290428K057472K073546l87397l919595n303059l088542J267914N674054
8427e916035P813376M770313k801882p662285l933595K885985K432578m006890
8419f418435m311263M616300J0046929K894175p444417p451831M78877M186548
$$ y = [2289740, 1219791, -280956, -2663857, -5799776, -7339315, -5932376, -3263698, -1443747, -847328, -1371268, -3085689, -4715899, -4220046, -2011440, -1107685, -2818024, -4532225, -3302043, 80545, 2145307, 943096, -2027296, -3790613, -3155163, -1760642, -1623147, -2154624, -1127279, 1424504, 2698909, 1442119, 39650, 536808, 1355829, 581764, -47019, 2092193, 5484021, 5956256, 2410709, -2110934, -4549289, -4290428, -2232956, -159410, -546807, -4466402, -9769461, -12858003, -11590089, -5916035, 1897341, 6667654, 3865772, -3796513, -7730108, -4844123, -2411545, -6418435, -10729698, -6113398, 3933531, 6827706, -616711, -8068542, -7589665, -3403117]
8411c403117J319730l59003J390447R30488k412457j983947L440296N791555P88629
8402E502621m621146l468416L86158m38309m297432l483693K682203N969960J604341
8393a63713m148010k769016M115984O888374J686935m331947l986987m84747j151100
8384d344227m886339m174503J632967M520816J099061j712725J281545M525750
8376b057655J532719l503356k656112K253272K917301j423862l264884J46539
8368f056038K591481l78182m542899m291751o20792K117580K893937L259581L046958
8359a980125J089192j161211n46419K959345M970573J825443l972195n639892
8351b455289m19212N928493N620662j024169n717889l028463K899287M451821
$$ y = [-3403117, -2083387, -2442390, -1051943, -121455, -2533912, -4517859, -1077563, 4713992, 5502621, 881475, -2586941, -2200783, -2639092, -6936524, -10420217, -7738014, -1768054, -163713, -4311723, -7080739, -2964755, 3923619, 5610554, 1278607, -2708380, -3193127, -4344227, -9230566, -13405069, -11772102, -7251286, -6152225, -7864950, -6583405, -2057655, -524936, -4028292, -6684404, -4431132, -1513831, -2937693, -6202577, -6056038, -3464557, -3842739, -8385638, -12677389, -13298181, -11180601, -8286664, -5027083, -1980125, -890933, -2052144, -2598563, 360782, 5331355, 7156798, 3184603, -2455289, -2874501, 3053992, 8674654, 7650485, 1932596, -1095867, 1803420, 6255241]
8343F255241J56317m539948m218906R07956N351740L813357k280669n009634o7997
8334C67457N594761K628634n679534o748232J639412O507874j68139p976465m252503
8325h086735N604996O729202j983980p236155k272438M777388N024818L3138m365691
8316a775457o324574n983916k425907L026000N683144L437703Q3348K5930K792694
8307a461035M639443K994229j611809n698215n165505r7749L977167K847545m03274
8298B0797m21943J933697J899080m69569q57001R32503N98829k402081l556790
8289b322478j352867L30231n04808j014598J73910K84620j424229j168543K415372
8280d583390M663798K115309j582363j202164K418118M248465J850446k898883
$$ y = [6255241, 6411558, 1871610, -2347296, -1439340, 3912400, 7725757, 5445088, 435454, 367457, 5962218, 8590852, 2911318, -3836914, -2197502, 4310372, 4142233, -3834232, -8086735, -2481739, 4247463, 2263483, -4972672, -7245110, -2467722, 2557096, 2590234, -1775457, -8100031, -14083947, -16509854, -13483854, -7800710, -4363007, -4279659, -4253729, -1461035, 3178408, 6172637, 4560828, -1137387, -6302892, -6400641, -2423474, 424071, 20797, -401146, 1532551, 3431631, 2962062, 2105061, 3037564, 3636393, 1234312, -2322478, -3675345, -3345114, -3849922, -4864520, -4690610, -4405990, -5830219, -6998762, -4583390, 80408, 2195717, 613354, -588810, 1829308, 6077773, 7928219, 5029336]
8272E029336o629220o690603k714484K351612M845757M682879M319581L592247
8264H787105k4374n354373o960961k803669K232395L243065J562298R25508J211417
8255B818411R5547j630319q46658K447768L986182L47616o334944r785660n973130
8246a4875187K098082P133932N565021J010270j289622q26603l76569r19738j296564
8237c776978r96413k00969J133709J839668M4372k551301j341808L056640L409321
8228F16241k370872n254361J295000Q890703O182881k619006m420493J357753
8220C677846L117640k297642n315338j746462P27088j541894j212454M503503
8212h7713O040833j683307p696600j494538R325202J0276478J251184n628725
$$ y = [5029336, -1599884, -8290487, -11004971, -8653359, -3807602, 875277, 5194858, 8787105, 8762731, 3408358, -3552603, -6356272, -4123877, -880812, 681486, 1606994, 2818411, 2913958, 1283639, 436981, 2884749, 6870931, 7218547, 883603, -8902057, -14875187, -12777105, -5643173, -78152, 932118, -357504, -1184107, -1560676, -2480414, -3776978, -4773391, -4974360, -3840651, -2000983, -1956611, -4507912, -5849720, -2793080, 616241, -1754631, -7008992, -5713992, 3176711, 9359592, 6740586, 2320093, 3677846, 6795486, 4497844, -817494, -2563956, -1836868, -3378762, -4591216, -87713, 5953120, 4269813, -3426787, -4921325, 4403877, 14680355, 15931539, 10302814]
8204A0302814m356581M9862J968883Q46638j903045m358718m102903j809433j610085
8195d972568l862633k995275K658547N815096J522348l695533k120407K394857
8187e255568J513603l217458l624208J166897M470071L495216J495855o022k351883
8178b313497m268545l184768p41961Q1381R78414M034422M805892j241659q183565
8169a0033886n982914L750943Q950271M309368k897705n452869m640929l533183
8161a5530904j160857K612868L993980J405997j086462k42413J455786O77451
8153g874554j396859j812015n08980M93586K46466m90733j77769K058278M408741
8144e053839L482552k43993j211397K983155N937138J190520o641687p477723
$$ y = [10302814, 5946233, 5996095, 7964978, 8811616, 6908571, 2549853, -1553050, -3362483, -4972568, -8835201, -11830476, -9171929, -3356833, -1834485, -5530018, -7650425, -5255568, -3741965, -6959423, -10583631, -9416734, -4946663, -1451447, 44408, 38386, -2313497, -6582042, -9766810, -10508771, -10427390, -9448976, -5414554, -608662, -1850321, -10033886, -16016800, -12265857, -3315586, 993782, -1903923, -7356792, -11997721, -15530904, -16691761, -14078893, -10084913, -8678916, -9765378, -10007791, -8552005, -7874554, -9271413, -11083428, -11592408, -11098822, -10852356, -11343089, -11520858, -9462580, -5053839, -1571287, -1815280, -3026677, -43522, 5893616, 7084136, 442449, -7035274]
8136g035274p86071L903472J619504j878121n60476L237148M083162J286795j980283
8127A889856l111195j389469J556422J997274j292382l494064j59177M266892
8119B64157J852313n396408o777335Q00439P448623N162893j001018k437141J39023
8110E5546P61493o93664R1288K601117J798194k963101o071352l722349R31053
8101g211775K450730L9076k180256p74237K793394M375578K824238J126203J073441
8092D516392J51474l383308n692963k521398L170186M758093J899475K13150J321164
8083D432265P53288k894549m471248j208023J738486n69359m540468l503090J986632
8074h276066M989107K070564k339697k078412K856993O036316K378084m732429
$$ y = [-7035274, -7821345, -3917873, -2298369, -4176490, -4736966, -1499818, 2583344, 3870139, 1889856, -1221339, -2610808, -1054386, 942888, -349494, -3843558, -4002735, 264157, 2116470, -3279938, -10057273, -9256834, -1808211, 3354682, 2353664, -83477, 55546, 817039, 123375, 214663, 2815780, 4613974, 1650873, -4420479, -8142828, -7211775, -4761045, -4721969, -6902225, -7676462, -4883068, -507490, 2316748, 3442951, 4516392, 4667866, 1284558, -4408405, -6929803, -3759617, 998476, 2897951, 3111101, 4432265, 5185553, 2291004, -2180244, -3388267, -1649781, -2219140, -6759608, -10262698, -8276066, -3286959, -1216395, -3556092, -5634504, -2777511, 3258805, 5636889, 904460]
8066I04460o816498j734670K635547j83089m985153k742749M865692P796890L084647
8057B825077k019663k901598l137628m585713k421550M790156R219098M808095
8049F576274k813498m533809m30618K637831J773718l30513j449533j595281p76337
8040i41766N61353Q47099J26430N56016J921570R69174k368504l497433r62970
8031b789031N24144j215269j156441L416210N896562L24020p614024q115407j404074
8022a2133310M288483N394098M857394L902621R86443k248160k398725j176854
8014A471990l072750o489216n044531J806309O931984N646456J170358j560640
8006H59960j742230o86953R06447J874072R01601q30383q36360M61658L69261
$$ y = [904460, -5912038, -7646708, -5011161, -5194250, -10179403, -12922152, -8056460, -259570, 2825077, 805414, -2096184, -5233812, -9819525, -12241075, -7450919, 1768179, 6576274, 3762776, -771033, -1201651, 1436180, 3209898, 2879385, 1429852, -165429, -941766, -380413, 466686, 593116, 1149132, 3070702, 4039876, 1671372, -1826061, -2789031, -2264887, -3480156, -4636597, -1220387, 4676175, 5000195, -2613829, -10729236, -12133310, -7844827, -2450729, 2406665, 6309286, 7295729, 5047569, 2648844, 1471990, -1600760, -8089976, -13134507, -11328198, -4396214, 1250242, 2420600, 859960, -882270, -1569223, -662776, 1211296, 2112897, 1282514, 446154, 907812, 1277073]
7997A277073j295142j976782q22048N57778J380905J801775N59463k974437n281275
7988f772690k399917L254947N175048J902288j536571j637572j79553Q93677K533887
7979A233544M677701M513035J187167j955440k301147j587717k307608l603704
7971a44169l150090r39482P93427K38020k176134l699526j591126L044857N328682
7962b295541K814621m82905M03589M022971M880804J456073k731972m614400l584441
7953a31201J86052M524192M584329r03886n235895k312576L110799K089712l904784
7944B006742n247751j59422L087445J069194J59700L324426M104065q34655m529540
7935B980204k019368P07503j889011m451204j079353K882734K50040m452784k710900
$$ y = [1277073, -18069, -1994851, -2816899, -2259121, -878216, 923559, 1483022, -1491415, -6772690, -9172607, -5917660, -742612, 1159676, -376895, -2014467, -2194020, -1300343, 1233544, 5911245, 10424280, 11611447, 9656007, 7354860, 5767143, 3459535, -144169, -3294259, -4233741, -3440314, -3202294, -5378428, -9077954, -10669080, -7624223, -2295541, 519080, 36175, 439764, 4462735, 9343539, 10799612, 8067640, 3453240, -131201, 54851, 4579043, 9163372, 8259486, 3023591, 711015, 3821814, 5911526, 2006742, -3241009, -3400431, -312986, 756208, 915908, 4240334, 8344399, 7509744, 2980204, 960836, 1668339, -220672, -4671876, -5751229, -2868495, -2618455, -7071239, -9782139]
7926i782139K784925L177377q60576j395929J822027J866302j371682q34780L965899
7917f28576N615244K424901R98096L033210K006297l546987n792394j583764J199213
7908C725240k337598n141026j250393K831894k42321m746260j247709O762252
$$ y = [-9782139, -6997214, -3819837, -4680413, -6076342, -4254315, -2388013, -3759695, -4594475, -628576, 4986668, 7411569, 8409665, 11442875, 13449172, 9902185, 4109791, 2526027, 3725240, 1387642, -3753384, -5003777, -2171883, -2414204, -7160464, -8408173, -1645921]
$$ [...]
##END NTUPLES=NMR SPECTRUM
##END=
