##TITLE=31Pdec_LR-598-H
 D2O, 24 sc
 3.9.2024
##JCAMPDX= 6.0         $$ Bruker NMR JCAMP-DX V2.0
##DATA TYPE= NMR SPECTRUM
##DATA CLASS= NTUPLES
##ORIGIN= UXNMR, Bruker Analytische Messtechnik GmbH
##OWNER= root
$$ XWIN-NMR		Version 3.5
$$ Tue Sep  3 14:33:44 2024 Russian Standard Time (UT+4h)  she@DPX200
##.OBSERVE FREQUENCY= 81.013821
##.OBSERVE NUCLEUS= ^31P
##.ACQUISITION MODE= SIMULTANEOUS
##.ACQUISITION SCHEME= undefined
##.AVERAGES= 24
##.DIGITISER RES= 17
##SPECTROMETER/DATA SYSTEM= spect
##.PULSE SEQUENCE= zgpg30
##.SOLVENT NAME= D2O
##.SHIFT REFERENCE= (INTERNAL, D2O, 0, 198.062)
##AUDIT TRAIL= $$ (NUMBER, WHEN, WHO, WHERE, WHAT)
$$ ##TITLE= Audit trail, XWIN-NMR		Version 3.5
$$ ##JCAMPDX= 5.01
$$ ##ORIGIN= Bruker BioSpin GmbH
$$ ##OWNER= she
$$ F:/spectra/data/she/nmr/P31/2/pdata/1/auditp.txt
$$ ##AUDIT TRAIL=  $$ (NUMBER, WHEN, WHO, WHERE, WHAT)
(   1,<2024-09-03 14:32:38.45 +0400>,<she>,<DPX200>,
      <created by zg, POWCHK disabled, PULCHK disabled
       configuration hash MD5:
       00 E9 B6 7A A2 85 ED C7 34 08 36 98 17 FE 4E 26
       data hash MD5: 32K
       8A 6F 1A 8E D9 C9 82 83 86 69 95 B5 E8 1E D9 8F>)
(   2,<2024-09-03 14:32:41.23 +0400>,<she>,<DPX200>,
      <Start of raw data processing
       efp BC_mod = 2 LB = 1.5 FT_mod = 6 PKNL = 1 PHC0 = 2750.073 PHC1 = -26.71252 SI = 64K 
       data hash MD5: 64K
       40 37 CA EC CA 43 36 0B 8B 3C 28 4F CA 43 34 11>)
(   3,<2024-09-03 14:33:04.56 +0400>,<she>,<DPX200>,
      <pk PHC0 = -72.61211 PHC1 = 90.39999 
       data hash MD5: 64K
       13 80 01 82 FA ED 25 48 19 44 AD 7B 92 1F F0 25>)
(   4,<2024-09-03 14:33:07.85 +0400>,<she>,<DPX200>,
      <abs ABSG = 5 
       data hash MD5: 64K
       5E FA F0 2B 8A 54 47 C4 71 45 36 76 2E 70 3A D4>)
$$ ##END=
$$ 
$$ hash MD5
$$ C1 FF F0 17 27 05 73 51 08 21 F1 EC E7 89 6E D0
##$RELAX= 
##$RELAX= 
##$RELAX= 
##$RELAX= 
##$RELAX= 
##$RELAX= 
##$RELAX= 
##$RELAX= 
$$ Bruker specific parameters
$$ --------------------------
##$DU= <F:/spectra>
##$EXPNO= 2
##$NAME= <P31>
##$PROCNO= 1
##$TYPE= <nmr>
##$USER= <she>
##$AMP= (0..31)
100 100 100 100 100 100 100 100 100 100 100 100 100 100 100 100 100 100 
100 100 100 100 100 100 100 100 100 100 100 100 100 100 
##$AQSEQ= 0
##$AQ_mod= 1
##$AUNM= <au_zg>
##$AUTOPOS= <>
##$BF1= 81.014009
##$BF2= 200.13
##$BF3= 200.13
##$BF4= 200.13
##$BF5= 200.13
##$BF6= 200.13
##$BF7= 200.13
##$BF8= 200.13
##$BYTORDA= 1
##$CFDGTYP= 0
##$CFRGTYP= 5
##$CHEMSTR= <none>
##$CNST= (0..31)
1 1 145 1 1 1 1 1 1 1 1 1 1 1 1 1 1 1 1 1 1 1 1 1 1 1 1 1 1 1 1 1 
##$CPDPRG= <waltz16>
##$CPDPRG1= <>
##$CPDPRG2= <waltz16>
##$CPDPRG3= <>
##$CPDPRG4= <mlev>
##$CPDPRG5= <mlev>
##$CPDPRG6= <mlev>
##$CPDPRG7= <mlev>
##$CPDPRG8= <mlev>
##$CPDPRGB= <>
##$CPDPRGT= <>
##$D= (0..31)
0 1 0 0 0 0 0 0 0 0.06 0 0.03 2e-05 3e-06 0 0 0.0002 0 0 0 0 0 0 0 0 0 
0 0 0 0 0 0 
##$DATE= 1725359557
##$DBL= (0..7)
120 120 120 11 120 120 24 19 
##$DBP= (0..7)
150 150 150 150 150 150 150 150 
##$DBP07= 0
##$DBPNAM0= <>
##$DBPNAM1= <>
$$ [...]
##$SUBNAM3= <"">
##$SUBNAM4= <"">
##$SUBNAM5= <"">
##$SUBNAM6= <"">
##$SUBNAM7= <"">
##$SUBNAM8= <"">
##$SUBNAM9= <"">
##$SW= 400.765351723535
##$SWIBOX= (0..15)
0 1 3 0 0 0 0 0 0 0 0 0 0 0 0 0 
##$SW_h= 32467.5324675325
##$TD= 32768
##$TD0= 1
##$TE= 0
##$TE2= 300
##$TE3= 300
##$TEG= 300
##$TL= (0..7)
0 120 53 12 22 120 120 120 
##$TP= (0..7)
150 150 150 150 150 150 150 150 
##$TP07= 0
##$TPNAME0= <>
##$TPNAME1= <>
##$TPNAME2= <>
##$TPNAME3= <>
##$TPNAME4= <>
##$TPNAME5= <>
##$TPNAME6= <>
##$TPNAME7= <>
##$TPOAL= (0..7)
0.5 0.5 0.5 0.5 0.5 0.5 0.5 0.5 
##$TPOFFS= (0..7)
0 0 0 0 0 0 0 0 
##$TUNHIN= 0
##$TUNHOUT= 0
##$TUNXOUT= 0
##$USERA1= <user>
##$USERA2= <user>
##$USERA3= <user>
##$USERA4= <user>
##$USERA5= <user>
##$V9= 5
##$VALIST= <valist>
##$VCLIST= <CCCCCCCCCCCCCCC>
##$VD= 0
##$VDLIST= <DDDDDDDDDDDDDDD>
##$VPLIST= <PPPPPPPPPPPPPPP>
##$VTLIST= <TTTTTTTTTTTTTTT>
##$WBST= 1024
##$WBSW= 4
##$XGAIN= (0..3)
0 0 0 0 
##$XL= 0
##$YL= 0
##$YMAX_a= 11693
##$YMIN_a= -7440
##$ZGOPTNS= <>
##$ZL1= 120
##$ZL2= 120
##$ZL3= 120
##$ZL4= 120
##$ABSF1= 198.0616
##$ABSF2= -202.7028
##$ABSG= 5
##$ABSL= 3
##$ALPHA= 0
##$AQORDER= 0
##$ASSFAC= 0
##$ASSFACI= 0
##$ASSFACX= 0
##$ASSWID= 0
##$AUNMP= <proc_1d>
##$AZFE= 0.1
##$AZFW= 0.5
##$BCFW= 0
##$BC_mod= 2
##$BYTORDP= 0
##$COROFFS= 0
##$CY= -3
##$DATMOD= 1
##$DC= 0
##$DFILT= <>
##$DTYPP= 0
##$F1P= 0
##$F2P= 0
##$FCOR= 1
##$FTSIZE= 65536
##$FT_mod= 6
##$GAMMA= 0
##$GB= 0
##$INTBC= 1
##$INTSCL= 9.790993e-09
##$ISEN= 30
##$LB= 1.5
##$LEV0= 0
##$LPBIN= 0
##$MAXI= 10000
##$MC2= 0
##$MEAN= 0
##$ME_mod= 0
##$MI= 50
##$NCOEF= 0
##$NC_proc= -9
##$NLEV= 6
##$NOISF1= 182.463
##$NOISF2= 159.3651
##$NSP= 0
##$NTH_PI= 0
##$NZP= 0
##$OFFSET= 198.0616
##$PC= 4
##$PHC0= 2677.461
##$PHC1= 63.68747
##$PH_mod= 1
##$PKNL= yes
##$PPARMOD= 0
##$PSCAL= 0
##$PSIGN= 0
##$REVERSE= no
##$SF= 81.0140089999434
##$SI= 65536
##$SIGF1= 159.3651
##$SIGF2= -187.1042
##$SINO= 113.3802
##$SIOLD= 16384
##$SREGLST= <1H.CDCl3>
##$SSB= 0
##$STSI= 65536
##$STSR= 0
##$SW_p= 32467.5324675325
##$SYMM= 0
##$S_DEV= 0
##$TDeff= 32768
##$TDoff= 0
##$TI= <>
##$TILT= no
##$TM1= 0
##$TM2= 0
##$TOPLEV= 0
##$USERP1= <user>
##$USERP2= <user>
##$USERP3= <user>
##$USERP4= <user>
##$USERP5= <user>
##$WDW= 1
##$XDIM= 65536
##$YMAX_p= 467845878
##$YMIN_p= -46411710
$$ End of Bruker specific parameters
$$ ---------------------------------
##NTUPLES= NMR SPECTRUM
##VAR_NAME=  FREQUENCY,     SPECTRUM/REAL,   SPECTRUM/IMAG
##SYMBOL=    X,             R,               I
##VAR_TYPE=  INDEPENDENT,   DEPENDENT,       DEPENDENT
##VAR_FORM=  AFFN,          ASDF,            ASDF
##VAR_DIM=   65536,         65536,           65536
##UNITS=     HZ,            ARBITRARY UNITS, ARBITRARY UNITS
##FACTOR=    0.49542278885378, 1,            1
##FIRST=     16045.7642231865, 0,            0
##LAST=      -16421.768244346, 0,            0
##MIN=       -16421.768244346, -46411710,    0
##MAX=       16045.7642231865, 467845878,    0
$$ Real data points
##PAGE= N=1
##DATA TABLE= (X++(R..R)), XYDATA
$$ [...]
44453G890114L363731n3270j803101q10901N6107j355305k815180j474173P38172
$$ 7890114 11253845 11200575 9397474 8586573 8642680 7287375 4472195 2998022 3736194
44444C736194k32811l448721l694483K40861L462800K855943J561180K561405
$$ 3736194 3503383 54662 -3639821 -3398960 63840 2919783 4480963 7042368
44436G042368L085628p6570m047379m203133j894015j773369l503144k607338
$$ 7042368 10127996 10051426 6004047 1800914 -93101 -1866470 -5369614 -7976952
44428g976952J245717L406711K077751O27546O83580q78267n307443p888418m514337
$$ -7976952 -6731235 -3324524 -1246773 -619227 64353 -813914 -6121357 -14009775 -18524112
44419a8524112J729183M908608M193413L068621K889867K059260N65309N08494
$$ -18524112 -16794929 -11886321 -7692908 -4624287 -1734420 324840 890149 1398643
44411A398643J819837J668609o75265j900119N00748M055075M396744R71467k765294
$$ 1398643 3218480 4887089 4211824 2311705 2812453 6867528 11264272 12235739 9470445
44402I470445m063546l354064k076369n62584Q70035P90756j361681l286645k230224
$$ 9470445 5406899 2052835 -23534 -586118 283917 1074673 -287008 -3573653 -5803877
44393e803877Q47930K052542k049k156253j449886O61969J156459M12140J091669
$$ -5803877 -4955947 -2903405 -2905454 -5061707 -6511593 -5849624 -4693165 -4281025 -3189356
44384c189356L157657L663286J610627l78330j64007R95199R77135q0436p58859
$$ -3189356 -31699 3631587 5242214 4863884 4699877 5695076 6672211 6591775 5832916
44375E832916p22882o70038j222728k776345m913362n344506j750877M034945
$$ 5832916 5110034 4439996 3217268 440923 -4472439 -9816945 -11567822 -7532877
44367g532877O288272K171764l777812m882152p35093K929642K332266k2777j18703
$$ -7532877 -1244605 927159 -2850653 -7732805 -8467898 -5538256 -3205990 -3228767 -3347470
44358c347470J534482J085650k708323o323594n781555j557661K169988K764699
$$ -3347470 -1812988 -727338 -3435661 -9759255 -15540810 -17098471 -14928483 -12163784
44350a2163784J989710K852101M957065M875060Q64672m628709p548762n887898
$$ -12163784 -10174074 -7321973 -2364908 2510152 3374824 -1253885 -8802647 -14690545
44342a4690545o54616N035713P462000M968194J46672k314699q54797J642669
$$ -14690545 -15345161 -10309448 -2847448 2120746 2267418 -47281 -902078 740591
44334G40591K444635K301451K626751K175978n64534l618401l631968r24458Q86997
$$ 740591 3185226 5486677 8113428 10289406 9724872 6106471 2474503 1550045 2437042
44325B437042J92463p46454K60918K177785K612452J032374j046481k076114j884865
$$ 2437042 2629505 1883051 2143969 4321754 6934206 7966580 6920099 4843985 2959120
44316B959120j521168j923183k620749k308377r26115J08611M04556J497618L822930
$$ 2959120 1437952 -485231 -3105980 -5414357 -6340472 -6231861 -5827305 -4329687 -506757
44307e06757M787725K200117j944600l852119k937217j536655o78424M29293J211987
$$ -506757 4280968 6481085 4536485 684366 -2252851 -3789506 -4467930 -4038637 -2826650
44298b826650j99129l336413n159893m138241j756262M22953K207553K945250
$$ -2826650 -3025779 -6362192 -11522085 -15660326 -17416588 -16993635 -14786082 -11840832
44290a1840832J622240m36144l61734J714532K365167M25505p84207J262111M223617
$$ -11840832 -10218592 -10654736 -11016470 -9301938 -6936771 -6511266 -7295473 -6033362 -1809745
44281a809745M588805K552213N80210l86442o65028m631J344588J656798J75842
$$ -1809745 2779060 5331273 5911483 5525041 4860013 4855382 6199970 7856768 8032610
44272H032610j387622j839715k548062m216917m504346j902367P95092N91166
$$ 8032610 6644988 4805273 2257211 -1959706 -6464052 -8366419 -7571327 -6980161
44264f980161o28530O51233L271341L138478N1180k107523j505323J2314J263096
$$ -6980161 -7608691 -6957458 -3686117 -547639 -496459 -2603982 -4109305 -4096991 -2833895
44255b833895K892919L842115J544692l118880n491865l464218k80214O97258
$$ -2833895 59024 3901139 5445831 2326951 -3164914 -6629132 -6909346 -6212088
44247f212088K88023N39436J074347R21696Q82204J329996M31198k421026l835133
$$ -6212088 -5924065 -5384629 -4310282 -3388586 -2506382 -1176386 -745188 -3166214 -7001347
44238g001347o54951M571140O034337K115906k780112m041061j896379N4672n09684
$$ -7001347 -7656298 -3085158 2949179 5065085 2284973 -1756088 -3652467 -3597795 -4107479
44229d107479k558703l510786k271150k75814N27862K27002N05444J896958L031861
$$ -4107479 -6666182 -10176968 -12448118 -12723932 -12196070 -11969068 -11463624 -9566666 -6534805
44220f534805K934497K359066K080450J546624L63065m31283k3256M87696l15001
$$ -6534805 -3600308 -1241242 839208 2385832 2748897 2317614 2294358 2782054 2467053
44211B467053j745763j831545j51453J487662J167189j104307l319914l188972
$$ 2467053 721290 -1110255 -1261708 225954 1393143 288836 -3031078 -6220050
44203f220050m89758K199907K053080o89657l174863l560678k360068k54269K725313
$$ -6220050 -6709808 -4509901 -2456821 -3146478 -6321341 -9882019 -12242087 -12496356 -9771043
44194i771043N155305M457873Q02233k095371k086117j524140k518657k602429
$$ -9771043 -4615738 -157865 644368 -1451003 -3537120 -5061260 -7579917 -10182346
44186a0182346Q52892M655995L545981j379721l697260j137455J710638J379418
$$ -10182346 -9329454 -4673459 -1127478 -2507199 -6204459 -7341914 -5631276 -4251858
44178d251858M40893J672915K461469n74119m922765n273464j501094J383067
$$ -4251858 -3810965 -2138050 323419 -250700 -5173465 -10446929 -11948023 -10564956
44170a0564956Q00919m38195N95311K683845L091854J564326k57769j416470j740569
$$ -10564956 -9764037 -10202232 -9606921 -6923076 -3831222 -2266896 -2524665 -3941135 -5681704
44161e681704q88645P85222J508183K21139j265261l39045K424507L543054J327304
$$ -5681704 -6570349 -5785127 -4276944 -4055805 -5321066 -5660111 -3235604 307450 1634754
44152A634754j738173k380003o47548R34469J200158J312211K110311K419401
$$ 1634754 -103419 -2483422 -3130970 -2196501 -996343 315868 2426179 4845580
44144D845580P54415k323297m436967l837945j368843J15217j227542l594679
$$ 4845580 5599995 3276698 -1160269 -4998214 -6367057 -6251840 -7479382 -11074061
44136a1074061l003512J684742O374300O145703J332628l063950l758782k237016
$$ -11074061 -14077573 -12392831 -6018531 127172 1459800 -1604150 -5362932 -7599948
44128g599948r96208J07747K012493L567648L181230J834298J693506K444488
$$ -7599948 -8596156 -8488409 -6475916 -2908268 272962 2107260 3800766 6245254
44120F245254J648456j302693l900978l703008j170035J266220J932771J283772
$$ 6245254 7893710 6591017 2690039 -1012969 -2183004 -916784 1015987 2299759
44112B299759J099990K334081L544615K298987j301304l890181k966894l50218
$$ 2299759 3399749 5733830 9278445 11577432 10276128 6385947 3419053 3068835
44104C068835N19191m50197m73722J174586J907996P9117k446703l300291k823087
$$ 3068835 3588026 3137829 2664107 3838693 5746689 5825806 3379103 78812 -2744275
44095b744275k584860k580201j867584o43868L73266J670832L850940N355817
$$ -2744275 -5329135 -7909336 -9776920 -10420788 -10047522 -8376690 -4525750 830067
44087H30067L766056l27634l114481k344759l58741n49216k343219k413332l23642
$$ 830067 4596123 4268489 1154008 -1190751 -1549492 -2098708 -4441927 -6855259 -7178901
44078g178901M32338j965366m247316k617196J755108M965064O161336P081371
$$ -7178901 -6746563 -8711929 -12959245 -15576441 -13821333 -8856269 -2694933 4386438
44070D386438P065303L634633j780206m166864k554821j885818m549587n596342
$$ 4386438 11451741 15086374 13306168 9139304 6584483 4698665 149078 -5447264
44062e447264q56119N007800M632155j097148m866429l824398j772428j145881
$$ -5447264 -6303383 -1295583 3336572 2239424 -2627005 -6451403 -8223831 -9369712
44054i369712J16929K810977M055456K656463J464403K140042K415617R11655
$$ -9369712 -9252783 -6441806 -2386350 270113 1734516 3874558 6290175 7201830
44046G201830j2550R90140J024395k161973n679578n477118k097315Q31473J673499
$$ 7201830 7189280 8179420 9203815 7041842 1362264 -4114854 -6212169 -5380696 -3707197
44037c707197J463921J322578J584095K015766J507051m81304j611908Q43217
$$ -3707197 -2243276 -920698 663397 2679163 4186214 3704910 2093002 2936219
44029B936219M485589L433812k692236o719749l986617Q42733J317210j489648
$$ 2936219 7421808 10855620 8163384 1443635 -2542982 -1700249 -383039 -1872687
44021a872687k651104j934592k174266k434410J32739L679685L905485J647902
$$ -1872687 -4523791 -6458383 -8632649 -11067059 -10934320 -7254635 -3349150 -1701248
44013a701248J438908L288940K855545l53230j998522p89528m60762k477277l345503
$$ -1701248 -262340 3026600 5882145 5528915 3530393 2740865 2280103 -197174 -3542677
44004c542677j278742N68071M4408m76656O70529J040256r25768k424405j258985
$$ -3542677 -4821419 -4253348 -4208940 -4685596 -4015067 -2974811 -3900579 -6324984 -7583969
43995g583969J84406n47629j641228p88549O36956Q00628R16777J817814J122814
$$ -7583969 -7399563 -7947192 -9588420 -10376969 -9740013 -8939385 -8022608 -6204794 -5081980
43986e081980j899517k866241J055751M858462K460018l045153l198047K928363
$$ -5081980 -6981497 -9847738 -8791987 -3933525 -1473507 -4518660 -7716707 -4788344
43978d788344P177957M397323q20461j859944R84769K718830J088727j672447
$$ -4788344 2389613 6786936 5966475 4106531 5091300 7810130 8898857 7226410
43970G226410k621437j124978Q74522N00838k830947n522971l363757K471809
$$ 7226410 4604973 3479995 4354517 4855355 2024408 -3498563 -6862320 -4390511
43962d390511N805109L120380j961684l881306k242769q13264j166544j013546
$$ -4390511 1414598 4534978 2573294 -1308012 -3550781 -4364045 -5530589 -6544135
43954f544135J186815L296256K600632j86812j878587q87375J346052K715607
$$ -6544135 -5357320 -2061064 539568 352756 -1525831 -2413206 -1067154 1648453
43946A648453K530594R04721k125515n532834o656826l750792J152248M040319
$$ 1648453 4179047 5083768 2958253 -2574581 -9231407 -12982199 -11829951 -7789632
43938g789632L785465L064319L860506M493813K612980r27139l278363l334619
$$ -7789632 -4004167 -939848 2920658 7414471 10027451 9100312 5821949 2487330
43930B487330k216335j111219o58558j475470l108741l368848j134456R72393
$$ 2487330 270995 -840224 -1498782 -2974252 -6082993 -9451841 -10586297 -9613904
43922i613904m14150m095487n258597k129191J599270K144675M32632k86470R58026
$$ -9613904 -10028054 -14123541 -19382138 -21511329 -19912059 -17767384 -17334752 -17621222 -16663196
43913a6663196K944875M921471O461432O012795K551022j807442l610786k557884
$$ -16663196 -13718321 -8796850 -2335418 3677377 6228399 4420957 810171 -1747713
43905a747713j636202k370751k589078j65081L317520M710573L691751K702860
$$ -1747713 -3383915 -5754666 -8343744 -8508825 -5191305 -480732 3211019 5913879
43897E913879L140356L904208L725428K725814J140597j396898m180318m902105
$$ 5913879 9054235 12958443 16683871 19409685 20550282 19153384 14973066 10070961
43889A0070961k548521M02845O61767j627134l266439k393599n10886J25409o55526
$$ 10070961 7522440 7925285 8587052 6959918 3693479 1299880 788994 914403 258877
43880B58877j464289j451487r77623p79034j026694j074373k91331P04959N94325
$$ 258877 -1205412 -2656899 -3634522 -4413556 -5440250 -6514623 -6805954 -6100995 -5506670
43871e506670k05147P57551M097080O108740L129377k590347n112463k853303
$$ -5506670 -5711817 -4954266 -857186 5251554 8380931 5790584 678121 -2175182
43863b175182k44494m59189r75951J234843M102113L659634J94500k621824l121866
$$ -2175182 -2419676 -2878865 -3854816 -2619973 1482140 5141774 5336274 2714450 -407416
43854d07416k666452k375862k001791j306195O2804K984822O518290O724818J377656
$$ -407416 -3073868 -5449730 -7451521 -8757716 -8694912 -5710090 808200 7533018 8910674
43845H910674n272629o540073j869824K693621K923304J112428J081279K358024
$$ 8910674 3638045 -2902028 -4771852 -2078231 845073 1957501 3038780 5396804
43837E396804J845633j133978m079112m599676k764189o02545o0758j082165j718121
$$ 5396804 7242437 6108459 2029347 -2570329 -5334518 -5937063 -5997821 -7079986 -8798107
43828h798107p04013Q31125J363486J420270K024881K076749K98285j194135P95034
$$ -8798107 -9502120 -8670995 -7307509 -5887239 -3862358 -1785609 -1487324 -2681459 -1886425
43819a886425M702750N043757K02685m735078m915202j802868K33762J96729L0091
$$ -1886425 2816325 7860082 8062767 3327689 -1587513 -3390381 -3156619 -2959890 -2929799
43810b929799K56285k81320j341152j125006R34346L346672M388196L387673Q20652
$$ -2929799 -2673514 -2954834 -4295986 -5420992 -4486646 -1139974 3248222 6635895 7456547
43801G456547j615526j898790L5747J814047J580219K45249m79651p81177j659215
$$ 7456547 5841021 3942231 3977978 5792025 7372244 7617493 7137842 6356665 4697450
43792D697450k442919j643438L50462J536791J082161J33034j19075K07617L48109
$$ 4697450 2254531 611093 961555 2498346 3580507 3713541 3594466 3802083 4150192
43783D150192o2907o72451p29519q9714K3156j673082m190178m807135k617053
$$ 4150192 4087285 3414834 2685315 2595601 2618757 945675 -3244503 -8051638 -10668691
43774a0668691J36571J171790P66097J01960q33473j962312j832802N6176J358509
$$ -10668691 -10532120 -9360330 -8594233 -8492273 -9325746 -11288058 -13120860 -13064684 -11706175
43765a1706175p8784k556817k563089M75072L960731N678680N075789K201122
$$ -11706175 -11784959 -14341776 -16904865 -16429793 -12469062 -6790382 -1714593 486529
43757D86529j618063l104704o12354K235648N13642m407462n756294r69688M182623
$$ 486529 -1131534 -4236238 -4848592 -2612944 -2099302 -6506764 -12263058 -13232746 -9050123
43748i050123L645214n62383j767002J886029N468185M182695j085537n490367
$$ -9050123 -5404909 -5967292 -7734294 -5848265 -380080 3802615 2717078 -2773289
43740b773289n243555n03865N041313P030605M127900p17448l459088l230088
$$ -2773289 -8016844 -8520709 -3479396 3551209 7679109 6961661 3502573 272485
43732B72485k384985k632950k947390j841274N0189J091730J325559K240673M072155
$$ 272485 -2112500 -4745450 -7692840 -9534114 -9483925 -8392195 -7066636 -4825963 -753808
43723g53808N073989L972553J722855l2818j058168j909734k279443j608228p79959
$$ -753808 4320181 8292734 10015589 9982771 8924603 7014869 4735426 3127198 2347239
43714B347239j266268k554383k332425K17570K943465L368721J561508m70451
$$ 2347239 1080971 -1473412 -3805837 -3588267 -644802 2723919 4285427 3814976
43706C814976j257633r89302q30536j455093j755996L31255M360821N916619J560221
$$ 3814976 2557343 1568041 737505 -717588 -2473584 -2142329 2218492 8135111 9695332
43697I695332n274022p395369l515540n6033j271937k790384Q34733O670538P626818
$$ 9695332 4421310 -2974059 -6489599 -6545632 -7817569 -10607953 -9773220 -3102682 4524136
43688D524136L385115J24470K25004m42186l862600n552930k099878K545286K760180
$$ 4524136 7909251 8033721 8258725 7816539 3953939 -1598991 -3698869 -1153583 1606597
43679A606597m90745j831022K53770J962411M13552k567186l538497j771236N15082
$$ 1606597 1115852 -715170 -461400 1501011 1914563 -652623 -4191120 -5962356 -5447274
43670e447274R46083p14492k582959k633801n81293K304470M619089N214867L066342
$$ -5447274 -4501191 -5215683 -7798642 -10432443 -11013736 -8709266 -4090177 1124690 4191032
43661D191032j360307m956596m560791r92937J800914K038523J882076L146592
$$ 4191032 2830725 -2125871 -6686662 -7679599 -5878685 -3840162 -1958086 1188506
43653A188506M318074L632786K352726K418585K837087J183282k478136n585420
$$ 1188506 5506580 9139366 11492092 13910677 16747764 17931046 15452910 9867490
43645I867490o167146m083489l42997K915992L158153M18410j810009j124884
$$ 9867490 3700344 -383145 -726142 2189850 5348003 5766413 3956404 2831520
43637B831520r5624k307854n796646m884841J199655O147805M822754j28248k671128
$$ 2831520 2735896 428042 -5368604 -10253445 -9053790 -2905985 1916769 1788521 -882607
43628h82607j408964L66566P54464J102648J977667J402555j371168l387847j725254
$$ -882607 -2291571 -1925005 -1170541 -67893 1909774 3312329 1941161 -1446686 -3171940
43619c171940K057772L830302K388037L81525j35980l37902j915452m044134m684754
$$ -3171940 -1114168 2716134 5104171 5485696 5349716 5011814 3096362 -947772 -5632526
43610e632526l488065j814609q02133o86289j054395o04799K049619N879500P234040
$$ -5632526 -9120591 -10935200 -11737333 -12423622 -13478017 -14082816 -12033197 -6153697 1080343
43601A080343M147708m71066k339476j320603o35763j485634j864699o18200P46582
$$ 1080343 5228051 4756985 2417509 1096906 461143 -1024491 -2889190 -3507390 -2760808
43592b760808R21738N97988O84563J106565J656830J725134l24005m341776n804323
$$ -2760808 -1839070 -1241082 -556519 550046 2206876 3932010 3608005 -733771 -6538094
43583f538094o97895P005450Q438272J800727m703317m502893j111111p52238
$$ -6538094 -7235989 -230539 8207733 10008460 5305143 802250 -308861 -1061099
43575a061099k326979q60898L118021M591541K369960P565o02509q82769j414608
$$ -1061099 -3388078 -4248976 -1130955 3460586 5830546 5838111 5235602 4352833 2938225
43566B938225j314144j316312k599988l109826j22081M008781M174277O00703
$$ 2938225 1624081 307769 -2292219 -5402045 -5524126 -1515345 2658932 3259635
43558C259635j164834Q86450K220422o52252m937594o385601m902205k736834
$$ 3259635 2094801 2981251 5201673 4549421 -388173 -6773774 -11675979 -14412813
43550a4412813q14981O27655Q95585L89594N28339Q59975m99275k661653k301368
$$ -14412813 -15227794 -14600139 -13704554 -13314960 -12786621 -11926646 -12425921 -15087574 -17388942
43541a7388942N90958J945846L96361j80543K620974N646714N981437N498964
$$ -17388942 -16797984 -14852138 -14455777 -14636320 -12015346 -6368632 -387195 5111769
43533E111769N539580K567784n117536j0981320p701716J702900P305014N358814
$$ 5111769 10651349 13219133 8101597 -2879723 -10581439 -8878539 -1573525 3785289
43525C785289J130805o13290q46998j259100o10154J577271K676084R28920j754566
$$ 3785289 4916094 4302804 3455806 2196706 1586552 3163823 5839907 6768827 5014261
43516E014261k992127k942996k574381j767551o16695l2527K08183J532318L586810
$$ 5014261 2022134 -920862 -3495243 -5262794 -5879489 -5912016 -5703833 -4171515 -584705
43507e84705L753286R74149k191014k695078m35165K344199L405876J819685j234828
$$ -584705 3168581 4142730 1951716 -743362 -1178527 1165672 4571548 6391233 5156405
43498E156405k784513j261907P85670j47466k924419k906478Q82248L764232J998972
$$ 5156405 2371892 1109985 1895655 1748189 -1176230 -4082708 -3200460 563772 2562744
43489B562744k393206n339274n724802m295984q71677M159269P875648P562195
$$ 2562744 169538 -5169736 -10894538 -15190522 -16062199 -11902930 -4027282 3534913
43481C534913M133496O18910j322226j665733q22500r2406j208863l506887l887649
$$ 3534913 7668409 8287319 6965093 5299360 4476860 4384454 3175591 -331296 -4218945
43472d218945j537004K53471n80666j169346J165402L479584J649259k345753
$$ -4218945 -5755949 -5502478 -6083144 -7252490 -6087088 -2607504 -958245 -3303998
43464c303998l073337p6613K002679J038772n37768j287771k490823l462897r92368
$$ -3303998 -6377335 -6453948 -4451269 -3412497 -3950265 -5238036 -7728859 -11191756 -12184124
43455a2184124M533246P612382M960844J01159k136910j860420j922915k930663
$$ -12184124 -7650878 -38496 4922348 5023507 2886597 1026177 -896738 -3827401
43447c827401l604807l401612k011855J109043M269438L708358r18531m410013
$$ -3827401 -7432208 -10833820 -12845675 -11736632 -7467194 -3758836 -4677367 -9087380
43439i087380k676141J613145L734377L928266M939635N445096K016512l642427
$$ -9087380 -11763521 -10150376 -6415999 -2487733 2451902 7896998 9913510 6271083
43431F271083n710915k834983j59661j602909m868398n824550l793300n40853
$$ 6271083 560168 -2274815 -2434476 -4037385 -8905783 -14730333 -18523633 -19064486
43423a9064486K634190M795907N005143L798337K967000K834847J919081j52550
$$ -19064486 -16430296 -11634389 -6629246 -2830909 136091 2970938 4890019 4737469
43415D737469k019358l348230n128994o600560n441963k073365Q1201J51452J495700
$$ 4737469 2718111 -630119 -5759113 -12359673 -17801636 -19875001 -19793800 -19642348 -18146648
43406a8146648N528110Q099734N456663K92631k111181j042308M25008J022862
$$ -18146648 -12618538 -4518804 937859 1230490 -880691 -1922999 -1497991 -475129
43398d75129J644169J714712k03770k878355l580692k473276k134524k995631
$$ -475129 1169040 2883752 2679982 -198373 -3779065 -6252341 -8386865 -11382496
43390a1382496k882760j043675Q63095J919791K809743L413725K785332J660267
$$ -11382496 -14265256 -15308931 -14445836 -12526045 -9716302 -6302577 -3517245 -1856978
43382a856978J707204K118338M34505k875084m362835k865221j050901o15905
$$ -1856978 -149774 1968564 2403069 -472015 -4834850 -7700071 -8750972 -9366877
43374i366877J61572K321442L462069J652486r18403j066999Q13876J965005J308737
$$ -9366877 -9205305 -6883863 -3421794 -1769308 -2687711 -3754710 -2940834 -975829 332908
43365C32908j00845j239939j657167j133293m31726r09199k050772j467249J065841
$$ 332908 232063 -1007876 -2665043 -3798336 -4230062 -5139261 -7190033 -8657282 -7591441
43356g591441K159445k21237k882766j709006K149715M143519L129023K213909
$$ -7591441 -5431996 -5653233 -8535999 -10245005 -8095290 -3951771 -822748 1391161
43348A391161L042272L291489Q72524k506848l571727j406595K031382M038810
$$ 1391161 4433433 7724922 8597446 6090598 2518871 1112276 3143658 7182468
43340G182468L117160l2562k958991l790401l141211k724151k542197j172823
$$ 7182468 10299628 10267066 7308075 3517674 376463 -2347688 -4889885 -6062708
43332f062708J244382K356820O74427k184561l294284j649709J117390K751807
$$ -6062708 -4818326 -2461506 -1787079 -3971640 -7265924 -8915633 -7798243 -5046436
43324e046436K583317J795591J537695J057688j300057n004928o840736m686078
$$ -5046436 -2463119 -667528 870167 1927855 627798 -4377130 -11217866 -15903944
43316a5903944m15001K603208L614637L993315L836908K020137n76034j026770
$$ -15903944 -16318945 -13715737 -10101100 -6107785 -2270877 -250740 -826774 -1853544
43308a853544J532041M110078L371839o43375n091945p055435n114331j14497
$$ -1853544 -321503 3788575 7160414 6517039 1425094 -5630341 -10744672 -10859169
43300a0859169M551859N118956J346576k803849l477503q82732J949017K964983
$$ -10859169 -6307310 -1188354 158222 -2645627 -6123130 -7005862 -5056845 -2091862
43292b091862K231025M53539j615818k550948r37994K597375N082194L908931
$$ -2091862 139163 592702 -1023116 -3574064 -4512058 -1914683 3167511 7076442
43284G076442k07475l593917l337608m07677J583877P30159j161319j501595n52714
$$ 7076442 6868967 3275050 -62558 -470235 1113642 1843801 682482 -819113 -1371827
43275a371827o14974k376514m026633l923598k320157j97397J898552L395272
$$ -1371827 -1986801 -4363315 -8389948 -12313546 -14633703 -14831100 -12932548 -9537276
43267i537276L674976L160318L037280L337039K763932J083557L3871P61420J780588
$$ -9537276 -5862300 -2701982 335298 3672337 6436269 7519826 7553697 8315117 10095705
43258A0095705R26270j597517l547372l492873k094166p53887l0704M42757R81221
$$ 10095705 11021975 9424458 5877086 2384213 290047 -463840 -494544 -51787 929434
43249I29434J145847L36902q70435r08457M57622J083290o98352l158979l381652
$$ 929434 2075281 2412183 1541748 633291 1090913 2174203 1475851 -1683128 -5064780
43240e064780j633133n30338k00681J730260M581964L730610k151936p166817
$$ -5064780 -6697913 -7228251 -7428932 -5698672 -1116708 2613902 461966 -6704851
43232f704851n545149Q1048K502701L8108k481468j995135p19336n61393M33581
$$ -6704851 -12250000 -12168952 -9666251 -9628143 -12109611 -14104746 -14824082 -15385475 -14951894
43223a4951894L523825N591889L642792K7557p64083J201973J847693k51950j743762
$$ -14951894 -11428069 -5836180 -2193388 -2165831 -2929914 -1727941 119752 -132198 -1875960
43214a875960J22212L303582M135708K495030J180973J125103J96247k677609
$$ -1875960 -1753748 1549834 5685542 8180572 9361545 10486648 10682895 8005286
43206H005286m842576l299662Q17861L656259L861843L487626L492862J755439
$$ 8005286 3162710 -136952 680909 4337168 8199011 11686637 15179499 16934938
43198A6934938k688967o452911n928665k733117j414631k608534k425913J062531
$$ 16934938 14245971 7793060 1864395 -868722 -2283353 -4891887 -7317800 -6255269
43190f255269M606759M514536J528998j020625j587052p91583O12848J784621
$$ -6255269 -1648510 2866026 4395024 3374399 1787347 995764 1608612 3393233
43182C393233J223780j350999l454118k570142J34144J247807j0278r36348L19864
$$ 3393233 4617013 3266014 -188104 -2758246 -2624102 -1376295 -1386573 -2322921 -2003057
43173b003057K096006J979672K31538j050912q33634L43653J800972K995411K884153
$$ -2003057 92949 2072621 2304159 1253247 419613 763266 2564238 5559649 8443802
43164H443802Q02500j876827k537911m83372J792099J454513j192383l177693
$$ 8443802 9246302 7369475 4831564 4348192 6140291 7594804 6402421 3224728
43156C224728k582004n87478N44371N06691R47999K758565M490473M003514J140935
$$ 3224728 642724 55246 599617 1106308 2054307 4812872 9303345 13306859 14447794
43147A4447794j973283l320673l033130k615424k573193j819174K48632K139779
$$ 14447794 12474511 9153838 6120708 3505284 932091 -887083 -638451 1501328
43139A501328J954413K62933k87018J395591L124839K300919p66665l697348n090853
$$ 1501328 3455741 3718674 3431656 4827247 7952086 10253005 9486340 5788992 698139
43130F98139n015085l398041l98337J851835Q17135k263676k596931J938433P162476
$$ 698139 -4316946 -7714987 -8113324 -6261489 -5444354 -7708030 -10304961 -8366528 -1204052
43121a204052P766045M250924J375471Q05943m25379l704467n554173k976816
$$ -1204052 6561993 10812917 12188388 12994331 12568952 8864485 3310312 333496
43113C33496J275331K304374O3959j079510Q20800K660539J133569k815607n655295
$$ 333496 1608827 3913201 3977160 2897650 3718450 6378989 7512558 4696951 -958344
43104i58344n241306k041300J693695L026847O85425k581308k314223J548008
$$ -958344 -6199650 -8240950 -6547255 -3520408 -2834983 -5416291 -7730514 -6182506
43096f182506L623352M98512l678753k806120K020791L950496N65217k694791
$$ -6182506 -2559154 -2060642 -5739395 -8545515 -6524724 -2574228 -2009011 -4703802
43088d703802p68920L943297N517960K284568k440939n235635n169496k912598
$$ -4703802 -5472722 -1529425 3988535 6273103 3832164 -1403471 -6572967 -9485565
43080i485565K1707J848618K269141K824089M098227M189106J842208p38404q01983
$$ -9485565 -9463858 -7615240 -5346099 -2522010 1576217 5765323 7607531 6869127 6067144
43071F067144P01963P00271j243299k789601k762999k187995j772607j254631
$$ 6067144 6769107 7469378 6226079 3436478 673479 -1514516 -3287123 -4541754
43063d541754r16104q93367M42611M076617O826612M328912k157912o200077m481268
$$ -4541754 -5457858 -6351225 -5908614 -1831997 4994615 9323527 7165615 965538 -3515730
43054c515730n38001J235546J040116Q65384L23729j432795k715010j679285M41777
$$ -3515730 -4053731 -2818185 -1778069 -912685 -588956 -2021751 -4736761 -6416046 -5974269
43045e974269J402628J215750Q45970N639j174306r97427M61972J30552k502804
$$ -5974269 -4571641 -3355891 -2509921 -2504282 -3678588 -4676015 -4214043 -4083491 -6586295
43036f586295k500754K871237P451506M110317l223348m027284K813272O851193
$$ -6586295 -9087049 -6215812 1235694 5346011 2122663 -1904621 908651 7759844
43028G759844K033809m379432l673157J382758K449815j067410k807948o95179
$$ 7759844 9793653 5414221 1741064 3123822 5573637 4506227 1698279 1003100
43020A003100P85970q30770k292128q77745J213987R13613j252010k868911k928802
$$ 1003100 1789070 958300 -1333828 -2211573 -997586 -83973 -1335983 -4204894 -7133696
43011g133696j686809L81554K003465J564777n39354j784829p64297J189705K370056
$$ -7133696 -8820505 -8438951 -6435486 -4870709 -5410063 -7194892 -7959189 -6769484 -4399428
43002d399428K601633J884766m10313l373597l857974l45777L950057M431573
$$ -4399428 -1797795 86971 -323342 -3696939 -7554913 -7900690 -3950633 480940
42994D80940Q67514k627983l132276j919503j344436j043097R43185M290776N859755
$$ 480940 1348454 -1279529 -4411805 -6331308 -7675744 -8718841 -7775656 -3484880 2374875
42985B374875L632750k63636j969156q86995l92137k882186n953368n381922r27725
$$ 2374875 6007625 5743989 3774833 2887838 2495701 -386485 -6339853 -11721775 -12649500
42976a2649500L253694L992522K512131J676018J950862J700118K76863r09993
$$ -12649500 -9395806 -5403284 -2891153 -1215135 735727 2435845 2712708 1802715
42968A802715k75148J845173L047303J035624l379677o105511m280459n08108
$$ 1802715 1527567 3372740 6420043 7455667 4075990 -2029521 -6309980 -6818088
42960f818088P1540k906692m211251q99097K975217K642790L7602J89862K595887
$$ -6818088 -6746548 -9653240 -13864491 -14763588 -11788371 -9145581 -9107979 -8918117 -6322230
42951f322230K207323j434297k488712K020183O999377O576103K210279o72160
$$ -6322230 -4114907 -5549204 -8037916 -6017733 981644 7557747 9768026 9095866
42943I095866r58560j823017m027602m396454j334023K207774K641212m1532l202224
$$ 9095866 8137306 6314289 2286687 -2109767 -3443790 -1236016 1405196 1363664 -1838560
42934a838560m649662l621130m37091L298978N093185L535053j65638l059216
$$ -1838560 -6488222 -10109352 -10546443 -7247465 -2154280 1380773 1215135 -1844081
42926a844081k813254N23460M411176N645610L231393m59966k104044r27619R09199
$$ -1844081 -4657335 -4133875 277301 5922911 9154304 8694338 6590294 5662675 6571874
42917F571874J137742m21383k290992k842774j460998O85767J231605p24891k831854
$$ 6571874 7709616 7288233 4997241 2154467 693469 1379236 2610841 1885950 -945904
42908i45904k102167Q06531K238503R00056k15089J219414K710729O38121l601634
$$ -945904 -3048071 -2241540 -3037 897019 681930 1901344 4612073 5250194 1648560
42899A648560m843191j420880K374608K303326k75046j073604P97324K081057
$$ 1648560 -3194631 -4615511 -2240903 62423 -212623 -1286227 -488903 1592154
42891A592154N45652j849179j943011K30408J661243M19829j955897k444389j14982
$$ 1592154 2137806 288627 -1654384 -1423976 237267 657096 -1298801 -3743190 -3858172
42882c858172K852654L535075J222405k157630m325844m752475m122688k527086
$$ -3858172 -1005518 2529557 3751962 1594332 -2731512 -7483987 -11606675 -14133761
42874a4133761K97629K886339K398102j363325m009057j398076M293971O696668
$$ -14133761 -13836132 -10949793 -8551691 -9915016 -13924073 -15322149 -11028178 -4331510
42866d331510L821428P51114J942935M545981K981972k373143n810962m688640
$$ -4331510 -510082 241032 2183967 6729948 9711920 7338777 1527815 -3160825
42858c160825k244503j435030p64810J616736L632900K379860r60798k677882
$$ -3160825 -5405328 -6840358 -7605168 -5988432 -2355532 24328 -936470 -3614352
42850c614352j639030J31734J134119J867469K922326L915663M293468L504872
$$ -3614352 -5253382 -5121648 -3987529 -2120060 802266 4717929 9011397 12516269
42842A2516269Q63571k975844n174032l663809m88161M05210j378797k209857
$$ 12516269 13379840 10403996 5229964 1566155 1077994 1483204 104407 -2105450
42834b105450J35071L330367L859014J195493k559040n119617m882048j566666
$$ -2105450 -1970379 1359988 5219002 6414495 3855455 -1264162 -6146210 -7712876
42826g712876K390573L174597K57987k185934p40672K344934K612923J05862j201001
$$ -7712876 -5322303 -2147706 -1889719 -4075653 -4816325 -2471391 141532 247394 -953607
42817i53607j3053N96539j113076k335802m05371K496725K321908j059901l980645
$$ -953607 -966660 -370121 -1483197 -3818999 -4224370 -1727645 594263 -465638 -4446283
42808d446283l767953q33627L059849N843693N105545K17464n238027o196848
$$ -4446283 -8214236 -9047863 -5988014 -144321 4961224 5178688 -59339 -6256187
42800f256187k228403J636132J344071j442846k678457j482030J64576J378294
$$ -6256187 -8484590 -6848458 -5504387 -6947233 -9625690 -11107720 -10943144 -9564850
42792i564850K809748L895839K946933K35186j747527j774507j199590r26330
$$ -9564850 -6755102 -2859263 87670 322856 -1424671 -3199178 -4398768 -5325098
42784e325098L88712L417387N565452L808029q53054m214642l952575j687132
$$ -5325098 -4936386 -1518999 4046453 7854482 7001428 2786786 -1165789 -2852921
42776b852921K37910J706109L319606L811494J372460k750994m422362j535748
$$ -2852921 -2615011 -908902 2410704 6222198 7594658 4843664 421302 -1114446
42768a114446K810591L909996J434586n18610N09970J983652N87722k567240l711468
$$ -1114446 1696145 5606141 7040727 6522117 7032087 9015739 9603461 7036221 3324753
42759C324753k078872n17961o55255q30816L49425J557322J442461J073904J511784
$$ 3324753 1245881 727920 72665 -758151 -408726 1148596 2591057 3664961 5176745
42750E176745J215156j402988m468303m734141k254844M0567Q71789J460621J988762
$$ 5176745 6391901 4988913 520610 -4213531 -6468375 -6427808 -5556019 -4095398 -2106636
42741b106636R30830j132140p75840K957017N593144K842226k810524m982018
$$ -2106636 -1175806 -2307946 -3083786 -126769 5466375 8308601 5498077 516059
42733E16059k144508N62721j051340m613727n281782k548624J32278Q87184J075739
$$ 516059 -1628449 -1065728 -2117068 -6730795 -12012577 -14561201 -14428923 -13541739 -12466000
42724a2466000J740898J845835R04148M83708J518866K373873J460126r4579n52701
$$ -12466000 -10725102 -8879267 -7975119 -7491411 -5972545 -3598672 -2138546 -2233125 -2785826
42715b785826o67196j972057l198559j705624J810707L456060J614348p80809
$$ -2785826 -3453022 -5425079 -8623638 -10329262 -8518555 -5062495 -3448147 -4228956
42707d228956o43489J284970K457891K234043J588482P77235o67229k531206l993019
$$ -4228956 -4872445 -3587475 -1129584 1104459 2692941 3470176 2802947 271741 -3721278
42698c721278m384787l142880k65715K597950L382969K686985L211715N026537
$$ -3721278 -8106065 -11248945 -11514660 -8916710 -5533741 -2846756 364959 5391496
42690E391496M533522L32147l216156j841391J878181K150276j253081k997319
$$ 5391496 9925018 10257165 7041009 5199618 7077799 9228075 7974994 4977675
42682D977675p17739J660675M40694k396790k631250K89052L285145L864773K291902
$$ 4977675 4259936 5920611 6361305 3964515 1333265 1622317 4907462 8772235 11064137
42673A1064137M47351k61371l06353j440704l923481n192211l098271M67931J808376
$$ 11064137 11511488 11250117 10943764 9503060 5579579 387368 -2710903 -2242972 -434596
42664d34596O00264l69912k57631r31444k256574j103722L177363O353320M961305
$$ -434596 165668 -204244 -461875 -1393319 -3649893 -4753615 -1576252 4777068 9738373
42655I738373J052555j516059k524550l839534m890191l537815k22817K211922
$$ 9738373 10790928 9274869 6750319 2910785 -1979406 -5517221 -5740038 -3528116
42647c528116K393624J447887N08981n11714j767023k731627k553160m84322L053603
$$ -3528116 -1134492 313395 822376 310662 -1456361 -4187988 -6741148 -7225470 -4171867
42638d171867N396781L693768q64219l323761j207305K105596K471534O76117
$$ -4171867 1224914 4918682 4054463 730702 -476603 1628993 4100527 4776644
42630D776644r6675L0998j417487m045801m623282k093224J034732K362300J819956
$$ 4776644 4679969 4710967 3293480 -752321 -5375603 -7468827 -6434095 -4071795 -2251839
42621b251839M79538k08717J285672M189617M474010j45486n312026m593140J348074
$$ -2251839 -1772301 -1981018 -695346 3494271 7968281 7822795 2510769 -2082371 -734297
42612g34297N066796K539264j884287k497613L16953K409303K062109O41795o15588
$$ -734297 4332499 6871763 4987476 2489863 2806816 5216119 7278228 7920023 7304435
42603G304435j498805j846996j769266j744153j356041L96161K612264K604540
$$ 7304435 5805630 3958634 2189368 445215 -910826 -514665 2097599 4702139
42595D702139k23950k987081l226904j762252k15007J367124K526418J356740
$$ 4702139 4478189 1491108 -1735796 -3498048 -3713055 -2345931 180487 1537227
42587A537227j744517k488512J370232N131874K767743m141154p954987m955277
$$ 1537227 -207290 -2695802 -1325570 3806304 6574047 2432893 -5522094 -10477371
42579a0477371R33724M619598N360413M630484K815889L70640q43303J27136J712617
$$ -10477371 -9543647 -4924049 436364 5066848 7882737 8253377 7410074 7537210 9249827
42570I249827K356930K560997K648061R66299l128088o549894n916401k486736
$$ 9249827 11606757 14167754 16815815 17782114 14654026 8104132 2187731 -299005
42562b99005m45865r65449j404358k60050Q97076J195080K206408M012684L322394
$$ -299005 -744870 -1710319 -3114677 -3374727 -2477651 -1282571 923837 4936521 8258915
42553H258915j226230n007292l176547J413691J491380l850988p632387n652629
$$ 8258915 7032685 2025393 -1151154 262537 1753917 -2097071 -9729458 -15382087
42545a5382087k580815l715352n889169k487651N357889R280356N115248j941241
$$ -15382087 -17962902 -21678254 -27567423 -30055074 -24697185 -15416829 -10301581 -12242822
42537a2242822m754750k182768K138700N027964N432964L653143J249649J45728
$$ -12242822 -16997572 -19180340 -17041640 -12013676 -6580712 -2927569 -1677920 -1532192
42529a532192M41559N95540K66383P36427J990863K180719R38880K75677R48659
$$ -1532192 -1090633 -495093 -228710 507717 2498580 4679299 5618179 5893856 6842515
42520F842515J088409Q768j4962K014862L131751Q22410k752068m058313l125313
$$ 6842515 7930924 7939692 7924730 9939592 13071343 13893753 11141685 7083372 3958059
42511C958059j976281p41328J032008J653517L2011r60577J539052M693934L275660
$$ 3958059 1981778 1240450 2272458 3925975 3957986 2997409 4536461 9230395 12506055
42502A2506055k267081o195598n623570l138795j175027Q45205K779046K443353
$$ 12506055 10238974 4043376 -1580194 -4718989 -5894016 -5048811 -2269765 173588
42494A73588o9440j244934N65243K618025K443857J119228K200j528688k765791
$$ 173588 104148 -1140786 -575543 2042482 4486339 5605567 5607767 4079079 1313288
42485A313288p34004M148772N925801R81502n606603o591343k548079J86055m37809
$$ 1313288 579284 4728056 10653857 11635359 6028756 -562587 -3110666 -2924611 -3362420
42476c362420l96037K484614M840449L446465m9760k191900k324958k129367k648943
$$ -3362420 -3758457 -1273843 3566606 7013071 6963311 4771411 2446453 317086 -2331857
42467b331857l294932k544396P71028N466560P762628N321382J047637j07783
$$ -2331857 -5626789 -8171185 -7400157 -1933597 5829031 11150413 12198050 12090267
42459A2090267K038639K846913J3427l259408l670207k398262j871087j502149
$$ 12090267 14128906 16975819 16989246 13729838 10059631 7661369 5790282 4288133
42451D288133J29142J644149J086081k44732J0734P35456q79949l843457m090338
$$ 4288133 4417275 6061424 7147505 6902773 6913507 7648963 6769014 2925557 -1164781
42442a164781r15503J598826O68096j578211k242934j746850j347744J6780K920870
$$ -1164781 -2080284 -481458 186638 -1391573 -3634507 -5381357 -6729101 -6712321 -3791451
42433c791451M095768L70249n181731n855128n26243M225945K939919j670569
$$ -3791451 304317 674566 -4507165 -10362293 -10888536 -6662591 -3722672 -5393241
42425e393241l317671p26102K254033L268702L598817L929500K691483M3604o47938
$$ -5393241 -8710912 -9437014 -7182981 -3914279 -315462 3614038 6305521 6349125 5701187
42416E701187J963174L791911Q28718m270937n605031k831281j330464l271751
$$ 5701187 7664361 11456272 12284990 8014053 2409022 -422259 -1752723 -5024474
42408e024474m190579q01657L067955K670075L80978J677227N348479M631145
$$ -5024474 -9215053 -10016710 -6948755 -4278680 -3897702 -2220475 3128004 7759149
42400G759149j785317o702476m631802P66809L129271K410612K520608L465959
$$ 7759149 5973832 -728644 -5360446 -4593637 -1464366 946246 3466854 6932813
42392F932813J881954k023186l944919k137135M09567J356441K069620L771521
$$ 6932813 8814767 6791581 2846662 709527 1119094 2475535 4545155 8316676
42384H316676M752958L610848J822460O53815j380565n089795p388421n095911
$$ 8316676 13069634 16680482 18502942 19156757 17776192 12686397 5297976 202065
42376B02065k10643K312521J200542k41676L24442J239240J03120k616292m523191
$$ 202065 -8578 2303943 3504485 3262809 3587251 4826491 4929611 2313319 -2209872
42367b209872m213068k216255r0745P54094J78346l02109J027519L939760O161843
$$ -2209872 -6422940 -8639195 -8729940 -7975846 -7797500 -8099609 -7072090 -3132330 3029513
42358C029513N619528K508889p35454j460424N54606K336375Q19918k921454m402203
$$ 3029513 8649041 11157930 10422476 8962052 9516658 11853033 12672951 9751497 5349294
42349E349294j710420J511992J154283j466362j992876J07293J080469q10879
$$ 5349294 3638874 5150866 6305149 4838787 2845911 2953204 4033673 3222794
42341C222794k530618j004974K494543M342291K782594j113394m810667n610872
$$ 3222794 692176 -312798 2181745 6524036 9306630 8193236 3382569 -2228303
42333b228303k576740J729684L270264J292587q11870k89965J605316K308375
$$ -2228303 -4805043 -3075359 194905 1487492 675622 385657 1990973 4299348
42325D299348J625669Q50069J98013o50950q90990L44019K179379L060913K771546
$$ 4299348 5925017 6775086 6973099 6322149 5431159 5775178 7954557 11015470 13787016
42316A3787016J884006K32727k436820n118887o312991n489419k913520P50254
$$ 13787016 15671022 15903749 13466929 8348042 2035051 -3454368 -6367888 -5617634
42308e617634L748714L989949J961438J014315K858387M654836K919305j401433
$$ -5617634 -1868920 2121029 4082467 5096782 7955169 12610005 15529310 14127877
42300A4127877m478869m797380l753287k145124M50838L028658L236270P69167
$$ 14127877 9649008 4851628 1098341 -1046783 -595945 2432713 5668983 6438150
42292F438150j754950j957263j394K352014L311057J923634q24456k200638q15260
$$ 6438150 4683200 2725937 2724543 5076557 8387614 10311248 9486792 7286154 6470894
42283F470894J259247J473602O17894Q59348J337973m12883l314766l492189n08993
$$ 6470894 7730141 9203743 9821637 10680985 12018958 11606075 8291309 4799120 4290127
42274D290127J625281P72318l66883O49318K070419J562371J53815k57820l21124
$$ 4290127 5915408 6687726 6320843 6970161 9040580 10602951 10756766 10498946 10177822
42265A0177822j172001j525092J01237K286726K701470J439938j38005j891874
$$ 10177822 9005821 7480729 7581966 9868692 12570162 14010100 13872095 11980221
42257A1980221l599409l373905n17267J978312J207644j012740r75754Q03766
$$ 11980221 8380812 5006907 4489640 6467952 7675596 6662856 5687102 6490868
42249F490868M69351k729989n076133l882852p83135J344571J854167J767966
$$ 6490868 6960219 4230230 -845903 -4728755 -5511890 -4167319 -2313152 -545186
42241e45186J944719K605180L146589K327105K2210j879082k056401j947862k954571
$$ -545186 1399533 4004713 7151302 9478407 9500617 7621535 5565134 3617272 662701
42232F62701l149529l33615K996252K303507j845267m273992l099060j792164
$$ 662701 -2486828 -2820443 175809 2479316 634049 -3639943 -6739003 -8531167
42224h531167k252040j589106J717849M040813K760057J311011L243708N231780
$$ -8531167 -10783207 -12372313 -10654464 -6613651 -3853594 -2542583 701125 5932905
42216E932905J884177m915091p715458l868244J433375K937908J355368L88262
$$ 5932905 7817082 2901991 -4813467 -8681711 -7248336 -4310428 -2955060 -2566798
42208b566798J585306L746158M784092L047119j042169m131135l080688O19082
$$ -2566798 -981492 2764666 7548758 10595877 9553708 5422573 2341885 2960967
42200B960967K168811k31639l180248l157504r96233L54684J27736l30495k73422
$$ 2960967 5129778 4898139 1717891 -1439613 -2435846 -2081162 -1953426 -2283921 -2557343
42191b557343K5769O84161K023622L212437K724798N27785j153817n3135L129638
$$ -2557343 -2531574 -1847413 176209 3388646 6113444 6641229 5487412 5434277 8563915
42182H563915M681160J891251l089104n202315k824899K40318N86334L8846J540109
$$ 8563915 13245075 15136326 12047222 6844907 4020008 4260326 4846660 4885506 6425615
42173F425615K951700M3104n472460o818527j843184L785992N004475L655233
$$ 6425615 9377315 9420419 3947959 -2870568 -4713752 -927760 4076715 7731948
42165G731948L382385L178995M20620l241725l861746j017535K377014M289563
$$ 7731948 11114333 14293328 14713948 11472223 7610477 6592942 8969956 13259519
42157A3259519M115780J278267k859698m058304o12531K572045M02104m018966
$$ 13259519 17375299 18653566 15793868 11735564 11123033 13695078 14097182 10078216
42149A0078216l604577J430650L743623O10323k128244j08132K680027J093363
$$ 10078216 6473639 7904289 11647912 12258235 10129991 10021859 12701886 13795249
42141A3795249k759187l349584j37015K724641K519569l78402m812066q840335
$$ 13795249 11036062 7686478 7549463 10274104 12793673 12415271 7603205 -1237130
42133a237130r191637m514061J938428N818882O493705N781880M073306J027868
$$ -1237130 -10428767 -14942828 -13004400 -7185518 -691813 5090067 9163373 10191241
42125A0191241j798384k731523k850977l473435k562410J976857O798181O100202
$$ 10191241 8392857 5661334 2810357 -663078 -3225488 -1248631 5549550 11649752
42117A1649752K7934m847986m188558n40912J813176K305226K373726J973783
$$ 11649752 11677686 6829700 2641142 2100230 3913406 6218632 8592358 10566141
42109A0566141M90480j128543j468454o02899L07080J74268j618396m241769m864272
$$ 10566141 11056621 9928078 8459624 7856725 8163805 8338073 6719677 2477908 -2386364
42100b386364j554931L114006M357438J564605r18510k53864J351943J149474
$$ -2386364 -3941295 -827289 3530149 5094754 4176244 3922380 5274323 6423797
42092F423797O8064m6409k3671j092061j751582k90383J721143J838172Q61663
$$ 6423797 6491861 6445452 6421781 5329720 3578138 3287755 5008898 6847070 7708733
42083G708733J087341J904021Q54084j740858k875913j418775O26268J476517
$$ 7708733 8796074 10700095 11554179 9813321 6937408 5518633 6144901 7621418
42075G621418J347589P44496l43584j258799j067555l15121j05384M70738L171928
$$ 7621418 8969007 9713503 9369919 8111120 7043565 6728444 6623060 7093798 10265726
42066A0265726O543285O203945O35040n838172p843090n150614k091471j711759
$$ 10265726 16809011 23012956 23647996 17809824 9966734 4816120 2724649 1012890
42058A012890k572292j543576J696227M118961L227236L37992j152475k29220
$$ 1012890 -1559402 -3102978 -1406751 2712210 5939446 6277438 5124963 4895743
42050D895743R41545Q45632P35895J733206K471602J786427J264246K179868K205926
$$ 4895743 5837288 6682920 7418815 9152021 11623623 13410050 14674296 16854164 19060090
42041A9060090r56291m527000m085968j094783j314349n328264o727755j883378
$$ 19060090 18103799 13576799 9490831 8396048 7081699 1753435 -4974320 -6857698
42033f857698M121745M962071J858958K73804J222492J263130o30480j629522
$$ -6857698 -2735953 2226118 4085076 4358880 5581372 6844502 6214022 4584500
42025D584500l92422P85274J49746p25426J43989J868708J979930k11939k720710
$$ 4584500 4192078 4977352 5127098 4401672 4545661 6414369 8394299 8182360 5461650
42016E461650k972846n44797K024091J781278q82795k357668o51814J701568J484911
$$ 5461650 2488804 1944007 3968098 5749376 4866581 2508913 1857099 3558667 5043578
42007E043578k21763J01682K505043L134266J30411l300599l132132M95221M121872
$$ 5043578 4821815 4923497 7428540 10562806 10693217 7392618 4260486 4755707 8877579
41998H877579N100156L288959j276k853611l178253k90220L489176M134460O7047
$$ 8877579 13977735 17266694 17265418 14411807 11233554 10943334 14432510 18566970 18634017
41989A8634017n147917n629153K15755O732542O572327p65594q152313r255731
$$ 18634017 13486100 7856947 8072702 14805244 21377571 20611977 12459664 3203933
41981C203933n153165r96597R60110J887045K186780J149987J70525J901874N555041
$$ 3203933 -1949232 -2945829 -1985719 -98674 2088106 3238093 3408618 5310492 10865533
41972A0865533O844856L887671p2940j293190K895J351502J527423N51502j225619
$$ 10865533 17710389 21598060 21525120 20231930 20234825 21586327 23113750 23665252 22439633
41963B2439633k198969k33457L578741M515457K57164n048699n945365k921877
$$ 22439633 20240664 20007207 23585948 28101405 28358569 23309870 17364505 14442628
41955A4442628q23184j405930j762230M4014K022304K015347J040916J166826
$$ 14442628 13619444 12213514 10451284 10495298 12517602 14532949 15573865 16740691
41947A6740691K342257K995799K266943M41426j523418k032442J41215L918201
$$ 16740691 19082948 22078747 24345690 24787116 23263698 21231256 21372471 25290672
41939B5290672O359100O080720M888333M856034N258930M208552K301259K199541
$$ 25290672 31649772 37730492 42618825 47474859 52733789 56942341 59243600 61443141
41931F1443141M470030O169218M862907K524389L383646Q244632J3149633J4549975
$$ 61443141 65913171 72082389 76945296 79469685 82853331 91097963 104247596 118797571
41923A18797571J4007263J6023263K2307737L0377030L7264364M1944434M3889256
$$ 118797571 132804834 148828097 171135834 201512864 238777228 280721662 324610918
41916C24610918M2200137L7357618L1116419K2979299R581487r749855k9109235
$$ 324610918 366811055 404168673 435285092 458264391 467845878 458096023 428986788
41909D28986788m1065650m4283494m2949599m0043744l5202047k8677182k2917552
$$ 428986788 387921138 343637644 300688045 260644301 225442254 196765072 173847520
41902A73847520j9314603j6829837j4649679j3034033j1129721p728761m851032
$$ 173847520 154532917 137703080 123053401 110019368 98889647 91160886 86309854
41895H6309854o079725r955931j0189266n120903j504197m355844q133485m759525
$$ 86309854 80230129 70274198 60084932 54964029 53459832 49103988 40970503 36210978
41887C6210978K964813M414785k915240r203560o490251N07237K619782m11004
$$ 36210978 39175791 43590576 40675336 31471776 24981525 25488762 28108544 27697540
41879B7697540j473979J864733M164805J392199k754353k664378R67480K674610
$$ 27697540 26223561 28088294 32253099 33645298 30890945 28226567 29194047 31868657
41871C1868657L35629k188140r07755K950287N226425M528719L188072L178174
$$ 31868657 32204286 30016146 29108391 32058678 37285103 41813822 45001894 48180068
41863D8180068L724367L562142L336793M234788N545014N264298K622162j154494
$$ 48180068 51904435 55466577 58803370 63038158 68583172 73847470 76469632 75315138
41855G5315138m105597m741167k902281n14854l80246k663770l630000L9468O296613
$$ 75315138 71209541 66468374 63566093 63051239 62670993 60007223 56377223 56416691 62713304
41846F2713304R483036O968766J663697k363305m172533m849995m594544k974578
$$ 62713304 72196340 79165106 80828803 78465498 74292965 69442970 64848426 61873848
41838F1873848p72487N55648R55841J783618L713798N758089O594919O081822
$$ 61873848 61101361 61657009 62612850 64396468 68110266 73868355 80463274 86545096
41830H6545096M946419L296815J87068m755144r583445j1137730q548443m684249
$$ 86545096 91491515 94788330 94975398 90220254 80636809 69499079 60950636 56266387
41822E6266387l040756l834780m398318l014637j029832j113881m173783p823559
$$ 56266387 53225631 49390851 44992533 41977896 40948064 39834183 35660400 27836841
41814B7836841p830360k483924L892099M237800k466383q309813n741124K329097
$$ 27836841 20006481 17522557 21414656 25652456 23186073 14876260 9135136 11464233
41806A1464233O317109K676596k803154m561855l754173l028794j031189L554307
$$ 11464233 17781342 20457938 17654784 13092929 9338756 6309962 5278773 8833080
41798H833080P093672N462432O90020j843172j032105j80626q64883j458670j287824
$$ 8833080 15926752 21389184 22079204 20236032 19203927 19023301 18158418 16699748 15411924
41789A5411924j766796l133039l752668l008434j750671N8663K956008N469396
$$ 15411924 13645128 10512089 6759421 3750987 2000316 2058979 5014987 10484383
41781A0484383N462219L827268L195271L212913J467297p57554R83500O410889
$$ 10484383 15946602 19773870 22969141 26182054 27649351 26891797 27875297 34286186
41773C4286186Q647072L557388l576572n179030j832650l05147k881716m483161
$$ 34286186 42933258 46490646 42914074 37735044 35902394 35597247 32715531 28232370
41765B8232370j039989M140873M887547L14431m412524m690197j573949L23601
$$ 28232370 27192381 31333254 36220801 36535232 32122708 27432511 25858562 26182163
41757B6182163j230282l668172l308667j46950K351044J698593j051444l350057
$$ 26182163 24951881 21283709 17975042 17828092 20179136 21877729 20826285 17476228
41749A7476228m093424l761115k856540j306256R47140L250514M147782K575458
$$ 17476228 13382804 9621689 6765149 5458893 6406033 9656547 13804329 16379787
41741A6379787j99419r47216J603089M207913K847044j633248m590255m084250
$$ 16379787 16180368 15233152 16836241 21044154 23891198 22257950 17667695 13583445
41733A3583445k688907k261516j086309J862668L738985K006289j192142k379961
$$ 13583445 10894538 8633022 7546713 9409381 13148366 15154655 13962513 11582552
41725A1582552k142895l242995m927262l546397J311987N253209M559155N13572
$$ 11582552 9439657 6196662 1269400 -2276997 -965010 4288199 8847354 9360926
41717I360926k705886k504359M49066L398572L724957J125572k038010l181252
$$ 9360926 6655040 4150681 4599747 7998319 11723276 12848848 10810838 7629586
41709G629586j973393K11964K271669L610834L527191J976649J65972r72259j823573
$$ 7629586 5656193 5868157 8139826 11750660 15277851 17254500 17420472 16448213 14624640
41700A4624640k368607j281317J259189K034031q81295m079578l023440Q75003
$$ 14624640 12256033 10974716 12233905 14267936 13386641 9307063 6283623 7158626
41692G158626J924640j260749l683743j549044K532399M005323K383238J99810
$$ 7158626 9083266 7822517 4138774 2589730 5122129 9127452 11510690 11710500
41684A1710500j246509k229550k475089j379764M45940J604466J326625l09025
$$ 11710500 10463991 8234441 5759352 4379588 4825528 6429994 7756619 7447594
41676G447594k467826l398804j809155J062214K625165K660421L457796N488911
$$ 7447594 4979768 1580964 -228191 834023 3459188 6119609 9577405 15066316
41668A5066316N877560K763805j581994m091138m829592n199591m627053k137075
$$ 15066316 20943876 23707681 22125687 18034549 13204957 8005366 3378313 1241238
41660A241238M85086N27536j386528j909972L01437K944245L247763R32012k017370
$$ 1241238 1726324 2253860 867332 -1042640 -741203 2203042 5450805 6382817 4365447
41651D365447l098999j097632K596999M890505M158154J718913n29635k225649
$$ 4365447 1266448 168816 2765815 7656320 11814474 13533387 13003752 10778103
41643A0778103l099538j767109J698004L962406K170425j841578l995853l392854
$$ 10778103 7678565 5911456 7609460 11571866 13742291 11900713 7904860 4512006
41635D512006k110121q18888J488299L861171L647412Q91646j188812r49182k01636
$$ 4512006 2401885 1582997 3071296 6932467 10579879 11471525 10282713 9333531 9131895
41626I131895m50674n74553M61798J636922K042658K240320K183513P96398r40913
$$ 9131895 8681221 8106668 8568466 10205388 12248046 14488366 16671879 17468277 16527364
41617A6527364R1881L937502N605020J525381m564652n827131r22650M929151
$$ 16527364 16619245 20556747 26161767 27687148 23122496 17295365 16372715 21301866
41609B1301866O473562K939100l078195p977628q662753m779263J23194J890356
$$ 21301866 27775428 30714528 27636333 19658705 10995952 6216689 6339883 8230239
41601H230239L86076j099299o85447L52048O20794N79436P87220O85614K00155
$$ 8230239 8616315 7517016 6831569 7183617 7804411 8383847 9171067 9856681 10056836
41592A0056836M79195J834799K717486J993139O85024J49706n3551r99977k275054
$$ 10056836 10536031 12370830 15088316 17081455 17766479 17916185 17862634 16862657 14587603
41583A4587603k595045j733202l54451J328562L129084L713348J843048j104696
$$ 14587603 11992558 10259356 9904905 11233467 14362551 18075899 19918947 18814251
41575A8814251j768752J166137M835385N254207J922754j707836k232147K12761
$$ 18814251 17045499 18211636 23047021 28301228 30223982 28516146 26283999 26496760
41567B6496760K733574L204613K211430J594433J921657K012647O46246j966209
$$ 26496760 29230334 32434947 34646377 36240810 38162467 40175114 40821360 38855151
41559C8855151m451282n433739m333438j721451P14129J202452l92329k190807
$$ 38855151 34403869 28970130 24636692 22915241 23629370 24831822 24439493 22248686
41551B2248686k289145q87431K44492J11548o90809j385334j899911j957561p38797
$$ 22248686 19959541 19072110 19316602 19428150 18737341 17352007 15452096 13494535 12755738
41542A2755738J450609K331953J67985l329593m404599j735377K041086L662786
$$ 12755738 14206347 16538300 16706285 13376692 8972093 7236716 9277802 12940588
41534A2940588K598337M89089j138325j492148k43434J832536K826279J790128
$$ 12940588 15538925 16028014 14889689 13397541 13154107 14986643 17812922 19603050
41526A9603050J81251j60572L97487M03718P2575N41827R37554q33035m064175
$$ 19603050 19784301 19623729 20021216 20424934 20497509 21039336 21976890 21143855 17079680
41517A7079680n196485k964933n56983o32471j046684J387434N005340N219787
$$ 17079680 11883195 8918262 8361279 7728808 6682124 8069558 13074898 18294685
41509A8294685J645879r83846J72492K032115P08383k292300k231165J811932
$$ 18294685 19940564 18956718 19129210 21161325 21869708 19577408 17346243 19158175
41501A9158175N377800M383566q9973l808921m435816l034939j446581m7703J495592
$$ 19158175 24535975 28919541 28829568 25020647 20584831 17549892 16103311 16055608 17551200
41492A7551200K544984J744070j118726m240283n173018l027032O12009K829300
$$ 17551200 20096184 21840254 20721528 16481245 11308227 8281195 8893204 11722504
41484A1722504J787885j426756l437209j737742K567844N741845N305477K334392
$$ 11722504 13510389 12083633 8646424 6908682 9476526 15218371 20523848 22858240
41476B2858240l13521j125531o65715p5295K2432n32676j494080k203267k328064
$$ 22858240 22544719 21419188 20753473 20678178 20700610 20167934 18673854 16470587 14142523
41467A4142523k522151l474337m364128l434150n15402K129611K440053J326329
$$ 14142523 11620372 8146035 3781907 347757 -167645 1961966 4402019 5728348
41459E728348J434111L168611L607408N56043l442985l444004J250871N236177
$$ 5728348 7162459 10331070 13938478 14494521 11051536 7607532 8858403 14094580
41451A4094580L619352j330890l102906K07567L583124K363654j709288l818432
$$ 14094580 17713932 16383042 13280136 13487703 17070827 19434481 17725193 13906761
41443A3906761k593642l76632J073806J793497J611737L47648l47767J416679
$$ 13906761 11313119 10936487 12010293 13803790 15415527 15763175 15415408 16832087
41435A6832087M256449M705110K299680K71037L03785q8089l228140p122362p952088
$$ 16832087 21088536 25793646 28093326 28364363 28668148 28580059 25351919 18229557 10277469
41426A0277469m820796J08495M555133O967938N863728J074609m583767p010386
$$ 10277469 5456673 5565168 10120301 17088239 22951967 24026576 19442809 12432423
41418A2432423m637203K37500L679483L220314l31794l422143l092378m59985
$$ 12432423 7795220 8032720 11712203 14932517 14600723 11178580 8086202 7626217
41410G626217M79297j811490m257189l617619q07283J320145K344109L502931
$$ 7626217 8105514 6294024 2036835 -1580784 -2388067 -1067922 1276187 4779118
41402D779118M151640K565316l19624j510079m89529L7041j436313k899824j956165
$$ 4779118 8930758 11496074 11176450 9666371 9176842 9213883 7777570 4877746 2921581
41393B921581J022495L885149M985733L749067Q12928j753176k218830j668640
$$ 2921581 3944076 7829225 12814958 16564025 17376953 15623777 13404947 11736307
41385A1736307k651775m918380n072878j507045K905486M650399L886230L042703
$$ 11736307 9084532 4166152 -906726 -2413771 491715 5142114 9028344 12071047
41377A2071047L002430K830485K022135J025456L23569L73911J452529K458369
$$ 12071047 15073477 17903962 19926097 20951553 21275122 21649033 23101562 25559931
41369B5559931J338365j978336m692916m670713l081027j850681o85268R84270
$$ 25559931 26898296 24919960 20227044 15556331 12475304 10624623 9939355 10923625
41361A0923625J322117j270057m358240m135197j081692R58645J031099K049222
$$ 10923625 12245742 10975685 6617445 2482248 1400556 2359201 3390300 5439522
41353E439522M933385O254448L637966k09168j480400m34084K11553k29883n45471
$$ 5439522 10372907 16627355 20265321 20056153 18575753 18141669 18353222 18123339 17577868
41344A7577868n60524p47071M2031L101473O432490O142917K021996j121823P90403
$$ 17577868 17017344 16270273 16312304 19413777 25846267 31989184 34011180 32889357 33679760
41335C3679760N981309R217679Q092497M956657L088267L013480L164582K528416
$$ 33679760 39661069 48878748 56971245 61927902 65016169 68029649 71194231 73722647
41327G3722647J257273n13474k702642m194612l611830j873993k044967n068819
$$ 73722647 74979920 74466446 71763804 67569192 63957362 62083369 60038402 54969583
41319E4969583p440110n677665j891722j344754m586092o233898l080750P85913
$$ 54969583 47529473 41851808 39960086 38615332 34029240 27795342 24714592 25500505
41311B5500505K06392l059606l327735k45967O14567l074057o110530l353096
$$ 25500505 25706897 22647291 19319556 19073589 19688156 16614099 10503569 7150473
41303G150473K456551M442350R40991l201636m033416k924551k564016k140762
$$ 7150473 9607024 14049374 14990365 11788729 7755313 4830762 2266746 125984
41295A25984P80220N370528P667145N681679K025405M19271J148806J525066L5983
$$ 125984 906204 6276732 13943877 19625556 21650961 22070232 23219038 24744104 24780087
41286B4780087j893633k413028j660370p14566L71281J887974K777392J718585
$$ 24780087 22886454 20473426 18813056 18098490 18469771 20357745 23135137 24853722
41278B4853722k57057m53539J576386K866878J082540j970293k747964p83358
$$ 24853722 24596665 24143126 25719512 28586390 29668930 27698637 24950673 24167315
41270B4167315J102383R65340j89490p52517p40718p93466p52136n52815j139824
$$ 24167315 25269698 26235038 26045548 25293031 24552313 23758847 23006711 22453896 21314072
41261B1314072k899264m159886l065633m72110Q83993J14733p27406K24400K060428
$$ 21314072 18414808 14254922 11189289 10717179 11601172 11715905 10988499 11212899 13273327
41252A3273327K604853J338264l65192j175741q19141L43792J518862J482233
$$ 13273327 15878180 17216444 16851252 15675511 14856370 15200162 16719024 18201257
41244A8201257l30172k556056k868325o92839J919709K751454J961812J297832
$$ 18201257 17871085 15315029 12446704 11753865 13673574 16425028 18386840 19684672
41236A9684672J368043J044745l23061j468752q90805P94046J406114P20j991483
$$ 19684672 21052715 22097460 21774399 20305647 19414842 20208888 21615002 21615722 19624239
41227A9624239k661369j712418k68134M81161q6456j684758k602793p88427L094844
$$ 19624239 16962870 15250452 14982318 15463479 15377023 13692265 11089472 10301045 13395889
41218A3395889M865999J384429m592554o913077l751246J63044K82807j842323
$$ 13395889 18261888 19646317 15053763 8140686 4389440 4552484 4835291 2992968
41210B992968j879979N07043J790440M04255j358416j503425j061984j589121
$$ 2992968 1112989 1620032 3410472 3814727 2456311 952886 -109098 -1698219
41202a698219k495458k222340k19279L301390P677815J0697227R249805L012600
$$ -1698219 -4193677 -6416017 -6635296 -3333906 4343909 15041136 24290941 27303541
41194B7303541l802872o281842l730737M93457L045209K969436J074876j030460
$$ 27303541 23500669 17218827 13488090 13981547 17026756 19996192 21071068 20040608
41186B0040608j631235m30016P16404J32753q12140R28455N528878Q997861P563018
$$ 20040608 18409373 17979357 18695761 18828514 18016374 18944829 24473707 33471568 41034586
41177D1034586K245674k178811k329263P67105L808882N326394O766282R641056
$$ 41034586 43280260 41101449 38772186 39539291 43348173 48674567 55440849 65081905
41169F5081905J2846776J3992048J2923940J2161692J3273268J4532468J3588169
$$ 65081905 77928681 91920729 104844669 117006361 130279629 144812097 158400266
41162A58400266J1160042R889169R824233P457039K66295r302919j5955675j7228662
$$ 158400266 169560308 179449477 189273710 196730749 196997044 187694125 171738450 154509788
41154A54509788j5703900j5238038j6116631j5275449j1221056o934504o427936
$$ 154509788 138805888 123567850 107451219 92175770 80954714 74020210 67592274
41147F7592274r387407j1373369r313962m636879n09290J642815J787342j2215
$$ 67592274 58204867 46831498 37517536 32880657 32371367 34014182 35801524 35789309
41139C5789309k542817l115968p57485J777498J673403K24093L65836J459260
$$ 35789309 33246492 30130524 29373039 31150537 32823940 33048033 33413869 34873129
41131C4873129M18307k485291l285021m42726K743447L259977K200669J514296
$$ 34873129 35291436 32806145 29521124 29078398 31821845 35081822 37282491 38796787
41123C8796787M08644k235966m601599m269064k015161l21578M45883J436148
$$ 38796787 39205431 36969465 32367866 28098802 26083641 25762063 26207946 27644094
41115B7644094K153129J172384n26413j63101K677698N149860M935223K749129
$$ 27644094 29797223 30969607 30443194 30280093 32957791 38107651 43042874 45792003
41107D5792003M94156j133824k372384l177389l170694k134723l36971J175653
$$ 45792003 46286159 45152335 42779951 39602562 36431868 34297145 33960174 35135827
41099C5135827J175418j766l46469P58658P10918k682206o847747p116004l564728
$$ 35135827 36311245 36309479 35963010 36721668 37432586 34750380 27902633 20786629 17221901
41090A7221901j290200k857316m472594k052893K274845L268850P8771l216119
$$ 17221901 15931701 13074385 8601791 6548898 8823743 12092593 12171364 8955245
41082H955245l706807k562374j741908j199777l89901O4014l35557p20855k37886
$$ 8955245 5248438 2686064 944156 -255621 -645522 -581508 -917065 -1637920 -1875806
41073a875806N31844N41634l22561j518041k434571k181060k28026J993741J879194
$$ -1875806 -1343962 -802328 -1124889 -2642930 -5077501 -7258561 -7486587 -5492846 -3613652
41064c613652o99560k318066m90493K380196K270155k43285n42781K924629N733047
$$ -3613652 -4313212 -6631278 -7121771 -4741575 -2471420 -2714705 -3257486 -332857 5400190
41055E400190L601032j239369k739669J009205N431717N297257P11720l665968
$$ 5400190 9001222 7761853 5022184 6031389 11463106 16760363 17472083 13806115
41047A3806115m124427j388820J102458J328697L32951o7125N5263n22659j557970
$$ 13806115 9681688 8292868 9395326 10724023 11056974 10989849 11045112 10522453 8964483
41038H964483j446646j17685K85678j383509l168905k525980M34482L584417N235543
$$ 8964483 7517837 7400152 7685830 6302321 3133416 607436 1041918 4626335 9861878
41029I861878M488904Q74155m172031o904496n006235q91695J201887N10877n58276
$$ 9861878 14350782 15224937 11052906 4148410 -857825 -1749520 -547633 -36756 -595032
41020e95032r17521j443462j693143n9708K467205K785079Q31904J76711K052125
$$ -595032 -1512553 -2956015 -4649158 -4708866 -2241661 543418 1375322 1552033 3604158
41011C604158L004743O89450k049357j872739j51206K8566r94016j143798q08588
$$ 3604158 6608901 7298351 5248994 3376255 3225049 3253615 2259599 1115801 307213
41002C07213j177678o50157K426755N087252K970796k430349m903880k188303
$$ 307213 -870465 -1520622 906133 5993385 8964181 6533832 1629952 -558351
40994e58351J332357J596560J417k32872R66124J564122P95482o19241j797876
$$ -558351 774006 2370566 2371983 2139111 3105235 4669357 5464839 4845598 3047722
40985C047722j856112m84919Q36890L10969r44373J46602L535845N108607K491516
$$ 3047722 1191610 706691 1543581 1854550 910177 1056779 4592624 9701231 12192747
40976A2192747j247431k027900k42469R49638O42133L15463L61618k72385j543941
$$ 12192747 10945316 8917416 8674947 9624585 10266718 10582181 10943799 10671414 9127473
40967I127473k239076k232708k404589k440948j085994J291173K627192K068818
$$ 9127473 6888397 4655689 2251100 -189848 -1275842 15331 2642523 4711341
40959D711341R05058N2549j250659l128870l448990n18800L703518N454182M053095
$$ 4711341 5616399 5668948 4418289 1289419 -2159571 -2678371 1025147 6479329 10532424
40950A0532424K508730K505297J419030l331300q839958r435207m734959p57600
$$ 10532424 13041154 15546451 16965481 13634181 4794223 -4640984 -9375943 -10133543
40942a0133543j395564k923914l48553M273280M968678J448157m78835J742408
$$ -10133543 -11529107 -14453021 -14801574 -10528294 -5559616 -4111459 -4590294 -2847886
40934b847886L663517J415948k291424l113243j733685j327880j451041O29624
$$ -2847886 815631 2231579 -59845 -3173088 -4906773 -6234653 -7685694 -7056070
40926g056070M094980M982947K267698p30620j603193j703931k413633k021996
$$ -7056070 -2961090 2021857 4289555 3558935 1955742 251811 -2161822 -4183818
40918d183818J058686M162631K902680k334718n557709k495100L220207M145337
$$ -4183818 -3125132 1037499 3940179 1605461 -3952248 -6447348 -3227141 918196
40910I18196j005155n115373k169275M343163O299766K154850j829804j267306
$$ 918196 -86959 -5202332 -7371607 -3028444 3271322 5426172 3596368 2329062
40902B329062J052948J157252r0293j93642j1630j355195k619696j301742J144023
$$ 2329062 3382010 4539262 4448969 4255327 4243697 2888502 268806 -1032936 111087
40893A11087J436094J21741N78691K922043L381377K32047l415038l807311q24916
$$ 111087 1547181 1668922 2247613 5169656 8551033 8783080 5368042 1560731 735815
40884G35815K777149M308983K908012J65981j030240O0577N07572k210340n744890
$$ 735815 3512964 7821947 10729959 10895940 9865700 9926277 10433849 8223509 2478619
40875B478619n642105j870366J127683R63336K2543Q30787K370542K590842J540688
$$ 2478619 -3163486 -5033852 -3906169 -2942833 -2920290 -2089503 281039 2871881 4412569
40866D412569J72370j464030k948207k558650L55072L590205M455752K790160
$$ 4412569 4584939 3120909 172702 -2385948 -2030876 1559329 6015081 8805241
40858H805241K86160j931487l558641l919388k206365J120376M076943M636316
$$ 8805241 9091401 7159914 3601273 -318115 -2524480 -1404104 2672839 7309155
40850G309155K618384J24492o33309k15817j251966m056585n198604k528665O85766
$$ 7309155 9927539 10052031 9418722 9202905 7950939 3894354 -1304250 -3832915 -3147149
40841c147149J11148k799559k712691J386215M708545L965470J448458K63890
$$ -3147149 -3036001 -5835560 -8548251 -7162036 -2453491 1511979 2960437 3224327
40833C224327j85059j556070k903030k409734l45865J932389L791001M438171
$$ 3224327 3039268 1483198 -1419832 -3829566 -4175431 -2243042 1547959 5986130
40825E986130K660312q38269l232352l274144k639805k264707n97676K667831
$$ 5986130 8646442 7808173 4575821 1301677 -1338128 -3602835 -4200511 -1532680
40817a532680M707700L896346K505823K230122P74103l384497o480829m514250
$$ -1532680 3175020 7071366 9577189 11807311 12581414 9196917 2716088 -1798162
40809a798162q738J624136N03660J279537M686653O154951L296515p42277k797318
$$ -1798162 -1806900 -182764 320896 1600433 6287086 12442037 15738552 14996275 12198957
40800A2198957l732639m937891m931038k246637J175984K327455J141155o6443
$$ 12198957 8466318 3528427 -1402611 -3649248 -2473264 -145809 995346 928903
40792I28903K7130P57126J065689O34516k31000r94668j315661j276647r44802
$$ 928903 956033 1713159 2778848 3413364 3182364 2187696 872035 -404612 -1349414
40783a349414q3492J101804J611069J039238N85705J416791K737188K912817J806358
$$ -1349414 -1432906 -331102 1279967 2319205 2904910 4321701 7058889 9971706 11778064
40774A1778064M92474n57508j373668j493917r02573q93497j868479j571319J631130
$$ 11778064 12270538 11713030 10339362 8845445 7942872 7049375 5180896 3609577 5240707
40765E240707M784229L293909k375704o697154o243957l231884j002113K63935
$$ 5240707 10024936 13318845 10943141 4245987 -1997970 -5229854 -6231967 -5968032
40757e968032J549980K169938J550220J291417K567144L298079R79913k744484
$$ -5968032 -4418052 -2248114 -697894 593523 3160667 6458746 7438659 4694175
40749D694175l533480l94989K485407J022905l424796n560030k458573L027134
$$ 4694175 1160695 765706 3251113 4274018 849222 -4710808 -7169381 -4142247
40741d142247N623373L496983k94004j872060n53562J574448K420523J161998
$$ -4142247 1481126 4978109 4684105 2812045 2258483 3832931 6253454 7415452
40733G415452j717976m096749l234056R01662M343762L382214n98735k857510
$$ 7415452 5697476 1600727 -1633329 -731667 3612095 6994309 6395574 3538064
40725C538064j328791J613413L141901K915583J732562l3075j714994k154544
$$ 3538064 2209273 3822686 6964587 9880170 11612732 11579657 9864663 7710119
40717G710119j222922j53272P8824o08216k240227m486051n719129m513110k062369
$$ 7710119 6487197 6333925 6412749 5804533 3564306 -921745 -6640874 -11153984 -13216353
40708a3216353r32082j447539j660408p32944M07973J712367L993196N888371
$$ -13216353 -14148435 -15595974 -17256382 -17989326 -17581353 -15868986 -11875790 -5987419
40700e987419M543043N29543j517841Q97348M447832M772684K184739m6825q36242
$$ -5987419 -1444376 -914833 -2432674 -1535326 2912506 7685190 9869929 9823104 8986862
40691H986862j641782k948013l238762j306375K137985N101379N791230L942860
$$ 8986862 7345080 4397067 1158305 -148070 1989915 7091294 12882524 16825384
40683A6825384J030895j416424l282132m524320l668537j42139L094800K929195
$$ 16825384 17856279 16439855 13157723 8633403 4964866 4822727 7917527 10846722
40675A0846722J345291K655047N725499M890111k95574k989166K53450L508344
$$ 10846722 12192013 14847060 20572559 25462670 25167096 22177930 22431380 25939724
40667B5939724J090688l062103k391592P66157r06744o836428q607252k994370
$$ 25939724 27030412 23968309 21576717 22342874 21436130 14599702 5992450 2998080
40659B998080L243876L659926M68354n87121J431253L242092K887625J115975
$$ 2998080 6241956 9901882 10370236 9783115 11214368 14456460 17344085 18460060
40651A8460060q34583k018602j484529P44279K988772L464333K155075P11677
$$ 18460060 17625477 15606875 14122346 14866625 17855397 21319730 23474805 24186482
40643B4186482R38072L190990N584637N433387K504849j33469J23868K035875
$$ 24186482 25124554 28315544 33900181 39333568 41838417 41704948 41828816 43864691
40635D3864691K701126J830082J544014K982497N558009Q603530J1245722J1813955
$$ 43864691 46565817 48395899 49939913 52922410 58480419 67083949 78329671 90143626
40627I0143626J0318787J0348805J4910936K0976221K1910704J5298827M916455
$$ 90143626 100462413 110811218 125722154 146698375 168609079 183907906 188824361
40620A88824361m869763j2729445j8095161j9538057j7080206j3233247j0352492
$$ 188824361 183954598 171225153 153129992 133591935 116511729 103278482 92925990
40613I2925990q974097q971368r750539r365259o582330l794947m309584o731662
$$ 92925990 83951893 74980525 65229986 55864727 49282397 45487450 41177866 34446204
40605C4446204o322730k466271M9754j337107k963089j107119K212988K943252
$$ 34446204 28123474 25657203 25706957 24369850 21406761 20299642 22512630 25455882
40597B5455882J093021l49282j14004Q24433J428984Q47607j448754l758698k964328
$$ 25455882 26548903 26199621 26085617 26910050 28339034 29186641 27737887 23979189 21014861
40588B1014861O53962K509988K08796k473657j566668N27993q76598m593874n060480
$$ 21014861 21668823 24178811 24387607 21913950 20347282 20875275 19998677 15404803 10344323
40579A0344323j094397K354248J820246p1907O45842L511433M966322L361709
$$ 10344323 9249926 11604174 13424420 13352513 13998355 17509788 22476110 25837819
40571B5837819L86986j638899k158280j908808j008884J460928N429889Q341516
$$ 25837819 26224805 24585906 22427626 20518818 19509934 20970862 26400751 34742267
40563C4742267P475271L592618O0663j824495l738567n780654m802502K92009
$$ 34742267 42217538 45810156 45870819 44046324 40307757 34527103 29724601 30016610
40555C0016610M985764M574065P64730j282431p88751j388001l852919m071370
$$ 30016610 35002374 39576439 40341169 39058738 38269987 36881986 33029067 28957697
40547B8957697K53634N195416N677603K278443j79186L64339P94199k042679o196451
$$ 28957697 29211331 34406747 40084350 42362793 42183607 42547946 43342145 41299466 35103015
40538C5103015o728692k388714K311785K802365P6908j737808j722490k352694
$$ 35103015 28374323 25985609 28297394 31099759 31176667 29438859 27716369 25363675
40530B5363675l937890l532646m83011J531510L39447j001725M65169K288724
$$ 25363675 21425785 17893139 17410128 18941638 19281085 18279360 18744529 21033253
40522B1033253P41458k668528l473293j116994J057561J453396J415989J557974
$$ 21033253 21774711 19106183 15632890 14515896 15573457 17026853 18442842 20000816
40514B0000816J085914L60034L46605J35599j266973j726587J002553L980169
$$ 20000816 21086730 21446764 21793369 21928968 20661995 18935408 19937961 23918130
40506B3918130K186720l077737m803895o12264L317511J391725l395326m572351
$$ 23918130 26104850 23027113 18223218 17610954 20928465 22320190 18924864 14352513
40498A4352513j581023O59214l21916j723170o63755J375763R01164k397575m738730
$$ 14352513 12771490 13430704 13108788 11385618 10721863 12097626 12998790 10601215 5862485
40489E862485k950731J177747L028572J391947j33925J042880K574262J520815
$$ 5862485 2911754 4089501 7118073 8510020 8376095 9418975 11993237 13514052
40481A3514052n61457o51464L23693j78601p66087J433126M188500K572450k315708
$$ 13514052 12952595 12301131 12624824 12446223 11680136 13113262 17301762 19874212 17558504
40472A7558504l960692o63185J853413R152k461881j964675r32133k113338l139630
$$ 17558504 13597812 12934627 14788040 14797192 12335311 10370636 9438503 7325165 4185535
40463D185535j810153j272537m118218o103916k397946L597135M780856J269904
$$ 4185535 2375382 1102845 -3015373 -9119289 -11517235 -7920100 -3139244 -1869340
40455a869340m43280K007864M347924L675170K304073K287488J752210j117010
$$ -1869340 -2312620 -304756 4043168 7718338 10022411 12309899 14062109 12945099
40447A2945099m575311n920404m702072j967489J171053L308669L419243K332746
$$ 12945099 8369788 2449384 -2252688 -4220177 -3049124 259545 3678788 6011534
40439F011534J507085N21958j688105l632736k693033K05129J039494j384469
$$ 6011534 7518619 8040577 6352472 2719736 26703 231832 1271326 -113143
40431a13143l433534j935724J542899L418256K685328J024745P8816J75889O15530
$$ -113143 -3546677 -5482401 -3939502 -521246 2164082 3188827 3267643 3443532 4059062
40422D059062L47937o13083m83992J802516L669436J372523l948105o038385j414045
$$ 4059062 4406999 3793916 3309924 5112440 8781876 10154399 6206294 167909 -1246136
40413a246136N145715N950043o3900o142604n909307j40728N378589O657946M392989
$$ -1246136 3899579 9849622 9785722 3643118 -2266189 -2406917 2971672 9629618 14022607
40404A4022607J146280j708526l391519k429085J405069M777915L667468j068447
$$ 14022607 15168887 13460361 10068842 7639757 9044826 13822741 17490209 16421762
40396A6421762m174005l112355j283026k164070l835031k638320P07491K848586
$$ 16421762 12247757 9135402 7852376 5688306 1853275 -785045 -77554 2771032
40388B771032L403330M097266L919706O00665l614492l483765J125872M116972
$$ 2771032 6174362 10271628 14191334 14791999 11177507 7693742 8819614 12936586
40380A2936586J891480j799682k205885k31765N25748l19770p77711n59865n93602
$$ 12936586 14828066 13028384 10822499 10590734 11116482 10796712 10019001 9459136 8865534
40371H865534l00491J177314K371686J349171p88289j388405o68961j487988m426955
$$ 8865534 8565043 9742357 12114043 13463214 12674925 11286520 10617559 9129571 4702616
40362D702616n895382k488256M168176Q417526O527793R52540k356294j178746
$$ 4702616 -1192766 -3681022 487154 8904680 15432473 16385013 14028719 12849973
40354A2849973J46441k984301p964321p675789p14648N645296M752504j101714
$$ 12849973 12996414 10012113 2047792 -5627997 -6342645 -697349 4055155 2953441
40346B953441m941288m587666l537048l981918l748226o43657L772147O205318
$$ 2953441 -1987847 -6575513 -10112561 -14094479 -17842705 -18486362 -14714215 -8508897
40338h508897N437155L040110J408693J577700K282697J317438j485043l391630
$$ -8508897 -3071742 -31632 1377061 2954761 5237458 6554896 5069853 1678223
40330A678223k123442P56337J616127m33526k462598j692864J197577L497183
$$ 1678223 -445219 311118 1927245 1493719 -968879 -2661743 -1464166 2033017
40322B033017L940308L579052L490341K756878l27030n055282p659913n256754
$$ 2033017 5973325 9552377 13042718 15799596 15472566 10417284 2757371 -2499383
40314b499383J80534L709545L290351J644344J762037K944122K664794L98067
$$ -2499383 -2318849 1390696 4681047 6325391 8087428 11031550 13696344 14094411
40306A4094411k210509l658553l421439j513387J281940L443067L963848K900599
$$ 14094411 11883902 8225349 4803910 3290523 4572463 8015530 11979378 14879977
40298A4879977N29760k449871l882456k031957Q89023M39572l417490n276600
$$ 14879977 15409737 12959866 9077410 7045453 7934476 8374048 4956558 -320042
40290c20042k233837J372034Q93822j073592N34458M056970L406693j775898n322482
$$ -320042 -2553879 -1181845 -288023 -1361615 -827157 3229813 6636506 4860608 -461874
40281d61874m238246k451354l161228l643387p12229L631436N595326M858184
$$ -461874 -4700120 -7151474 -10312702 -13956089 -14668318 -11036882 -5441556 -583372
40273e83372L042456K36781l380357n183748l175206M13882J999351J625697J831343
$$ -583372 2459084 2695865 -684492 -5868240 -9043446 -8629564 -6630213 -5004516 -3173173
40264c173173K833453K345605k25571k503010k334070j21483K205314K975171
$$ -3173173 -339720 2005885 1780314 -722696 -3056766 -3178249 -972935 2002236
40256B002236J666053o50405k051950j946596j730721k307133k354480o21383
$$ 2002236 3668289 3017884 965934 -980662 -2711383 -5018516 -7372996 -7994379
40248g994379J538394K029137J227312J026870J688222K157816K598330L623338
$$ -7994379 -6455985 -4426848 -3199536 -2172666 -484444 1673372 4271702 7895040
40240G895040L626938M66711l938816m534687j11312L994612K551383k710377
$$ 7895040 11521978 11988689 8049873 3515186 3403874 7398486 9949869 7239492
40232G239492n679857l593499Q56704M166336N433781M994412K814659l67892
$$ 7239492 1559635 -2033864 -1177160 2989176 8422957 13417369 16232028 15864136
40224A5864136k462666k358291j563156j904437k657224j880496P9668Q15298
$$ 15864136 13401470 11043179 9480023 7575586 4918362 3037866 3117534 3932832
40216C932832k69991q26034N75475J676913k46176l831848m967095k284576J282568
$$ 3932832 3662841 2836807 3412282 5089195 4843019 1011171 -3955924 -6240500 -4957932
40207d957932K718130K167015J114447j21449j310957q51116J964344M331995
$$ -4957932 -2239802 -72787 1041660 920211 -390746 -1241862 722482 5054477
40199E054477K593835k465800n716394l928718L49139K547465J778522O87307
$$ 5054477 7648312 5182512 -533882 -4462600 -4113461 -1565996 212526 899833
40191H99833Q13172Q43285l55747j478075q77518O59958J006834j34063q85819
$$ 899833 1713005 2556290 2200543 722468 -155050 504908 1511742 1377679 491860
40182D91860K6267J704366K693583K879507K993676L101026K518084Q75464j407479
$$ 491860 518127 2222493 4916076 7795583 10789259 13890285 16408369 17283833 15876354
40173A5876354l479240m455533l816372j946593j37706L63052n95902j886803
$$ 15876354 12397114 7941581 4125209 2178616 2040910 2403962 1808060 -78743
40165g8743j880545J10349K638853L042982N94315k009643j918658j38514K23678
$$ -78743 -1959288 -1848939 789914 3832896 4427211 2417568 498910 360396 584074
40156E84074p27355K12765L178535L580042p57083m828444l104804J920612L098574
$$ 584074 -143281 69484 3248019 6828061 6070978 1242534 -1862270 58342 3156916
40147C156916r58093m555894l950253j875797j599832j809397l25247J305381
$$ 3156916 2198823 -2357071 -6307324 -8183121 -9782953 -11592350 -11917597 -10612216
40139a0612216O82011p56802J93057L168449M486856K360360q78159k069408r56681
$$ -10612216 -9930205 -10687007 -10493950 -7325501 -2838645 -478285 -1356444 -3425852 -4382533
40130d382533J8822r95327k656332j721595K443702N787268M000901j595958n330827
$$ -4382533 -4363711 -5359038 -8015370 -9736965 -7293263 -1505995 2494906 898948 -4431879
40121d431879m294335j042751J247391K585195L608590K943424j17196k964033
$$ -4431879 -8726214 -9768965 -8521574 -5936379 -2327789 615635 498439 -2465594
40113b465594k696466o3318K095941K701379K379067J204341r28304k762766k736254
$$ -2465594 -5162060 -5225378 -3129437 -428058 1951009 3155350 2227046 -535720 -3271974
40104c271974r32086J302216K626341J994167l33178j570706Q10064M335752L579477
$$ -3271974 -4204060 -2901844 -275503 1718664 1385486 -185220 624844 4960596 8540073
40095H540073j606890m852790k811813k77238j640905l239576m25312L140602
$$ 8540073 6933183 2080393 -731420 -1008658 -2649563 -5889139 -6314451 -3173849
40087c173849J433283k692005j747245L130094L608666j383022l508671O76685
$$ -3173849 -1740566 -4432571 -6179816 -3049722 558944 -824078 -4332749 -3656064
40079c656064L928600J016902k540865o33758K833416J223965l177691l351800
$$ -3656064 272536 1289438 -1251427 -1885185 948231 2172196 -1005495 -4357295
40071d357295N86713K184483o06506l140225k062228Q58746L083977M090914L389611
$$ -4357295 -3770582 -1586099 -2192605 -5332830 -7395058 -6536312 -3452335 638579 4028190
40062D028190M54437k755125l203701j205593J05796j21374L26386J969692K034519
$$ 4028190 4482627 1727502 -1476199 -2681792 -2575996 -2697370 -2370984 -401292 1633227
40053A633227j024639m529480m817841j429910L137677O139214O132383L371324
$$ 1633227 608588 -3920892 -8738733 -10168643 -7030966 -891752 5240631 8611955
40045H611955m02638l353900m897572n062259l497183o82388R65139l36144k524494
$$ 8611955 8209317 4855417 -42155 -5104414 -8601597 -9283985 -8318846 -8654990 -11179484
40036a1179484j750440K294875N756779N753807L501961J443046j07583j744409
$$ -11179484 -12929924 -10635049 -4878270 875537 4377498 5820544 5712961 3968552
40028C968552k426224n72100K876769M518432K153611k473668n236698l873062
$$ 3968552 1542328 970228 3846997 8365429 10519040 8045372 2808674 -1064388
40020a064388k52021J956646J456926J48376j25303P8769m35823j115352p69348
$$ -1064388 -1316409 640237 2097163 2245539 2120236 2199005 1763182 647830 -121518
40011a21518L7810j88544j097899o79148J524111L186134K043184j052735k895834
$$ -121518 -83708 -272252 -1370151 -2049299 -525188 2660946 4704130 3651395 755561
40002G55561j593202J131872J817750n11000k955284k513067j92226N78366j027724
$$ 755561 -837641 294231 2111981 1600981 -1354303 -3867370 -4059596 -3481230 -4508954
39993d508954k516047k288941j302064M5310K825990N862642N178515j16489n043184
$$ -4508954 -7025001 -9313942 -10616006 -10570696 -7744706 -1882064 3296451 3179962 -1863222
39984a863222n169596k432861q41044K3532K335582M151430K425095k24806J241706
$$ -1863222 -7032818 -9465679 -10306723 -10283191 -7947609 -3796179 -1371084 -1595890 -354184
39975c54184N068360M153463k516065p215783m625961R60481L042064J781518
$$ -354184 4714176 8867639 6351574 -864209 -5490170 -4529689 -1487625 293893
39967B93893R83001P67844j324365m483472m974955j539451L174641O124697O245520
$$ 293893 1276894 2044738 720373 -3763099 -8738054 -10277505 -7102864 -978167 5267353
39958E267353L998607Q57928j161613j135015n4366P60315J096697J118945O77778
$$ 5267353 9265960 10123888 8962275 7827260 7772894 8533209 9629906 10748851 11426629
39949A1426629M6985j78229l92180j434414k531116j988379q7481J282050J808766
$$ 11426629 11473614 11295385 10903205 9468791 6937675 4949296 4861815 6143865 7952631
39940G952631K341674J513400k740530p785438p807650k480325J496078K57954
$$ 7952631 10294305 11807705 9067175 1281737 -6525913 -9006238 -7510160 -7252206
39932g252206j646674M90402L574086K650610j42306M71073L456903L456067K14029
$$ -7252206 -8898880 -8408478 -4834392 -2183782 -2326088 -1855015 1601888 5057955 5271984
39923E271984j483325n71259j109969m397626o268111l783958O64960L412636
$$ 5271984 3788659 3217400 2107431 -2290195 -8558306 -12342264 -11677304 -8264668
39915h264668L268788M81692l526491m955636j185149L841537L312099k258709
$$ -8264668 -4995880 -4514188 -8040679 -12996315 -14181464 -10339927 -7027828 -9286537
39907i286537m610720K76582O001491N267583J01060k483447r60860L22307r24377
$$ -9286537 -13897257 -13620675 -7619184 -2351601 -2250541 -4733988 -5694848 -5372541 -6296918
39898f296918k188693j062394J343423K567497J817487K93527q5162J663426M320401
$$ -6296918 -8485611 -9548005 -8204582 -5637085 -3819598 -3526071 -3611233 -1947807 2372594
39889B372594N422643M057794J706228m6024j088279j684502j727205j684884
$$ 2372594 7795237 11853031 13559259 13513235 12424956 10740454 9013249 7328365
39881G328365k286857k793524j867708m29629o65444j766759m62469L048700M003720
$$ 7328365 5041508 2247984 380276 -49353 -714797 -2481556 -2944025 104675 4108395
39872D108395J65578m071809l695420L41698L726544M533867K934651j208646
$$ 4108395 4273973 202164 -3493256 -3151558 574986 5108853 8043504 6834858
39864F834858o207057p277547k288129L842112N368674L646796L362722L713143
$$ 6834858 627801 -6649746 -8937875 -5095763 272911 3919707 7282429 10995572
39856A0995572M83013m630219m970179K10699L721137J471878j592152k403M010976
$$ 10995572 11478585 6848366 1878187 2088886 5810023 7281901 5689749 5687346 9698322
39847I698322N181177L106173O94227j401155l785100m593070j824349K180574
$$ 9698322 14879499 17985672 18679899 17278744 13493644 8900574 7076225 9256799
39839I256799L065648M42596k099970k272845j138231m51855q28653k120443l277387
$$ 9256799 12322447 12765043 10665073 8392228 7253997 6802142 5973489 3853046 575659
39830E75659k583610j35026J234789r9154j425639L13234L061735K267728j914122
$$ 575659 -2007951 -2142977 -908188 -1007342 -2432981 -2119747 941988 3209716 1295594
39821A295594m550506l122991l03065J236180K277376L654349L624286J296195
$$ 1295594 -3254912 -6377903 -6680968 -5444788 -3167412 486937 4111223 5407418
39813E407418p26150k21088Q24677m03291k502710j981764P89701J693235j079649
$$ 5407418 4681268 4460180 5284857 4881566 2378856 397092 1186793 2880028 1800379
39804A800379m394161m303669m44681M311748O662365M924064K48408l631532
$$ 1800379 -2593782 -6897451 -7342132 -3030384 3631981 8556045 8804453 5172921
39796E172921l596245o42844J365124P03194m93882p8724R77684P53272m02574
$$ 5172921 1576676 933832 2298956 3002150 2508268 2429544 3407228 4160500 3757926
39787C757926q52130m59795k45099j84439M70787J230713Q53606m28004j182098
$$ 3757926 2905796 2446001 2200902 2016463 2487250 3717963 4571569 4143565 2961467
39778B961467j190549j504961j992587j168122Q80065J768879L60553j030154
$$ 2961467 1770918 265957 -1726630 -2894752 -2014687 -245808 114745 -915409
39770i15409J23912K648330L335422J706730N48803J603101L037440K093997j327040
$$ -915409 -791497 1856833 5192255 6898985 7447788 9050889 12088329 14182326 12855286
39761A2855286m717337n484387k690142K381740O242049N159818q76593o726342
$$ 12855286 8137949 2653562 -36580 2345160 8587209 13747027 12870434 6144092
39753F144092o834957j562896L299399L740972J736655J027182J562360R74827
$$ 6144092 -690865 -2253761 1045638 4786610 6523265 7550447 9112807 10087634
39745A0087634m81204m43724Q11984M53320j638834k078478Q6637J116983j097936
$$ 10087634 9606430 9162706 9974690 10428010 8789176 6710698 6797335 7914318 6816382
39736F816382k775997k96121L132518K052156k498204m694265l014597j348019
$$ 6816382 4040385 3744264 6876782 8928938 6430734 1736469 -1278128 -2626147
39728b626147j332626k25362K598549L618519J803654J017940K806549K949835
$$ -2626147 -3958773 -4184135 -1585586 2032933 3836587 4854527 7661076 10610911
39720A0610911p15324l019444M76050N217329M096553j622279m964995m151783
$$ 10610911 9895587 6876143 7352193 12569522 16666075 15043796 10078801 5927018
39712E927018l233768l340599j323493K706116M102975J400429j369090j856119
$$ 5927018 2693250 -647349 -1970842 735274 4838249 6238678 4869588 3013469
39704C013469k533223m411649l997508J74432L689544K934070P10807R10730K086757
$$ 3013469 480246 -3931403 -7928911 -7754479 -4064935 -1130865 -420058 490672 2577429
39695B577429J205007j27169J145843K861018K84824n633094q296377m153657
$$ 2577429 3782436 3655267 4801110 7662128 7946952 2313858 -5982519 -10136176
39687a0136176K948287O932146N837359K207656m85699r73109r05210k439232
$$ -10136176 -7187889 -255743 5581616 7789272 7303573 6330464 5425254 2986022
39679B986022m713163m316017k91581L723604M307520K673272J691713J165584
$$ 2986022 -1727141 -6043158 -6334739 -2611135 1696385 4369657 6061370 7226954
39671G226954m03122j687803o01700J005321m81146m087974m806103q78125L643625
$$ 7226954 6823832 5136029 4534329 5539650 5058504 970530 -3835573 -4713698 -1070073
39662a070073M468990J728075j680594l276593j995789J015099K310613j58214
$$ -1070073 3398917 5126992 3446398 169805 -1825984 -810885 1499728 1341514
39654A341514l386979k847085O25408J907315j77043r45339K263370N584482M935147
$$ 1341514 -2045465 -4892550 -4267142 -2359827 -2536870 -3482209 -1218839 4365643 9300790
39645I300790K279398J723339K782809J855643j655042m640883m676569k134925
$$ 9300790 11580188 13303527 16086336 17941979 16286937 11646054 6969485 4834560
39637D834560J193887L288952K734938K63499j729367k503749l773512n781881
$$ 4834560 6028447 9317399 12052337 12315836 10586469 8082720 4309208 -1472673
39629a472673n597333j841145J911495J968115K81859J270030M671797O113363
$$ -1472673 -7070006 -8911151 -6999656 -5031541 -4749682 -3479652 1192145 7305508
39621G305508L912433P80737j192831k913333m859429n075471k164934K133832
$$ 7305508 11217941 11998678 10805847 7892514 3033085 -2042386 -4207320 -2073488
39613b073488M628641L532087m36657m191731m111095M8833L715903K554690j766839
$$ -2073488 2555153 6087240 5650583 1458852 -2652243 -2603410 1112493 3667183 1900344
39604A900344l871441j972675Q38357K204413K920379L169556J069876l196478
$$ 1900344 -1971097 -3943772 -3105415 -901002 2019377 5188933 6258809 3062331
39596C062331n871036m607656j640503K67065J666657L615581M344081K083991
$$ 3062331 -2808705 -7416361 -9056864 -8789799 -7123142 -3507561 836520 2920511
39588B920511j294921k845112k692111k482837j854319K6495J424513N97571j93137
$$ 2920511 1625590 -1219522 -3911633 -6394470 -8248789 -8222294 -6797781 -6200210 -6393347
39579f393347K222184N767256N080778k60031m502176l833449j003153J57224
$$ -6393347 -4171163 1596093 6676871 6416840 1914664 -1918785 -2921938 -2764714
39571b764714L56843J808970L169306J732625j281136j941119M11412K170671
$$ -2764714 -2407871 -598901 2570405 4303030 3021894 1080775 1492187 3662858
39563C662858R06107j358407j518963L32908J791242J880557J851029K460829
$$ 3662858 4568965 3210558 1691595 2024503 3815745 5696302 7547331 10008160
39555A0008160K302610j74466l754111n002149k223441K057785L654928J423871
$$ 10008160 12310770 12136304 8382193 3380044 1156603 3214388 6869316 8293187
39547H293187j800157k936819j812397k9181J649951L253939L924816K346026
$$ 8293187 6493030 3556211 1743814 1714633 3364584 6618523 10543339 12889365
39539A2889365r75675l442510l135272j003253L99359j36522j441305j725975
$$ 12889365 11913690 8471180 5335908 4332655 4732014 4595492 3154187 1428212
39531A428212q04250j88258r55394k055331j609130J16954M62611j878882m110746
$$ 1428212 623962 435704 -519690 -2575021 -4184151 -4067197 -3604586 -5483468 -9594214
39522i594214k335458L022283P052430O174083K089963j117061j918688j670046
$$ -9594214 -11929672 -8907389 -1854959 4319124 6409087 5292026 3373338 1703292
39514A703292j536289j405522j187022r29992J41026K563276M666305M040185
$$ 1703292 167003 -1238519 -2425541 -3355533 -3214507 -651231 4015074 8055259
39506H055259J307322j91480N93316O05140k122797m142470r45174N613598Q333308
$$ 8055259 9362581 9171101 9764417 10369557 8246760 4104290 3159116 8772714 17106022
39497A7106022L775744l021143m810319r01250K779626J470302l044908n327747
$$ 17106022 20881766 17860623 13050304 12149054 14928680 16398982 13354074 8026327
39489H026327k977168R36783K042921J13258q98622J707228N520906O040302K601921
$$ 8026327 5049159 5985942 8028863 8142121 7243499 8950727 14471633 20511935 23113856
39480B3113856r33144j540361o94722j403591l438288l735896j006963K163484
$$ 23113856 22180712 20640351 19945629 18542038 15103750 11367854 10360891 12524375
39472A2524375K402210m05318k961472k203318J331446M001383K993455o25401
$$ 12524375 14926585 14521267 11559795 9356477 10687923 14689306 17682761 17057360
39464A7057360l354706l326758j694398q0551J395822K682655K432534Q8423j954940
$$ 17057360 13702654 10375896 8681498 8600947 9996769 12679424 15111958 15200381 13245441
39455A3245441q10307K630284M330194K269127j257946l097695k835535j892861
$$ 13245441 12435134 15065418 19395612 21664739 20406793 17309098 14473563 12580702
39447A2580702j021722k78888n821o8435P67314K852392L984700J938951j761760
$$ 12580702 11558980 11280092 11274271 11205836 11973150 14825542 18810242 20749193 18987433
39438A8987433l049489n87885K446734K692901N71861j467715k684214l700790
$$ 18987433 15937944 15350059 17796793 20489694 21061555 19593840 16909626 13208836
39430A3208836l648815p80335L696245N275698J495573m049086n392711j416908
$$ 13208836 9560021 8779686 12475931 17751629 19247202 15198116 9805405 8388497
39422H388497K952566L188100N50623n10885J265458K771423J538864p93917j282988
$$ 8388497 11341063 14529163 15079786 14568901 15834359 18605782 20144646 19350729 18067741
39413A8067741J33877J446822K370216M441996P231430P407480L135094k651237
$$ 18067741 18201618 19648440 22018656 26460652 33692082 41099562 44234656 41583419
39405D1583419n463333m509098k527904j260779J74996K317094L589256K770765
$$ 41583419 36120086 31610988 29083084 27822305 27997301 30314395 33903651 36674416
$$ [...]
##END NTUPLES=NMR SPECTRUM
##END=
