##TITLE=31Pdec_LR-580-R2H2-CR3
 D2O, 24 sc
 10.1.2020
##JCAMPDX= 6.0         $$ Bruker NMR JCAMP-DX V2.0
##DATA TYPE= NMR SPECTRUM
##DATA CLASS= NTUPLES
##ORIGIN= UXNMR, Bruker Analytische Messtechnik GmbH
##OWNER= root
$$ XWIN-NMR		Version 3.5
$$ Fri Jan 10 15:23:04 2020 Russian Standard Time (UT+4h)  she@DPX200
##.OBSERVE FREQUENCY= 81.013821
##.OBSERVE NUCLEUS= ^31P
##.ACQUISITION MODE= SIMULTANEOUS
##.ACQUISITION SCHEME= undefined
##.AVERAGES= 24
##.DIGITISER RES= 17
##SPECTROMETER/DATA SYSTEM= spect
##.PULSE SEQUENCE= zgpg30
##.SOLVENT NAME= D2O
##.SHIFT REFERENCE= (INTERNAL, D2O, 0, 182.463)
##AUDIT TRAIL= $$ (NUMBER, WHEN, WHO, WHERE, WHAT)
$$ ##TITLE= Audit trail, XWIN-NMR		Version 3.5
$$ ##JCAMPDX= 5.01
$$ ##ORIGIN= Bruker BioSpin GmbH
$$ ##OWNER= she
$$ F:/spectra/data/she/nmr/P31/1/pdata/1/auditp.txt
$$ ##AUDIT TRAIL=  $$ (NUMBER, WHEN, WHO, WHERE, WHAT)
(   1,<2020-01-10 15:22:06.17 +0400>,<she>,<DPX200>,
      <created by zg, POWCHK disabled, PULCHK disabled
       configuration hash MD5:
       00 E9 B6 7A A2 85 ED C7 34 08 36 98 17 FE 4E 26
       data hash MD5: 32K
       7D 80 34 27 D3 58 D9 2F 40 E8 81 11 90 F9 91 9D>)
(   2,<2020-01-10 15:22:09.71 +0400>,<she>,<DPX200>,
      <Start of raw data processing
       efp BC_mod = 2 LB = 1 FT_mod = 6 PKNL = 1 PHC0 = -1681.998 PHC1 = 134.6012 SI = 64K 
       data hash MD5: 64K
       D3 4F D4 9A EB 25 C2 5D 10 2F D0 F7 7C 70 82 BE>)
(   3,<2020-01-10 15:22:28.78 +0400>,<she>,<DPX200>,
      <pk PHC0 = -31.19281 PHC1 = 3.399985 
       data hash MD5: 64K
       78 7D 68 BC B2 81 B1 F8 40 F4 79 75 8B D8 D7 7C>)
(   4,<2020-01-10 15:22:31.50 +0400>,<she>,<DPX200>,
      <abs ABSG = 5 
       data hash MD5: 64K
       1D 23 1C 99 27 91 A8 C9 37 A0 36 81 5E 6E 48 22>)
$$ ##END=
$$ 
$$ hash MD5
$$ E9 8E A8 27 02 EF AA 27 E4 75 FD 81 95 47 8A 2D
##$RELAX= 
##$RELAX= 
##$RELAX= 
##$RELAX= 
##$RELAX= 
##$RELAX= 
##$RELAX= 
##$RELAX= 
$$ Bruker specific parameters
$$ --------------------------
##$DU= <F:/spectra>
##$EXPNO= 1
##$NAME= <P31>
##$PROCNO= 1
##$TYPE= <nmr>
##$USER= <she>
##$AMP= (0..31)
100 100 100 100 100 100 100 100 100 100 100 100 100 100 100 100 100 100 
100 100 100 100 100 100 100 100 100 100 100 100 100 100 
##$AQSEQ= 0
##$AQ_mod= 1
##$AUNM= <au_zg>
##$AUTOPOS= <>
##$BF1= 81.014009
##$BF2= 200.13
##$BF3= 200.13
##$BF4= 200.13
##$BF5= 200.13
##$BF6= 200.13
##$BF7= 200.13
##$BF8= 200.13
##$BYTORDA= 1
##$CFDGTYP= 0
##$CFRGTYP= 5
##$CHEMSTR= <none>
##$CNST= (0..31)
1 1 145 1 1 1 1 1 1 1 1 1 1 1 1 1 1 1 1 1 1 1 1 1 1 1 1 1 1 1 1 1 
##$CPDPRG= <waltz16>
##$CPDPRG1= <>
##$CPDPRG2= <waltz16>
##$CPDPRG3= <>
##$CPDPRG4= <mlev>
##$CPDPRG5= <mlev>
##$CPDPRG6= <mlev>
##$CPDPRG7= <mlev>
##$CPDPRG8= <mlev>
##$CPDPRGB= <>
##$CPDPRGT= <>
##$D= (0..31)
0 1 0 0 0 0 0 0 0 0 0 0.03 2e-05 3e-06 0 0 0 0 0 0 0 0 0 0 0 0 0 0 0 0 
0 0 
##$DATE= 1578655325
##$DBL= (0..7)
120 120 120 11 120 120 24 19 
##$DBP= (0..7)
150 150 150 150 150 150 150 150 
##$DBP07= 0
##$DBPNAM0= <>
##$DBPNAM1= <>
$$ [...]
##$SUBNAM3= <"">
##$SUBNAM4= <"">
##$SUBNAM5= <"">
##$SUBNAM6= <"">
##$SUBNAM7= <"">
##$SUBNAM8= <"">
##$SUBNAM9= <"">
##$SW= 369.568048894756
##$SWIBOX= (0..15)
0 1 3 0 0 0 0 0 0 0 0 0 0 0 0 0 
##$SW_h= 29940.119760479
##$TD= 32768
##$TD0= 1
##$TE= 0
##$TE2= 300
##$TE3= 300
##$TEG= 300
##$TL= (0..7)
0 120 53 12 22 120 120 120 
##$TP= (0..7)
150 150 150 150 150 150 150 150 
##$TP07= 0
##$TPNAME0= <>
##$TPNAME1= <>
##$TPNAME2= <>
##$TPNAME3= <>
##$TPNAME4= <>
##$TPNAME5= <>
##$TPNAME6= <>
##$TPNAME7= <>
##$TPOAL= (0..7)
0.5 0.5 0.5 0.5 0.5 0.5 0.5 0.5 
##$TPOFFS= (0..7)
0 0 0 0 0 0 0 0 
##$TUNHIN= 0
##$TUNHOUT= 0
##$TUNXOUT= 0
##$USERA1= <user>
##$USERA2= <user>
##$USERA3= <user>
##$USERA4= <user>
##$USERA5= <user>
##$V9= 5
##$VALIST= <valist>
##$VCLIST= <CCCCCCCCCCCCCCC>
##$VD= 0
##$VDLIST= <DDDDDDDDDDDDDDD>
##$VPLIST= <PPPPPPPPPPPPPPP>
##$VTLIST= <TTTTTTTTTTTTTTT>
##$WBST= 1024
##$WBSW= 4
##$XGAIN= (0..3)
0 0 0 0 
##$XL= 0
##$YL= 0
##$YMAX_a= 15884
##$YMIN_a= -14803
##$ZGOPTNS= <>
##$ZL1= 120
##$ZL2= 120
##$ZL3= 120
##$ZL4= 120
##$ABSF1= 182.463
##$ABSF2= -187.1042
##$ABSG= 5
##$ABSL= 3
##$ALPHA= 0
##$AQORDER= 0
##$ASSFAC= 0
##$ASSFACI= 0
##$ASSFACX= 0
##$ASSWID= 0
##$AUNMP= <proc_1d>
##$AZFE= 0.1
##$AZFW= 0.5
##$BCFW= 0
##$BC_mod= 2
##$BYTORDP= 0
##$COROFFS= 0
##$CY= -3
##$DATMOD= 1
##$DC= 0
##$DFILT= <>
##$DTYPP= 0
##$F1P= 0
##$F2P= 0
##$FCOR= 1
##$FTSIZE= 65536
##$FT_mod= 6
##$GAMMA= 0
##$GB= 0
##$INTBC= 1
##$INTSCL= 5.30512e-09
##$ISEN= 30
##$LB= 1
##$LEV0= 0
##$LPBIN= 0
##$MAXI= 10000
##$MC2= 0
##$MEAN= 0
##$ME_mod= 0
##$MI= 50
##$NCOEF= 0
##$NC_proc= -10
##$NLEV= 6
##$NOISF1= 182.463
##$NOISF2= 159.3651
##$NSP= 0
##$NTH_PI= 0
##$NZP= 0
##$OFFSET= 182.463
##$PC= 4
##$PHC0= -1713.191
##$PHC1= 138.0012
##$PH_mod= 1
##$PKNL= yes
##$PPARMOD= 0
##$PSCAL= 0
##$PSIGN= 0
##$REVERSE= no
##$SF= 81.0140089999434
##$SI= 65536
##$SIGF1= 159.3651
##$SIGF2= -187.1042
##$SINO= 113.3802
##$SIOLD= 16384
##$SREGLST= <1H.CDCl3>
##$SSB= 0
##$STSI= 65536
##$STSR= 0
##$SW_p= 29940.119760479
##$SYMM= 0
##$S_DEV= 0
##$TDeff= 32768
##$TDoff= 0
##$TI= <>
##$TILT= no
##$TM1= 0
##$TM2= 0
##$TOPLEV= 0
##$USERP1= <user>
##$USERP2= <user>
##$USERP3= <user>
##$USERP4= <user>
##$USERP5= <user>
##$WDW= 1
##$XDIM= 65536
##$YMAX_p= 513425065
##$YMIN_p= -146847244
$$ End of Bruker specific parameters
$$ ---------------------------------
##NTUPLES= NMR SPECTRUM
##VAR_NAME=  FREQUENCY,     SPECTRUM/REAL,   SPECTRUM/IMAG
##SYMBOL=    X,             R,               I
##VAR_TYPE=  INDEPENDENT,   DEPENDENT,       DEPENDENT
##VAR_FORM=  AFFN,          ASDF,            ASDF
##VAR_DIM=   65536,         65536,           65536
##UNITS=     HZ,            ARBITRARY UNITS, ARBITRARY UNITS
##FACTOR=    0.456856943014862, 1,           1
##FIRST=     14782.0589164792, 0,            0
##LAST=      -15158.0608439998, 0,           0
##MIN=       -15158.0608439998, -146847244,  0
##MAX=       14782.0589164792, 513425065,    0
$$ Real data points
##PAGE= N=1
##DATA TABLE= (X++(R..R)), XYDATA
$$ [...]
42294E0614302N822091o751928j5603497j9959534k3232395j6375934P061077
$$ 50614302 56436393 49684465 34080968 14121434 -9110961 -25486895 -18425818
42287a8425818K4316284O569481l0669644l8919587o215925K4684391K1871249
$$ -18425818 5890466 12459947 -18209697 -57129284 -63345209 -38660818 -16789569
42280a6789569O235023M318866J496083k0348221l3604414l502935M4485396N0543678
$$ -16789569 -10554546 -6235680 -4739597 -25087818 -58692232 -62195167 -17709771 32833907
42272C2833907Q780966k3564670j2213414R591210K333898j8977683j8328743
$$ 32833907 41614873 18050203 5836789 15427999 17761897 -1215786 -19544529
42265a9544529o02256J084618j6221608k0770560J500675K5276798K5149442R746154
$$ -19544529 -20146785 -19062167 -35283775 -56054335 -54553660 -29276862 -4127420 5618734
42257E618734K439704O394794O040950n681819j7657733j7360860o504030L504778
$$ 5618734 8058438 14453232 20494182 14812363 -2845370 -20206230 -26710260 -23205482
42249b3205482O913237R215486J5562373J8110555N076897j5372290j5558739
$$ -23205482 -16292245 -7076759 8485614 26596169 31673066 16300776 742037
42242G42037J3840290L9649621K3829164k0805319m3188797k5319110n198187
$$ 742037 14582327 54231948 78061112 57255793 14066996 -11252114 -16450301
42235a6450301j3350436k4260904l002004L0558628K9829935l010517k0698137
$$ -16450301 -29800737 -54061641 -57063645 -26505017 3324918 314401 -20383736
42228b0383736o527735N952849l386961j0207744K190179R068448p103342j7896445
$$ -20383736 -26911471 -20958622 -24345583 -34553327 -32363148 -23294700 -30398042 -48294487
42220d8294487K287404K5712174J5342657j0714119j0551796Q714437P750857
$$ -48294487 -46007083 -20294909 -4952252 -15666371 -26218167 -17503730 -9752873
42213i752873r027397J022825L7038414M4817804M612608l2641943k4691624P12494
$$ -9752873 -18780270 -17757445 19280969 64098773 68711381 36069438 11377814 12090308
42205A2090308O80160j3741794r438518M524232k395925k0385737j3248648J5398635
$$ 12090308 12770468 -971326 -10409844 -5885612 -8281537 -28667274 -41915922 -26517287
42197b6517287K2882353l100130k3545878r307128J6643464J8425658j093333
$$ -26517287 -3634934 -6735064 -30280942 -39588070 -22944606 -4518948 -5612281
42190e612281j2515480n031490N933244Q113491O660918P129399J449876j8075206
$$ -5612281 -18127761 -23159251 -17226007 -9112516 -2451598 4677801 6127677 -11947529
42182a1947529l7626897l0372653P358147M0884723L4605369r98358k1401554
$$ -11947529 -49574426 -79947079 -72588932 -31704209 2901160 1902802 -19498752
42175a9498752p516834J3024806J2146808k82486k590699J574798m79024N90027
$$ -19498752 -27015586 -13990780 -1843972 -2126458 -4717157 -3142359 -3621383 -3031356
42167c031356J7390353L1892365J7898841j1711877j9779768l908080N19534j9469705
$$ -3031356 14358997 46251362 64150203 52438326 32658558 28750478 29270012 9800307
42159I800307l2800868j5911135J1472240K1196486J5695423J0283118L543763
$$ 9800307 -23000561 -38911696 -27439456 -6242970 9452453 19735571 23279334
42152B3279334j0219365k0413271j6340848p270233m858722j879439J0071643
$$ 23279334 13059969 -7353302 -23694150 -30964383 -35823105 -37702544 -27630901
42145b7630901J8059613P086313j1397753j4801208k895717P235056R705527R306009
$$ -27630901 -9571288 -2484975 -13882728 -28683936 -31579653 -24344597 -14639070 -5333061
42137e333061K233437j5789615k8867324j7052052R323169J9622515P591254k135620
$$ -5333061 -3099624 -18889239 -47756563 -64808615 -55485446 -35862931 -28271677 -30407297
42129c0407297M810057J4276376J4235164J4240764K0159083J6107256q127200
$$ -30407297 -25597240 -11320864 2914300 17155064 37314147 53421403 45294203
42122D5294203l2232853l1010716j0417532N042769R481032J4567223J8186128
$$ 45294203 13061350 -17949366 -28366898 -23324129 -13843097 724126 18910254
42115A8910254L895442k4580319l5872733j1851111K3233399L2286125J2315209
$$ 18910254 22805696 -1774623 -37647356 -49498467 -26265068 6021057 18336266
42108A8336266p039557n699866O485226J2073403Q785231K389070o478533j5790660
$$ 18336266 11296709 5596843 12082069 24155472 32940703 35329773 28851240 13060580
42100A3060580j4857674O67087J4669243R031100q224818j2134320K828723J5586826
$$ 13060580 -1797094 -1130007 13539236 22570336 14345518 2211198 5039921 20626747
42092B0626747J0366155m825527j7551081k6891905k9614694j3299816J9288114
$$ 20626747 30992902 26167375 8616294 -18275611 -47890305 -61190121 -41902007
42085d1902007L9077517K6592350K966698o95496Q628723j14270k7796341m1159599
$$ -41902007 -2824490 23767860 26734558 26039062 34667785 34553515 6757174 -34402425
42077c4402425k5148688l306672M333308R713303K4785483L1310789R920103k1344923
$$ -34402425 -59551113 -62857785 -58524477 -48811174 -24025691 7285098 17205201 -4139722
42069d139722k8370785j0064992L503116k039369r065044j845191Q804396N702346
$$ -4139722 -32510507 -42575499 -39072383 -41111752 -50176796 -52021987 -43217591 -37515245
42061c7515245p593288j3259524k947362J5886756L0802435L2310015J6537167
$$ -37515245 -45108533 -58368057 -61315419 -45428663 -14626228 17683787 34220954
42054C4220954r647241k8201372k4594262m568079J1326591J2035819O160329
$$ 34220954 24573713 -3627659 -28221921 -32790000 -21463409 -9427590 -3267261
42047c267261K901788n551757k7528135m4199140k3301899L1137349O6878509
$$ -3267261 -365473 -5917230 -33445365 -77644505 -100946404 -69809055 -2930546
42040b930546M3197281j2838644l8279768j5317657J2825833R346108r414141
$$ -2930546 40266735 27428091 -10851677 -26169334 -13343501 -3997393 -13411534
42033a3411534j0710579L436171R114535K562109j562567o34211k347383j294697
$$ -13411534 -24122113 -20685942 -11571407 -9009298 -10571865 -11206076 -13553459 -14848156
42025a4848156J1530074K0658997J268837l5763036m7660853j7701167K1067778
$$ -14848156 -3318082 17340915 18609752 -17153284 -64814137 -82515304 -61447526
42018f1447526L3126254K3084487J3738937Q284948j772159j1291865j0314782
$$ -61447526 -28321272 -5236785 8502152 16787100 15014941 3723076 -6591706
42011f591706m627545l686134l55951J3294324K2565455J0168087j0534405j3432407
$$ -6591706 -11219251 -14905385 -15261336 -1967012 20598443 30766530 20232125 6799718
42003F799718l486226o859887j9784572r339890K6489696M3416756J6722331j6812907
$$ 6799718 3313492 -3546395 -23330967 -32670857 -6181161 37235595 53957926 37145019
41995C7145019j4311190Q440043P904184j4864282k0385913Q17870J5357359N773078
$$ 37145019 22833829 31273872 39178056 24313774 3927861 4745731 20103090 25876168
41987B5876168l943633M790028J3763578N076279n332402P44142P207986p619751
$$ 25876168 21932535 26722563 40486141 45562420 40230018 40974160 48182146 40562395
41979D0562395k6495996j6069020J6182061K7684051M080312k0143246j4082224
$$ 40562395 14066399 -2002621 14179440 41863491 45943803 25800557 11718333
41972A1718333Q011229J4028024j419809j9709795k8251725k6678119j4276182
$$ 11718333 19729562 33757586 32337777 12627982 -15623743 -42301862 -56578044
41965e6578044P309753K3985246K1492796P283925L355381J5359450K4228401
$$ -56578044 -49268291 -25283045 -3790249 3493676 6849057 22208507 46436908
41958D6436908J3826747o178126j4080696m552401O770218M038301j1857054k7406744
$$ 46436908 60263655 54085529 40004833 35452432 42222650 46260951 34403897 6997153
41950F997153l1895479k6476511j9758381j5843764q496595R315260L0237713
$$ 6997153 -24898326 -51374837 -71133218 -86976982 -95473577 -86158317 -55920604
41943e5920604L4682877J4790488r703129j1634582Q172239K0290818P224671
$$ -55920604 -21237727 -6447239 -16150368 -27784950 -19612711 678107 7902778
41936G902778j0802523m823773J9328010K7827480O735750j9963509k6026554
$$ 7902778 -2899745 -7723518 11604492 39431972 46167722 26204213 177659
41929A77659j5444131p007949m218644J552989R492814J0639138N437239K742572
$$ 177659 -15266472 -22274421 -26493065 -24940076 -15447262 -4808124 629115 3371687
41921C371687M325132N448924P226051J2580364J3685113J613700j3524875j2376324
$$ 3371687 7696819 13145743 20371794 32952158 46637271 48250971 34726096 22349772
41913B2349772K839987Q764136l436635j4513028p532630Q470050J6258952J3205102
$$ 22349772 25189759 33953895 30517260 16004232 8471602 16941652 33200604 46405706
41905D6405706L838127j2010764k8119160k6195889o50878K4464688K3864137
$$ 46405706 50243833 38233069 10113909 -16081980 -16732858 7731830 31595967
41898C1595967N572802m261929j608346m932468k0082698l0661987k4970098r744278
$$ 31595967 37168769 32906840 31298494 26366026 6283328 -24378659 -49348757 -59093035
41890e9093035O713807K3505437L3208287K0769725j1788720l6530406l0120950
$$ -59093035 -52379228 -28873791 4334496 25104221 13315501 -23214905 -53335855
41883e3335855k338432J8977576K2536569J9013055J7534555J3043289l72940
$$ -53335855 -55674287 -36696711 -14160142 4852913 22387468 35430757 35057817
41876C5057817j5484510j9256350j0242751j054172j864151p247756n164821M380356
$$ 35057817 19573307 316957 -9925794 -10979966 -12844117 -20091873 -25256694 -20876338
41868b0876338R008066K663644o389661j0097021j0993152j0831899k168669J6277101
$$ -20876338 -11868272 -9204628 -15594289 -25691310 -36684462 -47516361 -49685030 -33407929
41860c3407929K7721138J7690855j947638q042160N41794N329942R57207K299652
$$ -33407929 -5686791 12004064 10056426 2014266 2556060 7886002 8843209 11142861
41852A1142861J6160465K7629710K2204618M667926j1198212j7721930j3715851
$$ 11142861 27303326 54933036 77137654 81805580 70607368 52885438 39169587
41845C9169587m342112l316554j8294030l1849455j8211046J5992316L2066158
$$ 39169587 34827475 31510921 13216891 -18632564 -36843610 -20851294 11214864
41838A1214864J0722036k1084974k9760264j8187860r439690q045750k367610
$$ 11214864 21936900 851926 -28908338 -47096198 -56535888 -64581638 -66949248
41831f6949248Q328186J4043246J2957446R542346K168943q556631r551495N773128
$$ -66949248 -58621062 -44577816 -31620370 -22078024 -19909081 -28465712 -38017207 -32244079
41823c2244079J8610337Q131923j4737062k1593755p769914O769283J2463714
$$ -32244079 -13633742 -5501819 -20238881 -41832636 -49602550 -42833267 -30369553
41816c0369553J7551575K1931639J3490085n243958j3765406l967392R160840
$$ -30369553 -12817978 9113661 22603746 17359788 3594382 -373010 8787830
41809H787830J3047691J1107866N568203q593678k4419880k2131551J025322K1293467
$$ 8787830 21835521 32943387 38511590 29917912 5498032 -16633519 -15608197 5685270
41801E685270J9970191N094063p311133j2201705o838804J1986361K9895745K0547613
$$ 5685270 25655461 30749524 23438391 11236686 4397882 16384243 46279988 66827601
41793F6827601j4186759l5533761j8965722J1288428K1228024J4219313J1186345
$$ 66827601 52640842 17107081 -1858641 9429787 30657811 44877124 56063469
41786E6063469R042645n589485k0349918j3921860L598616N670541n019743n383653
$$ 56063469 65106114 59516629 39166711 25244851 28843467 34514008 29494265 24110612
41778B4110612K026530m106136j5489221k551123K5541523K3116982j5497412
$$ 24110612 26137142 22031006 6541785 3990662 29532185 52649167 37151755
41771C7151755l6304061q964468K1803584P235371k7382729k6203770P461269
$$ 37151755 847694 -8116774 13686810 20922181 -6460548 -32664318 -25203049
41764b5203049K2368712L486207j2995108n376113O828161Q085153R679021J4369125
$$ -25203049 -2834337 651870 -12343238 -17719351 -10891190 -2806037 6872984 21242109
41756B1242109L247681k2808397k9513134k502919K1877929J0440951j3517379
$$ 21242109 24489790 1681393 -27831741 -30334660 -8456731 1984220 -11533159
41749a1533159r254860J3121720J0132782k0052028l0417391O92988L3562861
$$ -11533159 -20788019 -7666299 2466483 -17585545 -48002936 -47309948 -13747087
41742a3747087K6042976o151826j7880120j511101R121311n134113k1681462j3053679
$$ -13747087 12295889 6144063 -11736057 -13247158 -4125847 -9259960 -30941422 -43995101
41734d3995101J2704046K4258966Q312380j6850470k6434127j5350485L148676
$$ -43995101 -31291055 -7032089 1280291 -15570179 -42004306 -57354791 -54206115
41727e4206115J6142533K1573442K3066025K1386222J4177844J851901r849737
$$ -54206115 -38063582 -16490140 6575885 27962107 42139951 43991852 34142115
41720C4142115j4488046j1389257o470938o149221j0541614j3432184r592008
$$ 34142115 19654069 8264812 1793874 -4355347 -14896961 -28329145 -37921153
41713c7921153j467995L050955Q3903m665835j922086R554061J9853788J8638573
$$ -37921153 -39389148 -36338193 -36254290 -40920125 -42842211 -33288150 -13434362 5204211
41705E204211P608153j696200k962066j952642m071846k435418J0185764K1144901
$$ 5204211 12812364 11116164 8154098 6201456 2129610 -305808 9879956 31024857
41697C1024857P914115k5837085m3658029k2266007J1155431J2456426j6517137
$$ 31024857 38938972 13101887 -30556142 -52822149 -41666718 -29210292 -45727429
41690d5727429k9367239j961408L5352446M6206578L7585853L5472957L6022600
$$ -45727429 -75094668 -77056076 -41703630 4502948 42088801 77561758 113584358
41683A13584358J6193804j9414871l9582104l2681556j8318388j0303482j767624
$$ 113584358 129778162 110363291 70781187 38099631 19781243 9477761 7710137
41676G710137N411908p447153l6754618m2546554j364584N0580944N9256490K2879180
$$ 7710137 13122045 5674892 -31079726 -73626280 -74990864 -24409920 34846570 57725750
41668E7725750j2543713j8789421j1617450j1500230j2745399l474361R338831
$$ 57725750 45182037 26392616 14775166 3274936 -9470463 -12944824 -3605993
41661c605993J1612738M069062j608928N91919P848053J4381841J3826431L287654
$$ -3605993 8006745 12075807 10466879 11058798 18906851 33288692 47115123 50402777
41653E0402777r965789j3815098o931748m3128J074677J948170M418424n02040
$$ 50402777 40436988 26621890 19690142 19647014 20721691 22669861 27088285 26586245
41645B6586245j5907734k7648850k1612179l556193R765298J1845442P439009
$$ 26586245 10678511 -16970339 -38582518 -42138711 -32373413 -20527971 -13088962
41638a3088962m03070j0789613j6631770r569864O802454J8690168J7223420N033662
$$ -13088962 -13492032 -24281645 -40913415 -50483279 -43680825 -24990657 -7767237 -2733575
41630b733575r266117j5603500o571408J2367249K1191334O648273j7440445k5283269
$$ -2733575 -11999692 -27603192 -34174600 -21807351 -616017 6032256 -11408189 -36691458
41622c6691458j2988622q33793n96082k89826J0740882K0369031J2287280o843079
$$ -36691458 -49680080 -50513873 -51109955 -51399781 -40658899 -20289868 -8002588 -14845667
41614a4845667j6275183r908040P87978P964494J3567459J5483223O628620q120387
$$ -14845667 -31120850 -41028890 -40240912 -32276418 -18708959 -3225736 3402884 -4717503
41606d717503j2116851k299858K189928j0726602k3042743j1537296J3771974
$$ -4717503 -16834354 -19134212 -16944284 -27670886 -50713629 -62250925 -48478951
41599d8478951J9377638l855701k5313024j5015937J8421022M2206808L9020282
$$ -48478951 -29101313 -32957014 -58270038 -73285975 -54864953 -12658145 26362137
41592B6362137J8763736p02296j0334446j1057174r589470j1839131j4143773
$$ 26362137 45125873 44423577 34089131 23031957 13442487 1603356 -12540417
41585a2540417o463085R530336J6037134M336917p148420J936324J9680406J7022025
$$ -12540417 -19003502 -9473166 6563968 10900885 3752465 5688789 25369195 42391220
41577D2391220o214980j8347299l880032J3299359Q151590p673564n939758J5800228
$$ 42391220 36176240 17828941 13948909 27248268 35399858 27726294 21786536 37586764
41569C7586764L2377921K3507152p166901l8391730m5254069j7075526K6028285
$$ 37586764 69964685 93471837 86304936 47913206 2659137 -14416389 11611896
41562A1611896M5316515K5496308o534138j7716269q345481J064747M172452N382186
$$ 11611896 56928411 82424719 75890581 58174312 49828831 50893578 55066030 60448216
41554F0448216k057478k2796317l4283718j0915665K9613708M1343926J4921217
$$ 60448216 58390738 35594421 1310703 -9604962 20008746 61352672 76273889
41547G6273889r681743m196676J1685568J1111588J456561J029804L979907l208345
$$ 76273889 66592146 62395470 74081038 85192626 86649187 87678991 91658898 88450553
41539H8450553j2471907r948232l452888o745106j1933833n503058K384391n257561
$$ 88450553 75978646 66030414 62577526 55832420 43898587 38395529 40779920 35522359
41531C5522359j7687256j1272461Q646560J4801142M009896J004816J3284550
$$ 35522359 17835103 6562642 15209202 30010344 34020240 35025056 48309606
41524D8309606J6995915j689475k1595338j8673212J19663J1395465O519420n788129
$$ 48309606 65305521 63616046 42020708 23347496 23467159 34862624 41382044 35593915
41516C5593915j4033247j0255660N159330J7268607R978231q315210j1101614
$$ 35593915 21560668 11305008 16464338 33732945 43711176 35395966 24294352
41509B4294352O652314J7581569L239386j6536941j4274839M781112J5456117
$$ 24294352 30946666 48528235 51767621 35230680 20955841 25736953 41193070
41502D1193070J0496876J466531p125155j9681847l1280858k9509768j1889231
$$ 41193070 51689946 53156477 46031322 26349475 -4931383 -34441151 -46330382
41495d6330382J3731590L8148145M5978914J8936405l2210060n7108036k2321618
$$ -46330382 -32598792 5549353 51528267 70464672 38254612 -18853424 -41175042
41488d1175042L3900404M5451297J0508660j1062395L966467P780588k9244098
$$ -41175042 -7274638 38176659 48685319 37622924 41589391 49369979 20125881
41481B0125881n5580035j5967305N1348857O0680970K482031m6770566l7437717
$$ 20125881 -35454154 -51421459 -72602 60608368 63090399 16319833 -21117884
41474b1117884m245101N287825M17234J1157617K7848253K1653166p37011p771873
$$ -21117884 -25362985 -20075160 -19657926 -8500309 19347944 41001110 40264099 32492226
41466C2492226L735687O627199q554384j9921728j2607996O13483O001667R373746
$$ 32492226 36227913 42855112 34300728 14379000 1771004 2384487 8386154 17759900
41458A7759900J6875251J7156579j91080k3165830l1422101k2522916r172895
$$ 17759900 34635151 51791730 51600650 28434820 -2987281 -25510197 -34683092
41451c4683092J908471J1978180J5906376M844492j4071170j8063136J208742
$$ -34683092 -32774621 -20796441 -4890065 -45573 -14116743 -32179879 -30971137
41444c0971137J9904165R420423k3012091l8678930j6634002J7752476K6336139
$$ -30971137 -11066972 -1646549 -24658640 -63337570 -79971572 -62219096 -35882957
41437c5882957Q168822m529992M185902J4507012P553309m228007j244981Q776324
$$ -35882957 -27714135 -32244127 -28058225 -13551213 -5997904 -10225911 -11470892 -2694568
41429b694568N803137n402911k294327J5344765K1427273K801749k3380333l7081636
$$ -2694568 3108569 -2294342 -4588669 10756096 32183369 34985118 11604785 -25476851
41421b5476851l5704190k0778051Q507502L7300606L8344869J0508333j0945615
$$ -25476851 -61181041 -81959092 -73451590 -36150984 2193885 12702218 1756603
41414A756603k751251J2441924N411865j1014980o172711J4462824J9222069M069807
$$ 1756603 -994648 11447276 16859141 5844161 -328550 14134274 33356343 37426150
41406C7426150n035309p89825l160782j5171917j3085727O556777J1407358j3685769
$$ 37426150 32390841 31601016 28440234 13268317 182590 6739367 18146725 4460956
41398D460956l4650532j7988388J6756892K7728920J2074811J77015K681905J871483
$$ 4460956 -30189576 -48177964 -31421072 -3692152 8382659 8559674 11241579 13113062
41390A3113062p868996p666965J1078778K8347490K3930620M996311o418379j330417
$$ 13113062 5244066 -2422899 8655879 37003369 60933989 65930300 59511921 58181504
41382E8181504R551465R821716o131868k5507911k7508788q205573J0649771Q533885
$$ 58181504 67732969 77554685 71422817 45914906 18406118 10200545 20850316 29384201
41374B9384201n674805q859368k59786L04636j0198676j0032020R136414K2038606
$$ 29384201 23709396 14850028 14590242 14894878 4696202 -5335818 3800596 25839202
41366B5839202N938148k1662964k4441190K722277K7500647K2665019l566143
$$ 25839202 31777350 10114386 -14326804 -11604527 15896120 38561139 34994996
41359C4994996k3355040k1775551o880531M891615O217909L325362O245424J5763098
$$ 34994996 11639956 -10135595 -17016126 -12124511 -5906602 -2581240 3664184 19427282
41351A9427282K1553790J3932635n049409k3574337l0385975k2289581n576619
$$ 19427282 40981072 54913707 49864298 26289961 -4096014 -26385595 -31962214
41344c1962214Q110807J1564268R377328J0636051J3688055P261160r293317j8291514
$$ -31962214 -23851407 -12287139 -2909811 7726240 21414295 28675455 19382138 1090624
41336A090624o465687J3474620J8522071P839694K209334J0372846J4822008j62971
$$ 1090624 -5375063 8099557 26621628 34461322 36670656 47043502 61865510 61702539
41328F1702539k1761466k4707814o003959J1932013J0375724o830376k3350997
$$ 61702539 39941073 15233259 9229300 21161313 31537037 24706661 1355664
41321A355664k6852287j3996822Q528575K4196243J9640889K627908m803017K940880
$$ 1355664 -25496623 -39493445 -30964870 -6768627 12872262 15500170 10697153 13638033
41313A3638033O064285p918429j9204492l708330K5446075L1426222O322544j7909487
$$ 13638033 19702318 11783889 -7420603 -11128933 14317142 45743364 52065908 34156421
41305C4156421j6688822l913666l255029j2464350j5075612q972059j416740J0404934
$$ 34156421 17467599 13553933 10298904 -2165446 -17241058 -26213117 -27629857 -17224923
41297a7224923K9748679M0306820K1808734j6181690l9261999k9774329m793956
$$ -17224923 12523756 52830576 74639310 58457620 19195621 -10578708 -15372664
41290a5372664J0792047J2199085R984049J0636090R484553k166287k3953669
$$ -15372664 -4580617 7618468 17602517 28238607 37723160 35556873 11603204
41283A1603204l8467142k5396054Q556459K8175364J4036608p051187j9497K4094760
$$ 11603204 -26863938 -52259992 -43703533 -15528169 -1491561 -8542748 -8562245 15532515
41275A5532515K5323687j550619k1285264j7794100j5154319k6624798k7064444
$$ 15532515 40856202 39305583 18020319 226219 -14928100 -41552898 -68617342
41268f8617342j51925K6200210K3511391Q992647J1528927J9424349N125717j8219005
$$ -68617342 -68769267 -42569057 -19057666 -10065019 1463908 20888257 26013974 7794969
41260G794969j3409700J6166877K6737263J495609k5396978k1950024J315790
$$ 7794969 -5614731 10552146 37289409 38785018 13388040 -8561984 -7246194
41253g246194J7887178K0956241J6151637L879400j3072250k2164690j6245867
$$ -7246194 10640984 31597225 47748862 51628262 38556012 16391322 145455
41246A45455k746755J0917755K5267238L4419068K2827740j1447361m5324290
$$ 145455 -2601300 8316455 33583693 68002761 90830501 79383140 34058850
41239C4058850n4463833l7094225p370356J9987307L1264039J8276127o677598
$$ 34058850 -20404983 -57499208 -64869564 -44882257 -13618218 4657909 -2019689
41232b019689j5749703K094257K6706371L4733381K6373808J2963467l787479
$$ -2019689 -17769392 -15675135 11031236 45764617 72138425 85101892 81314413
41225H1314413k3164592l1831354j9881273q04252M316821l966133p656465P87618
$$ 81314413 58149821 26318467 6437194 5632942 9949763 5983630 -1672835 -885217
41217h85217J1427834J3720930N969525p799502j8045056j3850508L47713K751323
$$ -885217 10542617 24263547 30233072 22433570 4388514 -9461994 -9114281 -6362958
41209f362958j4264330k3188696L397648M5400760N4325169J9728108j6254796
$$ -6362958 -20627288 -43815984 -40418336 4982424 59307593 79035701 62780905
41202F2780905j9024405l777522n01488o386362j254347R868603M554686j4323156
$$ 62780905 43756500 39978978 39477490 33091128 31836781 41705384 46260070 31936914
41194C1936914j9280443m880888M98157j6670518k6344341j607359K9618636J8733910
$$ 31936914 12656471 7775583 8273740 -8396778 -34741119 -36348478 -6729842 12004068
41186A2004068k6169078m2646821l686725L9455430L2691217j35927J886216L7594635
$$ 12004068 -14165010 -56811831 -60498556 -21043126 11648091 11512164 13398380 50993015
41178E0993015M4762382O54603l9441464k7441094O259632O812367j8952158k2057761
$$ 50993015 95755397 96410000 56968536 29527442 35787074 42599441 23647283 1589522
41170A589522N287618K2338347J1031130K47589Q817288J2376596j0502143l6834366
$$ 1589522 6877140 29215487 40246617 40494206 49311494 61688090 51185947 14351581
41162A4351581l3751330r325769K242381q440870j8760877j0975095Q445925K4503955
$$ 14351581 -19399749 -28725518 -26483137 -34924007 -53684884 -64659979 -56214054 -31710099
41154c1710099K8962221K0169469L927665n400269Q22047J0330802L930216j4749224
$$ -31710099 -2747878 17421591 21349256 15948987 16771034 27101836 31032052 16282828
41146A6282828k0382838k056035J8308811J4951792o461609j7880555p061650
$$ 16282828 -4100010 -6156045 12152766 27104558 20642949 2762394 -4299256
41139d299256R990536J4593864O727149m843997j8090833l0914895l0524934p873434
$$ -4299256 5691280 20285144 27012293 22168296 4077463 -26837432 -57362366 -65235800
41131f5235800K1716597L1818193J9941757J0037660J5352708K0178376R800315
$$ -65235800 -43519203 -11701010 8240747 18278407 33631115 53809491 63609806
41124F3609806l097253j767419K649751j0000852k8320432k0549989J2901322
$$ 63609806 60512553 58745134 61394885 51394033 23073601 2523612 15424934
41117A5424934L1340742J0605710j9814550j7573014J3636782L2163065J7377395
$$ 15424934 46765676 57371386 37556836 19983822 33620604 65783669 83161064
41110H3161064o146024p310234R942164J6933250J218151j9185296k2641865j0851518
$$ 83161064 77015040 69704806 79646970 96580220 97798371 78613075 55971210 45119692
41102D5119692o62651J385416J674876Q2024j2631241l2105533l4294694o871614
$$ 45119692 44457041 45842457 47517333 47599357 34968116 2862583 -31432111 -38303725
41094c8303725K6987083L4402926J3499185r941202j8712132j6296240q173217
$$ -38303725 -11316642 23086284 36585469 26644267 7932135 -8364105 -16537322
41087a6537322N134170J6066886J3349093J003120m228927L270421J3674552K0110479
$$ -16537322 -11403152 4663734 18012827 19015947 14787020 18057441 31731993 51842472
41079E1842472K1886684J2722872r411181k3489120p401132K0661526J9336228
$$ 51842472 73729156 86452028 77040847 53551727 46150595 66812121 86148349
41072H6148349j1284028k4024737J303988K2919907L306394l1241714l5055519
$$ 86148349 74864321 50839584 52143572 75063479 78369873 47128159 12072640
41065A2072640j2531278J304181K445613J0180995J6219204m377003l8156530
$$ 12072640 -458638 845543 3291156 13472151 29691355 25314352 -12842178
41058a2842178m1825319r095242J8212440J4499021K920671J0385017K7965106
$$ -12842178 -54667497 -63762739 -45550299 -31051278 -28130607 -17745590 10219516
41051A0219516L3405650K2846903M242582j5401907k3822131r071285J8140874
$$ 10219516 43625166 66472069 70714651 55312744 31490613 22419328 40560202
41044D0560202L1186500K3452239J1701019M06357k2705956m7921400m1635067
$$ 40560202 71746702 95198941 106899960 107306317 84600361 36678961 -4956106
41037d956106j427601K6734930J2251644j5154666j4880072L609258O377829o315170
$$ -4956106 -6383707 20351223 32602867 17448201 2568129 6177387 12555216 6240046
41029F240046r189070j83937L485805M330578J6738518K8016215J0785983k6139516
$$ 6240046 -2949024 -3132961 352844 4683422 21421940 49438155 60224138 34084622
41021C4084622m0199868j4383366K1152777L4694316K8276970J7542555N916903
$$ 34084622 -6115246 -20498612 654165 35348481 63625451 81168006 87084909
41014H7084909p084072j4658777j3628774j0513829q693666m588500J33183l7679
$$ 87084909 80000837 65342060 51713286 41199457 32505791 27917291 28050474 28012795
41006B8012795j58216P220827J0558520p521181l3522026l1267677M354583L3902974
$$ 28012795 27854579 35075406 45633926 38112745 4590719 -26676958 -22322375 11580599
40998A1580599K8005726M893510m665122K10727N808666J2609365K0675009J2061992
$$ 11580599 39586325 44479835 39814713 40025440 45834106 58443471 79118480 91180472
40990I1180472j9337048m1846729k5912696P738647J8669520R748637J3953880
$$ 91180472 71843424 29996695 4083999 11822646 30492166 40240803 54194683
40983E4194683K8403236J6373969k1191816l3951820k096702K4886628L337688
$$ 54194683 82597919 98971888 77780072 43828252 41731550 66618178 69955866
40976F9955866l5043444l4223656j761070Q977857j2155300j9756800Q266487
$$ 69955866 34912422 688766 -1072304 7905553 -4249747 -24006547 -15740060
40969a5740060L4615502K4335404j927636n972880Q988345J2902418K196430j52896
$$ -15740060 18875442 43210846 41283210 35310330 44298675 57201093 59397523 59244627
40961E9244627R147199N250848k0571433l9452106k4432614Q748222K1148896
$$ 59244627 68391826 73642674 53071241 13619135 -10813479 -2065257 19083639
40954A9083639J806423k0595588j7634492L228768J1441284n460294k5150429
$$ 19083639 20890062 294474 -17340018 -14111250 -2669966 -8130260 -33280689
40947c3280689j8894751J0430621K9922694J8239214o683076j2251731N204639
$$ -33280689 -52175440 -41744819 -11822125 6417089 -265987 -12517718 -7313079
40940g313079J9065800J2876989J201011K765075J2176980J3232635N900330J029622
$$ -7313079 11752721 24629710 25830721 28595796 40772776 54005411 59905741 60935363
40932F0935363k308058j2514691k2866175j6467002M442051J6337769Q152128
$$ 60935363 58627305 46112614 23246439 6779437 11221488 27559257 35711385
40925C5711385k722849K229582J7106042K5166771K1916448J1312765n553174
$$ 35711385 32988536 35218118 52324160 77490931 99407379 110720144 105166970
40918A05166970k2051574k1077881J768254K2178122J6338430m025112j0627596
$$ 105166970 83115396 62037515 63805769 85983891 102322321 98297209 87669613
40911H7669613l849364q273714k6038911k9859573r254684J0435048R454745K905877
$$ 87669613 83820249 75546535 49507624 19648051 10393367 20828415 30283160 33189037
40903C3189037Q852009J5372238M971966j1408388j3833516q187391j0431344
$$ 33189037 42041046 57413284 62385250 50976862 37143346 28955955 18524611
40896A8524611j1761570N329057K6900157K2227867m929634j8880250p862440
$$ 18524611 6763041 12092098 38992255 61220122 56290488 37410238 29547798
40889B9547798K183452k852913k741127J4427566K5764756J3241286l497797j665005
$$ 29547798 31731250 28878337 26137210 40564776 66329532 79570818 76073021 74408016
40881G4408016O320581O3499r071827j258260R942083m39710j9580085j3692245
$$ 74408016 80728597 80792096 71720269 70462009 80404092 79964382 60384297 46692052
40873D6692052J2611109J9407569m054514k2727495j3661158J965557K072211
$$ 46692052 59303161 78710730 74656216 51928721 38267563 40233120 42305331
40866D2305331q12857P173541P392267j7236684l9676996k1051280K6360052M8556375
$$ 42305331 41492474 48666015 56058282 38821598 -855398 -21906678 4453374 53009749
40858E3009749K2278690j7182110k8645083j5173355n566309q636281r252294
$$ 53009749 75288439 58106329 29461246 14287891 8721582 85301 -9166993
40851i166993J9754O879002J334201p188728m301853O655169Q652420l439934
$$ -9166993 -9147239 -2268237 -934036 -8122764 -12424617 -5769448 2882972 -556962
40843e56962j3195552m401600J5546532K3799744J1106826o789819q368333R576406
$$ -556962 -13752514 -18154114 -2607582 21192162 32298988 25509169 17140836 26717242
40835B6717242K9508264L1355502J2254754j0103645j5442203l071659R354438
$$ 26717242 56225506 87581008 99835762 89732117 74289914 71218255 80572693
40828H0572693J0618765P940016P404826j749894k6034313m3702062k7914332
$$ 80572693 91191458 99131474 106536300 104786406 78752093 35050031 7135699
40821G135699J0103949K9291338J3623346q735716j0060251K53710k67408r358965
$$ 7135699 17239648 46530986 60154332 51418616 41358365 41612075 41344667 31985702
40813C1985702q242492O544498K0609824K3134108J4758116J194022q182233m024289
$$ 31985702 23743210 30287708 50897532 74031640 88789756 89983778 81801545 77777256
40805G7777256Q746734J0856038m694615j8323323j1347015M981792O788094o471475
$$ 77777256 86523990 97380028 92685413 74362090 63015075 67996867 74784961 68313486
40797F8313486j4659140q861577J033336P265946J1456833J1060002j268100k0651900
$$ 68313486 53654346 44792769 45826105 53092051 64548884 75608886 74340786 53688886
40789E3688886k8361400j3626407J2479218K8994346K5168258Q042315n880919
$$ 53688886 25327486 11701079 24180297 53174643 78342901 86385216 80504297
40782H0504297p808392n925861j1441047j8295536j2211208P23635j271937j6608885
$$ 80504297 72695905 66770044 55328997 37033461 24822253 25545888 24273951 7665066
40774G665066j6156535P671171K1608669N272746j1291745J178631J6981926L25561
$$ 7665066 -8491469 -820298 20788371 26061117 14769372 15948003 32929929 33255490
40766C3255490k4746362r973376K9384780L1886642q399415l0679904q929788
$$ 33255490 8509128 -1464248 27920532 59807174 51407759 20727855 11798067
40759A1798067R289608q299566k2127013M460039L5696002K3847933q979750j1242423
$$ 11798067 21087675 12788109 -9338904 -4878865 30817137 54665070 45685320 34442897
40751C4442897J0759866J1219473j1316940j4789899Q995533K0440696J180832
$$ 34442897 45202763 56422236 45105296 30315397 39310930 59751626 60932458
40744F0932458j7387915r206377P096141L893147j3248939j9905718p478912J3304023
$$ 60932458 43544543 34338166 41434307 45327454 32078515 12172797 4693885 17997908
40736A7997908K9008484L2044809K2422052O959063q659682k3564201l1081556
$$ 17997908 47006392 79051201 101473253 108432316 99772634 76208433 45126877
40729D5126877j7878255J1557390K6126816O913594k0409088k0399080n72673
$$ 45126877 27248622 38806012 64932828 71846422 51437334 31038254 30465581
40722C0465581N923050j589626N540023K7475597K9857255L551944j6560711q840576
$$ 30465581 36388631 34799005 40339028 67814625 97671880 101223824 84663113 75822537
40714G5822537K849973l578123j0496095J93553O896690j4558999m1423171l3662908
$$ 75822537 78672510 75094387 64598292 64791845 71688535 57129536 15706365 -17956543
40706a7956543L750437K8590537K2124943M632470n428156j1688221j7073642
$$ -17956543 -14206106 14384431 36509374 41141844 35713688 24025467 6951825
40699F951825j2466244L945995J9077476K3249814J8555050P698604o663827j2245282
$$ 6951825 -5514419 -1568424 17509052 40758866 59313916 67012520 60348693 48103411
40691D8103411R90098J8514745J5093586o317375j6448868o488584k011289j6173222
$$ 48103411 49093509 67608254 82701840 76384465 59935597 53447013 51435724 35262502
40683C5262502k1167022P505034M3565157M1274842L97862l5524202l9889002
$$ 35262502 14095480 21600514 65165671 106440513 106838375 71314173 31425171
40676C1425171k6588697j2881944L413599J9353487J5401575j0657465k6683161
$$ 31425171 4836474 -8045470 -4631871 14721616 30123191 19465726 -7217435
40669g217435q915684J9728869K2106706L07090j4669300j3831799j4800667k0736054
$$ -7217435 -16133119 3595750 25702456 26009546 11340246 -2491553 -17292220 -38028274
40661c8028274j3169989R437455K1566140J0484617m274798m636181J289668L132686
$$ -38028274 -51198263 -41760808 -20194668 -9710051 -13984849 -18621030 -17331362 -14198676
40653a4198676Q226845J8830902J7169792l644667j9062813r077315R309948J3419828
$$ -14198676 -5971831 12859071 30028863 26384196 7321383 -1755932 7554016 20973844
40645B0973844J3152950K3732966K5731368k810135l3069609j7974393K8701343
$$ 20973844 34126794 57859760 83591128 80780993 47711384 29736991 58438334
40638E8438334M2593220L694312l4768667k8959826l062447K234931o920119l537970
$$ 58438334 101031554 104725866 69957199 40997373 37934926 40169857 33249738 29711768
40630B9711768O800024J984475j0284191n170013J3242727J8059181N436167j856061
$$ 29711768 36511792 38496267 28212076 23042063 36284790 54343971 59780138 57924077
40622E7924077M253309N573134p655103j9037006j3176657M99250L119163p543655
$$ 57924077 62177386 67750520 60095417 41058411 27881754 28381004 31500167 23956512
40614B3956512j6679180j1283793O761123K2826351K2866917P393754q648489
$$ 23956512 7277332 -4006461 2754662 25581013 48447930 55841684 47193195
40607D7193195j1634648j308320J3424128K2847107J8864403M08027j9126907
$$ 47193195 35558547 34250227 47674355 70521462 89385865 89793892 70666985
40600G0666985k2210111j0339167k615785n490072l424860R741912J3680460m538574
$$ 70666985 48456874 38117707 35501922 30011850 26586990 36328902 50009362 45470788
40592D5470788k1358434r636865J5287822J5734505j0252325k6099109j1766699
$$ 45470788 24112354 14475489 29763311 45497816 35245491 9146382 -2620317
40585b620317J2190091K1739958J9253273J4671098M446652j3858703k6740758
$$ -2620317 9569774 31309732 50563005 65234103 69680755 55822052 29081294
40578B9081294k2506180r669064k752321j945287P8528L119022M375379P167939
$$ 29081294 6575114 -3093950 -5846271 -7791558 -7713030 -4594008 -218629 6949310
40570F949310J1551354P500951p752508j6473140k708819J9835987K2872395L685325
$$ 6949310 18500664 26001615 18249107 1775967 -932852 18903135 41775530 45460855
40562D5460855j1058235m049816J0709005J2587227K835526m407495n465292m970380
$$ 45460855 34402620 30352804 41061809 53649036 56484562 52077067 46611775 41641395
40554D1641395o8174J3543312K3954131J3171881j2713496k5226089j3646427
$$ 41641395 41573221 55116533 79070664 92242545 79529049 54302960 40656533
40547D0656533k160725j1934186k5714893j3764537J7908662L3972670K0328320
$$ 40656533 38495808 26561622 846729 -12917808 4990854 38963524 59291844
40540E9291844p21764q412796q393903j0849618r595626K084309J4200480J4399505
$$ 59291844 58570080 50157284 41763381 30913763 21318137 23402446 37602926 52002431
40532E2002431N556393k971076p879608o466823M590016J5556242Q644581j1988814
$$ 52002431 57558824 54587748 46708140 40241317 44831333 60387575 69032156 57043342
40524E7043342j8168310n3301J5523279Q598012r77627Q015893J5548205n521021
$$ 57043342 38875032 38821731 54345010 62943022 61965395 69981288 85529493 80008472
40516H0008472l5508060l4156615p100666L368635j1203074j5449267N392090
$$ 80008472 44500412 10343797 3243131 6611766 -4591308 -20040575 -14648485
40509a4648485K1888344J4434834L707485O975942P013164q844383j6356575O273628
$$ -14648485 7239859 21674693 25382178 32358120 39371284 30526901 14170326 20443954
40501B0443954L6016621L6698647J1911938p143467j0223329j0773732j1406278
$$ 20443954 56460575 93159222 105071160 97927693 87704364 76930632 65524354
40494F5524354j354182J4129981J3035472r262981k8121535k0745444M849739
$$ 65524354 64170172 78300153 91335625 82072644 53951109 33205665 38055404
40487C8055404J9948800P622572j9080572k9843681r126263K4844860L9121241
$$ 38055404 58004204 65626776 46546204 16702523 7576260 32421120 71542361
40480G1542361K3523461j217725j3361494j3605058j3736455j6642806j6389632
$$ 71542361 95065822 93848097 80486603 66881545 53145090 36502284 20112652
40473B0112652p923659R038917K6136809K6060418J749787k4114583k0634415
$$ 20112652 12188993 21227910 47364719 73425137 75174924 51060341 30425926
40466C0425926P060756K1158165O191960r340586r06628J3882296Q671871p149774
$$ 30425926 37486682 58644847 64836807 55496221 54589593 68471889 77143760 69993986
40458F9993986p557297N742781R401473l100740j7101800k2157745j7864687l397129
$$ 69993986 62436689 68179470 77580943 74480203 57378403 35220658 17355971 13958842
40450A3958842J6810944K6826064J8954452Q016345P438645Q096289J729749K833102
$$ 13958842 30769786 57595850 76550302 84566647 92005292 100101581 101831330 104664432
40442A04664432J9259566K5432623J472894k3440833j1556540J7603874J4240979
$$ 104664432 123923998 149356621 150829515 127388682 115832142 133436016 147676995
40435A47676995j9480565l2869426j2353159j625675k2841916l7629338j3460511
$$ 147676995 128196430 95327004 82973845 81348170 58506254 20876916 7416405
40428G416405K2260005K8848568J2377280K646921K895384m02095l171136M454741
$$ 7416405 29676410 58524978 70902258 73549179 76444563 76042468 72871332 77326073
40420G7326073J1064641J781315j2150916j0963021O56322N176423K327241J188978
$$ 77326073 88390714 90172029 78021113 67058092 67714414 72890837 75218078 76407056
40412G6407056k788783j5257267k1767545q105605J0939587J2786475M524556
$$ 76407056 73618273 58361006 36593461 28487856 39427443 52213918 56738474
40405E6738474P013432J3417195J481509j9310596j5306171J3627392K6398974
$$ 56738474 63751906 77169101 78650610 59340014 44033843 57661235 84060209
40398H4060209L568771k0880994j2813686R224255N473189k1196911k8715739
$$ 84060209 87628980 66747986 53934300 63158555 68631744 47434833 18719094
40391A8719094J602048L7874219M1311435J4608494q368487q453461K083990N833474
$$ 18719094 20321142 58195361 99506796 114115290 105746803 97293342 99377332 105210806
40383A05210806L313720J779302k447558j3998539k1450072j1780035L208250
$$ 105210806 108524526 110303828 107856270 93857731 72407659 60627624 63835874
40376F3835874J49160j5935286j4225750J1822999K8900773J5147937m090737
$$ 63835874 63985034 48049748 33823998 45646997 74547770 89695707 85604970
40369H5604970K165128K0410172J7861274l004507j3854981j0450616j1338600
$$ 85604970 87770098 108180270 126041544 123037037 109182056 98731440 87392840
40362H7392840j4173248J804866K8789238L0954101J394242k2939519j7439771
$$ 87392840 73219592 75024458 103813696 134767797 136162039 113222520 95782749
40355I5782749k009868R11944K014624J4129379K0581145N583591j1923421q092884
$$ 95782749 93772881 94684825 96699449 110828828 131409973 136993564 125070143 116977259
40347A16977259N251795M091340m150515J799202J1933388k36120k5648106k6252069
$$ 116977259 122229054 126320394 122169879 123969081 135902469 135666349 110018243 83766174
40339H3766174M624711K9071080K0690513j636529r228972j766231O534563J2522756
$$ 83766174 88390885 117461965 138152478 136515949 127286977 125520746 132055309 144578065
40331A44578065J6736945J0968639p407484k3654623k4650490j6630937j0386810
$$ 144578065 161315010 172283649 164876165 141221542 116571052 99940115 89553305
40324H9553305l347296Q687588J6478144J1414705K837697L617980Q398559L970918
$$ 89553305 86206009 94893597 111371741 122786446 125624143 129242123 137640682 141611600
40316A41611600p207727j1752540o415717K744666J4443593K6829584K6161383
$$ 141611600 134403873 122651333 116235616 118980282 133423875 160253459 186414842
40309A86414842L090214k4756067l0295467j4941444m332916o696349l970157
$$ 186414842 189505056 164748989 134453522 119512078 115179162 108482813 104512656
40302A04512656J0398335J5495883q83310j6811216p912709J5143233K3798378
$$ 104512656 114910991 130406874 129523564 112712348 104799639 119942872 143741250
40295A43741250J2523264m93651m339541m100940l180429J555009P121364M882255
$$ 143741250 156264514 155770863 151431322 147330382 144149953 145704962 152826326 157708581
40287A57708581m474900j0318925p382612J34158Q781847J7700485K1402896J4074203
$$ 157708581 153233681 142914756 135532144 135666302 144448149 162148634 183551530 197625733
40279A97625733J120520o219272p386544j0315882j3731499q217536K896140K250855
$$ 197625733 198746253 192526981 185140437 174824555 161093056 152875520 155771660 158022515
40271A58022515j3977948k3760765p790540K0566805K9639406R803203j5184800
$$ 158022515 144044567 120283802 112493262 133060067 162699473 172502676 157317876
40264A57317876j9371951n345310M449071Q24098j698774Q242716J6286660L531463
$$ 157317876 137945925 132600615 137049686 137873784 136175010 144417726 160704386 164235849
40256A64235849j7866767j6708614O549041J2226229j8712237m7060323k7645671
$$ 164235849 146369082 129660468 136209509 148435738 129723501 82663178 55017507
40249E5017507K3125132N0393811L7909369J8151576J0510116j074845k0493857
$$ 55017507 78142639 128536450 166445819 184597395 195107511 194032666 173538809
40242A73538809j9403825J2076661L6006789J9323079j5172738k3737105l655225
$$ 173538809 154134984 166211645 202218434 221541513 206368775 182631670 178976445
40235A78976445J3383995J1446162K09874j1844418k1318650j6308044R839655
$$ 178976445 192360440 203806602 204016476 192172058 170853408 154545364 164385019
40228A64385019L6922654L8112308J6836859k145511j1247300k1352075l0857353
$$ 164385019 201307673 239419981 256256840 254111329 242864029 221511954 190654601
40221A90654601k5223675o845826M755038M632395N990527R825324J389229j6317023
$$ 190654601 165430926 158585100 163340138 167972533 173963060 183788384 185177613 168860590
40213A68860590j5959597J3630691M5196700M7930235K6374910P943614M414801
$$ 168860590 152900993 166531684 211728384 259658619 286033529 293977143 298391944
40206B98391944K341067j2658488l3287870l5486913p549749K7724474L3506557
$$ 298391944 300733011 288074523 254786653 219299740 211749991 239474465 272981022
40199B72981022P083867j3631504o712256j234838k4822079m4687792j2757978
$$ 272981022 280064889 266433385 259721129 258486291 233664212 188976420 176218442
40192A76218442M5285116N1181153r412577n7714756l4253139J9715480L3472010
$$ 176218442 221503558 272684711 263272134 205557378 171304239 191019719 224491729
40185B24491729Q967663j532166J4878515K3955668J0576005k214346J085872
$$ 224491729 233459392 231927226 246805741 270761409 281337414 279123068 280208940
40178B80208940Q091325P882024N618218L270661n364515j6725363j8958282j2729107
$$ 280208940 288300265 296182289 301800507 305071168 299706653 282981290 264023008 251293901
40170B51293901q731750o515348J335734P773746K09j2755790q055978J2505751
$$ 251293901 242562151 236046803 237382537 245156283 245156492 232400702 224344724 236850475
40162B36850475K2962731J3246258J988426K931610O023750K175800J477257J2337374
$$ 236850475 259813206 273059464 275047890 277979500 284003250 286179050 287656307 299993681
40154B99993681K2738056J7937381K204800j0415984j4785878j2807227m533367
$$ 299993681 322731737 340669118 342873918 332457934 317672056 304864829 300331462
40147C00331462P329415J3133261O977013m475334j0675598q223401J142151J4816111
$$ 300331462 307660877 320794138 327771151 323295817 312620219 304396818 305538969 320355080
40139C20355080K5944617K4103576O642277j5165562k6178197k1298025q669602
$$ 320355080 346299697 370403273 377045550 361879988 335701791 314403766 305734164
40132C05734164k003270p645541j5622641q817202J3666858L1176025K8314895
$$ 305734164 303730894 296085353 280462712 271645510 285312368 316488393 344803288
40125C44803288J5564069R647261P016917k156905o379597J0669110L1992306
$$ 344803288 360367357 370014618 377031535 374874630 368495033 379164143 411156449
40118D11156449K1668454j7960266l9516689j5498496K1691363K6098889p81607
$$ 411156449 432824903 414864637 375347948 359849452 381540815 407639704 406858097
40111D06858097k1391856j6678056j263695O781617N295391j132700r019692j2390082
$$ 406858097 385466241 368788185 367524490 374306107 379601498 378468798 369449106 357059024
40103C57059024n556165P665119J6392306J5365235R372121N872484P265792Q624091
$$ 357059024 351502859 359167978 375560284 390925519 400297640 406170124 413435916 422060007
40095D22060007J747225j3953711k5023290j7287671L446123J5666654J0537512
$$ 422060007 423807232 409853521 384830231 367542560 370988683 386655337 397192849
40088C97192849L032351Q232552J9231270J8937861N008080q115890q302182Q34626
$$ 397192849 400225200 408457752 427689022 446626883 451634963 443519073 435216891 436051517
40080D36051517N023255l807338j5284715j1128912O907181J2072204r234108
$$ 436051517 441074772 437267434 421982719 410853807 417760988 429833192 420599084
40073D20599084k7952058q321056L3766574M4102341N974057l4415825l2371399
$$ 420599084 392647026 384325970 418092544 462194885 468168942 433753117 401381718
40066D01381718j94802K2901136K5704027K1850740J5320584Q59831j4350198
$$ 401381718 401186916 424088052 449792079 471642819 486963403 487823234 473473036
40059D73473036j7316717j0459331o284887q910181j5139172k1075934j5830739
$$ 473473036 456156319 445696988 439412101 430501920 415362748 394286814 378456075
40052C78456075J1065947M1503516L5467292j1421207m6636473k8930556J0429793
$$ 378456075 389522022 431025538 466492830 455071623 408435150 379504594 389934387
40045C89934387J5735054q015073r969335J9363576L3924432R210318k0158537
$$ 389934387 405669441 397654368 387685033 407048609 440973041 450183359 430024822
40038D30024822j7073713O876302J9513040J4920891Q368381P149144Q048830
$$ 430024822 412951109 419827411 439340451 454261342 462629723 469778867 477827697
40031D77827697R553693J1093095R729966N220614j024570j2279267k8197346
$$ 477827697 487381390 498474485 508204451 513425065 512400495 500121228 471923882
40024D71923882l3793005j6461786Q512868J2924334l546686j1926282L650265
$$ 471923882 438130877 421669091 430181959 443106293 439559607 427633325 431283590
40017D31283590K5603524K9686040J1703159j5388046l2455557k3705185M443989
$$ 431283590 456887114 486573154 498276313 482888267 450432710 426727525 431171514
40010D31171514J9031099r13049k9307578k6179284K963809J8311436J0112810
$$ 431171514 450202613 449289564 419981986 393802702 396766511 415077947 425190757
40003D25190757O854352J8297670J9569113J998522q380336N98206N233433q506886
$$ 425190757 432045109 450342779 469911892 471910414 463530078 464128284 469361717 460854831
39995D60854831k0607612j7955514j5834098j7608512n84553L1872858L4998929
$$ 460854831 440247219 422291705 406457607 388849095 388264542 420137400 455136329
39988D55136329n598615l6667282j5638194K0055662J4484057j6139556j5701045
$$ 455136329 449537714 412870432 397232238 417287900 431771957 415632401 399931356
39981C99931356J7542631L4431286J8209444J916935N381908R902504O73172j0590045
$$ 399931356 417473987 451905273 470114717 472031652 477413560 487316064 487989236 477399191
39973D77399191j3095772j2709129j5162777j9031412k3499922k2638253m261587
$$ 477399191 464303419 451594290 436431513 417400101 393900179 371261926 367000339
39966C67000339K3450433K6136188o359679l0535456r267440K6031541K2312315
$$ 367000339 390450772 416586960 410227281 379691825 370424385 396455926 418768241
39959D18768241r974889j7153756P661620J8612824l017103k5243211k5494248
$$ 418768241 408793352 391639596 399301216 417914040 414896937 389653726 364159478
39952C64159478j6589171n853509J6492170L8917621L1537228j858102k4710162
$$ 364159478 347570307 341716798 358208968 397126589 428663817 426805715 402095553
39945D02095553k8373380l8754845n4735516m0138221P231150L9319657L2862784
$$ 402095553 373722173 334967328 280231812 240093591 247324741 286644398 319507182
39938C19507182K1604232K7321652J9518458k0216724n0940353l4992855p57006
$$ 319507182 341111414 368433066 387951524 367734800 316794447 281801592 281044586
39931B81044586N598198p336194j136192K4673620L7597109K5363776M466582
$$ 281044586 286642784 279306590 278170398 302844018 340441127 365804903 370271485
39924C70271485r497442j0649624P71148R181642n676078l1316850k8311065P574466
$$ 370271485 360774043 350124419 350895567 360077209 354401131 323084281 294773216 302347682
39916C02347682K9873912J2761496q496600j198451J0019594m959514k2984131
$$ 302347682 332221594 344983090 336486490 335288039 345307633 340348119 317363988
39909C17363988j3295398R21218j3775487l2674055j3574497K3399368K5713928
$$ 317363988 304068590 304989808 291214321 258540266 244965769 268365137 294079065
39902B94079065k987619j4675804l114389n951310k6151915k3840288P955042
$$ 294079065 291091446 276415642 273301253 267349943 241198028 217357740 225312782
39895B25312782K6549270J1396574o960379n202580J95221l284976J329914J9917287
$$ 225312782 251862052 263258626 256298247 251095667 251290888 248005912 249335826 269253113
39887B69253113K4923390j226689l3778632l8624533j2967729K0408839L7344894
$$ 269253113 294176503 292949814 259171182 220546649 207578920 227987759 265332653
39880B65332653K4995310o666744k5886985j5320801O08074o842558k1447290
$$ 265332653 290327963 283661219 257774234 242453433 243061507 236218949 214771659
39873B14771659j0450809J3871903J3426242n415101j426261K4004352K4957505
$$ 214771659 204320850 218192753 231618995 226203894 224777633 248781985 273739490
39866B73739490o607147k4319843q647882L151817r078808j2724680Q410396J6418257
$$ 273739490 267132343 242812500 234164618 237316435 228237627 215512947 223923343 240341600
39858B40341600q819533k3628923M254711L2253078J1932789k8414053l3230952
$$ 240341600 231522067 207893144 212147855 244400933 256333722 227919669 194688717
39851A94688717j0569130n908956j6761366m985558K4385954K7556671o48214
$$ 194688717 184119587 178210631 161449265 156463707 180849661 208406332 207758118
39844B07758118j8343195p745397L179711k411290m922587O553662J0419507o957468
$$ 207758118 189414923 181669526 184849237 182437947 177515360 184069022 194488529 187531061
39836A87531061k4179343j9059587j546190P205725O528603P848947R939834J050398
$$ 187531061 163351718 144292131 142745941 149951666 156480269 164329216 174269050 175319448
39828A75319448j9830732l6058752k9202532k3124K8171643L2662742J7327712
$$ 175319448 155488716 119429964 90227432 90204308 118375951 151038693 168366405
39821A68366405M658279K025545n066965k1159471k7227988j2614777M031575
$$ 168366405 173024684 175050229 169983264 148823793 121595805 108981028 113012603
39814A13012603N258760K933987J1953588J8434913M319753j4817764j1552216
$$ 113012603 118271363 121205350 133158938 151593851 155913604 141095840 129543624
39807A29543624O111789O557734j1776742j6896388K952365J7576561Q09383k7934579
$$ 129543624 135655413 142213147 130436405 113540017 116492382 134068943 134878326 106943747
39799A06943747k8306592O286681L7026715K5384885j8241723m3031301j9287271
$$ 106943747 78637155 84923836 121950551 147335436 129093713 86062412 66775141
39792F6775141K2789632L3770994J1685705l634522K906231M635543r846145j2246139
$$ 66775141 89564773 123335767 135021472 131386950 134293181 138928724 129082579 116836440
39784A16836440R605954J9254959r073701l9745907k8211758R154923K5268007
$$ 116836440 126442394 145697353 136623652 96877745 68665987 77820910 103088917
39777A03088917J4858137O784750O537560j176314r540816j921909O427323q657196
$$ 103088917 117947054 124731804 131269364 130093050 120552234 118630325 125057648 116400452
39769A16400452k7861348j4385810J6863254J5605275k0713864m0863851k1840079
$$ 116400452 88539104 74153294 91016548 106621823 85907959 45044108 23204029
39762B3204029K194995M264349J593446J0742519J6199853N467445n988497m268756
$$ 23204029 25399024 29663373 31256819 41999338 58199191 63666636 57678139 53409383
39754E3409383L378791J0973991K1406645K5416640J0856354m941193M426104
$$ 53409383 56788174 67762165 89168810 114585450 125441804 120500611 124926715
39747A24926715K2190864Q813184k4947525k8224341k7174M045550k6042045k6239916
$$ 124926715 147117579 155930763 130983238 102758897 102731723 106777273 80735228 54495312
39739E4495312L0165722P0734364L0460020m4878828o8550179l4338497J905420
$$ 54495312 84661034 155395398 185855418 140976590 72426411 38087914 39993334
39732C9993334J9392742L4919321L8222641M518537m0777748m2981122k614272
$$ 39993334 59386076 94305397 132528038 137046575 96268827 53287705 50673433
39725E0673433K4483259J3756744p32046P187842J8178939J1797662N97393o79676
$$ 50673433 75156692 88913436 88181390 95369232 113548171 125345833 125943226 125263550
39717A25263550k149237j3783212k2854058j6782179o166061n974907r466073
$$ 125263550 123114313 109331101 86477043 69694864 63528803 57553896 48087823
39710D8087823J448568K7052457M4216491L1247633n191160l2741914k8970506
$$ 48087823 49536391 76588848 120805339 152052972 146861812 114119898 85149392
39703H5149392r128532l480292j1742120o485677J6364751K5731099P074795j1254531
$$ 85149392 76020860 72540568 60798448 54312771 70677522 96408621 103483416 92228885
39695I2228885n908301L395403n951008j5427269M3010K2493841J9687841Q17881
$$ 92228885 86320584 89715987 83764979 68337710 68380720 90874561 110562402 111380283
39687A11380283k967873L904908o833964k8284318k2637474J4706911M1051764
$$ 111380283 108412410 112317318 105483354 77199036 54561562 69268473 110320237
39680A10320237K4901083j6177665m3789162l8240871o969030K4089353K8932190
$$ 110320237 135221320 119043655 75254493 37013622 30044592 54133945 83066135
39673H3066135R199689n808163k341256k928207k1082957k7812318r56296K5035352
$$ 83066135 92265824 86457661 84116405 81188198 60105241 32292923 31336627 56371979
39665E6371979R409409k3072541k0909997O242603Q073396j2555039m840278L2319728
$$ 56371979 65781388 42708847 21798850 28041453 36114849 23559810 18719532 51039260
39657E1039260M0674681M370187j9511637Q70560J9147543n410600l8445893l2962387
$$ 51039260 91713941 96084128 76572491 77443051 96590594 91179994 52734101 19771714
39649A9771714n985636o66002j4394047j5869665k115431P471036R295466R825447
$$ 19771714 13786078 13120076 -1273971 -17143636 -19259067 -11788031 -2492565 7332882
39641G332882M952928l752903J700151K2414312K9136723R742132n440192L412501
$$ 7332882 12285810 8532907 10233058 32647370 61784093 71526225 66086033 69498534
39633F9498534P811728j5008903l1455434m646377L6377112L7050577K357853
$$ 69498534 77310262 62301359 30845925 26199548 62576660 99627237 101985090
39626A01985090j6388758l806377P715643L80960q965622r877897j0924222r648308
$$ 101985090 85596332 81789955 89505598 89886558 80920936 71043039 60118817 50470509
39618E0470509O152579K4254574J6322500j4526444l1837298j7614131P126106
$$ 50470509 56623088 80877662 97200162 82673718 50836420 33222289 40348395
39611D0348395J8488052J5291502M365638r959651j7197791q423331M889856M782634
$$ 40348395 58836447 74127949 78493587 68533936 51336145 42912814 47802670 52585304
39603E2585304k289048L781518J8643715J8539875K457908n547243J230213K932751
$$ 52585304 50296256 54077774 72721489 91261364 93719272 88172029 89402242 92334993
39595I2334993p173810q826705Q270872K4757674K1644445L503146j7947942l6144318
$$ 92334993 85161183 76334478 84605350 109363024 131007469 134510615 116562673 80418355
39587H0418355l7636263r658642K7919858L1641974n836945l6256249j9710191
$$ 80418355 42782092 33123450 61043308 92685282 86848337 50592088 30881897
39580C0881897J9759947L1408554Q017624j4888936j6190853r971244j2091428
$$ 30881897 50641844 82050398 90068022 75179086 58988233 49016989 36925561
39573C6925561j7514048j6620717j0556454k015342J1296646K4682710K2884921
$$ 36925561 19411513 2790796 -7765658 -9781000 1515646 26198356 49083277
39566D9083277R14033k1637860k1616964k726133J0732945R725933J0752470K2945503
$$ 49083277 49997310 28359450 6742486 4016353 14749298 24475231 35227701 58173204
39558E8173204K6540521M453069k1254659j5757173J2138056J7365158j2754519
$$ 58173204 84713725 89166794 67912135 52154962 64293018 81658176 68903657
39551F8903657l6938716k3164574N319106J3483264Q023930J1494025J4029571
$$ 68903657 31964941 8800367 14119473 27602737 35626667 47120692 61150263
39544F1150263m039900k3880927j2930999J5276103J8281100m490166j2064066
$$ 61150263 57110363 33229436 20298437 35574540 53855640 49365474 37301408
39537C7301408O170104J4854262j455954j2413222l40546Q524895k462380n636213
$$ 37301408 43471512 58325774 56869820 44456598 44116052 52640947 50178567 44542354
39529D4542354J7305568L1439235K072964m2112457m6899399j0482393K2412564
$$ 44542354 61847922 93287157 95360121 53247664 6348265 -4134128 18278436
39522A8278436K8223159K1188205J2140493m132446k0847852j8593881J322541
$$ 18278436 46501595 67689800 79830293 75697847 54849995 36256114 37578655
39515C7578655J4680282J1240075N808594P407772N647125l600830n516768P281411
$$ 37578655 52258937 63499012 69307606 76715378 82362503 78761673 73244905 80526316
39507H0526316J7395968Q337452p920325p302788J0671406K1319652Q786335j2450843
$$ 80526316 97922284 106259736 98339411 91036623 101708029 123027681 131814016 119363173
39499A19363173j7393810n068036q93295k0637695m4053892l9292929p886739
$$ 119363173 101969363 96901327 96008032 75370337 31316445 -7976484 -15863223
39492a5863223J6229378J5245454R792159J9983058K9412948J3223844j5243271
$$ -15863223 366155 15611609 25403768 45386826 74799774 88023618 72780347
39485G2780347j8930677O698672K5205445J2833118r009705r838718M227327L250373
$$ 72780347 53849670 60548342 85753787 98586905 89577200 79738482 83965809 87216182
39477H7216182j9552362l7661055k9071206n496276N704397j515798o351299Q387511
$$ 87216182 67663820 30002765 931559 -4564717 1139680 -376118 -6727417 1660094
39469A660094L2617039M2256103K8230619K834226j7944242k6936201k2974086
$$ 1660094 34277133 76533236 104763855 107598081 89653839 62717638 39743552
39462C9743552r197730L930665O242580J440126J270379M405629l024698k0760767
$$ 39743552 30545822 34476487 40719067 42159193 43429572 47835201 44810503 24049736
39454B4049736k6911164q823599J4972076J9922824R862208P060918J5923923
$$ 24049736 -2861428 -11685027 3287049 23209873 33072081 40132999 56056922
39447E6056922J7981144K648282j5535021j6329184J86482J3312777M241959k2913035
$$ 56056922 74038066 76686348 61151327 44822143 45008625 58321402 62563361 39650326
39439C9650326m2792303l4958835p675018J2488224J4664621J4031689K4332108
$$ 39650326 -3141977 -38100812 -45775830 -33287606 -18622985 -4591296 19740812
39432A9740812L6389122L4162769J8268522J069760j0065007j2798622n511979
$$ 19740812 56129934 90292703 108561225 109630985 99565978 86767356 81255377
39425H1255377M354402R26618j6902110k7077398j5279507J693393L283612j363300
$$ 81255377 85609779 86536397 69634287 42556889 27277382 28970775 32254387 30891087
39417C0891087O169480J4907589L68529k8724174l7063923j6870438J192951j555172
$$ 30891087 37060567 51968156 52336685 23612511 -13451412 -30321850 -29128899 -30684071
39409c0684071n729817P459812K2966838J8390226n290j0831559j0566274j0625195
$$ -30684071 -36413888 -28954076 -5987238 12402988 12397698 1566139 -9000135 -19625330
39401a9625330j2556558p208375O725941K0161800K7088492K8491815K5453553
$$ -19625330 -32181888 -39390263 -32664322 -12502522 14585970 43077785 68531338
39394F8531338J7963925Q524052J83229o833927j3202086j9226326k6277470l2573071
$$ 68531338 86495263 95019315 95202544 88368617 75166531 55940205 29662735 -2910336
39386b910336k8521138p930096J5848601K0622604O052826l581410N668729J8417646
$$ -2910336 -31431474 -39361570 -23512969 -2890365 3162461 -418949 5249780 23667426
39378B3667426J7247507R711889J0463690J3048588L065743j1033001o998843
$$ 23667426 40914933 50626822 61090512 74139100 77204843 66171842 59172999
39371E9172999J4078694K5689028J4859715j82561m49647N878670N08525j4291447
$$ 59172999 73251693 98940721 113800436 113617875 113168228 119046898 119555423 105263976
39363A05263976j9870527r527098L757804O566725j365957j3070559k1303547
$$ 105263976 85393449 75866351 79624155 86190880 84824923 71754364 50450817
39356E0450817j7982893j08630J8993025J7994581m394109k2641791j7071833
$$ 50450817 32467924 32359294 51352319 69346900 64952791 42311000 25239167
39349B5239167J81249P927430R956041K1115640L0387361J3144212k0400090k9050361
$$ 25239167 25420416 33347846 43303887 64419527 94806888 107951100 87551010 58500649
39341E8500649l544738J5192342J087670j5273604k082911J6176974L146648j9376018
$$ 58500649 54955911 70148253 71235923 55962319 53879408 70056382 73203030 53827012
39333E3827012m981760L2249053L3061374q871012l2566059o575211K5001631
$$ 53827012 48845252 81094305 114155679 105284667 72718608 66143397 91145028
39326I1145028J9302166k217832m518067n23776j5120469k9075384j1728392J9227652
$$ 91145028 110447194 108229362 103711295 103187519 88067050 58991666 47263274 66490926
39318F6490926K3540792M293319k997025O742514P203629m575010l287664J3437611
$$ 66490926 90031718 94325037 91328012 98070526 105274155 100699145 97411481 110849092
39310A10849092J5544817r094467l3461024l1287911p621913J7692010K9749464
$$ 110849092 126393909 117299442 83838418 52550507 44928594 62620604 92370068
39303I2370068J9308798p555292k0782591N30510K7803216J4218299l2231991
$$ 92370068 111678866 104123574 83340983 83871493 111674709 125893008 93661017
39296I3661017n1935305j9530037K0762897K4680806O624230P06405N201848K545417
$$ 93661017 41725712 22195675 42958572 67639378 74263608 74970013 80171861 82717278
39288H2717278O16168J2596437K0924153L595316k1891860k2125124j369889R169008
$$ 82717278 83333446 95929883 116854036 120449352 98557492 76432368 75062479 84231487
39280H4231487M660331O597510J5586807Q824153j3420344k1431398m554969J2137521
$$ 84231487 88891818 95489328 111076135 119900288 106479944 85048546 80493577 92631098
39272I2631098J1071166O290153R989163R280895m460963j3928895o249625J981591
$$ 92631098 103702264 109992417 119981580 129262475 124801512 110872617 104622992 106604583
39264A06604583m951222j0988339L276147K1874113J6867741l306496n483986
$$ 106604583 101653361 90665022 93941169 115815282 132683023 129376527 123892541
39257A23892541J3342133J9424401m857956l3665031l5244247j2481528Q455220
$$ 123892541 137234674 156659075 151801119 118136088 82891841 70410313 78865533
39250G8865533J2265573K994892q896320j4553269r666637J007305P960720J0213564
$$ 78865533 91131106 94125998 85229678 70676409 61009772 62017077 69977797 80191361
39242H0191361J5043466K1204469J6495916o18663j2159776n422078O545188M169365
$$ 80191361 95234827 116439296 132935212 132316549 120156773 114734695 121279883 125449248
39234A25449248r584114j6375451j1025491m749712m401265o439914r227583j3841120
$$ 125449248 115865134 99489683 88464192 83714480 79313215 72873301 63645718 49804598
39226D9804598j4160148m287460N083731j763516j6360699j1918758J5280154
$$ 49804598 35644450 31356990 36440721 34677205 18316506 6397748 21677902
39219B1677902L4857268K5159761M127155o53120P437703P001247k813734m809226
$$ 21677902 56535170 81694931 85822086 85168966 92606669 99607916 96794182 91984956
39211I1984956K162406K80858j4889948k4325025j4395561L917728J2834378R550124
$$ 91984956 94147362 94428220 79538272 55213247 40817686 44735414 57569792 67119916
39203F7119916K603929r74717J669271Q745678J1604001L605321o832725n346041
$$ 67119916 69723845 68749128 70418399 79164077 90768078 94373399 87540674 82194633
39195H2194633M904505O411149k524782k822233J0985213J5857137k493161k0055810
$$ 82194633 87099138 93510287 90985505 88163272 99148485 115005622 112512461 92456651
39187I2456651q531035J7639124K0487664l490619j9837089j1340573q12052q214634
$$ 92456651 83925616 101564740 122052404 118561785 98724696 87384123 86572071 78357437
39179G8357437j8590592j2758234k302317o421765j3352285K403736L3115082
$$ 78357437 59766845 47008611 44706294 38284529 24932244 27335980 60451062
39172F0451062M1505453J3620345k0413846k7112589q644612J0003984J4335782
$$ 60451062 101956515 115576860 95163014 68050425 59405813 69409797 83745579
39165H3745579P266848l258095r188180m046483Q455218J5149696J1559450Q703720
$$ 83745579 91012427 87754332 78566152 74519669 82974887 98124583 109684033 118387753
39157A18387753J2118291Q452000j1450400l0032466k5522071p106478j494890
$$ 118387753 130506044 138958044 127507644 97475178 71953107 64846629 63351739
39150F3351739r413147n690980J5129759K5657977R858231r228611n872962P827899
$$ 63351739 53938592 48247612 63377371 89035348 98893579 89664968 83792006 91619905
39142I1619905L074064j9624032l2362653k0370798K873000J7827782J6897356
$$ 91619905 94693969 75069937 42707284 22336486 25209486 43037268 59934624
39135E9934624L098859j2005706j2201131N428749K0825351J5433581m91518m672012
$$ 59934624 63033483 51027777 38826646 44255395 65080746 80514327 80022809 75350797
39127G5350797Q48141l768059j6765070j3031869J3013765L2883102K4876169
$$ 75350797 76198938 72430879 55665809 42633940 55647705 88530807 113406976
39120A13406976L913686n385600l516720n139966j0796248j0278020k922698L877429
$$ 113406976 117320662 111935062 108418342 103278376 92482128 82204108 79281410 83158839
39112H3158839Q324944J1217665P358579n896073j8814234k0606878j3406997
$$ 83158839 91483783 102701448 110060027 104163954 85349720 64742842 51335845
39105E1335845m835806L439293R505196O557426k912472k748784J1884593K1122777
$$ 51335845 46500039 49939332 59444528 66001954 63089482 60340698 72225291 93348068
39097I3348068J0624147k640052M08362M101443j5174313l8152347k2839016K4354016
$$ 93348068 103972215 101332163 101740525 105841968 90667655 52515308 29676292 54030308
39089E4030308M4580905Q876463l7148462l7262326k37617K2536941J2609768
$$ 54030308 98611213 107487676 70339214 33076888 32839271 55376212 67985980
39082F7985980j543681K467384J2020868Q891617j790417m960370N15769N337479
$$ 67985980 66442299 68909683 80930551 89822168 88031751 83071381 83587150 88924629
39074H8924629O546353Q068815R339603M462919o810087j4970685j1701103j604626
$$ 88924629 95470982 103539797 112879400 117342319 110532232 95561547 83860444 82255818
39066H2255818K358526m624994j2996525j2258963m921553r81889l377170p178106
$$ 82255818 84614344 79989350 66992825 54733862 49812309 48830420 45453250 38275144
39058C8275144r356212r404636l629463Q904772J7040117R003762o940270j0228576
$$ 38275144 28918932 19514296 15884833 24789605 41829722 50833484 43893214 33664638
39050C3664638J290421P400389j851819j0217011k916148R869197J2981878J1549255
$$ 33664638 34955059 42355448 40503629 30286618 27370470 37239667 50221545 61770800
39042F1770800J6214690J8564745N488593j2696639j4701729k639046K755277
$$ 61770800 77985490 96550235 102038828 89342189 74640460 72001414 74756691
39035G4756691k023724q19847Q010444O245099p702889q627408J2951156K7034670
$$ 74756691 72732967 71913120 79923564 86168663 78465774 69838366 82789522 109824192
39027A09824192P668382k2381124k2163222N572074J8808996K86534j9678640
$$ 109824192 117492574 95111450 72948228 78520302 97329298 97615832 77937192
39020G7937192j4569638k275403j0922632k8123205j7902041K0040521M3259611
$$ 77937192 63367554 61092151 50169519 22046314 4144273 24184794 67444405
39013F7444405K5570341o829740j5368639k079208K726386q566996j3557604j337178
$$ 67444405 93014746 86185006 70816367 68737159 71463545 62896549 49338945 48001767
39005D8001767R922473N540005k136487J916844Q901420L697087p138705o988045
$$ 48001767 57924240 63464245 61327758 63244602 72146022 75843109 68704404 61716359
38997F1716359J921961L974363k046205l613508k23388n512026k1433377l0741424
$$ 61716359 63638320 67612683 65566478 61952970 61729582 56217556 34784179 4042755
38989D042755k1162922j851733R643230N624536q236284j7056256o731450J7470528
$$ 4042755 -17120167 -18971900 -9328670 -3704134 -11940418 -28996674 -35728124 -18257596
38981a8257596K7969674Q355304j6901587j1260139J8900864K9853382M991802
$$ -18257596 9712078 18067382 1165795 -10094344 8806520 38659902 43651704
38974D3651704k1256747j7294212J650927N325801m629117p610305k267870j702296
$$ 43651704 22394957 5100745 6751672 12077473 7448356 -161949 -2429819 -4132115
38966d132115n285949l967743k672605j0396540j7325247q360124Q426954J3059922
$$ -4132115 -9418064 -13385807 -16058412 -26454952 -43780199 -52140323 -43713369 -30653447
38958c0653447O396276N256278J1199329J1512068O063334M796009L175752r142764
$$ -30653447 -24257171 -19000893 -7801564 3710504 9773838 14569847 17745599 8602835
38950H602835j8893829l600901K3972785K4438333p158945k7700509q986209K1801750
$$ 8602835 -10290994 -13891895 10080890 34519223 27360278 -340231 -9326440 12475310
38942A2475310K6795161J0968996L226361Q788460J1412415O688607L144388j3505
$$ 12475310 39270471 50239467 53465828 62254288 73666703 80355310 83499698 83486193
38934H3486193r471117j8153398j2775567J995783P209934l797393j8794216k4997556
$$ 83486193 74015076 55861678 43086111 45081894 52291828 48494435 29700219 4702663
38926D702663k0300099q580299L898171R764634Q024254O627822J0347937J3420356
$$ 4702663 -15597436 -24177735 -20279564 -10514930 -2490676 4137146 14485083 27905439
38918B7905439J1721931J1486115J5735360J4035577j083933j8583445k4222851
$$ 27905439 39627370 51113485 66848845 80884422 79800489 61217044 36994193
38911C6994193k1128415k0062934j9407725j1311849R90548Q269475R719422P886942
$$ 36994193 15865778 -4197156 -23604881 -34916730 -33926182 -25656707 -15937285 -8050343
38903h050343k97262j2111258j1758531O912687K3660556J8717030K841283k532832
$$ -8050343 -8347605 -20458863 -32217394 -25304707 -1644151 17072879 19914162 17381330
38895A7381330j37865m420954r568188l111514K094279j1561110k4537411m509041
$$ 17381330 17243465 12822511 3254323 142809 2237088 -9324022 -33861433 -38370474
38887c8370474L2059237L4575409p12883j9383433N899780L3670248K4220039
$$ -38370474 -6311237 28264172 27551289 8167856 14067636 47737884 71957923
38880G1957923K86244j214622O191604r487311l4368471k9457574K260033J9764740
$$ 71957923 72244167 71029545 77221149 67733838 33365367 3907793 6167826 25932566
38872B5932566P166830j1010761j4417483q018642L1992P067610L956744j3158580
$$ 25932566 33099396 22088635 7671152 -347490 -315498 6752112 10708856 -2449724
38864b449724k2485065j734833K9946153L2559434O567294p619479M807101J2923628
$$ -2449724 -24934789 -26669622 3276531 35835965 42403259 34783780 39590881 52514509
38856E2514509k152359j4706031k665938J2007367K767068j3983956p774572J2414998
$$ 52514509 50362150 35656119 32990181 44997548 47764616 33780660 26006088 38421086
38848C8421086J2901402r326174k4226150j7475217o840567p329607j0381243
$$ 38421086 51322488 41996314 17770164 294947 -6545620 -13875227 -24256470
38841b4256470n959374q80538l235783n967378J472570J5928015K5243347K3322326
$$ -24256470 -30215844 -31096382 -34332165 -40299543 -38826973 -22898958 2344389 25666715
38833B5666715J3384100J767093n871471o591077l103918j808179m951342p368211
$$ 25666715 39050815 40817908 34946437 28355360 25251442 23443263 18491921 11123710
38825A1123710l305422N501119J0669288O134626l829543o898541L787331J8779281
$$ 11123710 7818288 13319407 23988695 30123321 26293778 19395237 23182568 41961849
38817D1961849K0461315L303035k0495159l7175192m3527286l8518042j6415074
$$ 41961849 62423164 65726199 45231040 8055848 -35471438 -73989480 -90404554
38810i0404554J9080641M4323434L8021099J0761215o346180k817419J220988
$$ -90404554 -71323913 -27000479 11020620 21781835 15435655 12618236 13839224
38803A3839224r156043j9553579j1096508Q676575J9480839K0791730K6340077
$$ 13839224 4683181 -14870398 -25966906 -17290331 2190508 22982238 49322315
38796D9322315L0945172J1678034l0054109n3914029k8511456K1726378M2887705
$$ 49322315 80267487 91945521 61891412 7977383 -20534073 1192305 44080010
38789D4080010J9820882q146474m437923J7117383J8178756q304702l2283750
$$ 44080010 63900892 55754418 51316495 68433878 86612634 78307932 46024182
38782D6024182l0780024j3714974j986748l49601k022538m463191o885512k841316
$$ 46024182 15244158 1529184 -457564 -807165 -2829703 -7292894 -14178406 -17019722
38774a7019722R655840J7515594Q039928q507534q822206J0152087K4645903J5906488
$$ -17019722 -7363882 10151712 18191640 9684106 861900 11013987 35659890 51566378
38766E1566378o461221k1169838k1520679j3451966L37381J7418993K3993649
$$ 51566378 45105157 23935319 2414640 -11037326 -10699945 6719048 30712697
38759C0712697O774053k2340411l2317473j1143209J6607994K0475456R48904
$$ 30712697 37486750 15146339 -17171134 -28314343 -11706349 8769107 9718011
38752I718011j6672792j6245575l072403J2958154K7988963L5455352K4525187
$$ 9718011 -6954781 -23200356 -26272759 -13314605 14674358 50129710 74654897
38745G4654897k425919k2697866j7190208M207093J4259217L221597j1365512
$$ 74654897 72228978 49531112 32340904 36547997 50807214 54028811 42663299
38738D2663299j1269198m22868N634069K358895k650647m928109p203603r984585
$$ 42663299 31394101 30971233 36605302 38964197 36313550 31385441 24181838 14197253
38730A4197253r861067q058336r307784r888980L28874J8296046K4326514R153432
$$ 14197253 4336186 -3722150 -13029934 -22918914 -22590040 -4293994 20032520 29185952
38722B9185952q532589p521358L978310L404076o843537l850297J1902649J0963793
$$ 29185952 20653363 13132005 17110315 20514391 13670854 9820557 21723206 32686999
38714C2686999j4722968k9650437p225712K4266930K2332129m199953j2414583
$$ 32686999 17964031 -11686406 -18912118 5354812 27686941 23486988 11072405
38707A1072405L383566O360631j4889815k3959221M19294K5196328J6544638n393822
$$ 11072405 14455971 20816602 5926787 -18032434 -17613140 7583188 24127826 18734004
38699A8734004l757275J2076094O788907j5049670j4509527J2730056K2862470
$$ 18734004 14976729 27052823 33841730 18792060 4282533 17012589 39875059
38692C9875059p985832m4049496m1019711o194675J9405795J8570920R039452
$$ 39875059 31889227 -12160269 -53179980 -59374655 -39968860 -21397940 -12358488
38685a2358488P512745R781936O950081J088005j399220l10422J113976L889917
$$ -12358488 -4845743 4936193 11886274 12974279 11575059 11264637 12378613 16268530
38677A6268530J1991869K3347190K6771814J3927646n501356j0305946M034329
$$ 16268530 28260399 51607589 78379403 92307049 86805693 76499747 80534076
38670H0534076J4256354m12375k6116462l2304486j6669398o527043j3268613
$$ 80534076 94790430 94378055 68261593 35957107 19287709 12760666 -507947
38663e07947j4777678M293993K2506886J4366204p783134j2979862k30305L407170
$$ -507947 -15285625 -10991632 11515254 25881458 18098324 5118462 4888157 8295327
38655H295327j0283027j7373225j918598J7837739J7647301J859270q235230q014718
$$ 8295327 -1987700 -19360925 -21279523 -3441784 14205517 16064787 7829557 -185161
38647a85161j0753389j9113969j6212836P665240L3223898L0997325p72033l0120989
$$ -185161 -10938550 -30052519 -46265355 -38600115 -5376217 25621108 24849075 -5271914
38639e271914k8072078j878443J7660284J5593324N554516M181757R447862J0966540
$$ -5271914 -33343992 -35222435 -17562151 -1968827 3585689 7767446 17215308 28181848
38631B8181848P476503K941076l779520j2413131j3679080l355851L799961p207773
$$ 28181848 35658351 38599427 34819907 22406776 8727696 5371845 9171806 1964033
38623A964033k3692007j8566281P465716K1859658P494683r950495j68156K4672290
$$ 1964033 -21727974 -40294255 -32828539 -10968881 -3474198 -13424693 -13592849 11079441
38615A1079441K6990532j89869k2821589j4936659O795798J0221669p983399k2336336
$$ 11079441 38069973 37880104 15058515 121856 6917654 17139323 9155924 -13180412
38607a3180412j4306953Q596716K7282261L0595141J8785669j320231j9723713
$$ -13180412 -27487365 -18890649 8391612 38986753 57772422 56452191 36728478
38600C6728478k7648837k2311447o022043J6678241L6205159L7628152J4519009
$$ 36728478 9079641 -13231806 -19253849 -2575608 33629551 71257703 85776712
38593H5776712j7742094l4513912k9378358j7565608j0937225n126075L559941
$$ 85776712 68034618 33520706 4142348 -13423260 -24360485 -29486560 -25926619
38586b5926619O573002n7547l365198O403930J6205427Q839202q847248j5691699
$$ -25926619 -19353617 -19411164 -22776362 -16372432 -167005 8672197 -175051 -15866750
38578a5866750o426153P220553J7778638K2897267J3204378j4066465l4652028
$$ -15866750 -22292903 -15072350 2706288 25603555 38807933 24741468 -9910560
38571i910560k1586665J0632930K0445851J743357p162891J0587585J9060932
$$ -9910560 -31497225 -20864295 -418444 1324913 -5837978 4749607 23810539
38564B3810539q580113l6458099j7063269L0176937M2315787N579483k6405559
$$ 23810539 15230426 -21227673 -38290942 -8114005 34201782 39781265 13375706
38557A3375706j3477977J7340909J8759486j0104515l1391970k3040679J933428
$$ 13375706 -102271 17238638 35998124 25893609 -5498361 -28539040 -26605612
38550b6605612K2075313K8756563K0793232j403432k7538198l6113086j5418879
$$ -26605612 -4530299 24226264 45019496 43616064 16077866 -20035220 -35454099
38543c5454099J6533524K6336326M433723k1067309k0242718j264225L434659
$$ -35454099 -18920575 7415751 11849474 -9217835 -29460553 -30724778 -27290119
38536b7290119j3681709k4475405r207356J3387228J5608946J064905n377568
$$ -27290119 -40971828 -65447233 -74654589 -61267361 -45658415 -44593510 -49971078
38529d9971078M354555J5342892J5619777Q809781K536642o14042q46686J4865
$$ -49971078 -45616523 -30273631 -14653854 -5844073 -3307431 -3921473 -4768159 -4753294
38521d753294l00638J313429J0117407J8995901J1336667j1907499k5299912j3670339
$$ -4753294 -5053932 -3740503 6376904 25372805 36709472 24801973 -497939 -14168278
38513a4168278M167224N167538k810397P05987J2137874J3452034N142708L44234
$$ -14168278 -10001054 -4833516 -7643913 -6937926 5199948 18651982 23794690 24138924
38505B4138924k344112r737617r864976Q878637K5351766J1294350j8625328k4969156
$$ 24138924 21794812 12057195 2192219 11070856 36422622 47716972 29091644 4122488
38497D122488o649487J719576m900952O225254L8260359M5779644P109159l4532623
$$ 4122488 -2526999 -807423 -5708375 516879 38777238 84556882 91666041 57133418
38489E7133418l4642879j0234399k650193j2616037j2465809K241143J2354346
$$ 57133418 22490539 12256140 9605947 -3010090 -15475899 -13234756 -880410
38482h80410R951523J644004q788741j5872967p724320J1456295J5506543l647323
$$ -880410 9071113 10715117 1926376 -13946591 -21670911 -10214616 5291927 1644604
38474A644604j5495033K124403K3477581J6265669m345448l946981J0962373P422917
$$ 1644604 -13850429 -11726026 11751555 28017224 23671776 19724795 30687168 38110085
38466C8110085j3385069j7733900L343079K1783037J7880679J137869j4286100
$$ 38110085 24725016 6991116 10334195 32117232 49997911 51135780 36849680
38459C6849680k2344407j6037885L016764J1880093m477605k1051693p121425
$$ 36849680 14505273 -1532612 1484152 13364245 8886640 -12165053 -19286478
38452a9286478J9107230J5858554j0603318j3508492J4946369K9211255O272157
$$ -19286478 -179248 15679306 5075988 -8432504 6513865 35725120 41997277
38445D1997277k0316916k1205324j2668429j2287843m503362J7500301K3093967
$$ 41997277 21680361 475037 -12193392 -24481235 -28984597 -11484296 11609671
38438A1609671l572265k4532132n569032K3339211J5343190j4236984j2821341
$$ 11609671 8037406 -16494726 -22063758 1275453 16618643 2381659 -10439682
38431a0439682K1831643L7745374J1246527k0244013j9157572J774597Q277386
$$ -10439682 11391961 49137335 60383862 40139849 20982277 22756874 31034260
38424C1034260p306817k5903833k9785951j5899857N163352J4677802K729911
$$ 31034260 23727443 -2176390 -31962341 -47862198 -42698846 -28021044 -25291133
38417b5291133j5753074j5956920K842482J5335785P493270l070477M769567K2863640
$$ -25291133 -41044207 -57001127 -54158645 -38822860 -31329590 -34400067 -29630500 -6766860
38409f766860K5376495N139314j7694779k2330775j0172703K168512M354382R29591
$$ -6766860 18609635 23748949 6054170 -16276605 -26449308 -24280796 -19926414 -18996823
38401a8996823J588199Q493696J4460256J1284892j101053j2563782j1141254
$$ -18996823 -17408624 -8914928 5545328 16830220 15729167 3165385 -7975869
38394g975869K719494J2237310K905212j4780750j4332345R171012K6258839J1484265
$$ -7975869 -5256375 6980935 9886147 -4894603 -19226948 -10055936 16202903 27687168
38386B7687168j9423838l1054561j6864647j505923N5631k135082Q96715L937351
$$ 27687168 8263330 -22791231 -39655878 -41161801 -41106170 -43241252 -42344537 -38407186
38378c8407186N749062J3217994K0169654J0007448j0984618j3389772P928048
$$ -38407186 -32658124 -19440130 729524 10736972 -247646 -13637418 -5709370
38371e709370J8043545n106988l2748549k8750449m207898O256496J575292P275707
$$ -5709370 12334175 7227187 -25521362 -54271811 -58479709 -52223213 -50647921 -43372214
38363d3372214K3908141K5236287O231665o705085N01612R607389L949249o611965
$$ -43372214 -19464073 5772214 12003879 5298794 5800406 15407795 19357044 12745079
38355A2745079p711788l681132m062589n465885j726996J663390k585273q925849
$$ 12745079 5033291 1352159 -2710430 -8176315 -9903311 -8239921 -10825194 -19751043
38347a9751043o944310J749394N357165j196722q894866o134018N289854J0406048
$$ -19751043 -26695353 -24945959 -19588794 -20785516 -29680382 -35814400 -30524546 -20118498
38339b0118498J084777r248227k537563J4223150J5048247m578468j6633622l611790
$$ -20118498 -19033721 -28281948 -30819511 -16596361 -1548114 -6126582 -22760204 -26371994
38331b6371994J1517025J739675j8309839j4728006J0768723K4135861J2647696
$$ -26371994 -14854969 -13115294 -31425133 -46153139 -35384416 -11248555 1399141
38324A399141m19085K724263J1382905J2387478R442379N985353m969621k1290540
$$ 1399141 980056 3704319 15087224 27474702 36917081 42902434 37932813 16642273
38316A6642273k4817268p805608J2040296J5320709M207196p640389j3021635
$$ 16642273 -8174995 -15980603 -3940307 11380402 15587598 7947209 -5074426
38309e074426j0637143j807848M706680p95159j2359867j3982448m899475k80397
$$ -5074426 -15711569 -17519417 -12812737 -13607896 -25967763 -39950211 -44849686 -45130083
38301d5130083l702437j968915P092583P397607n238697j1660616j064134J0880386
$$ -45130083 -48832520 -50801435 -43708852 -36311245 -41549942 -53210558 -54274692 -43394306
38293d3394306J0646228Q930878J6730514K3458740J8924276J4052198J7334555
$$ -43394306 -32748078 -23817200 -7086686 16372054 35296330 49348528 66683083
38286F6683083J2970669j1548934l5877030l3844337j4427011n936475j1962353
$$ 66683083 79653752 68104818 32227788 -1616549 -16043560 -21980035 -33942388
38279c3942388j4039662q816455r559354j3827014j795096K8893259N2315477
$$ -33942388 -47982050 -56798505 -66357859 -80184873 -81979969 -53086710 -771233
38272g71233M5829175J5391304j4999499k6609645j8555849p638654j1983356
$$ -771233 45057942 60449246 45449747 18840102 284253 -7354401 -19337757
38265a9337757k6352833k4366868L324577K9439795K6935388Q198513K623340
$$ -19337757 -45690590 -70057458 -66732881 -37293086 -10357698 -2159185 464155
38258D64155J0712156J0957032N03753n428904p411739j8793196l1912794k4680744
$$ 464155 11176311 22133343 22637096 17208192 9796453 -8996743 -40909537 -65590281
38250f5590281j866156P842479p3132J52616J5090926J8187176P7947q478749
$$ -65590281 -67456437 -59613958 -59687090 -59534474 -44443548 -26256372 -26178425 -34657174
38242c4657174J2566213L5092846K5834252j868260j1371682L286039J7542056
$$ -34657174 -22090961 13001885 38836137 36967877 25596195 28882234 46424290
38235D6424290J4895167k186261k6158780m3560928l4038385L172656L3575206
$$ 46424290 61319457 59133196 32974416 -10586512 -44624897 -41452241 -7877035
38228g877035K5183132p559231k3952000j2091524M388500P979781N265039M097115
$$ -7877035 17306097 9746866 -14205134 -26296658 -21908158 -13928377 -8663338 -4566223
38220d566223J694274m83745N317303J4672602J1774014n166936j7852762j3002400
$$ -4566223 -2871949 -3355694 1961609 16634211 28408225 23241289 5388527 -7613873
38212g613873K807224J7334335K4771507J9855089j318967k7174514l4298298
$$ -7613873 -4806649 12527686 37299193 57154282 55835315 28660801 -5637497
38205e637497j5274846R624845J7110098O339098p141425j1365635m043644J0529550
$$ -5637497 -20912343 -11287498 5822600 12161698 5020273 -6345362 -10389006 140544
38197A40544K1594390J7317924j235458j7522088j7537444m903569O781494R752959
$$ 140544 21734934 39052858 37817400 20295312 2757868 -2145701 4635793 14388752
38189A4388752M942095l710782j0625286r019654K829098J6769373J9795204M436526
$$ 14388752 19330847 15620065 4994779 -4024875 -1195777 15573596 35368800 39805326
38181C9805326k3496872m4381832l7188554j562731L4957440M2519911K1147376
$$ 39805326 16308454 -28073378 -65261932 -66824663 -31867223 10652688 31800064
38174C1800064k942445j0758308n985199J753137R765024J3429576L871198j4943541
$$ 31800064 28857619 18099311 12114112 13867249 23632273 37061849 40933047 25989506
38166B5989506k2839161r541928R620996J6757529J5848422J8584316J9561678
$$ 25989506 3150345 -6391583 3229413 19986942 35835364 54419680 73981358
38159G3981358O252226j5050773k5348405k1075472j5265231j2662075n573504
$$ 73981358 80233584 65182811 39834406 18758934 3493703 -9168372 -14741876
38152a4741876M178938K300666j1811293j6969199p17847J8468020J5109206q046692
$$ -14741876 -10562938 -8262272 -20073565 -37042764 -37760611 -19292591 -4183385 -12230077
38144a2230077k5200315k2112158r200706n98718M559388J3429237K1626323J5383644
$$ -12230077 -37430392 -59542550 -68743256 -69341974 -64782586 -51353349 -29727026 -14343382
38136a4343382p796693k9087567k6899659l862366J4697152J2822264L209272
$$ -14343382 -22140075 -51227642 -78127301 -81989667 -67292515 -54470251 -51260979
38129e1260979M905432J3410256J1381514K392443Q006518K7728465L0226233
$$ -51260979 -46355547 -32945291 -21563777 -19171334 -11164816 16563649 46789882
38122D6789882p2974l2022682k8180420P22831J2601526k886995j3166308K197514
$$ 46789882 46716908 14694226 -13486194 -12763363 -161837 -3048832 -16215140 -14017626
38114a4017626K0426598J4935503l694489j0485889q112238j5343469k5851524
$$ -14017626 6408972 21344475 17649986 7164097 -948141 -16291610 -42143134
38107d2143134j4308002J6119188K8012876M780427j8569955l735252L2581426
$$ -42143134 -56451136 -40331948 -12319072 -7538645 -26108600 -29843852 2737574
38100B737574M0349031P915657k2714461j8197012R97009k117040k2168344k1440956
$$ 2737574 43086605 51002262 28287801 10090789 11087798 8970758 -13197586 -34638542
38092c4638542Q918693L1911318J8121405j1501283j7240462J906054R754390
$$ -34638542 -25719849 6191469 24312874 12811591 -4428871 -2522817 7231573
38085G231573j1869441l7001480l3271214m541128K0019021K5720652K1564391
$$ 7231573 -4637868 -41639348 -74910562 -79451690 -59432669 -33712017 -12147626
38078a2147626J5953558N161829j0157753j5254093K36815K3290608K8982419
$$ -12147626 3805932 8967761 -1189992 -16444085 -16207270 7083338 36065757
38071C6065757R134436j7889677k6429585r705652J2955486J5795379l715621
$$ 36065757 45200193 27310516 880931 -8824721 4130765 19926144 16210523
38064A6210523j8947477o638263J8703433K0022731j0279590l5757773k5765887
$$ 16210523 -2736954 -9375217 9328216 29350947 19071357 -16686416 -42452303
38057d2452303K179156J2196591L623378K786190J2280486Q535269r153705j0381217
$$ -42452303 -40273147 -28076556 -24453178 -21666988 -9386502 -851233 -10004938 -20386155
38049b0386155J2127349K2302164J93344j7194045P446867M5100072L9530383
$$ -20386155 -8258806 14043358 14236702 -2957343 4489524 49589596 89119979
38042H9119979m787166k8646330q641810J3858456M522778j6044742j9178644
$$ 89119979 84332813 55686483 47044673 60903129 65425907 49381165 30202521
38035C0202521j6314921k6540486l2931914j2262060J6892519J8779394j723199
$$ 30202521 13887600 -12652886 -45584800 -57846860 -40954341 -22174947 -23898146
38028b3898146p902294R400173K1773005J2678572r17057l039762j761704o552731
$$ -23898146 -31800440 -22400267 -627262 12051310 11134253 8094491 6332787 -219944
38020b19944r876496m512387K455064M970080Q444875J4104134J1090627m108447
$$ -219944 -10096440 -14608827 -12153763 -7183683 1261192 15365326 26455953 22347506
38012B2347506j6395765j2148347K322673J1773203R323804l636668k0589807
$$ 22347506 5951741 -6196606 -3873933 7899270 17223074 13586406 -7003401
38005g003401k7460131j3853200P393056J1097984l294537q651829O610527J9407747
$$ -7003401 -34463532 -48316732 -40923676 -29825692 -33120229 -41772058 -35161531 -15753784
37997a5753784J1619456j15842K452648M263204j2779020k7927356j0250931K4726671
$$ -15753784 -4134328 -4250170 -1797522 2465682 -10313338 -38240694 -48491625 -23764954
37989b3764954L1064269K136608j8603880l436844K1460656J8709251r080286
$$ -23764954 7299315 9435923 -9167957 -12604801 8855855 27565106 18484820
37982A8484820k9316044k1742093L700694J9300626M058830l1785354m8427505
$$ 18484820 -10831224 -32573317 -28872623 -9571997 -5513167 -37298521 -85726026
37975h5726026k1010749K2797900L6201290J8927085J2329383K7646405K6254992
$$ -85726026 -106736775 -83938875 -47737585 -28810500 -16481117 11165288 37420280
37968C7420280j1659357m5659767l4242403K261436J7306709Q051814O330829
$$ 37420280 25760923 -19898844 -54141247 -51879811 -34573102 -26521288 -20190459
37961b0190459J9460900K5217849J6034340O429971P94685q491130j4134095k496056
$$ -20190459 -729559 24488290 40522630 46952601 47747286 39256156 25122061 22626005
37953B2626005J2359371J351623l0671928m6320320l1190715j0909744n311094
$$ 22626005 34985376 36336999 5665071 -40655249 -71845964 -82755708 -88066802
37946h8066802l909713J573806k12462p716768M626959M0342406N8799781K9968836
$$ -88066802 -91976515 -90402709 -90615171 -98331939 -93704980 -53362574 5437207 35406043
37938C5406043j7270302l4820425j9685176l291107L450202J4267911K8288862
$$ 35406043 18135741 -16684684 -36369860 -39660967 -36210765 -21942854 6346008
37931F346008K7670642J2500822K148187P1528r696222k6728473k7564606n000099
$$ 6346008 34016650 46517472 48665659 48737187 39040965 12312492 -15252114 -20252213
37923b0252213J4719853Q719400j0999999j8656421r594842J959156O636040N545175
$$ -20252213 -5532360 3187040 -7812959 -26469380 -36064222 -34105066 -27469026 -21923851
37915b1923851R49304m803206o284906j470276K998756J246722j377246M830278
$$ -21923851 -20974547 -25777753 -32062659 -33532935 -30534179 -29287457 -30664703 -25834425
37907b5834425J9022474K8318439K1433268J479607j4766974j2080874N914515
$$ -25834425 -6811951 21506488 42939756 44419363 29652389 17571515 23486030
37900B3486030J8117745J0038456q185936j6530659j2542376j0228563j3667759
$$ 23486030 41603775 51642231 43456295 26925636 14383260 4154697 -9513062
37893i513062r619999Q473909K5292665K3159210O531626m395553N24715J1250692
$$ -9513062 -19133061 -10659152 14633513 37792723 44324349 39928796 40453511 51704203
37885E1704203J1572332k365738j7954908k0288395j1109408q021407j8567465
$$ 51704203 63276535 60910797 42955889 22667494 11558086 3536679 -15030786
37878a5030786k3640915k044921L2802058M2136395J2152732k5384854l3241627
$$ -15030786 -38671701 -40716622 -7914564 34221831 46374563 20989709 -12251918
37871a2251918j2633022O439310N706878o044680j0585728M30036J9892855L0327361
$$ -12251918 -24884940 -18445630 -12738752 -18783432 -29369160 -28939124 -9046269 21281092
37863B1281092J9564465l101509j4860353q562299j255816n882246j0643164p03403
$$ 21281092 40845557 37744048 22883695 14321396 13065580 7183334 -3459830 -4163233
37855d163233J4277073J3676186k601273j5994134j6332177q147138M108635J6562438
$$ -4163233 10113840 23790026 21188753 5194619 -11137558 -19284696 -15176061 1386377
37847A386377J5910490p620759l6391624l7573845n412964K8450510L5240665
$$ 1386377 17296867 9676108 -26715516 -64289361 -69702325 -41251815 -6011150
37840f011150K2033944J3358544J4803601J1128046n460026k0430040j4392867
$$ -6011150 16022794 29381338 44184939 55312985 49852959 29422919 15030052
37833A5030052J0063841K5481886R040619k5859251l8889631j1026421K8279623
$$ 15030052 25093893 50575779 59616398 33757147 -5132484 -16158905 12120718
37826A2120718L6393924J0508769j4524905j6352770q414271r642918j5203415
$$ 12120718 48514642 59023411 44498506 28145736 19731465 10088547 -5114868
37819e114868j0092909M830952J5622468J5162040P959406j39095p894444j6000559
$$ -5114868 -15207777 -10376825 5245643 20407683 28367089 28227994 20333550 4332991
37811D332991k2759024k2021209q231293J1725334J8126846J175044k0739167
$$ 4332991 -18426033 -40447242 -48678535 -36953201 -18826355 -17651311 -38390478
37804c8390478k0332926L778981K7681681L4877688K9350911J7502832K1574j5586776
$$ -38390478 -58723404 -54944423 -27262742 7614946 36965857 54468689 54490263 38903487
37796C8903487j7835582j1686754j2933316j7894860o441586J7676472K2555219
$$ 38903487 21067905 9381151 -3552165 -21447025 -27888611 -10212139 12343080
37789A2343080j391787k1053677j2316785K350110k497382p779202J3492775L9071516
$$ 12343080 10951293 -10102384 -22419169 -20069059 -22566441 -30345643 -16852868 22218648
37781B2218648K6641658j4723804l4158096j5724658N135306M987075J817034
$$ 22218648 48860306 34136502 -21594 -15746252 -10610946 -5623871 -3806837
37774c806837R384770J0565870k951645p392266R747211K0731318L783805j4921323
$$ -3806837 5577933 16143803 13192158 5799892 15547103 36278421 40062226 25140903
37766B5140903l459145J8538383R438960k4565483l8208628k0690005r853828
$$ 25140903 21681758 40220141 49659101 25093618 -13115010 -33805015 -43658843
37759d3658843k3981681k8124856O092689M6093999M2767728O729192n200024
$$ -43658843 -67640524 -95765380 -89672691 -43578692 -810964 5918228 718204
37752G18204K4294907M5993363J7937978l0275538l7568671M461670M3332202
$$ 718204 25013111 71006474 88944452 58668914 21100243 25561913 68894115
$$ [...]
##END NTUPLES=NMR SPECTRUM
##END=
