##TITLE=31Pdec_LR-580-R2H2-CR2
 D2O, 24 sc
 26.12.2019
##JCAMPDX= 6.0         $$ Bruker NMR JCAMP-DX V2.0
##DATA TYPE= NMR SPECTRUM
##DATA CLASS= NTUPLES
##ORIGIN= UXNMR, Bruker Analytische Messtechnik GmbH
##OWNER= root
$$ XWIN-NMR		Version 3.5
$$ Thu Dec 26 13:54:51 2019 Russian Standard Time (UT+4h)  she@DPX200
##.OBSERVE FREQUENCY= 81.013821
##.OBSERVE NUCLEUS= ^31P
##.ACQUISITION MODE= SIMULTANEOUS
##.ACQUISITION SCHEME= undefined
##.AVERAGES= 24
##.DIGITISER RES= 17
##SPECTROMETER/DATA SYSTEM= spect
##.PULSE SEQUENCE= zgpg30
##.SOLVENT NAME= CDCl3
##.SHIFT REFERENCE= (INTERNAL, CDCl3, 0, 182.463)
##AUDIT TRAIL= $$ (NUMBER, WHEN, WHO, WHERE, WHAT)
$$ ##TITLE= Audit trail, XWIN-NMR		Version 3.5
$$ ##JCAMPDX= 5.01
$$ ##ORIGIN= Bruker BioSpin GmbH
$$ ##OWNER= she
$$ F:/spectra/data/she/nmr/P31/1/pdata/1/auditp.txt
$$ ##AUDIT TRAIL=  $$ (NUMBER, WHEN, WHO, WHERE, WHAT)
(   1,<2019-12-26 13:51:06.48 +0400>,<she>,<DPX200>,
      <created by zg, POWCHK disabled, PULCHK disabled
       configuration hash MD5:
       00 E9 B6 7A A2 85 ED C7 34 08 36 98 17 FE 4E 26
       data hash MD5: 32K
       6C 30 40 1F D6 BA 28 63 81 91 E8 35 C6 BE F5 A9>)
(   2,<2019-12-26 13:52:40.95 +0400>,<she>,<DPX200>,
      <Start of raw data processing
       efp BC_mod = 2 LB = 1 FT_mod = 6 PKNL = 1 PHC0 = -1668.995 PHC1 = 95.00119 SI = 64K 
       data hash MD5: 64K
       4C AA EB 09 88 99 98 E6 E4 4D BA 3C 7A 53 D1 01>)
(   3,<2019-12-26 13:53:03.62 +0400>,<she>,<DPX200>,
      <pk PHC0 = -11.97698 PHC1 = -41.4 
       data hash MD5: 64K
       CC 59 31 7B 45 54 D8 05 56 CC BC 87 89 CE 90 3B>)
(   4,<2019-12-26 13:53:11.04 +0400>,<she>,<DPX200>,
      <abs ABSG = 5 
       data hash MD5: 64K
       0B 10 28 B5 9E 88 99 2B CB 6D 3D 01 9D 50 18 96>)
$$ ##END=
$$ 
$$ hash MD5
$$ 9B 84 2B B4 A0 40 06 87 FD A3 F9 D8 4C 8B 79 EF
##$RELAX= 
##$RELAX= 
##$RELAX= 
##$RELAX= 
##$RELAX= 
##$RELAX= 
##$RELAX= 
##$RELAX= 
$$ Bruker specific parameters
$$ --------------------------
##$DU= <F:/spectra>
##$EXPNO= 1
##$NAME= <P31>
##$PROCNO= 1
##$TYPE= <nmr>
##$USER= <she>
##$AMP= (0..31)
100 100 100 100 100 100 100 100 100 100 100 100 100 100 100 100 100 100 
100 100 100 100 100 100 100 100 100 100 100 100 100 100 
##$AQSEQ= 0
##$AQ_mod= 1
##$AUNM= <au_zg>
##$AUTOPOS= <>
##$BF1= 81.014009
##$BF2= 200.13
##$BF3= 200.13
##$BF4= 200.13
##$BF5= 200.13
##$BF6= 200.13
##$BF7= 200.13
##$BF8= 200.13
##$BYTORDA= 1
##$CFDGTYP= 0
##$CFRGTYP= 5
##$CHEMSTR= <none>
##$CNST= (0..31)
1 1 145 1 1 1 1 1 1 1 1 1 1 1 1 1 1 1 1 1 1 1 1 1 1 1 1 1 1 1 1 1 
##$CPDPRG= <waltz16>
##$CPDPRG1= <>
##$CPDPRG2= <waltz16>
##$CPDPRG3= <>
##$CPDPRG4= <mlev>
##$CPDPRG5= <mlev>
##$CPDPRG6= <mlev>
##$CPDPRG7= <mlev>
##$CPDPRG8= <mlev>
##$CPDPRGB= <>
##$CPDPRGT= <>
##$D= (0..31)
0 1 0 0 0 0 0 0 0 0 0 0.03 2e-05 3e-06 0 0 0 0 0 0 0 0 0 0 0 0 0 0 0 0 
0 0 
##$DATE= 1577353865
##$DBL= (0..7)
120 120 120 11 120 120 24 19 
##$DBP= (0..7)
150 150 150 150 150 150 150 150 
##$DBP07= 0
##$DBPNAM0= <>
##$DBPNAM1= <>
$$ [...]
##$SUBNAM3= <"">
##$SUBNAM4= <"">
##$SUBNAM5= <"">
##$SUBNAM6= <"">
##$SUBNAM7= <"">
##$SUBNAM8= <"">
##$SUBNAM9= <"">
##$SW= 369.568048894756
##$SWIBOX= (0..15)
0 1 3 0 0 0 0 0 0 0 0 0 0 0 0 0 
##$SW_h= 29940.119760479
##$TD= 32768
##$TD0= 1
##$TE= 0
##$TE2= 300
##$TE3= 300
##$TEG= 300
##$TL= (0..7)
0 120 53 12 22 120 120 120 
##$TP= (0..7)
150 150 150 150 150 150 150 150 
##$TP07= 0
##$TPNAME0= <>
##$TPNAME1= <>
##$TPNAME2= <>
##$TPNAME3= <>
##$TPNAME4= <>
##$TPNAME5= <>
##$TPNAME6= <>
##$TPNAME7= <>
##$TPOAL= (0..7)
0.5 0.5 0.5 0.5 0.5 0.5 0.5 0.5 
##$TPOFFS= (0..7)
0 0 0 0 0 0 0 0 
##$TUNHIN= 0
##$TUNHOUT= 0
##$TUNXOUT= 0
##$USERA1= <user>
##$USERA2= <user>
##$USERA3= <user>
##$USERA4= <user>
##$USERA5= <user>
##$V9= 5
##$VALIST= <valist>
##$VCLIST= <CCCCCCCCCCCCCCC>
##$VD= 0
##$VDLIST= <DDDDDDDDDDDDDDD>
##$VPLIST= <PPPPPPPPPPPPPPP>
##$VTLIST= <TTTTTTTTTTTTTTT>
##$WBST= 1024
##$WBSW= 4
##$XGAIN= (0..3)
0 0 0 0 
##$XL= 0
##$YL= 0
##$YMAX_a= 23365
##$YMIN_a= -21853
##$ZGOPTNS= <>
##$ZL1= 120
##$ZL2= 120
##$ZL3= 120
##$ZL4= 120
##$ABSF1= 182.463
##$ABSF2= -187.1042
##$ABSG= 5
##$ABSL= 3
##$ALPHA= 0
##$AQORDER= 0
##$ASSFAC= 0
##$ASSFACI= 0
##$ASSFACX= 0
##$ASSWID= 0
##$AUNMP= <proc_1d>
##$AZFE= 0.1
##$AZFW= 0.5
##$BCFW= 0
##$BC_mod= 2
##$BYTORDP= 0
##$COROFFS= 0
##$CY= -3
##$DATMOD= 1
##$DC= 0
##$DFILT= <>
##$DTYPP= 0
##$F1P= 0
##$F2P= 0
##$FCOR= 1
##$FTSIZE= 65536
##$FT_mod= 6
##$GAMMA= 0
##$GB= 0
##$INTBC= 1
##$INTSCL= 5.30512e-09
##$ISEN= 30
##$LB= 1
##$LEV0= 0
##$LPBIN= 0
##$MAXI= 10000
##$MC2= 0
##$MEAN= 0
##$ME_mod= 0
##$MI= 50
##$NCOEF= 0
##$NC_proc= -8
##$NLEV= 6
##$NOISF1= 182.463
##$NOISF2= 159.3651
##$NSP= 0
##$NTH_PI= 0
##$NZP= 0
##$OFFSET= 182.463
##$PC= 4
##$PHC0= -1680.972
##$PHC1= 53.60119
##$PH_mod= 1
##$PKNL= yes
##$PPARMOD= 0
##$PSCAL= 0
##$PSIGN= 0
##$REVERSE= no
##$SF= 81.0140089999434
##$SI= 65536
##$SIGF1= 159.3651
##$SIGF2= -187.1042
##$SINO= 113.3802
##$SIOLD= 16384
##$SREGLST= <1H.CDCl3>
##$SSB= 0
##$STSI= 65536
##$STSR= 0
##$SW_p= 29940.119760479
##$SYMM= 0
##$S_DEV= 0
##$TDeff= 32768
##$TDoff= 0
##$TI= <>
##$TILT= no
##$TM1= 0
##$TM2= 0
##$TOPLEV= 0
##$USERP1= <user>
##$USERP2= <user>
##$USERP3= <user>
##$USERP4= <user>
##$USERP5= <user>
##$WDW= 1
##$XDIM= 65536
##$YMAX_p= 469599038
##$YMIN_p= -98917956
$$ End of Bruker specific parameters
$$ ---------------------------------
##NTUPLES= NMR SPECTRUM
##VAR_NAME=  FREQUENCY,     SPECTRUM/REAL,   SPECTRUM/IMAG
##SYMBOL=    X,             R,               I
##VAR_TYPE=  INDEPENDENT,   DEPENDENT,       DEPENDENT
##VAR_FORM=  AFFN,          ASDF,            ASDF
##VAR_DIM=   65536,         65536,           65536
##UNITS=     HZ,            ARBITRARY UNITS, ARBITRARY UNITS
##FACTOR=    0.456856943014862, 1,           1
##FIRST=     14782.0589164792, 0,            0
##LAST=      -15158.0608439998, 0,           0
##MIN=       -15158.0608439998, -98917956,   0
##MAX=       14782.0589164792, 469599038,    0
$$ Real data points
##PAGE= N=1
##DATA TABLE= (X++(R..R)), XYDATA
$$ [...]
44738 -8231371 -9518389 -1537493 7293193 8600296 4401551 986584 -545340 -2039930
44730 -2039930 -2449609 -620547 251450 -3060737 -8176149 -10862105 -11270599 -11795167 -12363703
44721 -12363703 -12762012 -15588485 -21192132 -23655923 -18515459 -11196193 -10444813 -15694474
44713 -15694474 -18471125 -14849982 -8927378 -4558757 -1125602 2093786 4009089 4953084
44705 4953084 6216489 6257373 3043635 -132968 2441169 9885056 14872098 13364515
44697 13364515 8192019 2723014 -2210573 -4276444 -44186 8050239 11508995 5604671
44689 5604671 -5403688 -14714720 -19504275 -19592952 -15574870 -10555137 -8310978 -7587160
44681 -7587160 -3527277 3635195 7526113 5327971 1873982 1334339 1658907 685359 750094
44672 750094 2874679 3117628 -188864 -1888169 1728689 6080175 5791314 3298670 3233225
44663 3233225 3669944 805357 -2179667 271454 5512134 5570085 -755129 -6893376 -9042349
44654 -9042349 -9771252 -10725119 -9433731 -5352675 -2805878 -5085977 -9818509 -12397524
44646 -12397524 -11080274 -7498342 -4638996 -4753837 -7095294 -8246214 -6880306 -6442452
44638 -6442452 -9834038 -13514256 -11440459 -3591698 4257236 8468029 10306646 11211920
44630 11211920 10481384 8149678 5686898 3251616 16077 -2979155 -4345663 -5993663
44622 -5993663 -10399063 -14886965 -14377519 -9779257 -7352935 -9030451 -10033897 -7580309
44614 -7580309 -4889691 -4043515 -2138505 1750334 3160172 1061831 2982051 13943543
44606 13943543 25924613 27226190 18745433 11394566 9243217 5768461 -2354725 -8447166
44598 -8447166 -6961877 -2610407 -2277039 -4591147 -4694745 -4137935 -7457065 -11887883 -9944066
44589 -9944066 -2128122 1979982 -2547180 -9408900 -12057601 -13501692 -18901272 -24597972
44581 -24597972 -23092404 -15850201 -12127053 -15250083 -18200095 -14505176 -6640131 -858267
44573 -858267 688879 -479965 -2786477 -4470157 -3684616 -1662399 -2207215 -5488346 -6510359
44564 -6510359 -2903222 131903 -3140581 -10598949 -15389044 -14493854 -9844926 -3817220
44556 -3817220 1580161 3446233 926182 -2256999 -2500263 -1504809 -2583391 -4657117
44548 -4657117 -5114661 -5717206 -9280659 -12805151 -11194207 -6427766 -5243940 -8270164
44540 -8270164 -9847419 -8990786 -11069389 -16176092 -15622413 -5515393 4159069 1551637
44532 1551637 -10873866 -19660221 -17263106 -9025634 -4281991 -6076203 -10158098 -10532958
44524 -10532958 -5282758 1456523 3588064 -283141 -5957565 -9657155 -11414631 -11185445
44516 -11185445 -6461576 2465653 8893192 6821428 -206018 -2595850 3578589 12863330
44508 12863330 18191860 17940835 14681542 11050143 8563897 7646332 6865797 3772390
44500 3772390 -2150857 -8527775 -12869317 -15048207 -16212535 -16584363 -15652725 -13785254
44492 -13785254 -12090767 -10600432 -7939665 -3582683 609495 2564544 3115988 4687595
44484 4687595 6622512 4833768 -2086849 -9252390 -11151231 -8921643 -8023026 -9868721
44476 -9868721 -10338470 -6405456 524788 8474269 17020837 23762349 23536716 14610028
44468 14610028 2620038 -4705680 -4709798 108238 6075318 9872282 9011395 4049203
44460 4049203 -1358765 -4800373 -7402383 -10016030 -10274166 -6186579 384005 6954524
44452 6954524 13878381 20746598 22840172 16766704 7582829 4020359 6912938 8336083
44444 8336083 3198795 -3924398 -5948700 -2806337 -307099 -2051761 -6039044 -8445970
44436 -8445970 -7784662 -4779721 -173927 5451418 9777880 8870544 1427206 -7849761
44428 -7849761 -12255517 -11116702 -10565261 -14566156 -18510539 -15024473 -4086669 6245640
44420 6245640 8460062 2373168 -5754899 -8693307 -4200114 2285399 2673395 -3845159
44412 -3845159 -8647889 -4698311 3586045 6524678 2584792 -994894 150449 2742899
44404 2742899 3615054 4724565 7406703 8003144 3654263 -2253686 -5097153 -5766622 -7505364
44395 -7505364 -8940806 -5894006 1121634 6607698 7512769 6486624 6764950 7710047 7382612
44386 7382612 6688417 8208447 11989852 14890200 14286211 10932398 7500525 5304603
44378 5304603 3726823 2597277 3329648 6649213 10550807 12302219 11747962 10624760
44370 10624760 9205420 6413818 3420875 3679850 7739713 11099551 10050626 7395015
44362 7395015 8671356 13903065 17488821 16624675 15242799 17318471 20129759 18223746
44354 18223746 11920264 6880787 5394794 3306236 -2440449 -7820275 -7288141 -2468257
44346 -2468257 -380979 -3859783 -8384287 -8855878 -5446673 -1697697 -477772 -3104462
44338 -3104462 -8731508 -12749952 -9587917 85529 8134319 8123985 2876653 -721385
44330 -721385 -1557468 -3845057 -8309861 -9855605 -5393064 486025 501846 -6578998 -14408374
44321 -14408374 -15776294 -9747848 -1955613 1831221 1283248 -542730 -3095682 -8052507
44313 -8052507 -13083471 -11793617 -3162005 4161945 2285114 -5027975 -8006084 -4427141
44305 -4427141 -417607 261704 -563271 -2627239 -8585357 -16226647 -17819351 -11135785
44297 -11135785 -3876446 -2265116 -1801169 4407496 13388820 15953280 9770926 1533968
44289 1533968 -2885705 -3940633 -4082070 -3944561 -4186289 -6304517 -9525809 -10387701 -7608805
44280 -7608805 -4799338 -6076887 -10702018 -14265554 -14267373 -12385023 -11239241 -10760033 -8759882
44271 -8759882 -4177703 1614926 6564967 9569823 10137708 8129096 4648688 1414133
44263 1414133 -1885578 -7343300 -14142725 -16980723 -12554924 -5244380 -1814009 -2082824
44255 -2082824 -205266 5556882 10511278 11449163 10475957 9314363 6278865 1785757
44247 1785757 527939 3908496 5896611 1651418 -4403955 -5061051 -1182636 490526
44239 490526 -1899680 -3470989 -890091 3336540 5373523 4544517 2887122 3349050 7898923
44230 7898923 14417571 16730541 11265168 2378256 -2635888 -2301724 -672191 -171663
44222 -171663 167849 618342 541659 1581149 5101646 6738680 452858 -10748913 -15280478
44213 -15280478 -7362038 4912070 9799519 5314599 -1887295 -6548654 -8103803 -6667906
44205 -6667906 -1952428 3896957 7100746 6893115 6206429 6695849 5762199 440917 -7064940
44196 -7064940 -10151754 -5079190 3563350 6606900 196199 -9637761 -13568642 -8636867
44188 -8636867 340371 7082965 8657571 5431305 141163 -3174723 -2927182 -2754729
44180 -2754729 -7086242 -14135190 -17527326 -14925865 -9935903 -4917107 1542667 7689022
44172 7689022 6576312 -3637510 -13435729 -13309277 -7215394 -6256393 -11347439 -12005464
44164 -12005464 -3053457 7288574 9891988 7044828 6015392 6412536 2299072 -5807297
44156 -5807297 -9849945 -6101244 -901731 -1357461 -5567333 -6670130 -3436316 -1470158
44148 -1470158 -4536279 -9608305 -11967098 -11661626 -12291000 -15231094 -17935704 -17706444 -14912798
44139 -14912798 -11795257 -9422181 -6978701 -3837802 -1364239 -1804871 -5280470 -8850463
44131 -8850463 -9555212 -7734880 -5811698 -4247469 -1175904 3374726 5729848 3100213
44123 3100213 -2123760 -5264189 -5353413 -5310565 -6564891 -6728644 -3617770 719289 1753570
44114 1753570 -2412773 -8753771 -12264248 -11053542 -8050286 -6814002 -6405483 -3126531
44106 -3126531 2238999 3216747 -3105973 -9354459 -6099785 4663410 10770317 5435516
44098 5435516 -4539902 -8627706 -5406339 -1654403 -2421583 -6585284 -10336968 -11066159
44090 -11066159 -8647078 -5747746 -5911729 -9189895 -11486330 -10628505 -10306762 -14048978
44082 -14048978 -17929722 -15239383 -7546071 -4007499 -7838246 -10331459 -3057343 9016221
44074 9016221 13257251 6083020 -3059597 -4907581 -1104492 1088488 -419649 -1917589
44066 -1917589 -1313484 -798392 -2306168 -4607050 -5837699 -5881433 -5358445 -4779917 -5248015
44057 -5248015 -7301321 -8706858 -6799057 -3689077 -4757038 -10076575 -12254398 -6490315
44049 -6490315 1642822 3594855 -513386 -3900891 -4353048 -5985043 -10272574 -13011132
44041 -13011132 -11751082 -9396872 -7883197 -4736486 377414 1603208 -5322509 -15255012
44033 -15255012 -19050018 -14337396 -6185475 807272 6058336 9794126 11248820 10499778
44025 10499778 8832942 6980634 5166178 4288410 4820297 5467571 5233808 5546610 7685985
44016 7685985 9561478 8362288 5374978 4535570 6664486 8683128 8286198 5719584
44008 5719584 1025123 -6202868 -13456232 -16053396 -13341322 -10615168 -12209690 -15689982
44000 -15689982 -16201193 -14052684 -13365808 -14064675 -10726799 -1491150 6298326 3860628
43992 3860628 -7340217 -16650555 -17247329 -13023109 -10405129 -8803373 -4458089 105150
43984 105150 -1646528 -9006724 -13180401 -10017421 -6350253 -9377655 -15930544 -18143933
43976 -18143933 -15037447 -11596586 -9681676 -7490721 -6285271 -9367714 -14014618 -12519452
43968 -12519452 -3825164 2703217 -920817 -10891751 -17403845 -16782203 -12724782 -8158337
43960 -8158337 -1917818 6289281 12500351 12366636 6276132 -1135738 -5488283 -5384606
43952 -5384606 -1726434 3467002 7140995 6265912 803246 -5324224 -8316325 -8753836
43944 -8753836 -9193152 -8735893 -4731596 -90714 -2406797 -12520734 -20111776 -16535918
43936 -16535918 -7363607 -4584881 -9281619 -10994170 -4017684 4730140 6562703 2298650
43928 2298650 -1168603 -242917 3080183 4297520 -732637 -11716554 -20579418 -17451157
43920 -17451157 -3188896 9240281 9872430 3319857 488773 3526919 5425108 1509066
43912 1509066 -5681120 -12028018 -16186248 -17837146 -16248136 -11592189 -5118578 1626584
43904 1626584 5702546 3129751 -5974363 -14575187 -15588840 -10413854 -6162789 -5707633
43896 -5707633 -5821147 -4549658 -4180296 -5809227 -6721179 -5377085 -4196701 -4814604 -4839175
43887 -4839175 -2344470 55136 -968092 -4295306 -6361802 -6209859 -5374739 -4407665 -2629023
43878 -2629023 -195944 2376795 5710200 9730288 11218762 6601150 -2407950 -8781572
43870 -8781572 -7189397 413978 7299891 9125229 7429729 6229899 6425093 4953704
43862 4953704 -282034 -6425885 -8662669 -6525931 -4390650 -5131405 -6263669 -4138704
43854 -4138704 583932 4299109 5480578 5163219 3304535 -1858893 -10338551 -18830976
43846 -18830976 -23479568 -22712256 -17336977 -9687897 -2699982 2145566 5986632 9863341
43838 9863341 11705778 9236140 5240129 5100483 8192054 7470538 595617 -4393401
43830 -4393401 47568 9115993 12042291 7398395 3326030 3337423 1769074 -4391135
43822 -4391135 -8821566 -6272431 -1714299 -2105883 -5229963 -4813455 -2002573 -2382312 -4278366
43813 -4278366 -122560 10623927 19292316 20247834 16942504 13731149 10128318 6474861
43805 6474861 6849254 11236023 12292724 6274635 706408 3692839 10935126 12109121
43797 12109121 6586625 3339662 6635753 11258785 12552974 12404057 12814429 11140872
43789 11140872 5541129 -592286 -3668476 -5055196 -7592179 -10635202 -12073181 -12177980
43781 -12177980 -12100843 -11161704 -8684011 -6080314 -4305409 -1854240 1746371 3302831
43773 3302831 465890 -3626339 -4427108 -2759334 -2867491 -4980870 -4989259 -1457600 2076180
43764 2076180 2770700 1949223 1382220 263953 -1986054 -3692582 -4373426 -6748636 -11845864
43755 -11845864 -15010143 -11254214 -3016226 2161865 1449969 -348829 1433105 4945085
43747 4945085 5503692 2505388 -434664 -668346 982043 2332379 2232112 917520 -433404
43738 -433404 -362086 1682832 4743564 7214448 7777110 5558361 936844 -3372170 -4235340
43729 -4235340 -2305863 -1899728 -4881262 -7553455 -6586771 -4986983 -7461860 -12079161
43721 -12079161 -12778167 -9539505 -8748603 -11827234 -11027573 -904233 12097493 17494050
43713 17494050 14017314 8541663 4773328 520309 -4587781 -6310263 -2561137 2818294
43705 2818294 5660686 6514048 7485699 7799081 5636654 1830881 -1240797 -2657966 -2450286
43696 -2450286 -19113 4026431 5842745 1754319 -6009483 -9893948 -4941082 5192340
43688 5192340 11764464 10181232 4212367 621042 1412298 3415813 4362377 5539773
43680 5539773 7414828 6862258 2273135 -1612567 949603 7726164 10356147 5620394
43672 5620394 -421136 -1219936 2252657 5070791 5646386 5646144 5714910 5369851 5073175 4573617
43662 4573617 1051352 -6876697 -14658955 -16024938 -11391142 -7411914 -7651990 -8444424
43654 -8444424 -5777989 -1976936 -2257176 -7223751 -12137566 -12422090 -7342301 669342
43646 669342 7663932 9778086 6072785 314921 -2012816 819339 5478621 7823923
43638 7823923 6877437 4109726 569071 -3785963 -8576120 -12186000 -12697377 -9329009
43630 -9329009 -3120956 3612610 8759195 11443898 11579775 9254088 5729695 4287012
43622 4287012 7590355 13550313 16169079 12122866 4772718 -108999 -870623 -71222
43614 -71222 246305 396472 1167077 3213542 7721508 14456289 19654915 19540172 15837209
43605 15837209 13826213 14822444 15300586 14118590 14746827 17887917 17768497 10058438 -1296335
43596 -1296335 -10071778 -16238265 -22510769 -26284007 -22713771 -14168583 -8603873 -8144292
43588 -8144292 -6643338 -280109 6181570 6744661 2301955 -2233473 -4648714 -5423070
43580 -5423070 -4278588 -904240 2570551 3253528 966022 -2065348 -4142405 -5049567
43572 -5049567 -4849487 -3157838 410456 5093627 7974975 5691478 -782915 -4698631
43564 -4698631 -435597 8908289 14758526 13380138 8476031 4000610 329311 -1684412
43556 -1684412 249471 4004393 2816762 -4803053 -10807573 -8634580 -3259316 -3511346
43548 -3511346 -8455570 -9661056 -5261231 -2957653 -7665391 -13583043 -12314798 -4313469
43540 -4313469 2012562 681880 -5822309 -10849848 -11682218 -11715305 -14541212 -17982829 -16780030
43531 -16780030 -10512003 -4758084 -3389405 -4080177 -3615657 -2923715 -3238351 -1953516 2406844
43522 2406844 4920596 641600 -6060243 -5823375 2653423 10951885 12795582 10586915
43514 10586915 8435983 5537250 58658 -5683409 -8353668 -8555176 -8873743 -9583548
43506 -9583548 -9761116 -10423672 -12827854 -14906722 -12993994 -7085939 -1810402 -1618531 -6402920
43497 -6402920 -12139206 -14863254 -13652738 -10240810 -6489820 -3013838 -118889 1588622
43489 1588622 2575860 4630293 7719050 8051781 2248235 -7029014 -12765790 -11445395
43481 -11445395 -6615479 -3836646 -4425273 -5453652 -4177158 -894249 1869250 1952241
43473 1952241 -638426 -4237276 -7429341 -9630059 -10145942 -8785857 -7800847 -10112107
43465 -10112107 -13873126 -12207726 -1711352 11389446 17617183 14993799 9269647 5057367
43457 5057367 1752346 -2157057 -5715902 -7314126 -6304967 -2405678 3428780 7808114
43449 7808114 7947374 5546397 4431520 5319516 6448127 7645325 9129185 8079954
43441 8079954 2146722 -4990756 -7884244 -7876269 -10233278 -14072817 -14187376 -12646960 -17550069
43432 -17550069 -27750176 -30338498 -18841245 -3678075 2678065 1837194 2329540 4544726
43424 4544726 3233051 -825590 -2642971 -2906234 -5554700 -7828496 -3141606 6835427
43416 6835427 12554534 9390771 1742092 -5664340 -11901996 -14727882 -10647472 -2615922
43408 -2615922 631574 -3389439 -6525737 -1635236 7541221 12743777 12291378 10634668
43400 10634668 10389169 10026195 7837940 4195033 575659 -1191694 289816 4164268
43392 4164268 7543924 9020886 10422251 13512019 16516758 15978993 11410520 6368311
43384 6368311 4663140 6273128 7581400 5723477 1712951 -2073693 -6306541 -13199955
43376 -13199955 -20685472 -23080853 -19526399 -16244234 -16592243 -14777700 -5837203 3360659
43368 3360659 2247236 -6951451 -11021693 -4034705 6169209 11571709 14146186 18264050
43360 18264050 21614782 19957068 15047238 11767057 11214878 11224234 10121711 6450318 -662625
43351 -662625 -7434848 -6995689 819917 6982276 5749018 3539370 8453557 16678642
43343 16678642 18403645 13285610 9585025 9640653 7392721 1339979 -1194644 3076395
43335 3076395 5770394 -1225885 -12783733 -17223359 -12250843 -6507104 -6324796 -7947701
43327 -7947701 -4396099 4908848 14114124 17846746 15467783 9529338 2564047 -3817861
43319 -3817861 -7937296 -8062734 -4437965 -569927 -779002 -5777806 -11681266 -14312265
43311 -14312265 -13780124 -13566814 -15403326 -16837114 -14788371 -10102673 -6585833 -5941158
43303 -5941158 -6219611 -6000500 -7153684 -11014619 -14141046 -11736856 -4439140 2476793
43295 2476793 6694527 10944362 16175046 17734360 11881621 2347353 -4101915 -6325603
43287 -6325603 -8414303 -12143425 -14966267 -15522739 -16190618 -18553473 -19987537 -16938843
43279 -16938843 -9416693 -683944 5745644 7844261 6022412 3665202 4533882 7886532
43271 7886532 8214754 2226484 -5428548 -6601289 245468 7371277 6552900 -1415105
43263 -1415105 -8023897 -6994229 -637475 4009874 3188330 -1032198 -4734280 -6130588
43255 -6130588 -5620556 -4431217 -4384556 -7195610 -12172026 -15360231 -12652479 -3975085 6060839
43246 6060839 11471418 9110322 1034711 -6743677 -9286688 -7379007 -5957114 -7563925
43238 -7563925 -9657251 -9445297 -8262778 -8511518 -9020745 -7311851 -4569966 -3745281 -3706929
43229 -3706929 -512641 5387581 8752726 7570066 5779504 5704378 3922678 -1156043
43221 -1156043 -3721570 647447 5260540 452543 -10431866 -13406739 -3588424 7542177
43213 7542177 9130081 5967619 8751564 16274398 17835414 10454935 2794293 1322308
43205 1322308 2371916 949765 -1005094 -40450 1710794 729685 -1187326 -321651 2148882
43196 2148882 2407451 644188 -66446 308428 -551776 -1926960 -719228 3137801 6848223
43187 6848223 9508223 11541312 10423754 3380521 -5485922 -7649122 -1527025 4838580
43179 4838580 4942411 1601744 159182 -201864 -3106566 -7133086 -7410317 -3381172 196262
43170 196262 -183022 -2855513 -3949717 -2028908 463876 -436029 -5770650 -11466657 -12332727
43161 -12332727 -8231800 -3554313 -456988 3487323 9900910 16235419 19800848 21022378
43153 21022378 20366952 16428691 10101112 6265076 7520854 10128805 10036159 8797491
43145 8797491 9054568 8553983 4486340 128375 433705 3487100 3370901 47051 -907075
43136 -907075 1816210 2850038 -929346 -5054471 -3500536 3861765 11791972 15094057
43128 15094057 12696181 8271441 6417776 6703661 3858847 -3679391 -9498126 -8260507
43120 -8260507 -4774461 -6857674 -12365858 -12405418 -6146786 -2222133 -4248182 -5269079
43112 -5269079 -249402 5268080 4793201 1828479 4185040 12033492 18144960 17264789
43104 17264789 10023163 -207200 -9569296 -14225921 -12632010 -7107455 -1320357 2842583
43096 2842583 5294197 6905945 9199596 12104053 11989662 5853850 -2428707 -5163346
43088 -5163346 -1047691 3332543 3682855 3235849 5246171 7175182 6671214 7159518 12046846
43079 12046846 18237030 20851206 20320617 19754038 19220406 17496500 15423608 12867493
43071 12867493 7135643 -450528 -2192336 4911635 11392803 7439108 -1698253 -2876592
43063 -2876592 4836704 8711510 1504804 -8740921 -11149587 -5570530 551689 2501799
43055 2501799 1412419 1525088 7078179 17856121 26102114 22540538 7599568 -7523467
43047 -7523467 -12677602 -7623495 1546505 9126670 11044120 5567031 -3430313 -8521329
43039 -8521329 -7705403 -7183546 -11657154 -16451421 -14121281 -5212700 3146344 6964730
43031 6964730 7873365 7157913 3511138 -2382260 -6124844 -4799452 -755146 1900914
43023 1900914 2252163 1908407 1374879 -48492 -1456440 -486171 2957441 5626531 5341159
43014 5341159 4556345 6781376 10461134 10028627 3535329 -4287576 -8133538 -8075121 -7058648
43005 -7058648 -5369267 -1097643 5486109 11565885 15266943 16775071 16404679 13925850
42997 13925850 9540023 3836606 -2450196 -7347642 -8165609 -5125001 -2331076 -2484755
42989 -2484755 -2781916 739923 6861774 10923118 11116020 8991855 5278954 -191276
42981 -191276 -5232359 -6559362 -4185755 -922730 1782019 3894379 4147923 1739397
42973 1739397 -767693 -1027539 -1620887 -5356664 -7643295 -1188534 11690138 19457864
42965 19457864 15838745 6779031 693342 -1280066 -2168624 -2816758 -2765173 -2530095 -1504690
42956 -1504690 1996582 6086040 6013624 2349365 2467774 9914266 17972813 18593547 12728510
42947 12728510 6715216 2964640 -131956 -2710352 -3599395 -3533718 -3577034 -2857106 -1751417
42938 -1751417 -3868032 -10338324 -15647461 -14283351 -8506361 -4300704 -2584581 -185459
42930 -185459 2971789 3988092 2962580 2873258 3970243 3505985 922694 -1240740 -1615680
42921 -1615680 -1247290 -556788 1598916 5622911 9966870 11734355 7918286 -1094133
42913 -1094133 -8185660 -4551034 8916326 20362810 21198405 16187791 14128907 14529595
42905 14529595 11329406 5164462 2558654 5165023 8467783 9658588 8681503 3359497
42897 3359497 -7356036 -16361895 -14501568 -4131046 2750120 830542 -3361154 -3821850
42889 -3821850 -2495366 -1648428 1244750 6841560 10967802 12649307 16503928 22471619
42881 22471619 22311527 12634319 2858191 2477312 7866031 10284845 10184795 13319991
42873 13319991 17671942 15895509 8894502 5771162 9561120 12841925 9963646 5279740
42865 5279740 5262028 8751269 9773432 6077296 568671 -3347173 -4231296 -1862047 2838541
42856 2838541 7563401 10587283 12844918 16085778 18845503 16750364 8604809 247506
42848 247506 -1276519 2676242 3038016 -4612844 -13002254 -12801103 -5371524 519639 2050849
42839 2050849 4025645 7543698 6568915 -1086146 -7812606 -6498934 -187921 4356398
42831 4356398 6930018 10813704 13960822 11441122 4855102 1827267 5861766 12158956
42823 12158956 14083927 9942896 3366926 -90899 2285693 6362929 4041925 -6592540
42815 -6592540 -16816419 -17190632 -9065614 -1141944 2327874 3205683 1732533 -4173253
42807 -4173253 -11447212 -12265105 -4949288 2269529 2416017 -657680 1391519 9324371
42799 9324371 15848294 15406713 9579345 2782907 -3312259 -9201089 -13538681 -12782453
42791 -12782453 -5799439 3046675 7966328 8421553 8518453 9448065 7137787 -156236 -6686194
42782 -6686194 -6328077 -1392280 1370212 1150197 2883891 7748561 11083327 10748685 10907223
42773 10907223 14915490 19628305 19834140 14645661 6957397 -222524 -4618005 -4728000
42765 -4728000 -1245333 3493126 8405875 13610109 17246531 16014661 10014107 3707167
42757 3707167 851579 1429375 3958388 6959986 7688383 4135080 -688062 -1552553 759413
42748 759413 189928 -3631040 -2706690 6490449 14735704 11701610 639783 -6605365
42740 -6605365 -5590358 -1633040 1530389 5720311 10512551 10813582 5414308 744942
42732 744942 2041651 6387144 8749572 9838039 12517862 14117797 8975337 -2220334
42724 -2220334 -11538000 -13331560 -10196689 -7551486 -6040085 -2612514 2987528 6965988
42716 6965988 6878225 4858485 4030084 4417693 4718811 5829820 8991733 11517077 8915516
42707 8915516 2094999 -1914048 1168081 6750508 7469098 2868315 -1035669 -479468
42699 -479468 2070579 2546238 -79625 -4467374 -8639988 -9741317 -5433516 2264310
42691 2264310 7202762 5981056 2753373 3934225 9134784 11156817 5417401 -4236359
42683 -4236359 -10765873 -11829636 -9666191 -5765470 -151952 4826910 5238077 1621336
42675 1621336 -186608 2885045 6115564 3988449 -1014175 -1970603 1973490 4933764
42667 4933764 4066764 3485923 6500039 9854072 9161954 5353090 1521877 -2785689 -9167536
42658 -9167536 -14989272 -16032401 -13466884 -12823237 -15735397 -17468590 -13996968 -7623901
42650 -7623901 -3414051 -2760170 -2894200 -1202916 2180381 5344233 6321227 4063035 -656036
42641 -656036 -4844173 -5093741 -999672 3739196 5124723 3688646 3460252 5530150 5667112
42632 5667112 784285 -5097336 -5708414 -1746849 239270 -1899815 -2844284 1336297
42624 1336297 7120246 9552385 9277012 9400387 9439675 7093492 3075748 -146719 -1909979
42615 -1909979 -2106686 58999 1966677 -3139285 -16483942 -27277865 -23998215 -10281495
42607 -10281495 -1234580 -4379784 -12577866 -16347568 -14292937 -8887622 -619476 8730908
42599 8730908 13461203 10288346 3301184 -1852992 -5044529 -8792903 -11958077 -11218960
42591 -11218960 -6853130 -2838668 -2064120 -4054989 -6358251 -6515794 -4209044 -2256597
42583 -2256597 -3026642 -3687941 738531 8681862 11881346 6481857 -1250685 -3920881
42575 -3920881 -2252232 -741246 424745 2867226 4015328 1093610 -1919061 777932
42567 777932 6561010 7080080 961410 -3837665 -1291458 6002710 12830658 17346027
42559 17346027 18686556 14884176 6959848 749603 950972 5995904 11006114 13108324
42551 13108324 12499116 11588060 14212991 21748688 28819913 27708864 18911043 11822881
42543 11822881 11801721 12297716 4891325 -7635822 -14803660 -12234730 -5386314 -813180
42535 -813180 55638 -1282710 -2816684 -1356209 5281438 13700206 16741751 11848758
42527 11848758 4407688 1151988 3160233 6777090 8390793 6543024 2161047 -1208553
42519 -1208553 236391 5837429 10000090 8151856 1294926 -6627196 -13097151 -16805602
42511 -16805602 -16313834 -12242736 -8378768 -6975381 -5040828 696051 7249527 8987268
42503 8987268 6408072 5017325 5514946 2523774 -4623387 -7452796 -65848 10448393
42495 10448393 12423605 5124265 -1688673 -2233220 -819112 -2584024 -5446893 -4576778
42487 -4576778 235995 5471917 8909546 10642154 11504341 12818093 15292864 16428533
42479 16428533 12225609 3686728 -2134543 -880085 2787186 1730723 -3820825 -7887337
42471 -7887337 -7719357 -5387772 -1964306 3166856 7085113 4419584 -4115365 -10138810
42463 -10138810 -7861878 -1346616 1927036 602624 -1394880 -1510969 420678 4901453
42455 4901453 10875616 12710550 5275590 -7554947 -14989807 -11616788 -3221322 1612007
42447 1612007 1323840 -304444 -1753087 -4675650 -8652218 -10023730 -6795025 -1358055
42439 -1358055 2816153 4635573 4414263 2087241 -1535816 -3612242 -2058360 1100990
42431 1100990 1580121 -1779279 -5360946 -5124385 -1221383 2585183 3339654 1870805 1321634
42422 1321634 2918539 3792287 280067 -6394380 -9961633 -6459679 185324 2908616
42414 2908616 457190 -2353505 -2601957 -2259258 -2419747 -582269 3136593 2687388 -5585343
42405 -5585343 -15169179 -16386392 -9130655 -2174821 -892163 -2538487 -3712058 -4895281
42397 -4895281 -5565164 -2123684 5184157 9197714 4915595 -2664766 -5280628 -2698059
42389 -2698059 -1416036 -4355412 -8205303 -10312763 -11922223 -13738365 -13911353 -12511817
42381 -12511817 -13368802 -18446078 -23634788 -23358415 -17319257 -9740164 -3427494 2181454
42373 2181454 7472305 10329509 8601600 3327202 -1882838 -4328738 -4317132 -3924141 -4419529
42364 -4419529 -5286931 -5348600 -4134321 -2097962 -159090 701930 5714 -1693578 -3389485
42355 -3389485 -5055306 -7707970 -11459927 -14440301 -14884253 -13907425 -14697892 -18349945 -21359071
42346 -21359071 -18418057 -8141243 4450827 11978032 11403893 6048426 1052867 -1397249
42338 -1397249 -1580519 317139 3325122 3988993 -246651 -6163128 -7623573 -3986823
42330 -3986823 -1071653 -2175342 -3262724 -335191 3255446 1924084 -3054844 -5377096
42322 -5377096 -2848192 1054789 3978426 7273778 11343603 13633541 12639214 9834440
42314 9834440 6473394 2334719 -1255826 -1190180 2868474 7035500 8001850 6410875 4273365
42305 4273365 2247573 826555 892134 1552736 722735 -725693 795316 5295148 7364881
42296 7364881 3643820 -1553242 -1746786 3342911 8476285 9509782 5911869 -848684
42288 -848684 -7541709 -9790155 -6497952 -2303069 -1948766 -3748576 -2713524 1174461
42280 1174461 2713124 -475773 -4224671 -3474815 1494868 5914863 5629895 494190
42272 494190 -5913260 -9465263 -9022863 -6409777 -2864807 2154320 7582222 9553118
42264 9553118 6423459 2100108 860646 1505962 653584 -940466 -468896 678176 -1350279
42255 -1350279 -5942374 -8602632 -7851252 -6057244 -4390674 -3059244 -5193402 -12649173
42247 -12649173 -18455311 -12965114 927654 8847028 4754020 -731608 2240663 7455586
42239 7455586 4242517 -3956591 -5010554 2153464 5981488 57336 -8737454 -11619069
42231 -11619069 -8174074 -2511164 2791206 5243131 1795677 -5813834 -10203676 -7462266
42223 -7462266 -3237902 -5088106 -11593099 -14078741 -8166138 813398 4611341 1293968
42215 1293968 -3882348 -5318511 -2564381 1433445 5284861 9556226 13004995 12598579
42207 12598579 8608426 5545774 5489728 4706134 616229 -2324458 732828 6201730
42199 6201730 6888538 3244028 1971238 4662758 6405847 5777950 6993773 10254309
42191 10254309 9256163 2047823 -4133939 -3751089 -964015 -1119657 -1609278 1873776 6327107
42182 6327107 6538324 4213751 4139844 5506163 4981738 4254436 5814775 5212323 -2297786
42173 -2297786 -10266270 -7842236 2818653 8270192 4164705 1147466 6476730 12454728
42165 12454728 10533171 6039864 8582457 15381718 15666873 7647681 60200 -1830403
42157 -1830403 -1745562 -3356694 -4567434 -3137373 -1106442 -659430 -756417 -529700 -1554668
42148 -1554668 -4072882 -4966066 -2445738 644035 1353181 1477774 4170890 7794283 7418678
42139 7418678 1988513 -3806129 -5546923 -4059674 -2921119 -3048474 -1930429 2337706
42131 2337706 8170204 12136665 12365671 9598970 5801364 3057915 3494687 8413855
42123 8413855 16512914 23893818 26849519 24419772 18298712 11672459 8509543 11474003
42115 11474003 18344263 22287560 18795457 11592693 8440596 11467515 15523519 16412208
42107 16412208 15818964 15829641 13584905 6211215 -2144494 -4287758 5190 3919101
42099 3919101 3882829 3750623 6751892 9394604 7531885 3653642 2602768 3300324 1030838
42090 1030838 -3768650 -5720321 -3285304 -533376 969517 4921438 11800697 14378872
42082 14378872 7378495 -3018130 -6064779 -518737 4816111 3801215 -361890 -2099041
42074 -2099041 -1093806 -105433 665654 3334475 8192525 12554623 13438743 10448251 6423831
42065 6423831 5011001 6511134 7099959 4128360 747230 1828013 6323693 8451001
42057 8451001 6524209 4910696 5580013 3939894 -2998036 -9699738 -9110109 -3015159
42049 -3015159 941378 505843 341366 2862747 4452208 2314773 -753065 -1133831 583843
42040 583843 2273175 4102160 6319978 6475172 2989587 -532566 1052330 7193301
42032 7193301 11989661 11740593 8407279 4920083 939134 -4581217 -9562584 -10641895
42024 -10641895 -7452562 -2376892 2841654 7203782 8095353 3208985 -4146282 -5993729
42016 -5993729 1052512 10461971 13305411 8841189 3406886 608112 -1649164 -4350885
42008 -4350885 -4100054 503382 4245705 1445428 -6127831 -11569336 -11302911 -7607619
42000 -7607619 -4046708 -1953054 -877434 383345 2861929 5602031 6075229 4376261
41992 4376261 4556536 8603999 11877109 9398863 4614567 5410663 11654417 13865991
41984 13865991 6533303 -3580952 -6472035 -1552031 3583929 4036530 2023295 1419481
41976 1419481 2398625 2259971 -930438 -6286829 -10661151 -11380815 -8939432 -6080986 -3995392
41967 -3995392 -1400070 1833047 2846218 -366809 -5382637 -7984963 -6872993 -3705724
41959 -3705724 -290477 1850639 1069967 -2061732 -3447569 -91475 4828420 5363280
41951 5363280 1060396 -2218780 -432386 3582838 4790607 2322846 -1224805 -4385162
41943 -4385162 -7818441 -11864431 -15540581 -17714377 -17837314 -16001408 -13414420 -12065986
41935 -12065986 -12583727 -12981583 -10763548 -5689499 694975 7248396 12971568 15200941
41927 15200941 10948929 1030523 -9262696 -15139047 -16571327 -16210099 -14750283 -10905821
41919 -10905821 -5226372 -842209 313508 -291831 -291996 1072750 4124482 9779872 16858527
41910 16858527 20186248 14930924 2899130 -8081757 -11623252 -8047048 -2387827 851354
41902 851354 777430 -253310 254384 1242190 -1282554 -7863018 -11751711 -5870038 6714631
41893 6714631 14537184 11519346 4067792 1639428 4878596 7406344 5810271 2455985
41885 2455985 113720 -1006337 -1336228 -1473411 -3399980 -8055388 -11843651 -10024316
41877 -10024316 -4103911 -1239527 -4759708 -9536640 -9161510 -4003598 1012214 3552772
41869 3552772 4612185 3830429 -951997 -8702890 -13779825 -12106575 -6740209 -4210233
41861 -4210233 -5772358 -5677755 386343 8090515 9283367 2923347 -3272758 -3046537 911259
41852 911259 2351365 606568 94227 2850624 6287994 7780302 7275134 5305067 2169628
41843 2169628 -604070 -1458262 -1732833 -3883464 -6533515 -5316207 475065 6108966
41835 6108966 7707632 6532601 5347340 4284676 2381146 -324017 -4289337 -10315742
41827 -10315742 -15673973 -14865340 -7640412 -1748197 -2887413 -5783389 -1440788 9160973
41819 9160973 15600910 11843292 3065566 -2250242 -1325195 3505207 9053678 12011200
41811 12011200 9508732 2611131 -3040272 -3097075 447926 2370445 1000000 -340902
41803 -340902 2155702 8659991 15581155 18339416 14948316 7983140 2503631 1327392
41795 1327392 3019051 4824170 6070992 7603461 9203306 9351832 7293314 4082593
41787 4082593 1361598 -414651 -2318094 -5258776 -7779717 -6547138 -443947 6474578
41779 6474578 8335171 4089176 -1170829 -2074435 1802044 7064013 10254678 9220579
41771 9220579 3557242 -3794571 -7385301 -4615493 895306 3926745 4303969 5634928
41763 5634928 8507552 9526706 7761834 7441792 11600383 16530862 16254547 10555931
41755 10555931 4713859 2068410 793974 -1587098 -4248463 -5280314 -4995059 -4629716
41747 -4629716 -3641841 -1020619 1658038 1249036 -2881558 -7921641 -10792516 -10210531 -5740886
41738 -5740886 2191908 10316473 13593817 10762518 6948282 8072951 13810006 18687831
41730 18687831 19188475 16708022 14000605 12289791 12441163 15395636 19715396 21482333
41722 21482333 18768088 14164393 10890496 8416093 4343973 -1106981 -5408566 -7495235
41714 -7495235 -8325021 -8193201 -6410579 -3704562 -2182431 -2379557 -2779579 -2988814 -4923493
41705 -4923493 -9398153 -13421776 -12931117 -7685143 -2039283 -704490 -4162581 -8352135
41697 -8352135 -9015001 -6248926 -3794507 -3612508 -3350356 -952679 592870 -3091026 -10173837
41688 -10173837 -13040156 -7267341 3243120 11292256 13467487 11073620 7301981 5173092
41680 5173092 5507528 5564990 2473206 -1577881 -1990250 -353754 -3806302 -12719588 -16413826
41671 -16413826 -7384252 6360634 11330703 6329931 956110 -139975 -516359 -903731
41663 -903731 2846838 9104619 9516001 2752196 -1381870 3121000 9277200 9214311 5898756
41654 5898756 4791231 2818136 -4152817 -10156487 -7201076 481807 2351469 -1628384
41646 -1628384 -2618780 572870 186453 -4561387 -4010166 5468436 13689592 11673756 4651314
41637 4651314 2680693 5957586 7551670 5512451 4281960 6732196 11092328 14427657
41629 14427657 15045975 13057664 11190533 12478507 15202300 13988727 8079995 3569141
41621 3569141 4364931 6303665 4312132 86863 -2373641 -3891903 -6882269 -9188144
41613 -9188144 -7395359 -3060426 104564 1910646 2979679 629194 -5640041 -8782543
41605 -8782543 -2893256 5852351 6569722 253162 -1485856 5639670 12896366 13353431
41597 13353431 12006150 15979958 23012370 26214472 24450556 21502037 18889389 15490559
41589 15490559 11763405 9264005 7497959 5076465 2543547 1005867 -263974 -1823816
41581 -1823816 -1386589 3482653 10650742 14085113 9537844 -1171619 -10838927 -11822773
41573 -11822773 -2415148 10833225 18826401 18465652 13862238 9649999 6425133 3085807
41565 3085807 -293011 -3495039 -6840801 -9198060 -8157120 -3592661 1712932 6040837
41557 6040837 10231604 14332528 16450142 16216284 15556615 14647654 11384105 6589626 5047833
41548 5047833 8843190 14121089 17050611 18275982 18590269 15616476 8887688 3139458
41540 3139458 1785688 1905599 844409 2626652 11137074 21212037 24173634 19367780
41532 19367780 12745939 6622118 -853702 -7637804 -8176820 -2194520 4636095 9213581
41524 9213581 12683070 13444014 7302811 -3439121 -9531880 -6660534 -351208 4070533
41516 4070533 8258288 13237935 13712548 7071753 1035007 3456834 9271936 7230996
41508 7230996 -2771772 -8947414 -4399366 4254111 7392672 4244196 561724 -29028
41500 -29028 2089336 5790498 9990432 12881352 13698301 14208182 16035495 17725099 16802411
41491 16802411 13546262 10206176 7589448 5313538 4426765 5913211 6746822 2258266
41483 2258266 -5942233 -9377270 -3676655 4177767 5105187 1257166 2538932 10614854
41475 10614854 15255435 9335577 -727395 -5104945 -4737765 -7793113 -15696426 -21008947
41467 -21008947 -18406945 -10657472 -3259736 783648 84385 -5381182 -11851993 -13793453
41459 -13793453 -10149394 -4917901 -753642 3568684 8421469 11273189 11403002 11797381
41451 11797381 13710094 13906824 10587700 7904610 10534274 16699309 20439644 18671860
41443 18671860 12782592 5459557 -678923 -3067653 -1047721 3272140 7926743 12937238
41435 12937238 17471545 18202993 13512309 6778233 2221974 -187425 -2311302 -2950192
41427 -2950192 147107 4928525 6343761 2755743 -2453822 -5228811 -3774495 1634965
41419 1634965 8024051 9917893 4770889 -1659479 84578 11659911 23373820 24158698
41411 24158698 13300554 853630 -2659779 3579360 10282730 8193547 -1311994 -7933351
41403 -7933351 -5541559 471722 2139436 711085 3031015 8679604 9331718 1916036
41395 1916036 -5852079 -6759512 -3963558 -3916621 -4684699 971760 12698484 20493142 17328466
41386 17328466 8475549 4940196 10435374 18258710 20091718 14761849 7642055 3744868
41378 3744868 3506417 4605180 5362198 5392263 4747167 4120023 4834836 6863791 7684405
41369 7684405 5206955 1413829 629822 3747026 6422678 4289436 -1402770 -4803009
41361 -4803009 -1786363 5636558 11407881 11558915 7658560 3832429 1604657 -224416
41353 -224416 -1186290 1630103 8424113 14270518 14855139 11960185 9783354 8375525 5340067
41344 5340067 2145560 2839353 6562172 7326238 2892942 -1219549 869901 8094677
41336 8094677 15315173 19944244 22360385 22414911 19430575 14740628 11247517 10424906 11161350
41327 11161350 11149704 8684900 4035883 -463707 -2962715 -4869758 -8993433 -14347020
41319 -14347020 -15375730 -8056442 4712576 15177127 17429264 11916195 4690844 2130775
41311 2130775 4807237 7063278 4384236 -485766 -1903234 327915 2089586 3005973
41303 3005973 6488420 11584547 12770845 10085776 11224563 19258252 26048368 23962985
41295 23962985 17350677 14958236 16598450 15858320 11831760 8974233 7853269 5090791
41287 5090791 1052963 -1045831 -2469293 -6300153 -8341022 -1203240 11339206 15069079
41279 15069079 4419289 -8590796 -9979349 -658797 8169516 9693463 4994293 -2534231
41271 -2534231 -8966545 -9628354 -3807406 2480517 3569886 1393880 964833 2188686
41263 2188686 2119038 2076087 5096446 8012840 4225201 -5070719 -9948068 -4504099 5371709
41254 5371709 10249196 8564264 5797307 5288754 4496018 159031 -6040181 -8687695
41246 -8687695 -5163280 389001 1404244 -2696193 -5370300 -2195978 2020013 -164962
41238 -164962 -6920968 -7959164 1657666 14086370 18324530 13363777 7508908 6734671
41230 6734671 8523446 7567756 3690491 1715936 4824242 10382391 13038967 10838440
41222 10838440 6856239 4828554 4912425 4869386 3914031 3253693 3424886 3453875 2852620
41213 2852620 2384774 2342476 1917151 1001304 980036 2871084 5925067 8558379 9275597
41204 9275597 6564534 277424 -5933837 -6316174 513941 8582366 10664249 6220139
41196 6220139 528547 -3067073 -6338731 -11274141 -15924116 -17363358 -16089773 -14413811
41188 -14413811 -11929940 -6085241 2823426 10607053 14327426 15705756 17372102 18009924
41180 18009924 14482288 7952740 4184088 6615788 11750156 13354311 9866877 5665568
41172 5665568 5376898 8555208 10601781 8547874 5184665 6265090 13034247 19299453
41164 19299453 18212319 10805803 4402799 2975764 3643694 3603125 4878060 8828741
41156 8828741 11185937 8214298 4251473 6258379 12618260 14717914 9683134 4176389
41148 4176389 3881418 6205244 6638745 6217444 8055847 10975430 11516094 9337821 6415735
41139 6415735 3349419 127566 -1966598 -2578347 -3553275 -4825832 -3007420 1731061
41131 1731061 2131058 -6455283 -16861649 -18565731 -12517779 -8284796 -8045280 -4644130
41123 -4644130 3237793 6248470 -78555 -5836591 -1157386 8269505 10176846 4346430
41115 4346430 1001984 3783401 6251262 5218029 5780388 9967711 10747134 3212054
41107 3212054 -5954632 -7293656 -1776984 2007255 757335 -699728 1598063 5597650
41099 5597650 7957773 8722390 9400709 9963516 9737538 9011386 8314057 7795281 8050335
41090 8050335 9554956 10557707 7920265 1441673 -4766839 -7035306 -6506088 -6578976 -7411936
41081 -7411936 -5847678 -498888 5983297 10451628 12659079 13646188 12621252 7852096
41073 7852096 225105 -6318881 -8601930 -7146078 -4502921 -1735800 2107332 7341383
41065 7341383 11919801 13098937 10341186 5909560 2554521 940368 -482245 -3197429
41057 -3197429 -6551571 -8200802 -6408055 -1398233 5355863 12018604 16119961 15106725
41049 15106725 9216107 3129919 2071280 5645702 8033749 5544567 1380920 614638
41041 614638 2843757 3541487 1383873 -379031 -28997 109774 -929906 303751 5661909
41032 5661909 10138979 7788887 797667 -2998315 -1015367 1528741 678987 -792419
41024 -792419 368979 1838985 562645 -463460 3690149 10937043 13798355 10316728
41016 10316728 7518598 11726928 19822050 23549765 19969564 14056375 11737979 13186909
41008 13186909 13431906 8303085 -552582 -6384426 -3724153 5727823 14844487 19067275
41000 19067275 20611619 23346098 25930800 23483680 15414361 7556698 4862841 4982515
40992 4982515 2210805 -3641323 -6422291 -2591666 2815274 2527352 -2670041 -4631264
40984 -4631264 918326 8697747 11732274 10468265 9786696 10403198 9415815 7818348 10000796
40975 10000796 14758692 14392051 6395770 -564126 1961802 9759920 11759206 5142094
40967 5142094 -2791829 -6327201 -7038075 -7479728 -6845251 -5049454 -4488893 -4690117 -1087670
40958 -1087670 7238369 14066061 14590774 12377184 12574617 13026912 8875902 2332215 -260027
40949 -260027 657041 -1405228 -7048223 -8689848 -2849814 3463469 3454395 851343 3054005
40940 3054005 8896543 10913890 7274993 3552590 2928423 2232119 -453241 -923912 4500981
40931 4500981 11944651 14157803 9509363 2995293 -378419 164029 2788017 5637670
40923 5637670 7476885 7991881 8039555 8432152 8627508 7763312 6440000 6031137 6710177
40914 6710177 7655684 8703785 10241537 12048441 13894192 16486781 19828390 21556541
40906 21556541 19501110 15189856 11918039 10132985 8424612 8358703 13050110 20199589
40898 20199589 22639913 18623464 15812225 20484346 27685338 28189858 21830616 16953883
40890 16953883 18282465 22277341 24243682 23302891 19434959 11849102 2308356 -4878597
40882 -4878597 -8006751 -8860182 -7626558 -2253911 5735442 10698065 10534332 9311312
40874 9311312 9876783 10319134 10852165 16233567 25554980 27543368 15055062 -1405738
40866 -1405738 -5371688 3433671 10024365 6591447 2001029 6070695 15356820 20771384
40858 20771384 21377789 22921350 27056431 29289537 26228679 19813907 14691029 14249073
40850 14249073 18359727 23032331 23539253 19254813 13939838 10881043 10344350 11863081
40842 11863081 14973903 17025755 15303405 12785918 15816407 23382354 25638913 17994411
40834 17994411 9874071 12106564 20995927 24135130 18604920 12827935 11227236 8401824
40826 8401824 1225763 -3533996 474836 8527415 11359179 7971180 5293391 7391717
40818 7391717 11001959 11373330 7999345 3914353 2025070 2719755 3891602 3597640 3084268
40809 3084268 5549932 11194010 16019830 17228127 17210289 19608716 23464561 24433156 20805072
40800 20805072 15463123 12116350 11529626 11127371 7191516 -1292305 -9763518 -11184969
40792 -11184969 -4082106 4753155 8288587 7517808 7868018 9563476 7226787 -861518
40784 -861518 -8612511 -9265716 -2964437 4700832 8676633 7391083 2905531 117681
40776 117681 2899280 8877692 10958915 6519849 1965348 4568828 12330530 16585705
40768 16585705 13511717 8052680 6075823 7424629 8754213 9559699 12129192 17067190
40760 17067190 21662524 22601170 18971107 12910664 8115665 7042518 8713170 9895246
40752 9895246 9065174 8108116 9070644 10576916 9515054 5791409 3046136 4069684 7474764
40743 7474764 10128979 11333313 12666480 14372109 14223925 10679469 5565741 2284466
40735 2284466 1992455 2840028 2899267 2633211 3858828 6861763 9437235 9163853 6376881
40726 6376881 4238649 5436151 9347292 13391773 16641497 20097354 22989195 21595772
40718 21595772 14213686 5552059 2632711 6453891 11015146 11118329 7788571 4826807
40710 4826807 3624792 3785790 5718405 9187858 11426654 10384132 8489603 9531601
40702 9531601 12930576 15186274 16269051 19653871 25425336 28394164 25230772 19343898
40694 19343898 15737129 14274563 11553007 7232137 4618057 5569640 7868282 7975757
40686 7975757 4867423 1176834 1164044 6558514 13829337 17256023 15544509 13225296
40678 13225296 14375939 17870215 20888333 23792197 27828293 30452774 27697204 20452469
40670 20452469 14095569 11729488 11400280 10328556 8550322 7704643 8931349 12400609
40662 12400609 16611672 18467651 16813507 15243865 17846318 22708811 24085201 20980369
40654 20980369 18227714 17916914 15781352 9279887 3963519 6935305 17288122 27734802
40646 27734802 33323158 34021485 30790444 24319912 17049778 11879920 8791239 6320294
40638 6320294 5784797 9708260 16092251 19227277 17577758 16206727 18792944 21390297
40630 21390297 18266119 11360079 8737613 13676051 19966585 20102857 14840650 11195039
40622 11195039 12408359 14108060 11375628 6029440 3971012 7194702 11938879 14315174
40614 14315174 14307589 13583514 12587213 11501612 11789036 14744359 19660744 24555985 27490050
40605 27490050 26741366 21958020 16201930 14336418 17614164 21967466 23407999 22916706
40597 22916706 24039429 27943535 33098482 37495985 38632693 33840178 24035522 15299122
40589 15299122 13280104 17284449 22481369 25655486 25670719 21504782 14754790 11495704
40581 11495704 15648001 22129099 23019311 19261748 18657418 22523793 23412083 18214100
40573 18214100 14148248 16676649 19680491 15089384 6377464 3792775 9406100 15628666
40565 15628666 17549031 18382396 21508566 24343511 23243226 19546792 17237036 17636403
40557 17636403 19447234 22005725 25619814 29462001 31276159 29423209 24582099 19497544
40549 19497544 16940611 17205268 17579537 14991318 9287623 3606390 1848735 5864650
40541 5864650 13951451 21573986 25229131 26747138 31680878 41299678 48439640 45194763
40533 45194763 33869034 25568282 26797637 31844826 31367633 25300123 22836130 30494339
40525 30494339 44422143 55461612 58517324 54941467 48365745 41741226 37734308 38049788
40517 38049788 40855498 41640586 38810171 36330812 38117815 41577541 40549678 34118526
40509 34118526 28230237 27701899 30645643 32701200 33159057 34019661 35810010 37747803
40501 37747803 40168801 43411825 45691751 45458239 44730422 46469224 49437936 49740236
40493 49740236 47334097 46506673 48811132 49999033 46526134 41555624 40818382 44455072
40485 44455072 46855086 44230129 39041586 36212966 37384047 40203044 41783980 41314080
40477 41314080 39799119 38596690 38396862 38785470 38283799 35284316 29780940 24363645
40469 24363645 22805631 26911238 34779189 42616798 48102656 51257083 52180890 49661829
40461 49661829 43530554 37416909 36440309 41248763 46631317 47942535 46960941 48470099
40453 48470099 52580979 54905787 54357064 55456413 60718661 65666115 65214374 60931930
40445 60931930 57161063 53523569 47518858 42102464 43072842 49214407 52582894 49846669
40437 49846669 46228160 46001415 46300605 44185851 43325567 48192974 56170589 60890825
40429 60890825 60372200 57423133 55076566 55816195 61973417 72183116 80217230 81805309
40421 81805309 80014578 79949761 81621142 82561035 83322521 84431160 81711248 71990551 61053319
40412 61053319 58384123 65214411 74597778 81823427 87290181 90183991 87730310 81370998
40404 81370998 76323506 74285892 73314737 74557833 80794953 87915082 87345902 79210802
40396 79210802 73925050 77482482 84027185 86837686 87335239 87908237 85265817 78540767
40388 78540767 75962710 84214274 96774493 102062632 99053349 95839692 95962349 95585983
40380 95585983 92712061 90210261 89647207 89753245 91424386 97257690 105399778 110500330
40372 110500330 111993208 115005474 120909227 122974579 115254316 102002956 94127532 97459026
40364 97459026 107176964 113923536 114329747 114534280 122250721 136115688 146117790 145481545
40356 145481545 138158914 132248120 130427258 130976296 134189426 141782108 151890244 160236554
40348 160236554 165273170 167681999 166686274 162199467 158913828 162049142 169675979 175071061
40340 175071061 175969960 175280847 173421674 167604158 159569338 156170451 159621684 164020285
40332 164020285 164889476 165910941 172053499 181469404 189041657 193772353 197813916 201435549
40324 201435549 203630137 205280761 207526509 209053931 208825803 209381159 213336643 218311514
40316 218311514 219757801 218132700 219079392 226173279 236807382 246001952 251679369 255016878
40308 255016878 257277599 257850425 255583612 251821351 251233717 257868731 269859390 279855386
40300 279855386 282098466 278029930 273930628 274522108 280409256 290184904 302079432 313369961
40292 313369961 320986247 324787350 329150279 338675311 351699165 360594423 360733637 357330003
40284 357330003 359907895 370812408 383371908 391052509 392750724 388362297 377130934
40277 377130934 364596038 363003550 376713467 392940544 396623740 390518082 389701957 398824742
40269 398824742 407857545 410899051 415129127 426337753 437981416 442151231 441658412 442964769
40261 442964769 445266304 445342307 446086269 450593649 453693541 449846672 445073417 449802401
40253 449802401 462174288 469599038 466415792 459355833 454634572 450292538 444484574 441753090
40245 441753090 445442532 450493253 449757551 443517357 437744807 435576640 434837027 432515746
40237 432515746 428082328 422609497 417034690 412080438 409313937 411094071 417497326 423095308
40229 423095308 420332832 408691036 397292475 394517790 397710858 397777952 391337594 382367815
40221 382367815 373794676 364887850 356947317 353969377 355802607 356978860 354421726 350461272
40213 350461272 346326618 339253678 329059501 320996463 317821094 314975426 308603667 302619673
40205 302619673 301475433 300724903 292621981 278468078 267431345 263897311 263500322 262108319
40197 262108319 261185626 261789966 259902637 252347005 243196314 239176826 240492979 240625937
40189 240625937 234776689 224821422 215571482 209471055 206330577 205452106 205399859 203152744
40181 203152744 196562910 187584860 180399003 175926693 170983458 163873992 157687360 155753640
40173 155753640 156514566 156170188 154565612 154642729 156954961 158628927 157728189 155162487 152081700
40164 152081700 148711731 146092614 145595839 146072576 144586926 140600431 136561883 134275166
40156 134275166 134004023 136678427 142060500 144329602 135725303 117317136 100779128 95641434
40148 95641434 99088144 102234440 101944219 101124919 100908350 99232897 96169489 94837356
40140 94837356 96541775 99168819 100890092 102121495 103387022 103948248 102922545 99948882
40132 99948882 95153893 89989976 86833516 85981117 84943234 82827034 82684006 86286735
40124 86286735 89536913 87681956 82747111 80181826 79670285 75915878 68565397 64350750
40116 64350750 67412454 73650026 77681769 79900098 82440867 82696988 76512547 65857795
40108 65857795 58113253 57667238 61730479 64821688 64646558 62721679 61089144 59768940
40100 59768940 57165861 52431942 47052368 43767441 44105376 47212496 50357246 50064032
40092 50064032 44420615 36159231 32025025 36193422 44971203 51131257 52973141 55138597
40084 55138597 60236496 64487928 63744408 59656947 56636194 55629504 54386309 51909030
40076 51909030 49285759 47354113 46420486 47208575 49363677 50000138 46550792 40525328
40068 40525328 35927103 34342714 33913740 32792071 31264479 30468280 30898858 32073398
40060 32073398 32119041 28368995 20425848 12202520 8758851 11174187 16230597 20573884
40052 20573884 23090709 23847706 23483123 23763479 26135689 29227434 30014710 27939090 25769337
40043 25769337 25975067 28276316 30933580 32119830 29994930 24507477 19703762 20748432
40035 20748432 27255673 33045356 34432020 34925508 38548078 42189941 39669350 31520254
40027 31520254 25087803 24687357 26666012 25760388 22217669 19989379 20626286 22067260
40019 22067260 22410635 22293607 23263296 25086186 25481446 22943239 19731943 20443717 26103256
40010 26103256 31254038 29741548 22462803 15719289 12231331 8680831 3384903 815826
40002 815826 4787505 11657992 15519797 17063492 21156621 27230122 29027496 24596417
39994 24596417 20067719 20916246 24510632 24726453 20119572 13784763 8066415 3714666
39986 3714666 2729421 7641174 17511183 27275446 31795151 29622710 23358016 17493958
39978 17493958 15112034 15407622 15128150 13079473 11543114 12195221 13085850 11969486 10480083
39969 10480083 11760657 15218191 17171493 16346987 15382900 16545455 18782174 19682636
39961 19682636 18244544 15412989 13819343 16700065 24468245 32314208 34028678 28637675
39953 28637675 20597975 13316653 6142701 -1084904 -4566411 -690019 8590438 17379629
39945 17379629 21508302 20449980 15326311 7984750 1449079 -1462927 -453965 2634617
39937 2634617 6290825 10093561 13434979 15271980 15648109 16443820 19755193 25161239
39929 25161239 28524159 24609332 12797205 151479 -3761774 3423139 14016977 18573747
39921 18573747 15435266 10353283 8501628 9726208 11005746 10575850 8960398 7958050
39913 7958050 9560058 14628326 21683104 27445747 29187629 26841596 23202947 21877399
39905 21877399 23923811 26222052 24516974 18716544 13660617 13741673 18434552 24155721
39897 24155721 28208233 29011211 25061766 17035456 9320197 5743354 4661864 2071102
39889 2071102 -1233591 -427309 5020920 9107729 7666633 4488872 5564327 10442926
39881 10442926 13430808 11497820 6915561 2826105 -24217 -1941930 -2716927 -2130087
39873 -2130087 -141441 3522390 8123946 10644577 8412649 3330682 743025 2987880
39865 2987880 6388380 6091659 1811996 -3096553 -6380751 -8023690 -7730584 -4608220
39857 -4608220 125721 2907612 1914309 -341260 -304880 1957560 3649626 4217196 6468088
39848 6468088 11689763 16292528 15967567 11951322 9803877 11592353 12695570 8489610
39840 8489610 1603247 -1045457 2527472 7165681 8258008 7667423 9711037 14537034
39832 14537034 19169394 22923357 26981656 29263173 25334896 16100513 9528313 11183079
39824 11183079 16661773 17772250 13708758 11125918 14421369 21175418 27020164 29704021
39816 29704021 27570276 19568045 9079061 2956751 3718399 6648516 7486687 8299655
39808 8299655 11606339 13596572 9608455 3008949 1001584 3155210 2421498 -2097478
39800 -2097478 -2214388 6596199 17508214 22379978 22818252 24645328 26530868 22608650
39792 22608650 14135963 9634875 12461310 15734706 12530333 5318313 1263060 2282421
39784 2282421 4504597 5258548 5616032 6307872 5533209 2384723 -305926 1222063 7045772
39775 7045772 13531000 17589163 19364659 20330260 20169874 16996398 10426173 3080565
39767 3080565 -1630754 -2697575 -1979954 -1713017 -1841514 31719 5509677 11808065 12527611
39758 12527611 4184999 -7997075 -13509334 -7424115 3907514 10062552 8122942 4408123
39750 4408123 5189001 8981222 9547773 4517034 -1404817 -1833665 4189123 11428029 14381717
39741 14381717 12677877 9751173 7407363 4151593 -844328 -4969420 -5197617 -1827265
39733 -1827265 3067053 9059000 16180219 21665720 21958906 18099805 15195915 15364724
39725 15364724 14752058 9590953 2230479 -1764343 -781225 1423169 759871 -2951871
39717 -2951871 -6420266 -5897553 -161381 8027421 13667705 13852347 10282281 7183789
39709 7183789 7688980 12441785 19523604 24326370 21993733 13010126 5006728 5405424
39701 5405424 12248096 15594940 8949338 -3282177 -10950184 -8704078 9285 7650402
39693 7650402 9257503 5258031 -190839 -2968567 -1976327 619996 1629416 -436002
39685 -436002 -4002653 -5535041 -3039368 883215 792300 -5428025 -13168130 -15481609 -10166452
39676 -10166452 -1085118 6213373 8009610 3173001 -5814404 -12689635 -12028216 -5068511
39668 -5068511 1809800 4839043 5852452 7150866 7773050 6638613 5134085 3893075
39660 3893075 920332 -3945141 -6725681 -5434149 -4389673 -7012921 -7926239 514330
39652 514330 15441848 25053579 23417212 16486226 11835469 9590467 6744625 4068956
39644 4068956 3831984 4838855 4363655 2269126 -95463 -1984629 -1431291 4367208 12888001
39635 12888001 15067748 5847307 -7542676 -13958461 -12055920 -8730926 -6460564 -1175457
39627 -1175457 7226812 11709956 8692520 4227350 4951240 8660103 9153825 6182732
39619 6182732 4917787 7947263 12814222 16314841 17347133 16341703 14849516 14735372
39611 14735372 15551907 14367738 10313547 6834891 6774040 8164844 8371858 9007417 11680343
39602 11680343 11814058 3686177 -9235932 -16460347 -14245262 -10319391 -12058655 -16247304
39594 -16247304 -15207364 -8389532 -2052078 176731 673843 2196666 3804282 3668326
39586 3668326 2739972 3573945 6573887 8791634 6821198 888814 -4657104 -6096519
39578 -6096519 -4862408 -4976340 -6334927 -4472337 1644712 6087256 3903626 -832439
39570 -832439 -119007 6432682 10864422 7976378 1798302 -1051941 -245997 -776659 -5436402
39561 -5436402 -11351932 -13371566 -9134862 -1149625 5384096 7457091 7084108 8056184
39553 8056184 10273685 9898815 5570001 1199303 798745 3369619 5441082 6199408 6795147
39544 6795147 6367333 2833105 -2753656 -6374678 -6041527 -3574348 -981446 1676932
39536 1676932 3929856 3974501 2155401 2282920 6492802 10957030 10247820 4868427 772992
39527 772992 1544214 4680096 6426813 6789727 7790097 9480362 10427137 10560395 10821727
39518 10821727 10903165 9884301 8379683 7333132 5341453 642018 -4236378 -4057557
39510 -4057557 1428384 5572898 3429663 -1423507 -2514393 354439 2799793 4369493
39502 4369493 8573565 14691385 16900828 13692443 11433453 14724789 18958882 17499566
39494 17499566 11468358 6409502 3258933 -67306 -871652 5710771 16390977 20678289
39486 20678289 14398502 5006201 510695 103300 -171422 648693 4610911 8095055
39478 8095055 6180514 858804 -1945216 -1573063 -2070861 -3777617 -2888575 325622 118291
39469 118291 -6000459 -13192410 -16365159 -16018850 -14525368 -11880454 -8477258 -7243573
39461 -7243573 -8938273 -9359648 -5473050 -614963 921420 755809 2419512 3864958
39453 3864958 882706 -3920230 -3392244 2660704 5788741 785509 -7234744 -10608025
39445 -10608025 -8212138 -3169474 3034641 9054716 10645411 5477299 -1094857 -1095943
39437 -1095943 5883923 12780944 15041786 15105980 16173632 16999675 15494988 13349644 13486338
39428 13486338 15189888 14982692 11171897 5075247 -1267031 -6231357 -8091302 -5760185
39420 -5760185 -348986 5430497 9515103 11147092 9767392 5068354 -1274813 -5232884
39412 -5232884 -3179189 4599318 13406227 17723059 15932252 11489772 8908492 8785815
39404 8785815 7737432 3134384 -3514495 -8223429 -8063650 -2633035 5824697 12433112
39396 12433112 12215412 5511829 -275110 2369606 12298505 20718171 21426861 17067347
39388 17067347 13937517 13624880 12648100 8782467 4218169 2018071 2065224 2094537 1459099
39379 1459099 1919942 4507085 7071574 6268527 1703441 -3258807 -5299961 -4577098 -3460918
39370 -3460918 -3094269 -2877654 -2567002 -2551042 -1919584 1407028 7643300 13935339 17229665
39361 17229665 16954840 14125809 9825846 6089046 6125201 10791271 15736084 15191073 8980296
39352 8980296 3154530 2620909 5315875 5446760 1133474 -3393113 -2977330 3006824 10828170
39343 10828170 16337724 17609623 15022221 10767434 7990940 8251790 9337624 7549785
39335 7549785 2732338 -1538256 -3934906 -7887312 -14896438 -18942841 -13411450 -1984033
39327 -1984033 4462224 2411962 -306778 2370940 5597815 3135856 -788770 2410225
39319 2410225 11506151 16599512 13444685 8009225 5967834 5673524 3916209 1700545
39311 1700545 925614 848193 1023311 2629373 3856543 -334225 -9790828 -16110308 -13380584
39302 -13380584 -7182831 -6511628 -10660011 -11695101 -7523009 -3960959 -3961050 -3287607 692881
39293 692881 3154588 -955034 -8797612 -13541138 -13277549 -11415976 -10012838 -7551027
39285 -7551027 -3482425 -844724 -2287738 -5604051 -5816797 -1471519 3456482 4882200
39277 4882200 3585853 2281001 -576105 -9170838 -21697063 -28827083 -24608882 -14866204
39269 -14866204 -9641706 -10165956 -9582270 -5050196 -1598179 -2915674 -5496626 -5272267
39261 -5272267 -4481822 -7403219 -12793989 -15062965 -11192710 -3394706 3510426 5278631
39253 5278631 1292454 -3342181 -1787888 5675231 10259098 5899770 -1595159 -1792311
39245 -1792311 6607773 15435743 18978840 19118525 18273401 14840062 8622203 4390311
39237 4390311 5203916 6458802 1811321 -7562334 -14537780 -15058132 -10673016 -3504166
39229 -3504166 5312281 11818667 10406217 2010101 -3795421 281480 9135565 11391838
39221 11391838 4233053 -3822324 -5375440 -3029418 -2736759 -3716517 -781406 5920385
39213 5920385 10012316 7976865 3692388 2210600 3360055 4105628 4024609 5313101 9051179
39204 9051179 13893575 17383585 17104670 12138242 4913728 -8416 -391263 2040226
39196 2040226 5010649 7770067 8684819 5094026 -1589995 -5022254 -2396516 410123
39188 410123 -2258210 -5840838 -2253045 6061051 8558426 3251219 510673 6929518
39180 6929518 15030225 15029831 9005312 5698277 7018695 8279750 8131591 9332101 11139182
39171 11139182 9226564 3323484 -1878179 -3651117 -2897116 659977 7671325 13207518
39163 13207518 9909912 -479185 -6545006 -1977894 6168859 8734603 7069685 7887849
39155 7887849 11245357 11905841 9395840 8193553 9016143 7736881 3217701 -784235
39147 -784235 -2483737 -4267524 -6320304 -4355105 3317037 11605477 15003881 14109866
39139 14109866 12451348 10487440 6716848 2299938 797447 4371815 12266460 21221602
39131 21221602 25952773 22431243 13284057 6868242 7898836 11935175 12449994 9830718
39123 9830718 8658782 9156727 7640940 4271269 3931601 8785931 15151346 18773817
39115 18773817 18881998 16218252 11174246 4749659 -2086673 -9787681 -17048628 -17756985
39107 -17756985 -7657947 6184041 10731651 3784635 -2808521 -315426 5132921 3888591
39099 3888591 -2175340 -4507688 -1888424 131950 214302 1766687 4309071 3936383 1883499
39090 1883499 3294402 7096801 6545866 1374915 -108093 5872740 12300153 12584352
39082 12584352 10011747 10679600 14077076 16640489 18393403 19497449 15782636 5168388
39074 5168388 -5652711 -8551646 -5047257 -2944073 -4536298 -5601998 -4237498 -2864804
39066 -2864804 -2051318 302488 3478144 4439969 4116508 6415364 10368409 10407458 6061353
39057 6061353 4269740 9162533 15775409 17457723 14196185 9880791 6166655 3247344
39049 3247344 2727988 5309976 8353551 9210867 8307730 6158339 994612 -6892410 -11917231
39040 -11917231 -9072154 -1003203 5061125 5972097 4462675 3693874 3834510 3407074 1028646
39031 1028646 -3540707 -7978877 -8555701 -4870518 -1440134 -2318898 -6570887 -11182400
39023 -11182400 -14724311 -15090388 -8600096 3269141 10895377 7666593 713156 1646591
39015 1646591 8722412 9023634 -973757 -8881689 -5019771 3147812 3282791 -3061080
39007 -3061080 -4458516 1579382 5130901 -59367 -6560092 -3798761 7074330 14709259
38999 14709259 12312058 5725087 4985733 10785290 13483773 6210351 -5344823 -10135758
38991 -10135758 -6134125 -1498095 -1569451 -1783120 3303491 9877261 9486940 875422 -8343147
38982 -8343147 -10992409 -7126445 -1822028 434085 -1078747 -3627910 -4381925 -3878659
38974 -3878659 -4475697 -5208368 -2158278 4313226 7738248 4830375 1677272 4795218
38966 4795218 10139947 8887903 1921794 -537746 5783061 13046608 13049536 7484511 2412082
38957 2412082 -927436 -4208994 -5796720 -3228422 21125 -3397294 -15009488 -26835131
38949 -26835131 -29206370 -20799261 -9691002 -4593927 -5825435 -6362372 -2026061 2585674
38941 2585674 1232870 -4005791 -5509992 -1570084 1888067 1824540 2807227 7982493 12217814
38932 12217814 9620620 2904364 -656010 906741 4088194 6544307 7848538 5996542
38924 5996542 -281055 -6784550 -7691080 -3885255 -1601802 -2697898 -2386396 2287940
38916 2287940 7705762 9740476 9532746 10076170 10761498 8605563 2608414 -5501204 -12897023
38907 -12897023 -16372504 -13760395 -6481401 1241669 6943758 11326298 14209175 12927581
38899 12927581 7474807 3655000 6568643 12729536 13683164 7527987 2041334 4437649
38891 4437649 11850217 15605227 12980605 9965385 11507405 13556619 8806263 -1773347
38883 -1773347 -8629682 -5749771 2068359 7115726 9391195 13928846 20267200 21751752
38875 21751752 15834697 8527914 5976960 6803798 6481523 5117791 6094618 9471775
38867 9471775 11818723 11829700 11634373 12287860 11847143 9101286 6276604 6334040 9286944
38858 9286944 12616960 14333661 14613420 14988731 16405536 17703600 16428501 12433470
38850 12433470 10302585 15662203 27713150 37403890 35724167 23643975 11555684 8253734
38842 8253734 12427088 16239758 15297417 12378894 11974986 14431136 16717916 16660372 14526062
38833 14526062 11863772 10519715 11502231 12984232 10977643 4613976 -564368 1768033
38825 1768033 10075706 16012770 14893897 10721967 8603504 6746794 657599 -7581357
38817 -7581357 -10470682 -5593045 754853 2405963 1020936 1703042 5048250 8510196
38809 8510196 12890578 20727111 28360087 26981529 14748603 1887706 -1262967 3207975
38801 3207975 6212078 5752868 7345768 11989017 13510489 9739251 7032741 9363421
38793 9363421 11238860 7701567 3884209 6168165 9695353 5260289 -4372723 -6549879
38785 -6549879 2547591 11995941 11793459 5158003 681195 17241 -532470 -1631997 -664940
38776 -664940 2931514 7295377 11460273 15303449 17796026 18339466 18238454 18439247 17742948
38767 17742948 15476995 13696036 14290094 15878157 15790200 13328892 9415213 5261959
38759 5261959 2938558 4484581 8596917 10981619 9824873 7864036 7200262 5809700
38751 5809700 1931952 -1694654 -1493192 1732852 4414060 4749587 3111552 618983
38743 618983 -325308 2812376 8622674 12328750 12672510 13684281 16680635 16117328 8256003
38734 8256003 -1102136 -3665165 300790 4000505 3900527 1499111 -1406682 -2822890
38726 -2822890 925970 9771270 15656741 11200413 641596 -5303985 -3658042 -328544
38718 -328544 1246807 3430534 6445018 6409847 3116821 1861779 5295413 10139776 13645911
38709 13645911 16653604 18670577 16670794 10751713 4927873 988946 -2334177 -3800721
38701 -3800721 -826074 3161214 1306598 -5084531 -7040989 -2734967 -1478604 -8290077
38693 -8290077 -14905183 -13196558 -8214651 -8873047 -12997259 -11834216 -4763803 438140
38685 438140 -417581 -4402868 -8734104 -14031705 -20342975 -25424751 -26959362 -23173872
38677 -23173872 -13405421 -1626461 3955537 -339200 -8070760 -10458324 -6648118 -1434139
38669 -1434139 3425131 9210344 14272073 15023750 11951000 8851123 6803728 3965573
38661 3965573 515263 -1081583 -286781 992729 1345537 214276 -2937928 -6810794
38653 -6810794 -8146375 -6472883 -5613584 -7325973 -8164867 -6819027 -8611265 -16437174
38645 -16437174 -23086266 -20757942 -13301103 -9635615 -9208651 -4956813 1885913 2235445
38637 2235445 -5407276 -11606175 -10199108 -5634747 -3368521 -2430089 -1000808 -685516
38629 -685516 -1285318 868002 5456406 6547510 2444994 -338589 2285593 4592193
38621 4592193 275673 -6726851 -7191003 1324488 12790270 20216571 20567775 15068001
38613 15068001 8561039 6272344 8291294 9561391 6974169 2999902 822216 452980
38605 452980 1736572 6013159 11688642 13118750 7848475 992358 -1324531 548905
38597 548905 2057493 756583 -2558833 -5723320 -5888532 -1983194 1876029 130181
38589 130181 -5448939 -6721405 -1368957 2760752 -692345 -7697148 -11730153 -13649136
38581 -13649136 -17051625 -19806864 -17944073 -13500906 -10874066 -9034079 -4775706 -235102
38573 -235102 546063 -542720 630890 1630622 -2740971 -9379277 -9176159 -906590 5897628
38564 5897628 3875344 -3639194 -9216423 -9932814 -6712498 -883067 5046861 7228138
38556 7228138 4536090 515751 -923371 -42635 -73560 -2613812 -5045784 -2681105 5357966
38547 5357966 12719745 11865221 4526248 945463 5781171 10865363 7304754 -1152612
38539 -1152612 -4413471 -859655 3241519 5562965 8432545 9540752 3482685 -6721909
38531 -6721909 -10836075 -6599388 -3203752 -5964002 -7960546 -2723854 4004301 2904754
38523 2904754 -5211499 -12287413 -14974309 -16054012 -16850568 -15372205 -11133440 -6604085
38515 -6604085 -3995672 -3550435 -3941231 -2484081 2734079 9099574 10895650 6509225
38507 6509225 799204 -1692035 -1724309 -1260015 557141 3785444 5023339 2846763 1375794
38498 1375794 3451093 4757453 765060 -4449796 -3595408 2058995 3953272 -1400617
38490 -1400617 -8416858 -11263909 -10337183 -8608781 -7095324 -6100491 -6739771 -9071612 -11706516
38481 -11706516 -14482837 -18374726 -21631055 -19544043 -10240125 1666856 9289904 9937178
38473 9937178 6109531 1648340 -1495915 -3572009 -5726291 -8577396 -11426715 -12374887
38465 -12374887 -9153995 -802050 10078198 17274010 15741812 7235398 -1045211 -4255752
38457 -4255752 -3733355 -2085543 1532367 8134138 14178152 14689243 9804072 4289937
38449 4289937 1327679 279138 -192095 -624206 -2142894 -5548699 -8586284 -7462741
38441 -7462741 -1937486 3766689 5912560 4863460 3191606 2391389 2333241 2341452 1931187
38432 1931187 1172758 370712 -886223 -3173528 -5112107 -4075540 -746422 -368665 -6479731
38423 -6479731 -15422350 -20477949 -19708228 -16047888 -11533832 -6145265 -1260259 895221
38415 895221 1173355 2224409 3398199 1730171 -2129860 -4494270 -5501014 -9121384
38407 -9121384 -14794758 -15662278 -8326023 1365744 6129498 5771972 3846569 1071877
38399 1071877 -2373417 -2296106 4929698 15241086 20466322 18103529 12471416 7326111
38391 7326111 2815952 -750579 -1768088 -639087 415105 1405061 4055186 6964295
38383 6964295 6372709 2839961 1850442 5566956 8895911 6817046 1335893 -2389957
38375 -2389957 -2895119 -1266209 2962190 9200950 11840184 5732741 -4904298 -9816910
38367 -9816910 -6068718 -1703591 -3513438 -7272951 -4908681 3130171 8887721 8198847
38359 8198847 4798655 3393856 4270594 5944161 8288441 10683172 10542231 6312308
38351 6312308 -73532 -5218567 -6709332 -3167361 4460476 10478368 8079744 -1587305
38343 -1587305 -8480103 -5966650 238206 1047276 -2123477 -507572 6813711 10331676
38335 10331676 4244395 -5438364 -10523529 -10983026 -10764927 -9633338 -5575631 -844696
38327 -844696 1145154 1938749 4622046 6877593 4429358 -381126 -1179045 1794236 1813030
38318 1813030 -2545810 -4339799 -85215 3700375 1263934 -2273687 666529 6691029
38310 6691029 5979957 -1636908 -5154338 1432590 10136979 10384583 2845779 -3747236
38302 -3747236 -5090023 -4031519 -3038458 -966591 2002564 2225079 -1666726 -4767409
38294 -4767409 -1521050 6311930 11030745 8393520 2529583 21672 1320524 997231
38286 997231 -3671708 -7817228 -5206752 2461660 6508639 2154004 -5250410 -7172686
38278 -7172686 -2270895 3462062 4987142 2621332 -971098 -3637710 -3090317 2135672
38270 2135672 9226539 12205674 8914782 4102485 3248395 6023243 8434390 8578112
38262 8578112 6756186 2248710 -5548936 -13686109 -17658524 -17068152 -15842929 -16407331
38254 -16407331 -16731999 -13892415 -7932343 -1322895 3427031 5072354 4222101 2787150
38246 2787150 1486491 -1260080 -5987351 -9253091 -7408722 -2329618 702026 450463
38238 450463 374927 1547384 464623 -4106960 -7367830 -5038206 270726 2911938 1242650
38229 1242650 -2667078 -7002288 -9671634 -6970960 1719161 9641731 8990065 1399911
38221 1399911 -3372712 -188948 5202630 4784281 -1287018 -6412098 -6964243 -5798142
38213 -5798142 -6977658 -10573611 -13730865 -14662993 -13821795 -12068910 -9726679 -7678218
38205 -7678218 -7453574 -8852406 -8901376 -5342408 -545622 487548 -3864899 -9978629 -13200262
38196 -13200262 -11662801 -6103135 897671 5073501 3686964 -48233 424413 6004617
38188 6004617 9503515 5006509 -4111479 -9996262 -9647413 -5557926 -589938 2921060
38180 2921060 1995157 -3369207 -7476526 -5542952 -1258440 -1771975 -6867077 -10116077
38172 -10116077 -9716020 -9974200 -11562482 -9262870 -2248557 1779023 -2318986 -8477568
38164 -8477568 -7696063 -177584 6541120 8010465 5825383 2689420 -178628 -1950613
38156 -1950613 -2480204 -2655470 -1965053 1928421 8487464 12316091 9443949 2733728 -2577356
38147 -2577356 -5502832 -7361006 -6793461 -2114150 4070633 8159070 11078712 14833040
38139 14833040 16375859 12071707 6095392 5843135 9602710 8077764 -754094 -8093786
38131 -8093786 -8699433 -8865910 -14225323 -18624934 -14044771 -5266682 -3900089 -10428973
38123 -10428973 -13106058 -5658688 3570560 4064791 -2558591 -6441798 -3378873 1595534
38115 1595534 3190159 2432325 2688976 3288421 511656 -6526126 -14252154 -19048186 -20555744
38106 -20555744 -19668502 -16095019 -10299133 -5729322 -5631172 -8372606 -9253620 -6661313 -3058000
38097 -3058000 -181115 2448659 3798996 1224639 -3942194 -5750302 -1925325 1660922
38089 1660922 -875921 -6723796 -9021268 -6954310 -4858029 -3351411 1111618 7698415
38081 7698415 9569879 3199940 -6214775 -11355902 -10294240 -5152967 1725286 6977283
38073 6977283 6343177 224435 -4296476 -1824402 3644344 4490584 639905 -1295766
38065 -1295766 741193 892167 -4907906 -11873621 -12769602 -7330492 -1068154 2650629
38057 2650629 4733911 5906475 5060356 2684005 1808311 3578884 4750261 2021456
38049 2021456 -3026102 -5911536 -4929709 -2062808 1029333 4602105 8104911 9300058
38041 9300058 7610543 5498198 4515020 2744904 -1043287 -3438991 -968781 2814194
38033 2814194 260580 -9580435 -18063038 -17243833 -9307065 -2610713 -1174722 -1907134
38025 -1907134 -827383 1952738 3804008 3262717 837118 -2646489 -7222830 -12810735
38017 -12810735 -17133521 -16180639 -8939254 -977798 232806 -5433368 -9622740 -5511254
38009 -5511254 4302333 12357227 15293148 14613331 11666997 7023590 3330280 3436987
38001 3436987 5629786 5141347 794847 -3613438 -4767286 -3099653 -686934 394495
37993 394495 -2010824 -7405746 -10010205 -4215423 6519519 11773650 6883588 -1773740
37985 -1773740 -6276750 -6188114 -5002332 -3436305 -1018911 241262 -870972 -1126808 2586584
37976 2586584 7926996 10937318 12173528 14077181 15364013 13687152 11168776 10997680
37968 10997680 10568802 4683463 -5656657 -14221249 -18344067 -20105822 -19867929 -16328272
37960 -16328272 -12621420 -13751454 -17219953 -15523004 -9936648 -11330087 -22608197 -30762076
37952 -30762076 -24220523 -9584726 -1313437 -1236768 161000 5781698 7945017 2709652
37944 2709652 -3276579 -3575889 -656665 667759 1337114 4179343 7128545 6145207 1989669
37935 1989669 -979908 -1110546 -339237 177408 1513237 4232692 7164862 9166546 10056113
37926 10056113 9687776 7821744 5142212 3118073 2565865 3038016 3518973 3172328 1787526
37917 1787526 66825 -1017564 -1613512 -2864978 -4662408 -4696608 -1342580 3084193 3869590
37908 3869590 -959299 -8469266 -14322532 -17059228 -17924097 -17779150 -16165157 -13117578
37900 -13117578 -9673400 -5893200 -634773 4984744 6105218 -432844 -9915651 -13400956
37892 -13400956 -8719244 -3562229 -4770540 -8505654 -6032558 3093866 10037858 8976281
37884 8976281 3864353 563259 -1730611 -6379558 -11004075 -10013371 -4119222 -730332
37876 -730332 -3745241 -8403588 -8731500 -5589552 -3651461 -3726141 -2971032 -1403675 -2952839
37867 -2952839 -8880888 -14122830 -12801383 -5548655 954524 1001489 -5113647 -12397533
37859 -12397533 -15867545 -14071327 -9275197 -4847868 -2474733 -1973303 -3100473 -5866031
37851 -5866031 -8717621 -8523581 -4053706 1765320 4849992 4278344 1902087 -1037740
37843 -1037740 -4262657 -6273300 -5300622 -2804661 -2533145 -4711732 -4464362 1383629 8310592
37834 8310592 8419345 142706 -9455645 -12653504 -9112800 -4749987 -4045323 -5581753
37826 -5581753 -5568157 -3839251 -3898630 -7125778 -10179117 -10156677 -9487367 -11970506 -15765716
37817 -15765716 -15311435 -10044585 -5949457 -7232507 -11419848 -14588824 -16371978 -17012569
37809 -17012569 -14617878 -9215587 -4791320 -2849693 1097977 9012378 13450558 7143321
37801 7143321 -4126321 -7527504 -565038 7142546 9377841 10253241 13432696 14795757
37793 14795757 10892745 6124412 5066348 4469455 -64241 -4907027 -3469038 3388908
37785 3388908 9242778 11469216 11701660 9492190 3227211 -3718505 -5266086 -1411414
37777 -1411414 1653426 681241 -1376898 -1861318 -1946992 -2339552 -1448289 -3509 -1889615
37768 -1889615 -7512389 -11352752 -9503868 -5159096 -2689017 -296514 6392549 15837559
37760 15837559 20939320 17543263 8848095 1283170 -1243190 950795 4816974 7262395
37752 7262395 7730214 8138933 9527214 9856604 6634164 655520 -4901858 -8649371 -12204685
37743 -12204685 -17046104 -21718929 -22881957 -18698733 -11076255 -4521475 -2121781 -2476643
37735 -2476643 -1498069 2686030 8009842 11692601 12958171 11861847 8245153 3683304
37727 3683304 1699402 3162793 3761179 -282444 -5704138 -5947078 -739444 3175237
37719 3175237 1618201 -1809668 -2194760 -248432 764616 1266989 3880029 7923518
37711 7923518 10252023 10484111 10572069 9582480 4279951 -4099471 -9055593 -7388752 -3867473
37702 -3867473 -3705408 -4671070 -1960058 2277303 1420864 -4162585 -5660267 1872154 12025949
37693 12025949 15897323 13534632 11364552 11693706 11017815 7424041 3581101 1994046
37685 1994046 2281545 3780073 6029284 5902266 -239633 -9582138 -13669736 -9436533
37677 -9436533 -4025080 -4061478 -5429183 -423927 8890292 13120667 9899434 6504042
37669 6504042 7012519 6165193 -1616 -5684333 -4061369 1344844 1833891 -3277285 -6463477
37660 -6463477 -3696782 944031 2500421 501778 -3735570 -9126628 -12559599 -10283427
37652 -10283427 -4001023 -821580 -4531508 -11021910 -14523309 -13756376 -9576475 -2258548
37644 -2258548 4846054 4715068 -4165124 -12318788 -10030996 -689807 4101679 827098
37636 827098 -3026415 -2386351 -1993156 -7343659 -15345765 -18719407 -15515473 -10259100 -8139637
37627 -8139637 -10484550 -13806777 -12494639 -5433376 407531 -2043775 -8646851 -7996090
37619 -7996090 1815033 9116988 5499905 -2245907 -3883844 -1025778 -953608 -1896669 3051739
37610 3051739 10809041 10815108 2847932 -1087954 3987108 7329897 -639893 -13195638
37602 -13195638 -17747024 -13860003 -10882319 -11977590 -10811578 -3389470 5454343 9093859
37594 9093859 6780813 2181624 -1836704 -4867878 -7479093 -9429598 -9027875 -5096614
37586 -5096614 -183923 700198 -3302608 -6292498 -3109029 2860661 4031622 -407987
37578 -407987 -3230109 680590 7989398 12473281 12468851 9952551 5843436 253387 -4580465
37569 -4580465 -6014534 -5343706 -6368147 -8780594 -7101489 1017485 8719576 7019073
37561 7019073 -3064075 -10950507 -10070517 -5194721 -3290784 -3373761 -1647112 -1507884 -8725000
37552 -8725000 -18433216 -18158864 -6075423 4344254 3014708 -3034465 -2250460 3438554
37544 3438554 3716945 -2395609 -5938798 -3370419 -944753 -2882094 -5671456 -6730115
37536 -6730115 -9179176 -13941391 -15525421 -10974772 -5967508 -6038328 -7694400 -5019212
37528 -5019212 -406037 -1088739 -7640712 -13411371 -14604842 -14235640 -15503746 -16911240
37520 -16911240 -15788820 -12866682 -11393829 -13630559 -18816114 -23083590 -21963340 -15140906
37512 -15140906 -7967258 -5671078 -6892696 -6061628 -1575461 2221623 1623158 -1667157
37504 -1667157 -3838893 -4104718 -4572477 -6847908 -10300769 -12337061 -9593877 -890479
37496 -890479 9717363 14898901 11133944 2637286 -3604985 -5446000 -5848164 -6472794
37488 -6472794 -4665848 1664891 8891311 10696147 5978702 653822 240692 3134897
37480 3134897 3881920 1480214 256829 2040725 2003935 -4624076 -14564774 -19287933 -14760688
37471 -14760688 -4767289 4816762 10869072 11996005 7791702 1630601 -3888 4818937
37463 4818937 8915410 3894774 -8082297 -15271439 -10019750 2615055 11768762 12616716
37455 12616716 8370973 3551905 -140278 -2278433 -2831426 -3732300 -7514786 -12851967
37447 -12851967 -14882618 -12161347 -9932840 -13027927 -18037107 -17173599 -8992960 -400582
37439 -400582 2573787 1383992 515022 543434 -1010667 -4398797 -6916548 -6608356 -3860429
37430 -3860429 147352 3925069 4885410 1014766 -5781003 -10200815 -8899700 -4071799
37422 -4071799 -257513 1462532 3917879 8254129 10474103 6159566 -2294357 -6880422
37414 -6880422 -3718565 1787086 2338356 -1635105 -4074179 -2989187 -2191911 -3506734
37406 -3506734 -3758761 -1436110 -183168 -2206285 -3816098 -2263103 -1930239 -7402304
37398 -7402304 -14171183 -13841197 -6807079 -1901340 -3390965 -5942231 -4244830 -675016
37390 -675016 74863 -1335785 -910349 2185917 4883658 4322195 498877 -3656188 -3837994
37381 -3837994 1698074 8960619 11752426 9049615 5631699 4944522 5701260 6575563 8832289
37372 8832289 11769753 11045921 5526463 1016782 2371155 5919780 5003989 -463710
37364 -463710 -5659476 -8882387 -11378144 -11410860 -5826455 3037314 8779243 9594338 9629039
37355 9629039 11676775 14672295 18495387 24197478 28445675 25356627 16257777 10080930
37347 10080930 10456004 9918841 2108486 -7302076 -8821771 -2754071 3373309 6955785
37339 6955785 11075365 15289873 14885583 9578800 4883007 3539147 2835605 2023280 4767573
37330 4767573 11072486 13918626 8847681 1374794 -597386 2570521 4917290 4636875
37322 4636875 4635819 5388396 4064068 582776 -1537063 -1188040 -1231294 -2799724 -3095514
37313 -3095514 -859319 702313 -592112 -1472084 1967278 7850936 10894284 9389671
37305 9389671 6048788 3099891 395708 -2038596 -3258387 -3535459 -4165246 -4632688 -2833726
37296 -2833726 1068307 3631897 2132206 -2505341 -7634375 -11533950 -13155673 -11740491
37288 -11740491 -8378642 -5900424 -5352649 -4349932 -794835 3653941 6196693 7300171
37280 7300171 9511280 12803841 14276047 12436578 9091116 6712858 6184633 7164494
37272 7164494 8237222 6594927 391694 -7877358 -12996308 -12974185 -10771488 -9023584
37264 -9023584 -6140327 187638 8289368 14328933 17111115 17984459 17118394 13347873
37256 13347873 7637725 3425050 2406609 2079986 -1235113 -7935463 -14427412 -16382212
37248 -16382212 -12704189 -6819063 -3591070 -4360184 -6007337 -5711920 -4645573 -4831229
37240 -4831229 -4486111 -481637 5240031 6377407 442311 -7977400 -14027606 -18505633
37232 -18505633 -23636069 -26401865 -21313665 -9171368 1577908 3628406 -1617676 -6631496
37224 -6631496 -6355554 -2879491 -1937186 -5601239 -9377304 -7624401 -1344961 2014156
37216 2014156 -2387803 -10602317 -15049525 -13613998 -10411885 -9088659 -9305442 -9414451
37208 -9414451 -8500779 -5108018 2237671 11486080 16863573 14450729 6699409 181926
37200 181926 -212433 5277530 11863942 14018913 10626168 6361169 5795544 6714440 2837034
37191 2837034 -6662684 -14757521 -15220339 -9560473 -3157283 1395115 4061562 4477213
37183 4477213 3469599 4494610 9012280 12578909 10159881 3737273 -133097 676881
37175 676881 2195938 1325828 -502296 -1360793 -2035797 -3411003 -3604569 452596 9601534
37166 9601534 20436182 25742427 19392188 3989520 -8673683 -9394921 -2168154 2137550
37158 2137550 833778 895845 5712340 9243516 6453868 1733470 1671283 5121464 6190377
37149 6190377 3126805 -1105827 -4019130 -4526426 -1524402 3800170 6918654 5738492
37141 5738492 4613583 7768024 11713409 9997806 3136535 -2668609 -5309198 -8410973
37133 -8410973 -13398468 -16709591 -16114134 -14021160 -12901004 -12413682 -12463290 -14035689 -15389764
37124 -15389764 -12753030 -7223271 -5698017 -11322882 -17447427 -15584273 -6402410 1623633
37116 1623633 2515869 -2396678 -8476746 -12183191 -11683552 -7068560 -1238581 1706998
37108 1706998 227578 -3515910 -6578508 -8022689 -8282034 -7051709 -3377041 2038745
37100 2038745 6079640 6312090 4422415 4446141 7099767 8539105 6464755 4597673 7636056
37091 7636056 13584298 15466409 10315216 2382733 -2726232 -3082348 616278 6238901
37083 6238901 8923751 3598497 -8104738 -17231575 -17248961 -11452976 -7269383 -6178366
37075 -6178366 -3861958 1341406 5213730 3332106 -3569512 -10784864 -13863067 -11240874
37067 -11240874 -4877405 973925 3174045 2554212 2430051 4172242 5443543 3150445
37059 3150445 -2895713 -9837046 -14639014 -16366540 -15779267 -13785629 -11401628 -10626190
37051 -10626190 -13007351 -16482236 -16255088 -11068577 -6253077 -7082172 -10868456 -10281688
37043 -10281688 -3957365 1337265 -58655 -6015977 -10566607 -10092006 -3969234 6156756
37035 6156756 15178598 17018844 11527377 5355114 3297229 2776643 -196706 -4300284
37027 -4300284 -6143374 -5734026 -3901137 1474284 10860063 18336904 18194235 13937419
37019 13937419 13911499 19338340 23428948 21733716 16750325 12202146 9188230 8798599
37011 8798599 12467345 18101879 20817732 18984337 15413052 12061328 8207628 4240544
37003 4240544 2049492 901322 -1749744 -4546529 -3229765 1319801 2603635 -1239562
36995 -1239562 -3102940 2935008 12235124 15245914 9075837 -745740 -7103059 -6118753
36987 -6118753 1986760 12769415 19914116 20555709 16693372 10139960 -8261 -12262469
36979 -12262469 -19712448 -17077260 -8335195 -2695606 -4319351 -9643896 -13199541 -12193332
36971 -12193332 -6675217 688045 5256117 4175948 -186897 -2498019 221539 6708057
36963 6708057 13382836 16623670 15072082 11629718 11205626 14600478 17014475 14713798
36955 14713798 10203119 7859192 7393562 5417393 1165750 -3280802 -6543575 -7834119
36947 -7834119 -5301338 1185052 7272360 8812705 8152981 10957775 17475473 21950810
36939 21950810 20757341 16362751 12619205 10460811 9255517 8603736 7604521 5370161
36931 5370161 2936702 1861571 1027549 -1696565 -4824625 -4598044 -1377481 125091
36923 125091 -1502686 -1218547 5207985 14366200 18758140 14837013 5142149 -5184436
36915 -5184436 -11585376 -12071459 -8864417 -6762631 -7850876 -9376203 -8614318 -7438369
36907 -7438369 -9094870 -12359454 -12897996 -9927401 -7352596 -7347837 -6712294 -2205685 3292474
36898 3292474 3914923 -781778 -4882631 -4576804 -3296615 -5469384 -8733136 -7387661
36890 -7387661 -1874126 1197268 -1187877 -4657515 -5209503 -4784457 -5825938 -6052469 -3658200
36881 -3658200 -2844295 -7683008 -13804899 -13374153 -6581598 -993609 -157661 -196201 1741039
36872 1741039 2990021 1463842 -155686 586627 1847226 1650796 1772054 3984770 5984440
36863 5984440 4673652 978647 -1951240 -3660253 -6581061 -11978621 -17485213 -18629641
36855 -18629641 -12905591 -3249089 3491904 3383692 -663826 -4017961 -6662203 -10297196
36847 -10297196 -12162926 -8415218 -2127686 -162946 -2253002 -1579466 2980676 4624063
36839 4624063 1113641 -438777 4220114 9196947 9520861 10038295 15157885 18454821
36831 18454821 12729986 3424581 527070 2480739 681281 -3755114 -1699635 6459680
36823 6459680 9352368 3076487 -2008227 2239866 9786035 11360980 7908513 5497932
36815 5497932 4240050 744576 -3310762 -3447897 -682101 -335248 -3589751 -6054608
36807 -6054608 -4568481 -946135 1258596 573127 -1854754 -3446450 -2342958 379685
36799 379685 1894261 1810406 2683407 5118423 5880343 3357913 1250720 2955603 5251110
36790 5251110 2512079 -4334563 -8211856 -5192814 997558 4406710 3059518 -1181670
36782 -1181670 -5545141 -7589986 -6192038 -3149280 -2055164 -4019193 -5892721 -4132165
36774 -4132165 811977 5427040 7425983 7308194 6016022 3003573 -2470677 -9007295
36766 -9007295 -13160224 -12230694 -6879312 -817542 2363361 2338354 1939804 3617520 6341713
36757 6341713 6963937 4657829 2371821 2758870 4260609 3523767 806833 -180825 1899016
36748 1899016 3771697 2632774 391075 366493 2097513 2377622 -10907 -3248342 -4864990
36739 -4864990 -2900725 3320299 10603716 12429008 6410004 -470183 670773 8650103
36731 8650103 13596515 10547918 5075592 3456844 4176236 3405864 2853710 5808687 9426626
36722 9426626 8414817 4718617 5903605 13252271 18518167 15237213 7470024 3038785
36714 3038785 2416474 69569 -5279786 -8291478 -5744264 -1944553 -2317093 -5618994
36706 -5618994 -6830549 -5316655 -4964157 -7004746 -8273319 -7546470 -8064544 -11059186 -11825044
36697 -11825044 -6645205 187348 1785212 -1175939 -1698932 2859301 7280373 6472222
36689 6472222 1924497 -1425194 -819057 3337884 8588227 11000704 7821277 1062364
36681 1062364 -4121246 -5277910 -3878354 -760906 4912705 10867596 11082702 3162875
36673 3162875 -7351450 -13321161 -13839067 -12977344 -13626247 -15540218 -16926384 -15095910
36665 -15095910 -8075412 1468957 6474130 3063984 -4068645 -7215369 -5048660 -3195670
36657 -3195670 -6362388 -12778919 -16423134 -13425702 -6689321 -3879962 -8646623 -14575589
36649 -14575589 -12279350 -2646697 3178388 -930527 -7863199 -8559435 -4578434 -2946481
36641 -2946481 -4335979 -4508042 -3319349 -3375162 -2451453 3304388 9843952 8582631 -165526
36632 -165526 -6232704 -3746579 2275901 5763795 7365466 8602142 6478787 -233276
36624 -233276 -5555398 -3755077 1713221 2750900 -2559170 -9033988 -12343360 -12675272
36616 -12675272 -11245992 -7904282 -3089019 725178 928813 -2550242 -6828244 -8670029
36608 -8670029 -8091729 -8297459 -10562694 -11207197 -6991103 -1560329 -1172113 -4710410 -4585176
36599 -4585176 1342338 5823218 3249082 -1969432 -2690509 745168 3147056 3139817 3244762
36590 3244762 4215390 5094433 6924452 10904597 14148846 12349498 5948045 -512290
36582 -512290 -4049692 -4284857 -666871 6352957 12584664 13826363 11762167 10933883 10364400
36573 10364400 4411385 -7065211 -15607032 -14094413 -5270687 2690028 5510805 4538266
36565 4538266 2181810 -434552 -2457410 -3245108 -3591156 -5394261 -9743192 -15502175
36557 -15502175 -19351787 -17746279 -10491116 -2309727 1258079 -97854 -1743260 -931849
36549 -931849 -281444 -2480056 -4374079 -244481 9502357 16695836 14066157 3362944
36541 3362944 -7297625 -12828137 -14892641 -16237940 -15291980 -9466592 -1489323 2239326
36533 2239326 -222185 -4059272 -4739794 -3285264 -2291206 -666496 3869804 9642325
36525 9642325 12432708 10592251 5459895 -1400777 -7581427 -8563023 -2244857 6062392
36517 6062392 8518338 4863646 2567351 6112864 11310752 11933202 7103790 -324984
36509 -324984 -8227794 -14822971 -17545078 -15959632 -13266044 -11913362 -10391401 -7408441
36501 -7408441 -6124777 -9893564 -15864756 -17624443 -13438064 -7530327 -3484945 -854629
36493 -854629 1082013 705786 -2655961 -6087064 -6523343 -4971464 -4597886 -5589401 -4689652
36484 -4689652 -162152 4936001 5787669 1337088 -4450025 -6815158 -4795514 -1370552
36476 -1370552 75575 -1228460 -3318470 -3465674 -497332 4170515 8063572 10527933
36468 10527933 13024284 15633089 14837282 7156926 -5466033 -16287418 -19935252 -16233184
36460 -16233184 -8483362 -716060 3480171 2909068 680788 1242742 4289927 4682104
36452 4682104 -60243 -5585426 -6521861 -3524613 -1453252 -2730516 -5646887 -7652862
36444 -7652862 -7574578 -6058449 -5969780 -9972321 -15321384 -14637455 -5820064 2573295 1661020
36435 1661020 -5055073 -6752631 -1386093 2305988 -353672 -2805484 1229516 7733807
36427 7733807 10135100 10182967 13287388 17775356 17474284 12477126 8586168 6729938 1682724
36418 1682724 -7302469 -12800531 -9785200 -3552340 -2425908 -7026693 -11592552 -12694489
36410 -12694489 -11542367 -9486734 -6273738 -2537660 -41647 974935 1716031 1885109
36402 1885109 -235970 -4166237 -6527512 -5288985 -2460176 -807877 389532 3931475
36394 3931475 9615177 13071860 10667779 4175379 -953723 -1622352 48021 72685 -2800513
36385 -2800513 -6878100 -10385246 -12546761 -12693525 -10925588 -9601334 -11207041 -14011952
36377 -14011952 -13084708 -7411206 -2711814 -3992900 -7924791 -7128880 -868976 3693468
36369 3693468 1607353 -3375500 -4868044 -2728930 -2213004 -5952995 -10368687 -10155872
36361 -10155872 -4103957 4041203 9259931 9439105 6581485 4239128 3981174 4802458
36353 4802458 5389673 5349443 4132798 901830 -3455244 -6030911 -5271329 -3356769 -3492712
36344 -3492712 -5794250 -7615949 -7204946 -5133444 -2534905 81534 2098296 2566426
36336 2566426 1376770 -224391 -690966 721092 3818673 7751422 11354983 13678008
36328 13678008 14321943 13417113 11771975 10900105 11813336 13460872 13415387 10562209 6190306
36319 6190306 2291737 103583 392122 3267062 7256190 10555985 13532710 17399965
36311 17399965 20078978 17252394 9185975 2335206 1259810 2842040 2198006 300247
36303 300247 718281 2305128 1385926 -1204116 -2054688 -2353846 -5521310 -8655721 -5168672
36294 -5168672 3230330 6509057 1116980 -4326183 -2919600 -415217 -5209366 -14367677
36286 -14367677 -18292821 -14823381 -9842467 -6575624 -3206976 -309987 -2085080 -8787779
36278 -8787779 -14483203 -14348989 -9625338 -4227296 -643473 139584 -1238952 -1832662 524055
36269 524055 3484132 3281759 663729 -1056048 -2772877 -8032929 -14752474 -15965961
36261 -15965961 -10590636 -5948334 -6328632 -6410249 -1041163 5091923 4388742 -1856818 -6132620
36252 -6132620 -6265165 -6644833 -9223066 -10850363 -10102137 -10096169 -12636004 -14736287 -13276310
36243 -13276310 -9209316 -5099754 -1797570 512643 951789 -259075 -955204 195576
36235 195576 1900627 2362704 1047115 -2533764 -8882682 -15833036 -18915189 -16766455
36227 -16766455 -13421651 -12531671 -12229210 -9375555 -6013137 -6167617 -7682992 -3949520
36219 -3949520 5155904 10572421 5725946 -4244040 -9669848 -8903420 -7844753 -9412359
36211 -9412359 -10563303 -9755045 -10175697 -13032546 -13633767 -8349279 -1133678 1791885 820743
36202 820743 1290254 4655204 6762177 4624752 116 -4217488 -6680380 -5958951 -951220
36193 -951220 5372178 6996312 2213648 -3614158 -5339264 -4539465 -5281373 -6634571 -4357217
36184 -4357217 1328942 4694336 1906945 -3946522 -6313908 -1702159 7410692 14342798
36176 14342798 13302805 5077390 -2595228 -2810971 2522802 5225884 1163213 -5584268
36168 -5584268 -9588736 -10892002 -12268601 -12992629 -9715595 -2779199 2313226 903347
36160 903347 -5499110 -11140575 -12047720 -9013032 -5337577 -3056259 -1846796 -837784
36152 -837784 -215328 -566576 -1565291 -2476389 -3643584 -6155078 -9925887 -13411648 -15552359
36143 -15552359 -16596463 -16354932 -13218559 -6358747 2011562 8134414 10154178 9038082
36135 9038082 6762923 5010327 4980123 6436285 7000884 4675690 1552011 2376857 7856781
36126 7856781 11879427 8293718 -994310 -8177873 -9248154 -7451878 -6484064 -5160611
36118 -5160611 -1872009 -30346 -3645856 -9457033 -9695496 -3086472 2659771 1157261
36110 1157261 -5157905 -10758548 -14965388 -19172065 -20250083 -13774632 -2737892 3727779
36102 3727779 1414894 -4552681 -7918146 -8720433 -9883598 -11015176 -9683046 -6055916
36094 -6055916 -2307615 824099 3356031 3565412 167035 -3777614 -3313451 1543196
36086 1543196 4985253 2768667 -2419894 -4647552 -1648040 3892612 8291181 9572590
36078 9572590 6912936 441343 -7113744 -10640590 -7150965 33069 4020574 2245578
36070 2245578 -594376 679566 4302455 4393931 -106436 -4123160 -4478507 -3887083 -4475308
36061 -4475308 -2511966 5524112 15035165 17540844 11761263 4879909 2624601 3315861
36053 3315861 2897984 1006605 -341863 -481282 145861 1471079 2735091 1853585 -2150265
36044 -2150265 -7408395 -11140263 -12014377 -10185368 -7042767 -5240052 -6376296 -8358069
36036 -8358069 -8177872 -7261622 -9461492 -13220547 -12183128 -6230170 -4513071 -11754477
36028 -11754477 -18204218 -12089654 2074082 8177714 537917 -9559574 -11148805 -6935532
36020 -6935532 -4586932 -3925151 -774784 2353051 -1218651 -10859368 -17498788 -14610584
36012 -14610584 -4944458 4438401 9393928 9945811 8093437 6033607 4400117 1528066
36004 1528066 -3692071 -8394772 -7958778 -2263104 2849785 1613543 -5764897 -13962460
35996 -13962460 -17733080 -15775687 -11213501 -8931020 -10838626 -13205524 -10468750 -2366996
35988 -2366996 4795520 5232718 119997 -4597181 -4988936 -1623789 3126889 7302436
35980 7302436 9389768 9105491 8409362 9088773 8939966 3610611 -6263284 -13208052 -11451682
35971 -11451682 -4991221 -2882633 -7435216 -11855141 -10128129 -4303234 230241 2322356
35963 2322356 4358626 7242564 10250987 13538545 16283585 14274484 4872377 -6266874
35955 -6266874 -9512937 -3443923 2834832 1730331 -3679281 -5896253 -3796572 -2193576
35947 -2193576 -3310375 -4162832 -2113379 1353788 3485290 4182060 5529694 8264963
35939 8264963 9815373 6837761 389531 -3000112 1811385 11407765 17345207 16756217
35931 16756217 14437312 13557208 10904141 4709179 405133 2397419 5177353 295930
35923 295930 -10809572 -18772507 -19413170 -17134410 -15934149 -14972555 -13623938 -13318896 -12927001
35914 -12927001 -9449795 -5087892 -6323592 -13350473 -17715593 -14261298 -8635779 -8261058
35906 -8261058 -12080558 -14928360 -16592719 -19687762 -22328385 -20161479 -13903193 -8579685
35898 -8579685 -6110512 -3993053 -870745 1470562 1785509 1033797 -50377 -2084512
35890 -2084512 -5497561 -9816964 -13974133 -16012692 -14322021 -10872206 -10552886 -14733382
35882 -14733382 -18290398 -16191303 -10212234 -5487220 -3263758 -1408525 478380 1368013
35874 1368013 2297822 4731370 7084777 7515723 8185484 11717592 15600241 15860726 14185621
35865 14185621 14715637 15457311 10609598 899079 -6459353 -8576402 -9630271 -11805553
35857 -11805553 -11964405 -9357078 -7993269 -8289497 -5100144 1842268 4519366 -662362
35849 -662362 -5422632 -2187217 3803257 3795733 -125138 -743886 -409757 -7295557 -19034093
35840 -19034093 -23120287 -15038621 -4513443 -511311 -396383 1091770 1402364 -3966969
35832 -3966969 -11573124 -13975059 -10265361 -5921459 -4282463 -4310834 -5493683 -8659769
35824 -8659769 -11513056 -9013453 -484967 7426805 7843800 1861191 -2961246 -1654867
35816 -1654867 3060028 5438402 4571618 5130351 9953406 14435503 11006323 -1172001
35808 -1172001 -13680729 -17238988 -11306648 -4229267 -4494195 -12487965 -20417494 -20098845
35800 -20098845 -11228635 -1671551 1071639 -2372861 -5652972 -5518651 -4719821 -5865633
35792 -5865633 -6687925 -3989571 783903 3492885 3115018 1978115 1152479 -427882 -2143632
35783 -2143632 -1012322 3665393 8087203 8442177 5367202 1898434 -782846 -2835785
35775 -2835785 -2868014 604024 5195347 6154636 2925098 758172 3686990 8770212 10447238
35766 10447238 8622371 8243849 11160745 12916597 9543784 4149230 3320559 8286796
35758 8286796 13072358 11879836 5885254 1444357 2788009 7736959 10278217 6684410
$$ [...]
##END NTUPLES=NMR SPECTRUM
##END=
