##TITLE=31Pdec_LR-579-H1-CR9
 D2O, 24 sc
 24.6.2019
##JCAMPDX= 6.0         $$ Bruker NMR JCAMP-DX V2.0
##DATA TYPE= NMR SPECTRUM
##DATA CLASS= NTUPLES
##ORIGIN= UXNMR, Bruker Analytische Messtechnik GmbH
##OWNER= root
$$ XWIN-NMR		Version 3.5
$$ Mon Jun 24 16:10:51 2019 Russian Standard Time (UT+4h)  she@DPX200
##.OBSERVE FREQUENCY= 81.013821
##.OBSERVE NUCLEUS= ^31P
##.ACQUISITION MODE= SIMULTANEOUS
##.ACQUISITION SCHEME= undefined
##.AVERAGES= 24
##.DIGITISER RES= 17
##SPECTROMETER/DATA SYSTEM= spect
##.PULSE SEQUENCE= zgpg30
##.SOLVENT NAME= D2O
##.SHIFT REFERENCE= (INTERNAL, D2O, 0, 182.463)
##AUDIT TRAIL= $$ (NUMBER, WHEN, WHO, WHERE, WHAT)
$$ ##TITLE= Audit trail, XWIN-NMR		Version 3.5
$$ ##JCAMPDX= 5.01
$$ ##ORIGIN= Bruker BioSpin GmbH
$$ ##OWNER= she
$$ F:/spectra/data/she/nmr/P31/1/pdata/1/auditp.txt
$$ ##AUDIT TRAIL=  $$ (NUMBER, WHEN, WHO, WHERE, WHAT)
(   1,<2019-06-24 16:09:40.34 +0400>,<she>,<DPX200>,
      <created by zg, POWCHK disabled, PULCHK disabled
       configuration hash MD5:
       00 E9 B6 7A A2 85 ED C7 34 08 36 98 17 FE 4E 26
       data hash MD5: 32K
       1C BE B8 1C 6B 7B E6 A2 80 FB 79 50 38 A2 04 91>)
(   2,<2019-06-24 16:09:42.78 +0400>,<she>,<DPX200>,
      <Start of raw data processing
       efp BC_mod = 2 LB = 1 FT_mod = 6 PKNL = 1 PHC0 = -2661.834 PHC1 = 310.199 SI = 64K 
       data hash MD5: 64K
       FF 23 7D 8E 1D 9B 10 B3 E9 16 6B 39 1F 87 FE 51>)
$$ ##END=
$$ 
$$ hash MD5
$$ 24 00 B9 C3 F2 6C EB 6E A7 90 AF 49 E7 41 6E C6
##$RELAX= 
##$RELAX= 
##$RELAX= 
##$RELAX= 
##$RELAX= 
##$RELAX= 
##$RELAX= 
##$RELAX= 
$$ Bruker specific parameters
$$ --------------------------
##$DU= <F:/spectra>
##$EXPNO= 1
##$NAME= <P31>
##$PROCNO= 1
##$TYPE= <nmr>
##$USER= <she>
##$AMP= (0..31)
100 100 100 100 100 100 100 100 100 100 100 100 100 100 100 100 100 100 
100 100 100 100 100 100 100 100 100 100 100 100 100 100 
##$AQSEQ= 0
##$AQ_mod= 1
##$AUNM= <au_zg>
##$AUTOPOS= <>
##$BF1= 81.014009
##$BF2= 200.13
##$BF3= 200.13
##$BF4= 200.13
##$BF5= 200.13
##$BF6= 200.13
##$BF7= 200.13
##$BF8= 200.13
##$BYTORDA= 1
##$CFDGTYP= 0
##$CFRGTYP= 5
##$CHEMSTR= <none>
##$CNST= (0..31)
1 1 145 1 1 1 1 1 1 1 1 1 1 1 1 1 1 1 1 1 1 1 1 1 1 1 1 1 1 1 1 1 
##$CPDPRG= <waltz16>
##$CPDPRG1= <>
##$CPDPRG2= <waltz16>
##$CPDPRG3= <>
##$CPDPRG4= <mlev>
##$CPDPRG5= <mlev>
##$CPDPRG6= <mlev>
##$CPDPRG7= <mlev>
##$CPDPRG8= <mlev>
##$CPDPRGB= <>
##$CPDPRGT= <>
##$D= (0..31)
0 1 0 0 0 0 0 0 0 0 0 0.03 2e-05 3e-06 0 0 0 0 0 0 0 0 0 0 0 0 0 0 0 0 
0 0 
##$DATE= 1561378179
##$DBL= (0..7)
120 120 120 11 120 120 24 19 
##$DBP= (0..7)
150 150 150 150 150 150 150 150 
##$DBP07= 0
##$DBPNAM0= <>
##$DBPNAM1= <>
##$DBPNAM2= <>
##$DBPNAM3= <>
##$DBPNAM4= <>
##$DBPNAM5= <>
##$DBPNAM6= <>
##$DBPNAM7= <>
##$DBPOAL= (0..7)
0.5 0.5 0.5 0.5 0.5 0.5 0.5 0.5 
##$DBPOFFS= (0..7)
0 0 0 0 0 0 0 0 
##$DE= 6
##$DECBNUC= <off>
##$DECIM= 4
##$DECNUC= <off>
##$DECSTAT= 4
##$DIGMOD= 1
##$DIGTYP= 9
##$DL= (0..7)
0 0 52 120 120 21 21 25 
##$DP= (0..7)
$$ [...]
##$SUBNAM2= <"">
##$SUBNAM3= <"">
##$SUBNAM4= <"">
##$SUBNAM5= <"">
##$SUBNAM6= <"">
##$SUBNAM7= <"">
##$SUBNAM8= <"">
##$SUBNAM9= <"">
##$SW= 369.568048894756
##$SWIBOX= (0..15)
0 1 3 0 0 0 0 0 0 0 0 0 0 0 0 0 
##$SW_h= 29940.119760479
##$TD= 32768
##$TD0= 1
##$TE= 0
##$TE2= 300
##$TE3= 300
##$TEG= 300
##$TL= (0..7)
0 120 53 12 22 120 120 120 
##$TP= (0..7)
150 150 150 150 150 150 150 150 
##$TP07= 0
##$TPNAME0= <>
##$TPNAME1= <>
##$TPNAME2= <>
##$TPNAME3= <>
##$TPNAME4= <>
##$TPNAME5= <>
##$TPNAME6= <>
##$TPNAME7= <>
##$TPOAL= (0..7)
0.5 0.5 0.5 0.5 0.5 0.5 0.5 0.5 
##$TPOFFS= (0..7)
0 0 0 0 0 0 0 0 
##$TUNHIN= 0
##$TUNHOUT= 0
##$TUNXOUT= 0
##$USERA1= <user>
##$USERA2= <user>
##$USERA3= <user>
##$USERA4= <user>
##$USERA5= <user>
##$V9= 5
##$VALIST= <valist>
##$VCLIST= <CCCCCCCCCCCCCCC>
##$VD= 0
##$VDLIST= <DDDDDDDDDDDDDDD>
##$VPLIST= <PPPPPPPPPPPPPPP>
##$VTLIST= <TTTTTTTTTTTTTTT>
##$WBST= 1024
##$WBSW= 4
##$XGAIN= (0..3)
0 0 0 0 
##$XL= 0
##$YL= 0
##$YMAX_a= 4899
##$YMIN_a= -4497
##$ZGOPTNS= <>
##$ZL1= 120
##$ZL2= 120
##$ZL3= 120
##$ZL4= 120
##$ABSF1= 0
##$ABSF2= 0
##$ABSG= 0
##$ABSL= 0
##$ALPHA= 0
##$AQORDER= 0
##$ASSFAC= 0
##$ASSFACI= 0
##$ASSFACX= 0
##$ASSWID= 0
##$AUNMP= <proc_1d>
##$AZFE= 0.1
##$AZFW= 0.5
##$BCFW= 0
##$BC_mod= 2
##$BYTORDP= 0
##$COROFFS= 0
##$CY= -3
##$DATMOD= 1
##$DC= 0
##$DFILT= <>
##$DTYPP= 0
##$F1P= 0
##$F2P= 0
##$FCOR= 1
##$FTSIZE= 65536
##$FT_mod= 6
##$GAMMA= 0
##$GB= 0
##$INTBC= 1
##$INTSCL= 5.30512e-09
##$ISEN= 30
##$LB= 1
##$LEV0= 0
##$LPBIN= 0
##$MAXI= 10000
##$MC2= 0
##$MEAN= 0
##$ME_mod= 0
##$MI= 50
##$NCOEF= 0
##$NC_proc= -9
##$NLEV= 6
##$NOISF1= 182.463
##$NOISF2= 159.3651
##$NSP= 0
##$NTH_PI= 0
##$NZP= 0
##$OFFSET= 182.463
##$PC= 4
##$PHC0= -2661.834
##$PHC1= 310.199
##$PH_mod= 1
##$PKNL= yes
##$PPARMOD= 0
##$PSCAL= 0
##$PSIGN= 0
##$REVERSE= no
##$SF= 81.0140089999434
##$SI= 65536
##$SIGF1= 159.3651
##$SIGF2= -187.1042
##$SINO= 113.3802
##$SIOLD= 16384
##$SREGLST= <1H.CDCl3>
##$SSB= 0
##$STSI= 65536
##$STSR= 0
##$SW_p= 29940.119760479
##$SYMM= 0
##$S_DEV= 0
##$TDeff= 32768
##$TDoff= 0
##$TI= <>
##$TILT= no
##$TM1= 0
##$TM2= 0
##$TOPLEV= 0
##$USERP1= <user>
##$USERP2= <user>
##$USERP3= <user>
##$USERP4= <user>
##$USERP5= <user>
##$WDW= 1
##$XDIM= 65536
##$YMAX_p= 299622625
##$YMIN_p= -343161596
$$ End of Bruker specific parameters
$$ ---------------------------------
##NTUPLES= NMR SPECTRUM
##VAR_NAME=  FREQUENCY,     SPECTRUM/REAL,   SPECTRUM/IMAG
##SYMBOL=    X,             R,               I
##VAR_TYPE=  INDEPENDENT,   DEPENDENT,       DEPENDENT
##VAR_FORM=  AFFN,          ASDF,            ASDF
##VAR_DIM=   65536,         65536,           65536
##UNITS=     HZ,            ARBITRARY UNITS, ARBITRARY UNITS
##FACTOR=    0.456856943014862, 1,           1
##FIRST=     14782.0589164792, 0,            0
##LAST=      -15158.0608439998, 0,           0
##MIN=       -15158.0608439998, -343161596,  0
##MAX=       14782.0589164792, 299622625,    0
$$ Real data points
##PAGE= N=1
##DATA TABLE= (X++(R..R)), XYDATA
$$ [...]
##PAGE= N=2
##DATA TABLE= (X++(I..I)), XYDATA
8714 34249387 22902386 13843738 9928581 7419147 4044178 4267071 12474873 23626853
8706 23626853 25518294 11439273 -11084579 -25618791 -21721697 -4683843 10137787
8699 10137787 12144784 3243346 -7571667 -12888622 -9968648 -1222343 5399086 1805821
8691 1805821 -10085296 -18048172 -14096273 -4793316 -1324273 -3964950 -4299252 342184
8683 342184 4288359 5106598 8244389 17067157 25250530 23528782 10445624 -6604513
8675 -6604513 -18849755 -23224311 -23963685 -27672132 -35298367 -40087352 -35772037 -24811757
8667 -24811757 -14977500 -9665731 -6015821 -1401863 2809102 3678750 -276920 -7168285
8659 -7168285 -10530389 -3868940 9734368 17643371 13044971 4482140 2081549 956731
8651 956731 -9396704 -23725214 -24869143 -9378208 6130249 7802795 -225726 -8176863
8643 -8176863 -13959663 -16791399 -11064019 2618781 10553319 2010511 -14452693 -21276703
8635 -21276703 -13331541 120860 9892629 14026117 14070487 12392845 10945920 7693000
8627 7693000 -1485563 -13712131 -19516116 -17102375 -16331596 -21615837 -22639150 -12457945
8619 -12457945 -2767746 -6961156 -18309468 -21470060 -16992204 -15987644 -17631255 -12561768
8611 -12561768 -3768181 -2067590 -3796663 3175357 12230594 3634589 -19318507 -28302938
8603 -28302938 -12974997 2115801 -2511674 -11718194 -5919059 3930585 -2329551 -16451480
8595 -16451480 -15356668 -965078 3905370 -5437169 -9800282 -170543 8909234 5509351
8587 5509351 -2156535 -2216103 4083862 9688210 11884890 8910313 -1253812 -13638978
8579 -13638978 -19201221 -18290266 -19245418 -21582123 -15412227 -1540429 4229585 -5496196
8571 -5496196 -16699594 -13866253 -217665 11926936 19054216 23208168 21030517 9061604
8563 9061604 -6366842 -15553143 -16805633 -13141026 -4458031 7980455 16319711 15383384
8555 15383384 11241829 11354193 12862280 10229130 6677428 6573948 4303945 -5562701
8547 -5562701 -13963774 -9036925 3247759 8030587 7878468 19522192 42866880 54700631
8539 54700631 40954868 17067339 5221085 6025337 5993007 1789216 1394189 6587395
8531 6587395 8871375 2815223 -6532257 -10998808 -8260189 -3125052 -3373669 -12859103
8523 -12859103 -25712020 -29939256 -20020153 -3419250 7745457 7931362 -696275 -12427826
8515 -12427826 -19507120 -15707490 -4278031 2432414 -2815674 -12651746 -15525860 -10564853
8507 -10564853 -5009196 -1954887 329179 564476 -3783847 -8571320 -7063161 -1674567
8499 -1674567 -1389417 -6726932 -8080982 -1658599 3632865 -141144 -9136416 -16413703
8491 -16413703 -21948097 -26177980 -22397550 -6482062 11482507 17242229 11452562 7078561
8483 7078561 8604704 6477091 -5021552 -16440737 -16475953 -7863978 -1756982 -2205834
8475 -2205834 -5110782 -8819084 -15747220 -23487488 -23339680 -11225627 5163103 13471133
8467 13471133 8167211 -6261491 -19851970 -23421216 -14607230 -628450 7931529 8468428
8459 8468428 8354818 13610426 20621337 23544699 24467182 27936298 28511914 15379215 -8262465
8450 -8262465 -21830509 -11437099 10018324 17275802 3784750 -13083292 -17869624 -15314241
8442 -15314241 -17126196 -21591416 -17986252 -6051372 2522782 2750538 3644612 11212907
8434 11212907 15095858 2955936 -17845563 -26423623 -16518725 -5872087 -11898402 -27682428
8426 -27682428 -31829640 -17492002 -613829 1563717 -8794374 -15465980 -8855323 4640812
8418 4640812 12549896 10593590 5404218 5059697 9182340 9672951 1338069 -10387830
8410 -10387830 -15459948 -12551677 -11460352 -19272639 -28533624 -25528208 -8978008 7011079
8402 7011079 10342386 3760412 -4045924 -12436803 -24929752 -36008946 -34206480 -19413711
8394 -19413711 -5714383 -2401609 -1879562 6920441 21515907 30848056 30679942 24493948
8386 24493948 14533700 2872620 -2875407 2292886 8835358 2544889 -13324306 -20206567
8378 -20206567 -11372348 -2009268 -5789986 -15345794 -16013357 -7895279 -2406233 -4384154
8370 -4384154 -9007465 -11394818 -9541257 -2443833 5835420 5396228 -7154362 -20631677
8362 -20631677 -22491576 -14679997 -7345652 -3712725 -2019492 -4755473 -12085172 -12928426
8354 -12928426 691914 15270964 10710931 -8704366 -18837611 -11668822 -4020133 -5447569
8346 -5447569 -1673091 17614893 35469302 30472418 8941238 -4520592 -291757 9593079
8338 9593079 12661803 8210792 1252613 -2129332 4638742 20651115 32083896 26318499
8330 26318499 9774432 -8893 1560103 3251332 -455626 28734 11700759 24557452
8322 24557452 24596101 13472029 4534897 2797337 -363563 -11626663 -24487083 -29102777
8314 -29102777 -27177519 -28523550 -34575859 -34910446 -22788940 -5416243 6737969 12813436
8306 12813436 16065268 13672709 3726366 -3735297 2353640 14646924 14837022 645759
8298 645759 -11274181 -11467951 -8582002 -9090152 -5380329 6377316 14501665 10941209
8290 10941209 6474901 11971529 18415837 12355463 -473013 -5005185 -1163266 -85404
8282 -85404 -3107372 -2279684 3611192 9926719 17161322 25054045 23440914 7409566 -6135920
8273 -6135920 1617875 21193737 28084954 21222715 20956822 29913181 26498653 3415931
8265 3415931 -16776967 -16550505 -8384831 -9878319 -15718567 -11742018 595193 11317639
8257 11317639 19253393 25476593 21947787 4061969 -14711409 -16762641 -2229324 15636894
8249 15636894 28788369 35587640 32953458 21901438 13740108 16284918 19920334 11665440
8241 11665440 -2387557 -4144053 9944156 24470392 27162738 22480846 21321442 26898029
8233 26898029 33215890 31814937 19990306 5961441 2510512 11635548 21479652 23199947
8225 23199947 21897339 22928217 18044400 -1167166 -23057799 -25362557 -3617156 23142106
8217 23142106 35226910 29744362 15495710 1832782 -5548969 -6675539 -7342850 -11322966
8209 -11322966 -13471653 -7162509 3483147 6676287 -2989270 -20666648 -39142847 -52698100
8201 -52698100 -55625627 -46334791 -32526168 -24349576 -22801707 -21353251 -16702468 -10338345
8193 -10338345 -2248935 8029685 16027977 16863994 13545467 12323661 12132012 8004766
8185 8004766 2617473 3693374 10929661 16207125 16580968 16502846 16936726 13261732 5659213
8176 5659213 1439147 4444181 10585108 15746516 20037018 22664181 20548303 13934358
8168 13934358 6978218 2351253 1131062 5952494 16457399 24137109 20857759 9991642
8160 9991642 -597546 -12436605 -30377936 -46231697 -44998306 -27759905 -11867427
8153 -11867427 -5871933 -599465 10811004 20593742 20522559 13365682 3415605 -9520154
8145 -9520154 -19552703 -14708060 2208716 8955225 -6125316 -23491274 -18323612 3971392
8137 3971392 16601500 8492488 -6764330 -16037890 -21187271 -25753401 -23937181 -11046416
8129 -11046416 4965652 11108597 4689852 -4739665 -7514196 -4046117 -2001073 -5463030
8121 -5463030 -10535581 -13044425 -15837973 -23025266 -30621884 -30960877 -24362434 -17146290
8113 -17146290 -9581283 2787376 16162243 20529136 16579368 15561170 18152650 10339008
8105 10339008 -11660281 -29265168 -26397231 -11767149 -2401463 1543123 9219284 18237794
8097 18237794 20205853 18435070 20736562 21248611 9830530 -5224876 -6097824 4179118
8089 4179118 3185818 -15931587 -33078241 -32120798 -23142027 -22433184 -26705848 -22104087
8081 -22104087 -8411318 1198062 573851 -1512016 5988629 23152111 39455671 44350980
8073 44350980 37636985 29567320 28831844 32444119 32246924 28541323 28622583 32497438 30743009
8064 30743009 19334451 6805418 2187378 4460853 8878245 14855761 20873127 19938911
8056 19938911 9524433 333846 4615171 17950512 22639126 10012003 -8639847 -15969921
8048 -15969921 -7618784 5980644 12903585 10575046 4383695 -688683 -4760859 -9726288
8040 -9726288 -13600213 -11217620 -1644506 7542980 6961007 -3099409 -11297053 -8209629
8032 -8209629 1686194 5999098 1646099 -1529481 2666348 5606500 -2208621 -13117969
8024 -13117969 -11254645 3526866 15796595 19138393 23762062 34718124 40083868 30982423
8016 30982423 17720283 12568030 10409884 2781421 -1665082 8504453 21808661 16697419
8008 16697419 -3155418 -11053580 3318244 20190257 21335055 13359753 9427211 7121732
8000 7121732 -1729563 -13633637 -20098658 -21398052 -21224814 -16801055 -6382438 1831333
7992 1831333 934946 -1683043 4028740 11511830 4567459 -17835016 -37038494 -36960302
7984 -36960302 -20900560 -3349855 6928937 11287321 13621974 14020705 10839021 6997842
7976 6997842 9941978 21464383 30527648 24099911 5597641 -6517989 -1951679 8560214
7968 8560214 9495161 1505254 -2619952 2170937 7166746 3072019 -7857669 -14406984
7960 -14406984 -8553343 5223425 13477036 9541658 3440066 8750626 21033229 21168361
7952 21168361 2795907 -17083592 -21736098 -15520488 -10620098 -6005918 4677048 13742713
7944 13742713 7702970 -8120293 -12760525 13867 11471951 4523617 -12917473 -20160655
7936 -20160655 -10414282 4053860 8654438 412878 -13107925 -22807756 -24976183 -21609790
7928 -21609790 -15522576 -7128225 2666508 9431341 9273950 4658346 1942937 3563372
7920 3563372 6177921 5918521 2293257 -2039588 -2282482 6081539 22324665 39024787
7912 39024787 48077542 46512483 35537210 18758075 3626459 -2250344 -888963 -2919294
7904 -2919294 -11383485 -15701126 -9932850 -5875459 -14128677 -21971012 -9789389 15363441
7896 15363441 25547212 12556594 -544680 4438867 15354775 12972732 581861
7889 581861 -6618929 -6685433 -5666692 1816805 23746528 47042372 46376555 19502102
7881 19502102 -6129177 -8621299 3017568 7389258 -151976 -9240039 -14732837 -20093983
7873 -20093983 -25002337 -23862162 -17175992 -13075241 -14665790 -14554833 -5826645 8445694
7865 8445694 21020226 29712796 34973386 32899537 18603519 -3995511 -22236447 -26417829
7857 -26417829 -17998043 -5403274 4891317 11846045 17038128 19994569 16237333 1837304
7849 1837304 -18283294 -30361419 -25667585 -12338191 -6387872 -11684464 -17298667 -15774165
7841 -15774165 -13906935 -20370283 -31261509 -35448358 -28615177 -14997603 -146109 10748724
7833 10748724 11781030 1856575 -10944749 -17057874 -14996189 -8177705 2375811 14530966
7825 14530966 20133447 14560720 7562025 12372914 25591312 30804185 22703277 14101087
7817 14101087 15836227 22790997 25650181 24762625 24188814 21525186 13398191 4583378
7809 4583378 1755277 1867518 -4119819 -17233790 -27680809 -26521249 -15363343 -3941329
7801 -3941329 -845870 -6300828 -12231378 -10229881 -230336 10181522 14520479 12071666
7793 12071666 4541003 -6145236 -15273555 -16588111 -9456329 -545247 4387800 6418148
7785 6418148 9214489 13638637 18775255 23298072 23740143 17376437 9202909 8570155 14855613
7776 14855613 14918205 1667133 -12552490 -10796770 5329498 18126544 16966210 7870712
7768 7870712 -352940 -8215505 -18986916 -28120365 -26845183 -14071621 783848 7430474
7760 7430474 4561993 -786229 -2391676 -1561301 -3949183 -11245570 -18767304 -21389456
7752 -21389456 -18836707 -13769367 -7286031 1247890 10908694 17678184 16885045 7907962
7744 7907962 -3392130 -9262930 -8581891 -7461194 -8770802 -6506649 3247269 11323956
7736 11323956 6012382 -7857241 -12819899 -2692396 9876725 12819365 8988356 5857350
7728 5857350 3427047 222199 40216 3185772 912597 -10797786 -20835551 -17940025
7720 -17940025 -7904549 -2675103 580802 13628645 33802665 43082155 32252390 13031592
7712 13031592 2924467 7455844 19443203 27525766 24031623 12054357 5610181 15749164
7704 15749164 36356002 50252992 48203065 34916858 18922349 5793901 -188109
7697 -188109 1995509 6034173 4787522 491788 338458 3893405 4620664 1681864 -888261
7688 -888261 -4435753 -12061577 -16356635 -6010289 14588621 27956414 27633525 23362159
7680 23362159 19679618 8768991 -8782194 -16620704 -8028238 -415896 -8882762 -20957894
7672 -20957894 -16535044 -1066835 2480408 -11634324 -26136895 -27752091 -21146276 -14902487
7664 -14902487 -10360693 -7883910 -10351466 -15869747 -17796325 -15460386 -14853040 -15880860
7656 -15880860 -10020529 4271508 13904376 6688407 -11684460 -23649113 -19446929 -4911096
7648 -4911096 8176427 13718264 13047979 9556915 4860832 12910 -2493560 -855269
7640 -855269 2924015 5643705 7908062 11480189 12270245 3999902 -9369643 -14762316
7632 -14762316 -8585448 -3777048 -9828969 -16103947 -8006832 7893027 11220546 -2846162
7624 -2846162 -18530198 -24436857 -26571796 -31520169 -32383314 -21222528 -4614139 4197484
7616 4197484 2410339 -2581882 -6446672 -11960954 -20937468 -29042228 -30016541 -22223904
7608 -22223904 -10471679 -1840968 1050986 1844646 3982921 5412520 3814141 3315986
7600 3315986 8509059 14177219 10581402 -1407206 -10943153 -14115731 -18636562 -28086955
7592 -28086955 -33288965 -25862104 -10380126 4302000 16634702 27006369 29451298 19061390
7584 19061390 2105468 -10482445 -15389387 -15472973 -12057971 -6812746 -4921488 -7229445
7576 -7229445 -5551752 4366710 12398675 8651097 1578912 6267574 19373358 23252295
7568 23252295 13573499 4198952 2508136 -1057913 -12214256 -18900518 -8879672 11310230
7560 11310230 25831444 28200547 20737977 5088819 -15204554 -29774481 -30727901 -22972811
7552 -22972811 -16756547 -14838232 -14777427 -16904107 -19895207 -15155056 1922401 19974045
7544 19974045 24664487 20444410 23845533 35390298 35516513 14007212 -11765655 -18285292
7536 -18285292 -5341611 7486211 7572752 323067 -4621662 -6525705 -9392426 -12486363
7528 -12486363 -11503462 -6754029 -4328761 -8094210 -14882993 -20445250 -26152525 -34103591
7520 -34103591 -38409644 -30877148 -16627487 -12764103 -24969224 -35718559 -26713906 -5369623
7512 -5369623 5148389 -1868498 -10403592 -7431338 1841309 8639177 14558746 22282461
7504 22282461 25510749 19675608 13584801 18233797 29629159 34040442 26929937 16435050
7496 16435050 10034512 7308556 5860310 6511884 10796187 17182175 20260222 13337372
7488 13337372 -3588488 -17137469 -10606094 13647506 31196644 24176037 4350709
7481 4350709 -4714310 -830182 -1674147 -13632292 -22045370 -16138411 -5440861 -2220878
7473 -2220878 -1722958 7559965 22703625 28802461 19562394 4633503 -3834423 -4149397
7465 -4149397 -2629236 -3065167 -1947329 6193818 20284646 31944301 34589305 30442831
7457 30442831 25218961 19183693 9287170 -2034581 -7367770 -3325759 6766681 17423232
7449 17423232 21677662 11448646 -11499382 -27596682 -17794575 8292027 18889166
7442 18889166 702070 -22906261 -24070171 -5859824 8120726 7462265 1322976 -1560156
7434 -1560156 -1612254 228047 4304182 5364733 -3124560 -17043392 -24832217 -22604554
7426 -22604554 -15854485 -7404383 4303310 14769876 14113100 1093450 -13896169 -22261989
7418 -22261989 -24130111 -21086981 -13764388 -8820730 -15261987 -28891730 -32714158 -19331051
7410 -19331051 -1484406 7055242 9148044 12864084 13867975 3480676 -12691498 -19600227
7402 -19600227 -13812575 -6005874 -3025440 -1096439 943168 -4760107 -21208376 -35831925
7394 -35831925 -32997412 -13156884 7959561 17156727 14349785 6605407 -971824 -6119661
7386 -6119661 -7015712 -4084573 -1787860 -3565614 -5900764 -2943786 2695315 1004583
7378 1004583 -10061791 -17714122 -10586434 3061034 3957098 -12266571 -28677366 -29254748
7370 -29254748 -17923867 -10257296 -13693579 -22497515 -27360328 -23597298 -12683992 -611324
7362 -611324 7128420 11332093 16447790 20990767 17405562 4935427 -5417771 -5131883
7354 -5131883 -54631 -33649 -3385786 -1692518 5277864 10850792 13805826 17020661 16327498
7345 16327498 4944845 -10774077 -14874133 -4257828 6552033 7919956 7531070 12337377
7337 12337377 13067104 26656 -17023667 -21258093 -14553911 -13635843 -22618233 -26590148
7329 -26590148 -15254554 2043734 11052322 10698518 8647082 7404647 3743462 -2954894
7321 -2954894 -9921727 -16405098 -23562144 -29827570 -31198286 -26346076 -18652096 -12819872
7313 -12819872 -10302955 -7762908 -1014984 7699173 8982839 -2243647 -16737725 -20146439
7305 -20146439 -11650262 -3625832 -1651258 2146831 10208010 8555651 -12637543 -38387578
7297 -38387578 -45702612 -35524437 -30056755 -39565180 -49927442 -46221028 -31996146 -18866367
7289 -18866367 -11390557 -10199457 -17314707 -28821753 -32905817 -25099816 -16283258 -15916697
7281 -15916697 -17003249 -9045030 3317419 8457636 7412522 10087162 16539128 18283579
7273 18283579 16200832 20291957 30181527 31650615 16782706 -5820253 -25418857 -40652421
7265 -40652421 -50902036 -49414203 -34609099 -18569576 -13791326 -17653157 -19196678 -16119452
7257 -16119452 -15476590 -20521286 -26140735 -27278445 -24822973 -21614998 -16997193 -7667901
7249 -7667901 6784936 20226776 24350105 19455502 18015851 31337873 53900105 68682223
7241 68682223 67965623 59391628 50036970 36725817 18322141 6103738 10878764 26412073
7233 26412073 36644399 35638959 30406484 26563732 21501232 11970354 130222 -9390399
7225 -9390399 -12843749 -7670698 4961956 17461361 20560920 12082485 -1458141 -11477954
7217 -11477954 -13766507 -10706261 -9639541 -16089252 -25998071 -28774330 -21195948 -12845135
7209 -12845135 -12962164 -17868765 -18106931 -12310225 -5413165 1972388 11660457 18054308
7201 18054308 12001940 -4833720 -19702200 -24776773 -24249094 -22908105 -17164272 -3185217
7193 -3185217 12561364 18141923 10033614 -2158045 -5429521 3081962 12799122 11494333
7185 11494333 257128 -7663603 -4632337 1427865 6636 -5952507 -5778848 1779773
7177 1779773 7525129 5943076 468265 -4474706 -7314928 -6167413 -1790996 -3127545
7169 -3127545 -18734204 -41560080 -53314600 -46450667 -31564401 -20595151 -13812684 -7285435
7161 -7285435 -1927268 976917 3911203 6715061 4365532 -3337580 -8568629 -7941575
7153 -7941575 -9227082 -18422649 -28582579 -29936843 -23768789 -17147510 -10383322 -148478
7145 -148478 9197387 8227235 -4445506 -19741298 -28743567 -30250664 -28786994 -29821186
7137 -29821186 -35659413 -42529431 -43878743 -39090925 -34954287 -35561556 -36116420 -30931735
7129 -30931735 -21889333 -13892314 -7842909 -4224700 -7485094 -18723781 -28571600 -26316651
7121 -26316651 -13867065 -2773067 1017512 1946831 5173454 9308228 10202695 7593653
7113 7593653 6256375 11206915 20758155 25413436 18328296 6364482 3340521 11519124
7105 11519124 19326536 19576977 17687322 16665313 8361327 -10013576 -23876300 -20110012
7097 -20110012 -7811245 -4491926 -9872616 -10882212 -6319549 -6575869 -11334932 -8210737
7089 -8210737 4543732 13043194 10134046 5699669 8163042 11132004 7115949 1790537
7081 1790537 4489267 13379654 19393942 18938737 15359764 12171624 10135245 7549295
7073 7549295 585423 -12555150 -26238022 -30628210 -21051897 -670667 22973494 37926944
7065 37926944 30423456 5347 -30496484 -34190570 -10061404 18322301 32614175
7058 32614175 33479969 26214812 12345981 -841750 -2342419 3791849 217536 -14999156
7050 -14999156 -21109619 -7283057 7629360 3495190 -11210549 -16880208 -14201975 -15748770
7042 -15748770 -18393263 -9332427 6787405 11727150 3190589 -2089211 3924008 10575738
7034 10575738 9922629 8964952 13909744 18189673 14478803 6622378 1504114 -2083338
7026 -2083338 -9347590 -20482734 -30938876 -36411147 -35070322 -28750077 -22269401 -17775303
7018 -17775303 -12141225 -5033374 -4394482 -15036769 -26667161 -25224801 -13184877 -5119958
7010 -5119958 -4271256 1280890 16771011 29665262 26269500 8633050 -10648799 -21920474
7002 -21920474 -22605673 -15854197 -8730953 -5723132 -3730898 -241845 -2399625 -15385836
6994 -15385836 -25466191 -13186599 15285922 30884200 22135349 11675967 20548005
6987 20548005 36286773 34643313 17340084 5943948 7331611 8407312 2392970 -1213377
6979 -1213377 4390145 11889009 12925224 9689340 7794814 7525114 7494055 9141302 12684632
6970 12684632 14744296 14003679 13864700 15991044 16482792 12608370 8834503 10847883 16047361
6961 16047361 15893492 8182120 1616654 4341981 11073845 8266686 -7227480 -22187036
6953 -22187036 -24058922 -16590872 -10706459 -6822163 1546353 11058640 11142491 2881714
6945 2881714 -1646212 -1669908 -11010646 -32314387 -46721563 -40465436 -24482717 -13522128
6937 -13522128 -2736750 16599251 33263922 31007691 16914833 10568345 12042899 6325019
6929 6325019 -4704694 -2907012 12402421 19286697 7890977 -5120346 -5605079 -1740527
6921 -1740527 -3873479 -6844506 -5536904 -7633638 -16338954 -19366714 -10552843 -3827248
6913 -3827248 -8915867 -12435278 -3182849 3234955 -9679043 -25901957 -20120818 -2336694
6905 -2336694 -4556923 -28234177 -41683488 -31989372 -22426568 -28099279 -29758433 -10912292
6897 -10912292 8738192 2881189 -18988443 -26286234 -11896619 4112879 8036775 5030416
6889 5030416 601454 -7664431 -17807587 -21521898 -18442539 -17705774 -21814751 -22313096
6881 -22313096 -15097363 -7080612 -2781564 3533669 15515046 24669631 21104115 7998787
6873 7998787 -2105177 -1830101 5195906 9694731 4496336 -9446641 -22141497 -23377316
6865 -23377316 -14117017 -4683685 -1107086 -95887 963660 -1898510 -10233609 -16442093
6857 -16442093 -13387314 -5100623 -393946 207518 3973898 15046967 29968857 41785720
6849 41785720 44128395 35074241 21845548 16706058 22097439 25299296 15220282 -1617145
6841 -1617145 -11479677 -13698001 -17527566 -22781100 -19773638 -9113947 -4888618 -13066328
6833 -13066328 -21576397 -19545505 -13078408 -11868827 -11864494 -4171196 7375653 12074304
6825 12074304 10818396 13761342 20972344 20186962 6613475 -7577849 -9397677 -1620817
6817 -1620817 3639866 1728614 -1776322 -2089481 -1580214 -4338235 -9442219 -12562506 -12279236
6808 -12279236 -11494047 -12010412 -10641132 -3549455 6954642 13831471 13626201 9514456
6800 9514456 5391373 1246751 -3962610 -9097267 -12715722 -14275266 -11626961 -2273942
6792 -2273942 10079676 15651071 9552404 -1646863 -8331908 -8513297 -6404623 -5471037
6784 -5471037 -7019108 -10018214 -8134177 5561978 25155567 32197072 18213867 -2076917
6776 -2076917 -11351067 -14132601 -24983960 -39778389 -39705959 -22749563 -9235640 -11017038
6768 -11017038 -15068666 -7120745 5531107 7760422 341453 -4551652 -3590129 -4250913
6760 -4250913 -10583369 -18473131 -23432069 -24663762 -22469900 -17469514 -10908559 -2322240
6752 -2322240 9649853 21530839 25742488 20562677 13238754 9801760 8973608 9510614
6744 9510614 14197434 21376424 22816840 17064431 14270436 19050986 19962069 7719939
6736 7719939 -6884327 -8085031 277888 1835008 -6522488 -13456979 -14517512 -16694680
6728 -16694680 -22021957 -23761230 -20579701 -18556418 -16626166 -6163094 10504355 16745844
6720 16745844 3672862 -17519986 -32212548 -39312597 -44310944 -47127956 -45682689 -41847357
6712 -41847357 -35302400 -20580784 925336 14954268 10852602 -2830103 -9891948 -8150782
6704 -8150782 -8352985 -14806637 -18677098 -11022328 6046445 22707465 30302104 26253346
6696 26253346 14655014 2736373 -5485570 -11065900 -14588904 -12891135 -4894712 3177136
6688 3177136 3725035 -2782470 -8543015 -7484273 -447671 7367127 11518351 11977517 12932925
6679 12932925 17092689 20254939 15587629 3735699 -6766534 -10342084 -9000981 -4023526
6671 -4023526 8402958 27597086 42039241 41263245 30123106 23023708 25810507 30439082
6663 30439082 26809932 13701857 -2394469 -14611789 -20746551 -23373685 -25664976 -27251314
6655 -27251314 -25787907 -21630483 -17259809 -13121822 -9461544 -10854497 -20613869 -31037985
6647 -31037985 -30256916 -20825064 -18590854 -28000181 -32701942 -19942216 -733283 7387520
6639 7387520 6283810 9951424 19733091 24467485 20679832 15229370 10084814 1182941
6631 1182941 -8276257 -9595970 -3874403 228392 4027482 16397921 31990009 31866223
6623 31866223 12541221 -4709357 -4145425 1920864 -4990722 -19273440 -20700486 -5853989
6615 -5853989 8312803 9899698 4712698 1728993 -328401 -5760898 -9871550 -2555963
6607 -2555963 17514457 37865391 43958455 34338293 20583321 12142525 7319291 2986802
6599 2986802 5164637 19624641 36776178 39613141 26260673 10886540 1278365 -8461568
6591 -8461568 -18883090 -17532219 -1273010 9943799 -2057594 -25603711 -33355574 -18375472
6583 -18375472 956812 8701574 6818801 2584403 -2899734 -8706926 -9591792 -5103236
6575 -5103236 -4991036 -17659286 -36916916 -46433574 -37275330 -18070261 -6335744 -9743628
6567 -9743628 -18476335 -19471005 -14959997 -18089332 -30535204 -37448836 -29943611 -19252016
6559 -19252016 -18475287 -22463109 -19802451 -14489833 -17918418 -26110057 -25060799 -16123819
6551 -16123819 -15075715 -24559754 -28531893 -19582035 -11533656 -15065663 -18681761 -7744142
6543 -7744142 10933894 19158940 13900985 8909985 13374606 21027437 20033017 6381816
6535 6381816 -11603689 -18592328 -6407819 13935436 21184652 8902942 -7058053 -11650881
6527 -11650881 -10641196 -18355315 -35082829 -48708048 -51791808 -44573727 -27118702 -2541587
6519 -2541587 15801035 14959581 -713916 -15629295 -23763369 -29860389 -32369057 -22947640
6511 -22947640 -5513882 2028190 -7439397 -18293275 -14040311 1329928 14032773 20950946
6503 20950946 26216892 25762901 11168987 -12960113 -28951489 -25761118 -10410132 1795544
6495 1795544 2104174 -7312936 -17764495 -21229237 -17103384 -12403433 -12694675 -14589825
6487 -14589825 -11124188 -2170864 5990088 9822465 10838230 9249289 2366437 -8919879
6479 -8919879 -17850252 -18992517 -14289019 -9975841 -10269115 -15058793 -20614167 -21473612 -14745668
6470 -14745668 -3802200 4609820 7188713 5551655 1841754 -3006532 -6861026 -6906959
6462 -6906959 -3032850 3426640 13549312 27402852 37259755 32914868 16344665 2330746
6454 2330746 -470132 -987563 -11376990 -28319784 -37857166 -34430020 -25474014 -19256329
6446 -19256329 -17231334 -17693029 -18602506 -16551130 -10209702 -4886275 -6639152 -12128795
6438 -12128795 -11921453 -3951698 4282884 7213709 6216548 2682268 -3637836 -7300542
6430 -7300542 308921 16145899 23868440 13798382 -4866364 -18720889 -26695719 -32792632
6422 -32792632 -33088950 -23486392 -12808962 -12806293 -19414664 -19513121 -13561070 -14151996 -21788186
6413 -21788186 -21272469 -7883874 971852 -8986548 -26632311 -32230542 -25690331 -21953612
6405 -21953612 -24657172 -22137642 -9452280 1605718 -654110 -12471228 -22541807 -27131464
6397 -27131464 -30011711 -32141406 -28843614 -16643718 1308535 16929023 23017014 18846918
6389 18846918 11262832 8346313 10786128 11919305 7697398 3094063 5285990 13253264
6381 13253264 19070505 18590947 15399759 13174681 9726216 2265300 -5622384 -8057251
6373 -8057251 -6471641 -8853237 -18036830 -26130315 -23994644 -12583043 -703443 5932368
6365 5932368 8384595 8271985 3700852 -6680640 -19311619 -27894639 -28087998 -19082535
6357 -19082535 -3610040 11418070 17205425 9987247 -4656312 -16852504 -21382583 -19666004
6349 -19666004 -14560078 -7706551 -2588490 -4806486 -14908248 -23606582 -19824313 -4037659
6341 -4037659 10822059 13158478 3413841 -10516223 -22985907 -31205991 -31153267 -20816575
6333 -20816575 -6317858 2690015 4158678 3549141 2894123 -999262 -5667137 -1366495
6325 -1366495 13428650 24679535 20361042 8111745 4318076 10709440 14118996 6847811
6317 6847811 -5671400 -17090713 -26558463 -30477874 -20947144 1605029 24164851 35699359
6309 35699359 37688905 34839574 25151051 7787257 -7166974 -7952423 3120433 12237955
6301 12237955 10676004 1612429 -7660885 -12878000 -12797526 -8799630 -5415859 -6970331
6293 -6970331 -13205335 -20432343 -25210552 -24611588 -16698111 -4914949 1887643 -739492
6285 -739492 -6274364 -6229012 -2189978 -1694258 -5126542 -5839386 -2511322 -1515822 -4896578
6276 -4896578 -5129244 3109773 12478394 10872216 -2813472 -16191868 -16608944 -3993799
6268 -3993799 9841940 13249597 5231245 -6133708 -14223575 -19635495 -24646804 -26355391
6260 -26355391 -19538666 -4372614 12612273 24188305 26334312 19056973 7396283 -495797
6252 -495797 -803000 2019309 2738609 3795203 10313299 19098205 20573574 12051136 1873146
6243 1873146 -1539993 1004215 3301541 2180152 -319553 -194651 4380109 10302027
6235 10302027 11927754 8545237 6199414 7681157 5382662 -7955764 -25075083 -31425733
6227 -31425733 -25090147 -17342545 -12746404 -2961163 14551433 25537308 16837017 -3918913
6219 -3918913 -17235617 -14536334 -2625968 9206399 15999904 14072855 2045272 -13988794
6211 -13988794 -23302555 -19974562 -6337501 10683841 22235352 20029736 3297533 -17307579
6203 -17307579 -28131675 -24818750 -13286893 -1329239 6239271 7336731 3834485 1663163
6195 1663163 4536858 9042007 10187278 8611615 6775299 2020708 -8555819 -18911238
6187 -18911238 -19241673 -10432715 -4440934 -8358021 -15529215 -15208373 -5232661 7282241
6179 7282241 13108082 7252350 -7206016 -20370128 -24532511 -21804469 -18549090 -14370519
6171 -14370519 -3927210 11294265 22073150 23661163 20429981 16555753 11093450 5077066
6163 5077066 3710617 6696899 5652410 -2770181 -10049202 -9432187 -7785539 -14220229
6155 -14220229 -23799453 -23937003 -13142964 -2277567 1345233 1271884 3631962 9779528
6147 9779528 17098428 20548948 15100088 3620208 -731274 10757771 27541977 30518407
6139 30518407 16494974 136745 -8540495 -14524244 -22155496 -23853192 -13075741 2607299
6131 2607299 11722131 14544703 18784189 25504530 28885693 26085982 19291757 11339511
6123 11339511 5646775 5772698 8829278 5668353 -5044556 -10833505 -3421349 5656992
6115 5656992 1237945 -10342179 -9599684 5416882 15574803 9243235 -3886246 -12190242
6107 -12190242 -17657531 -24232708 -26914032 -23492706 -23772503 -34442288 -45056486 -41809044
6099 -41809044 -27261349 -14526830 -9281208 -9397605 -14919462 -24670493 -28421114 -16862083
6091 -16862083 3156326 15784539 16127065 11484904 6207867 -1306865 -8523612 -9630409
6083 -9630409 -6478587 -6054986 -7258907 -2939085 5337994 8697459 7832039 13388903 26999089
6074 26999089 37187211 38298363 38113370 40849918 38343307 26764287 17429440 19568099
6066 19568099 24242611 17968990 3452951 -5343658 -2249410 7437853 16470130 19921765
6058 19921765 16126415 11203546 15032114 24753304 22289653 -600212 -24611994 -24648820
6050 -24648820 -2267474 18812689 24236797 19454433 11695763 96900 -13330612 -18483056
6042 -18483056 -9534298 6892394 20178824 25007605 20784537 10607566 2982768 5866946
6034 5866946 15636237 18906077 8271303 -9386454 -21922185 -23565794 -16416828 -6305217
6026 -6305217 859801 2795599 1907072 366489 -3212294 -8360162 -9021078 -2421062 2843685
6017 2843685 -2951241 -15215989 -20051592 -13132071 -3429772 829749 -561793 -5882668
6009 -5882668 -13465076 -16751278 -8514761 7556736 18732553 18391221 10897987 1369820
6001 1369820 -9523240 -20065988 -26834090 -29988390 -29928737 -20893846 -248807 18534677
5993 18534677 18668690 5736936 1881507 11482405 13373146 -5102057 -26754773 -29992799
5985 -29992799 -18676107 -11500536 -14669495 -20641647 -24256667 -25438349 -23210586 -19439819
5977 -19439819 -21343036 -29402848 -31350846 -19658992 -5937098 -5018853 -12982761 -14800957
5969 -14800957 -7019283 945069 2617728 -1071329 -7790661 -12761297 -8097249 5328684
5961 5328684 12787652 4343348 -10122380 -17264960 -20602144 -28268849 -32201830 -20922766
5953 -20922766 -4385421 -1761765 -9372469 -6279298 9874461 19105456 13135576 6653951
5945 6653951 8625362 7791488 -3468155 -13648150 -12499915 -7135873 -5453024 -1867319
5937 -1867319 7366979 12260643 7222996 4859467 15214759 25527114 19027624 2817569
5929 2817569 -2227740 7829773 17526638 16011340 7326361 -1040386 -5982430 -6398196
5921 -6398196 -4207280 -5822511 -13049397 -16165183 -6196347 9840130 16728606 10729269
5913 10729269 789808 -6664880 -12762769 -17774318 -18583613 -14669199 -8789215 -3109973
5905 -3109973 -803082 -6649541 -18157689 -22737542 -14451273 -6606804 -13669814 -26425560
5897 -26425560 -22595397 92910 20400528 24776926 23049675 27217574 32345825 28592704
5889 28592704 18292475 9307406 1564407 -8015463 -14630093 -11280754 -1057865 5884292
5881 5884292 4846157 -1100513 -7677184 -11355123 -8590369 -411831 5253711 2461943
5873 2461943 -4812124 -9848138 -13370490 -18034865 -17724163 -4829139 13006575 17425791
5865 17425791 4357271 -8090214 -3872046 9719308 15694582 13978029 19177327 33424208
5857 33424208 37653611 16637927 -18297264 -41520806 -42456982 -32906867 -27605856 -27715001
5849 -27715001 -25274147 -15770853 -1664335 12268118 22861980 29380055 32509735 32123879
5841 32123879 27127932 19796269 17430865 23871842 30856089 25711021 8092515 -9754351
5833 -9754351 -21038791 -31656914 -44337062 -47748215 -32303224 -8323267 4795797
5826 4795797 2919124 -2413446 -4780828 -9230870 -17291881 -20695118 -15118131 -7915945
5818 -7915945 -5201172 -1306632 10440834 24213401 28630779 22772083 16135879 14583505
5810 14583505 14374858 10336537 3614323 -438143 1496720 7961329 14505375 17777704
5802 17777704 18466589 19542269 21749709 23045345 22519158 21387212 19344720 14347651
5794 14347651 7832176 5098427 7230423 7942949 3700026 2080583 12156260 28987179
5786 28987179 37160843 30956501 22073656 23148416 31227693 34573389 30438578 26581616
5778 26581616 26871022 25884636 20143959 14811701 13404312 9521746 -2066908 -12870794
5770 -12870794 -11586044 -3887248 -6350144 -20249051 -28096080 -21365653 -14033415 -17529702
5762 -17529702 -19123543 -3457948 16580238 14083640 -11092981 -29840377 -24295145 -8550360
5754 -8550360 -2311328 -4562903 -4770492 -3020010 -4343893 -5376659 -1618830 931624
5746 931624 -4354492 -10147356 -4303225 11118364 22360979 21503984 10615241 -6288629
5738 -6288629 -23333625 -30029092 -22078454 -11297900 -11120644 -16121078 -11530939 161891
5730 161891 1234161 -11965478 -22034724 -18234714 -11773512 -14024730 -17231148 -10355035
5722 -10355035 113710 1138931 -5194356 -7528171 -5861828 -9486096 -18249189 -23143199
5714 -23143199 -25099529 -35936122 -56539737 -69426008 -61346214 -42449104 -33191727 -39016609
5706 -39016609 -47792959 -48647797 -43431753 -39161500 -37054138 -32868165 -24586144 -15979085
5698 -15979085 -12554562 -15288474 -18947017 -17117427 -9333219 -2505558 -3870679 -12251952
5690 -12251952 -17848975 -12298275 1560688 12096729 11646253 4463776 142924 1800282
5682 1800282 4908151 6705495 10986877 21368541 34145464 41567000 40146150 32779936
5674 32779936 24201652 16905846 10249584 1442174 -11008794 -22919733 -26046028 -17353860
5666 -17353860 -4698540 824836 -2710672 -7293272 -6154253 -1271074 1204297 -1000802
5658 -1000802 -5106452 -7815693 -8550378 -8746701 -9376569 -9661269 -8624358 -7668241 -9489280
5649 -9489280 -13056965 -12327597 -3503484 7754772 10787568 2067701 -10808310 -18044796
5641 -18044796 -16814090 -10134911 -968550 8665885 14913962 13318572 4127912 -5993116
5633 -5993116 -9477782 -4876259 2505389 6923397 7951445 9081779 12104426 15568832
5625 15568832 18303793 20433337 20015777 13967308 5611999 5562784 18362721 32166400
5617 32166400 30727902 14550109 323690 -1948563 -669541 -6824173 -16425532 -17506260
5609 -17506260 -8236314 2085965 7363353 10316668 13918551 16044309 15249527 15502321
5601 15502321 21183126 30248087 35089726 29578798 15360386 1964943 -1699296 1649509
5593 1649509 -1170490 -16658033 -32141948 -28576324 -5191545 17646524 22513243 13422539
5585 13422539 5781059 5820327 8040686 8413675 9881882 13634890 12906058 710147 -18877487
5576 -18877487 -32099618 -29550580 -16658146 -7887469 -11372161 -22509321 -32673994 -38549513
5568 -38549513 -39602624 -33097535 -19934279 -11188276 -17043402 -29162311 -27035468 -6357421
5560 -6357421 11419374 6478288 -12973305 -23770760 -19623175 -14772468 -18787570 -24233018
5552 -24233018 -22843568 -19856929 -24138810 -33096259 -36432893 -30053463 -18506632 -6639801
5544 -6639801 3891709 10989556 11902223 8174667 6233305 10362505 17075965 18703576
5536 18703576 12012894 1406241 -6884599 -11679194 -15449534 -17457331 -13566989 -4913315
5528 -4913315 -1146444 -9354383 -23087001 -29658107 -27404866 -27856316 -39124139 -54275937
5520 -54275937 -60138747 -52913676 -41006309 -35242907 -39034080 -45463299 -42173182 -22796661
5512 -22796661 3742236 18684187 11545706 -9143147 -25080171 -25460982 -13499706 86461
5504 86461 6523499 4624607 613353 1307554 6169677 8273714 3484974 -5280498 -13442619
5495 -13442619 -18771770 -18779832 -11675122 -3399079 -5286855 -18419047 -28116775 -22391408
5487 -22391408 -8795574 -2465214 -3680353 -874174 7643768 11133470 6724199 6171295
5479 6171295 16522345 27848391 29170869 25752813 29583941 39834254 43998907 34864276
5471 34864276 17133225 -44355 -9116189 -6034230 4826835 9865608 27051 -15239080
5463 -15239080 -17536864 -3875845 8579824 5184076 -8368628 -16528788 -14093870 -7846296
5455 -7846296 -3354181 28738 1960751 -2045353 -13429050 -25485642 -29406222 -23462847
5447 -23462847 -13751933 -6984023 -4468148 -2736078 1634935 8556776 15143000 18590781
5439 18590781 17555225 11832377 3148134 -3522660 -2706667 5067744 11641862 9390765
5431 9390765 248490 -6540619 -5602883 -1416374 -2479232 -11742503 -23696892 -29781218
5423 -29781218 -26626046 -19451636 -15657206 -14441669 -7541786 5958310 12133346 -748251
5415 -748251 -21375086 -25363793 -7495591 10825876 12038928 4842618 5276421 10346681
5407 10346681 8064644 3127083 10077613 24517851 24840984 5864536 -10897846 -8049831
5399 -8049831 5675214 14267456 17776456 23290812 26965453 21072201 9558956 1919961
5391 1919961 -1160186 -3268462 -1537694 5769870 8929783 -393916 -12277138 -11099274
5383 -11099274 -544259 896220 -13189598 -31053851 -41218736 -40101275 -23751095
5376 -23751095 8001862 38102093 43688038 26249056 12213765 17270369 27539894
5369 27539894 23665149 6458213 -11072563 -21926169 -24820127 -19196589 -10913687 -10928355
5361 -10928355 -19476970 -24251724 -21729911 -23823783 -33429752 -33001527 -13275677 5481111
5353 5481111 2167456 -10817149 -7056895 11513606 19988023 12329693 8017829 16076580
5345 16076580 21077902 11954196 -281973 -4439336 -7553587 -17686205 -25405056 -18753111
5337 -18753111 -5465534 -3610573 -14986018 -21769056 -9555883 15325122 33159229
5330 33159229 31032479 14159201 -1790674 -7740329 -6712470 -2291599 8700800 24739769
5322 24739769 30955432 16255969 -6871856 -16663914 -13274663 -16301986 -30542209 -36264476
5314 -36264476 -20903533 -37276 5692458 -1857487 -8589392 -12612127 -20939241 -30013915
5306 -30013915 -27904292 -14382964 -4072817 -7245402 -17069721 -19110765 -8505379 4593097
5298 4593097 5757870 -7219152 -20413998 -20122337 -9706517 -2243621 -201816 4519970
5290 4519970 11754328 11314940 2857495 -995868 2340073 -1101098 -15465753 -23058218
5282 -23058218 -13884347 -6951874 -20712529 -38812371 -31492025 -884987 22085683 20822495
5274 20822495 6980564 -6155505 -17423759 -23122730 -14718353 1863381 6628905 -6279743
5266 -6279743 -19171754 -17242150 -6722100 1111849 5705032 6839582 -3836539 -27006480
5258 -27006480 -44868302 -40671107 -20017174 -916826 8593649 11661813 10432423 5791576
5250 5791576 3550047 8478157 15029696 13893799 5871736 1390418 7463084 20409119
5242 20409119 29820730 27016974 13144305 262984 -1263235 3233196 17296 -11369065
5234 -11369065 -16538503 -9862305 -4397463 -9963545 -16127071 -9641925 3270442 6936281
5226 6936281 -522622 -9284732 -16062711 -24110600 -29685889 -24877948 -12287113 -2300217
5218 -2300217 3423006 11941267 22868288 26256664 18377986 7270975 208692 -3517782
5210 -3517782 -5524843 -4915129 -4157403 -7967971 -13841375 -13682576 -7086440 -2341202 -1453150
5201 -1453150 3951521 16604923 24984418 18720861 3681852 -7096417 -10356076 -10966048
5193 -10966048 -9044086 -375482 11654018 15681587 7075511 -4762238 -8718078 -6406992
5185 -6406992 -7982472 -16305923 -23528453 -24510293 -24470662 -27418646 -25624390 -12105376 1747911
5176 1747911 -2979262 -23963905 -37142423 -30298107 -19486902 -21799721 -28973279 -23757733
5168 -23757733 -8181201 3856651 11012578 19476852 21676918 5249687 -19469759 -26537722
5160 -26537722 -10943028 5677364 9341469 9406940 13762657 13734917 5235912 2078246
5152 2078246 13584211 28585214 36616125 45280882 58909223 59629701 33168960 -977307
5144 -977307 -10941911 4536774 19206462 19678209 17265320 20252821 18920104 3879790
5136 3879790 -18893477 -37741243 -46925916 -45015404 -33960701 -22502525 -19151598 -20112164
5128 -20112164 -15056304 -4716429 72015 -2981315 -4592699 -2011326 -5529740 -21735827
5120 -21735827 -42383107 -55232614 -55940782 -46071726 -30651972 -20647445 -24694659 -33681429
5112 -33681429 -27474553 -3987260 12491541 2429032 -21246970 -29554491 -13904932
5105 -13904932 6932355 12350142 664298 -14760022 -20987675 -15805055 -7706955 -6933751
5097 -6933751 -15448717 -26985657 -35632809 -39273977 -35862838 -25054010 -14707546 -15796862
5089 -15796862 -27415855 -36440850 -35764639 -31837885 -29135713 -20572728 -3004557 9993014
5081 9993014 4583332 -12048862 -20926821 -16745325 -10706015 -11234427 -14977979 -15929959
5073 -15929959 -12159528 -3903753 5240011 6332113 -5875752 -22708416 -29532251 -22813759
5065 -22813759 -10686295 312857 8052574 7468428 -5156510 -19998881 -20391033 -5558135
5057 -5558135 6117566 1558848 -11048431 -16701073 -12629361 -5007103 3538518 13217161
5049 13217161 20348370 21003853 17935480 16478456 16379745 13739319 8322109 3580366 1739604
5040 1739604 2999717 6858483 10793046 10904166 6724549 1492752 -4061309 -11816667
5032 -11816667 -17714728 -12302170 4204757 16558466 13105382 1848129 -2759130 -1330351
5024 -1330351 -3621507 -6778898 1750735 18935647 23180624 4334178 -18822031 -22302545
5016 -22302545 -6750423 8989491 15281317 17705848 20178845 18293196 11037387 5603060
5008 5603060 5563571 4375180 -3367002 -12084190 -13209054 -6907671 920270 7856152 13057014
4999 13057014 10411603 -5887508 -29084346 -42855923 -39331950 -26833565 -16928820 -11521964
4991 -11521964 -7551752 -7149275 -15039803 -29246452 -41751316 -47071041 -44831649 -36427487
4983 -36427487 -25607576 -19841203 -22763819 -26108436 -18239592 -1419193 9249586 6687537
4975 6687537 1262314 4387119 13289865 20115989 25917246 33347673 33312412 15416169
4967 15416169 -10523792 -20855620 -9252688 4432059 3424202 -2782274 3736167 20082893
4959 20082893 27346901 19113377 8371708 6014571 7636168 5547675 1074525 -1577005
4951 -1577005 -3703158 -6802750 -6572848 -23269 7483720 10027122 10366640 12926969 12870686
4942 12870686 2866601 -12301705 -19748443 -16823545 -13642331 -15414272 -14297570 -3963627
4934 -3963627 8542942 13455761 12623252 13936523 17140912 15394121 8453188 4845410
4926 4845410 10715452 23319561 35505099 40738178 34510418 17618136 -1416753 -13200340
4918 -13200340 -17299630 -19653434 -20816966 -15155080 -3760245 1176416 -8437678 -22914358
4910 -22914358 -24487455 -8743606 10702086 19010328 15412925 9667540 8070876 7355267
4902 7355267 1251752 -10692324 -22188140 -26421704 -21633821 -11204821 -21902 8708275
4894 8708275 14063856 15744479 12503342 3810613 -6383343 -10786220 -7143495 -2897473
4886 -2897473 -6081719 -13505035 -15687859 -12727302 -14093689 -19624610 -14182430 9080216
4878 9080216 31343329 28869984 5424238 -11740162 -6509239 10730085 22861848 25285417
4870 25285417 21100500 11822244 1107516 -2825827 3145881 12311365 18636414 23635334
4862 23635334 27463048 23393693 9097647 -5821959 -12772133 -16551398 -24929974 -33381047
4854 -33381047 -31669481 -20404460 -9874111 -6365197 -9768478 -19960692 -33889888 -40337628
4846 -40337628 -31042676 -15790769 -13361407 -26645259 -38586398 -34563670 -17788612 -114576
4838 -114576 11645864 16162382 13594184 6700753 536378 -2373933 -3026839 -2284618 -870440
4829 -870440 -736578 -271282 7382893 21850728 27015906 9542250 -17276806 -26137100
4821 -26137100 -12477579 1308118 1678828 789985 8212247 10301582 -4281232 -19206244
4813 -19206244 -14812069 -2848548 -8821388 -28330127 -31995384 -13099434 1059783 -7124133
4805 -7124133 -19301295 -13627138 93911 -1249657 -16268551 -22978835 -13186751 -1098967
4797 -1098967 1416334 -418048 2525941 9741480 15869672 18688090 17524512 11807736
4789 11807736 5355248 4904078 10301004 12756932 7071540 -708210 -2574504 438650
4781 438650 2152128 1005764 -406455 -1449386 -2413365 -623150 5603943 11850278 13325322
4772 13325322 12631542 13832402 12348960 1964848 -9702207 -6899031 10166661 21203625
4764 21203625 12756506 -3807805 -11225063 -11128107 -15572932 -22516498 -17812946 428585
4756 428585 16519363 18926747 13688796 11725733 13860860 13758197 7339775 -5317142
4748 -5317142 -20742482 -31907815 -34156750 -32829757 -36928279 -44186950 -42637073 -29315916
4740 -29315916 -16043583 -12544269 -15431796 -18916161 -23417830 -26145796 -17039524 4456631
4732 4456631 20705780 18015208 7685517 9211865 20120978 20458663 3484293 -16545323
4724 -16545323 -27490796 -33124596 -40096098 -45309080 -42288134 -30724267 -15554525 -3568589
4716 -3568589 -1550436 -9350662 -15426982 -9613119 322009 -2713365 -19355744 -30667075
4708 -30667075 -23831416 -6820740 7338252 16245145 20699906 16070470 2205282 -9166398
4700 -9166398 -8812944 -3147894 -1844655 -887688 9102646 24337791 31902108 28773977
4692 28773977 23213037 18738346 10156202 -3131419 -11744999 -8337254 2948408 12596643
4684 12596643 15721865 13639074 10091980 7860585 6299963 2268026 -4189684 -7675786
4676 -7675786 -5149560 -2739205 -8765657 -21584768 -30327555 -26970266 -13108072 3035953
4668 3035953 11293447 4793572 -12352488 -25294915 -24016054 -16126306 -15829142 -23350087
4660 -23350087 -26516193 -21416397 -18022441 -22559266 -27006019 -22040477 -10289270 100519
4652 100519 6915606 12242389 16631768 21545416 30813139 42597359 46401643 36149121
4644 36149121 20798939 13320751 13619610 11741229 4524269 -1655935 -3768311 -6769192
4636 -6769192 -12978819 -15950286 -9812591 1087605 7016591 4240341 -2649207 -8174862
4628 -8174862 -11641082 -14428841 -14368805 -6928266 6012303 12393412 1669208 -19795568
4620 -19795568 -33148209 -30080086 -22843932 -24968862 -31164264 -28049832 -18530855 -19236271
4612 -19236271 -33543137 -43647816 -35705366 -19394314 -12835048 -18055841 -22953630 -20993977
4604 -20993977 -16376353 -12462376 -7215063 -800552 2148370 -39723 -3935538 -7759125
4596 -7759125 -12892666 -17296694 -15793297 -9722075 -7502934 -10834144 -9349870 3367706
4588 3367706 16742674 17410205 10887976 14529992 29534232 36073779 22220784 3537656
4580 3537656 2314538 16980209 26988811 23458882 18056805 19866180 20140169 8519427
4572 8519427 -8224992 -16171409 -15382958 -16895738 -21565195 -17202201 51292 14675915
4564 14675915 10412983 -7715468 -19097986 -12061062 4632200 13654897 6856164 -8527726
4556 -8527726 -17163550 -9360829 9332345 23006600 22265235 14008217 11025566 15033348
4548 15033348 16109491 7714723 -4805898 -12233380 -12388308 -10426724 -11965399 -18086208
4540 -18086208 -24541598 -24924073 -17304018 -7556458 -2369738 142840 6949052 17307518
4532 17307518 21610972 15829679 8816461 9610044 14531805 14468456 9716588 8751997 15010545
4523 15010545 23385315 28717372 30107737 27166045 18987012 7191304 -5425363 -18139537
4515 -18139537 -28669666 -29634171 -17463175 -2514775 1055612 -4445119 -2796951 10833108
4507 10833108 21201305 16214035 5339659 3805235 9104690 7539895 -2045514 -6455649
4499 -6455649 1069493 11522413 13359060 4935726 -8100692 -18921082 -20938971 -11369226
4491 -11369226 3679615 13812489 15471116 12505623 6535569 -3694140 -12348699 -7912294
4483 -7912294 9819478 24511674 23099100 12447757 7033811 7775234 5631439 1569778
4475 1569778 7404334 24864423 37742717 32143777 15382992 5783893 8927266 13633687
4467 13633687 10089046 2564940 1144678 7338792 13436770 13530736 9564019 5873007
4459 5873007 2153591 -5157485 -16294303 -26180163 -29375606 -25066919 -16520787 -7338701
4451 -7338701 230719 4237247 2901447 -2837508 -7665932 -5635520 2798474 9277830
4443 9277830 6167432 -3476137 -8004001 -598722 12510127 19791088 17998250 14531707
4435 14531707 17171620 24950358 29906345 25908345 14828507 4175398 -1785297 -7674886
4427 -7674886 -20593799 -37541610 -44510885 -32444258 -10546232 2024535 -3715958 -19763986
4419 -19763986 -32902801 -37247862 -35078057 -31198041 -28580981 -26339904 -21110460 -12311960
4411 -12311960 -4090401 1251369 8008123 19007518 26276931 19055886 285352 -14649779
4403 -14649779 -16455399 -9655440 -861434 9225403 18607278 20541394 13849277 7300254
4395 7300254 7282805 9879474 10895892 13096835 16007005 10549330 -5118110 -15454997
4387 -15454997 -7072303 10512976 18854216 17484391 19334109 25170368 23200947 12934654
4379 12934654 8406110 14264580 17917343 11587675 4592935 5426638 7624182 3665990
4371 3665990 -1221085 -1033702 -2605406 -13647195 -26293866 -26953105 -17062638 -10668610
4363 -10668610 -14174365 -20119947 -20004689 -13798992 -6944995 -4904150 -9837108 -17482573
4355 -17482573 -19610495 -13839764 -6687369 -2442018 3996376 16116553 25385507 22327941
4347 22327941 12163469 7280327 8091050 4699625 -4154916 -8096980 -2481150 4630723
4339 4630723 6767812 8413066 14136658 18230206 12820351 -37196 -11109214 -14417441
4331 -14417441 -9715463 1087977 14296005 23871580 25611260 21275322 16111547 13376012
4323 13376012 12501511 10851874 6458952 803992 -1467428 1795937 6076336 5711262
4315 5711262 2405567 2745939 7549785 10097408 6105972 -707737 -5003458 -6177046
4307 -6177046 -6221398 -6562591 -9215703 -15803166 -23102895 -24861584 -20489223 -16611664 -17316969
4298 -17316969 -18135211 -12561226 152957 15423403 26005652 23830736 7899674 -7585694
4290 -7585694 -3959263 17749290 34660049 31906655 22739488 26797370 39401209 40167546
4282 40167546 26140390 15558829 17583422 18121063 3117285 -19696244 -32660016 -30549632
4274 -30549632 -20275052 -6976922 7370285 16582110 14019242 3199730 -4749717 -4846543
4266 -4846543 -2133848 -1607671 -1904738 -817742 -31074 -535269 1611707 10073703 21190775
4257 21190775 26342521 20762691 7524672 -6218639 -14186199 -12835370 -2212629 12726934
4249 12726934 23213573 22145265 10095997 -4393201 -11424284 -7387685 3329027 13416718
4241 13416718 18732751 19735559 18691120 17260820 16531911 17139980 18070458 16888399 13038827
4232 13038827 9801567 10467577 13222431 13098672 9108072 5228464 2770673 -3264317
4224 -3264317 -15977767 -28537332 -30723620 -22398614 -13959537 -12422349 -13076982 -7915961
4216 -7915961 2188866 8043817 3167971 -8858546 -17841078 -16604201 -7625607 -34823
4208 -34823 632445 -2078123 -2347267 -1253204 -4131013 -11106174 -17475425 -22685414 -29866163
4199 -29866163 -35014684 -27327919 -5882953 13276225 14934755 2864793 -8350259 -13321318
4191 -13321318 -16848413 -19179123 -13711980 -715882 8119238 4115939 -5968745 -7031858
4183 -7031858 7717237 29795849 43317441 38987710 21829826 5007828 -3861748 -6928221
4175 -6928221 -6695832 -595677 10048539 14471502 5961665 -4910931 -2337869 12794686
4167 12794686 24878186 24833328 16631509 5097819 -7319015 -12120007 -1283752 14318955
4159 14318955 12127447 -8710117 -19818340 -1609787 28146721 39823822 31584866
4152 31584866 23625277 23255210 19354976 8234257 1347124 3590348 3956177 -4204839
4144 -4204839 -9182129 2154027 23232803 34013000 23923459 2019277 -12915033
4137 -12915033 -9219449 7115803 17333812 9769920 -5414912 -8324910 3907081 12519301
4129 12519301 2635711 -16886887 -26007421 -17891741 -2123757 11081258 20128766 26843337
4121 26843337 30072107 26531131 15130272 363898 -8043998 -2454436 13379305 26390037
4113 26390037 28654610 25177864 23647867 22734261 17379493 10399258 9285370 13760196
4105 13760196 16198204 13974481 11679786 10202844 4166299 -6300533 -11496201 -6005635
4097 -6005635 2168694 4144694 3932431 9425331 15766788 10902102 -4222306 -14644101
4089 -14644101 -12409218 -6134144 -5443608 -7724104 -7077164 -5683372 -6942555 -6069152 1447458
4080 1447458 8743066 7132781 1707663 3651986 9725858 4703869 -14634113 -32676232
4072 -32676232 -36286911 -30101869 -25164496 -24153156 -24517715 -25376360 -23664890 -13479339
4064 -13479339 2519292 10860552 5638428 -567834 5108487 16129895 18086732 11701419
4056 11701419 8755251 10556321 7574831 -1427713 -6900927 -6081677 -6988118 -11602388
4048 -11602388 -10133995 2139118 14994551 17174819 10271109 2700048 -1102246 5828
4040 5828 6117824 11704648 7482636 -6491351 -17566151 -17192440 -13074625 -16773745 -26225465
4031 -26225465 -30037905 -24598217 -17341088 -14755123 -15025347 -12649716 -5056739 5755764
4023 5755764 15309075 20610544 22631585 22877629 18607657 6604253 -8606877 -17295239
4015 -17295239 -16534516 -12789201 -11648383 -13088944 -17500218 -25593707 -30148410 -20843115
4007 -20843115 -2457290 5238883 -6472827 -22457662 -26219598 -21147646 -17117656 -10681372
3999 -10681372 3797164 15063883 8435053 -8339621 -14105920 -5399370 2899316 5449977
3991 5449977 10984658 17621110 9882616 -11216351 -19552385 -296465 24249369 23646205
3983 23646205 877318 -14625642 -7662481 8641564 17489282 19435024 24310040 33610338
3975 33610338 37949121 28618274 8315906 -9726767 -14351915 -8074896 -2736745 -4091540
3967 -4091540 -7237130 -8172206 -10407683 -15499917 -16494451 -8691780 432433 1124392 -4347905
3958 -4347905 -6370230 -2258316 3479965 8773347 13368992 12002028 364014 -12879723
3950 -12879723 -12551282 2221346 14596534 11523275 -544808 -6428016 -1012398 8260981
3942 8260981 11344372 2347520 -18000559 -40082660 -49605701 -40823386 -23422961 -11057418
3934 -11057418 -6109446 -2046788 2721198 3349683 1144095 6192085 21147929 30888934
3926 30888934 18863512 -9152898 -28522873 -24714513 -9649833 -4717850 -15354469
3919 -15354469 -29788596 -37295443 -37622384 -34047259 -27836550 -22074022 -21840350 -25467508
3911 -25467508 -22697204 -8246382 7907822 11768957 4128058 -461527 6610331 17978465
3903 17978465 22755485 21052761 19695681 18666321 11090603 -3341907 -13881845 -12147590
3895 -12147590 -3804126 269611 928053 9235687 26815949 37412479 24747256 -6307013
3887 -6307013 -33535800 -40132909 -27897114 -10110754 1684461 4104869 1787176 2545773
3879 2545773 8824740 14040332 11131725 2759535 -2788045 -3727417 -4674887 -5193852 1309561
3870 1309561 14685743 23857181 20849059 11483629 6477347 8332914 12777642 17032452
3862 17032452 19837616 17935244 9567566 -1013003 -7470067 -7359200 -1510170 7555888
3854 7555888 13461588 9174098 -2610891 -9554355 -6346122 -3278234 -9925980 -18637802
3846 -18637802 -15915592 -3965581 2847141 -106104 -3407978 -751394 2900340 2155627
3838 2155627 -1123044 -3219094 -1812264 7211564 25246797 41443255 39354492 16813713
3830 16813713 -11031299 -31258827 -44059121 -50888963 -46670229 -32332857 -21881475
3823 -21881475 -24729764 -30676852 -25666333 -14825113 -14623736 -26295966 -33491692 -27144396
3815 -27144396 -17429248 -15851486 -18180308 -14448589 -7723422 -10782313 -25182814 -34409706
3807 -34409706 -23010834 3216622 23397146 26060372 18961640 12803601 5781075 -7030335
3799 -7030335 -17355099 -12080230 3376790 6688305 -10846958 -29497786 -26453267 -5274141
3791 -5274141 11553716 11724637 2058667 -6616918 -9813447 -5812190 5384820 16951426
3783 16951426 18414352 7539157 -6414694 -12742970 -8266143 2816498 12503192 13608075
3775 13608075 6909072 2661316 9155390 21700391 29395458 29775498 28360991 26688078
3767 26688078 21414574 13783742 8270644 2226409 -10205611 -23066320 -22375471 -8668767
3759 -8668767 -199867 -6731661 -15424281 -12749591 -5407291 -5188473 -5837776 6268561
3751 6268561 25605974 31413194 16716410 -3583384 -14581294 -16302629 -14719475 -12088196
3743 -12088196 -10448664 -12940472 -17204811 -17371308 -15424339 -19654871 -28886379 -30994986
3735 -30994986 -22353450 -15466092 -18930579 -22162967 -11685216 6725484 15299161 7943988
3727 7943988 -5685716 -15866004 -20627340 -20284228 -15774636 -12155110 -14014466 -17682192
3719 -17682192 -16700628 -13464857 -15033989 -18196234 -11039304 8305682 26230048 31464986
3711 31464986 27912823 23943972 18894130 8702868 -2551292 -7089747 -5909673 -7399780
3703 -7399780 -14081815 -18209460 -11801118 3678664 18638684 23278962 14260481 -3146918
3695 -3146918 -18530226 -23840344 -18850928 -9770540 -3189529 -745964 1945694 10411837
3687 10411837 23247723 30660848 25216543 12626137 5800346 8318687 11149769 7336631
3679 7336631 1681414 1775849 7035692 12515727 17177611 21442479 21917218 16594233 11705436
3670 11705436 15168605 24865005 30531786 26388986 16001414 5871944 -127835 -1195247
3662 -1195247 137771 -825909 -5412560 -9576365 -11100754 -13841499 -19059355 -18896020 -7719549
3653 -7719549 5483267 8177061 4459422 9868615 25912670 35011491 25508413 8609495
3645 8609495 3005984 12368567 25490983 30811650 23737520 6764067 -10127656 -14693669
3637 -14693669 -4766406 9078095 17692191 23352714 29825963 30900572 18859807 -763733
3629 -763733 -13703133 -14271091 -9025757 -4639182 -1610205 -445356 -4675387 -13932136
3621 -13932136 -20120502 -15244574 -1083228 11302715 11191524 -2388129 -19292220 -26758113
3613 -26758113 -20729697 -8311928 981352 3671645 1332952 -4236866 -11335435 -16867199
3605 -16867199 -18566832 -17551875 -16508388 -17084270 -20086571 -24837799 -27072032 -22261912
3597 -22261912 -13270090 -9141904 -12947360 -16779529 -13411818 -6961124 -6142097 -12284640
3589 -12284640 -20365522 -26678539 -28515377 -21697260 -6930291 5817013 8253065 5191589
3581 5191589 5831918 8067698 2995878 -7870446 -13021267 -8318737 -1192757 3639978
3573 3639978 9739656 17337929 18808375 10627833 -1242780 -12942049 -28217843 -45842302
3565 -45842302 -53068305 -41264921 -19579414 -3507620 2911186 4246456 797780 -9531667
3557 -9531667 -21439161 -26583863 -25449268 -24069377 -21422973 -12177297 -971106 -208754
3549 -208754 -10853130 -18435407 -14212060 -8866050 -15910714 -29887229 -32838024 -18835040
3541 -18835040 -584152 8529563 8875454 8233981 9674588 11563573 14102097 18644571
3533 18644571 22465442 20714328 13968953 8851000 9962271 15206838 20254866 23407245
3525 23407245 24130591 21227807 15865315 12812863 14478618 16395180 13071965 6002864
3517 6002864 804885 -1650070 -5060518 -9448862 -10262315 -7237638 -7547030 -16596041 -30304114
3508 -30304114 -39935480 -40823070 -33457071 -20534068 -7203780 -35727 125606 1570742
3500 1570742 11394918 23120413 22445458 6776319 -8692400 -9046378 1959022 8190477
3492 8190477 2369850 -6934796 -8815325 -2139986 7592187 14998472 14158611 9906
3484 9906 -21445554 -31345588 -17841001 5878765 16047730 9305083 4638552 12825334
3476 12825334 20892866 14675363 1194709 -4318111 -1945660 -2184749 -5390153 -2762148
3468 -2762148 5805203 10694614 8686791 6385407 7516077 9311182 11322940 15247783
3460 15247783 16279165 8099148 -3234101 -4669737 3743423 9741931 11339544 19909745
3452 19909745 35749740 40727299 25907779 8204707 5001478 7990642 210668 -13343891
3444 -13343891 -13576251 573447 9486702 2305959 -9653536 -12771821 -9263735 -8814571
3436 -8814571 -12804416 -14875845 -11770483 -6687023 -2761069 2741832 15124287 32407080
3428 32407080 42268498 34546467 15187864 -569385 -8282750 -15840441 -23540771 -18875193
3420 -18875193 1085704 18407954 18641829 12655595 17589469 27453075 22728424 2268921
3412 2268921 -15201818 -18380398 -12798825 -4928774 3394068 4886177 -8492540 -28008643
3404 -28008643 -34240310 -24618597 -16805053 -20295306 -23741925 -17328236 -9043636 -9154698
3396 -9154698 -14853824 -20214931 -26024654 -30044972 -23938283 -11376237 -11906340 -31414514
3388 -31414514 -44679397 -26919742 9016784 28297653 19567084 3202126 -2506513
3381 -2506513 -1744407 -5336572 -12618056 -15694164 -10820805 -1133423 4660856 -3620638
3373 -3620638 -25883904 -45097573 -43218544 -24165951 -10026628 -13236039 -23941556 -27677176
3365 -27677176 -23544705 -18405040 -12532019 -628160 16193661 27077596 21571804 1396690
3357 1396690 -18733768 -23898508 -13956749 -2780163 -419412 -1642327 2530340 8572897
3349 8572897 5700148 -6351253 -16341134 -17574341 -13769559 -8554728 -1115177 5122848
3341 5122848 1765344 -10760552 -18817943 -12228556 2481911 12694205 16426457 19879081
3333 19879081 23387112 19849928 6751727 -7634059 -12380111 -5748532 2090588 -1293484
3325 -1293484 -16435644 -28990453 -25493505 -10887459 -3120585 -9935798 -20111907 -20566883
3317 -20566883 -12331927 -4049784 971435 3458293 2310193 -533124 3511089 17589672
3309 17589672 29557935 26384942 14128482 9909628 16218817 18486184 9518902 791887
3301 791887 3801188 13500619 18614933 18064580 17577193 17564635 14397981 9097208 5809334
3292 5809334 4501818 2379841 -233215 -1876770 -4540858 -9566821 -12346650 -8710843
3284 -8710843 -3944316 -7184003 -18279990 -28343694 -32419552 -33088659 -31736476 -25858657
3276 -25858657 -17188026 -13596861 -18807621 -26915238 -30791329 -29484430 -23457440 -9722617
3268 -9722617 11557468 30184427 33357461 19821234 2376837 -4034459 4594646 18770205
3260 18770205 24910915 18559846 7528199 114308 -5541078 -13697291 -17151650 -4268428
3252 -4268428 19218446 30608006 19369558 2444735 142737 8723619 10723762 3061872
3244 3061872 -2082806 713940 4829291 7009693 11135255 14919885 8893353 -6518247
3236 -6518247 -16392482 -10241563 4648461 14320319 13730546 6694390 -1114046 -4610972
3228 -4610972 -2231001 748709 -538859 239920 12801765 30754362 34995960 21249326
3220 21249326 8309067 10753193 18994961 17555426 8440135 2191448 -1526373 -7902263
3212 -7902263 -11617016 -5008900 5816108 10015430 10258666 14297831 15505947 2957644
3204 2957644 -13743167 -13904808 -26507 2590277 -14334363 -27380193 -17184725 3409132
3196 3409132 12343349 11264205 16316378 28361558 33055294 25393112 15995053 13343730
3188 13343730 13544358 9079733 -1856986 -15336843 -24029447 -21246395 -9808845 -4320033
3180 -4320033 -16290389 -38473629 -51945615 -47614307 -32840951 -17828335 -4766359
3173 -4766359 7708577 17312322 19889236 14961790 6971296 2323418 4701626 11171196
3165 11171196 14313319 10357496 2575357 -5388139 -14078144 -21690252 -20298609 -7857667
3157 -7857667 1533268 -7818676 -29881247 -41748855 -33645047 -20463866 -18488541 -24056077
3149 -24056077 -24206141 -16969261 -8841187 -544228 10024193 15224849 4292745 -16872896
3141 -16872896 -27673914 -19213094 -5922671 -4080382 -10548605 -12881282 -10399390 -10708226
3133 -10708226 -10660944 1859963 25463883 40613435 35144959 22403476 23023418 36597912
3125 36597912 44304362 36011082 21211280 12260937 9635303 8924056 11925179 21948041
3117 21948041 33717952 36907134 28255111 14254213 3287292 91760 5724920 16723893
3109 16723893 25245032 26192405 23868053 25423117 28213980 21594803 2887906 -16752668
3101 -16752668 -26298433 -27052733 -25673710 -22635859 -15390202 -6671306 -2014 8084299
3093 8084299 19747376 23578358 6042415 -23712709 -37010820 -20536668 6048341
3086 6048341 17269286 13875743 14127017 23318608 29854918 27400246 22741769 20636654
3078 20636654 16580481 8108578 158955 -4484952 -8132066 -8773397 -1097762 9383582
3070 9383582 8533175 -3399524 -6840575 8782090 26970599 28137811 17982363 14681864
3062 14681864 18944033 17926393 12828079 19414466 40108589 55996882 52151847 35461958
3054 35461958 21513016 16462224 17373007 19622356 18981385 15157956 15487549 25326338
3046 25326338 34667905 27897626 8635606 -1399435 6260154 13417018 2724030 -16448366
3038 -16448366 -22543277 -10721056 6394029 18147188 22587939 20444913 15238641 14403637
3030 14403637 18950860 17433624 1724638 -16979824 -20950723 -10140670 189411 2534158
3022 2534158 2643949 3270077 -1199412 -10899340 -15750940 -10366760 -2671345 -1618509 -5104763
3013 -5104763 -5769728 -1350627 6070236 14420017 19764271 15908575 1918278 -13642110
3005 -13642110 -20994275 -19313594 -15316882 -14238079 -15046837 -12661342 -3260001 10475650
2997 10475650 19054616 14694232 925043 -10330312 -12333320 -9785547 -9996513 -12700477
2989 -12700477 -11836146 -4119696 7210113 15116493 13621875 2737299 -9827173 -14859069
2981 -14859069 -11221693 -6044013 -3756187 487159 12452017 27452676 33480559 25623130
2973 25623130 12184609 4545268 4886081 7338416 8384513 10374364 14537497 17002323
2965 17002323 15527470 14683056 17820964 17937676 5762049 -14277617 -26668556 -25041855
2957 -25041855 -19177313 -18202074 -18209333 -13376254 -8449153 -10028201 -13869975 -12099370 -6446964
2948 -6446964 -2959333 178533 7077996 12303142 8837413 3260222 7191430 16699767
2940 16699767 17480386 9118449 5178922 8153717 5239323 -5998808 -9289291 3333195
2932 3333195 16042550 14132416 7054871 10429251 19582697 19441871 9837973 1705032
2924 1705032 -4011063 -14023677 -24459611 -24593369 -16582400 -12932242 -15069474 -12779194
2916 -12779194 -5492467 -4900999 -13064800 -17168076 -12542916 -12326789 -24266916 -34959223
2908 -34959223 -30760926 -20197374 -18792997 -21831850 -11722109 11537445 26406208 18309197
2900 18309197 -3313027 -20967926 -29365151 -33229895 -35263180 -35105299 -34136295 -32934584
2892 -32934584 -27467035 -15140002 -2353677 1077083 -5751398 -14372761 -18399692 -18689705
2884 -18689705 -16391983 -8679126 4479949 15284753 15826171 7753046 -892308 -5694270
2876 -5694270 -7150446 -4697958 2765206 10461716 9928875 494031 -7829051 -6773854
2868 -6773854 289644 5659421 9339975 16291925 23785339 20449502 1263044 -22111293
2860 -22111293 -31681616 -22660510 -7859061 -1539225 -3471302 -3130033 3502493 8899726
2852 8899726 6591157 428437 -3596993 -7290482 -14020707 -18752903 -15408266 -10283991
2844 -10283991 -14319028 -22590440 -17587844 2781369 16833721 8541653 -8526490 -10410884
2836 -10410884 4324972 16941544 17290291 12492422 8728742 2185394 -8630946 -16717832
2828 -16717832 -18701573 -21014245 -27141213 -29180818 -20231852 -6639267 1205846 3613122
2820 3613122 7011655 9083743 226925 -19669853 -35815040 -34295103 -18141186 -3452817
2812 -3452817 -1767336 -9400097 -13581243 -6904826 5141013 10632628 4284317 -7269532
2804 -7269532 -13859300 -13899754 -15513382 -24823278 -35716802 -34952581 -17968321 4146510
2796 4146510 16312647 15074972 8021691 530071 -8516709 -17103018 -16482698 -3506238
2788 -3506238 11143172 15756148 13360026 14774878 19829287 17979806 7443431 316096
2780 316096 4165827 10122882 7049166 -1331546 -3626264 56054 -2530910 -17207795
2772 -17207795 -33312627 -35868076 -23189198 -8668749 -6170074 -15489249 -22859422 -16341245
2764 -16341245 58404 10396240 5663352 -5267320 -6854991 3969991 15187539
2757 15187539 15655971 7811092 1592476 -66590 -3826729 -13857617 -22945521 -20475811
2749 -20475811 -7040709 5323961 8729342 8856602 14454062 22836083 23316545 12701476
2741 12701476 -1047800 -10998815 -18872589 -27672157 -33928856 -32520367 -24857700 -17063084
2733 -17063084 -12121837 -7743391 -964023 7299902 11411074 5108328 -10124778 -21513662
2725 -21513662 -16311014 1724605 14506902 11878742 3955099 5500117 15956415 24039997
2717 24039997 25767465 25769243 23613428 12624953 -5646175 -18052924 -16555785 -9301377
2709 -9301377 -8321495 -12866265 -12684493 -4113340 4712420 4246864 -5867814 -16995388
2701 -16995388 -19705061 -12036817 -943477 5411328 6656816 8421965 11676637 10131248
2693 10131248 1717862 -3634878 4832440 22312422 31204483 21466625 2472945 -7887783
2685 -7887783 -2329954 10253347 16494190 13225622 9589721 14792272 26033874 32104643
2677 32104643 27992142 19468496 11337372 -288965 -17332500 -29133493 -23745723 -6080931
2669 -6080931 7484945 11213621 13449447 17606838 15439220 4116948 -5902813 -9228245
2661 -9228245 -16793418 -35456107 -49497564 -40535726 -17177065 -4283628 -6924928 -7135361
2653 -7135361 2968905 8475472 -401249 -9068211 -1187647 14971068 19314437 9239236
2645 9239236 -372413 -1215751 -198181 -5352017 -15833265 -26660123 -33613590 -32535859
2637 -32535859 -21874491 -7121773 3216764 6125235 4083547 -611396 -5253002 -4069700
2629 -4069700 4903668 12190591 6061316 -10486329 -21793075 -20367382 -16039780 -20553635
2621 -20553635 -31527657 -37449374 -32607684 -21107404 -9938813 -3497995 -2802725 -5766095
2613 -5766095 -9042033 -11732141 -15602866 -20219825 -20891236 -14263404 -3816565 3449218
2605 3449218 4989177 4677673 6783617 10194926 9911767 3618696 -4785020 -9095609 -7317944
2596 -7317944 -2834398 47723 -505463 -3949264 -7349172 -5739839 2767009 11726922
2588 11726922 11898535 3855723 -1098540 4154498 12922783 14481789 7480102 -2217181
2580 -2217181 -11566460 -20664038 -26303755 -22968927 -10189193 5291157 14250340 11151534
2572 11151534 -411749 -8083075 -3613381 4032530 -895846 -15455975 -18516104 -3736568
2564 -3736568 6361597 -6027487 -23234118 -16586255 9828676 24979353 15230673 -2341409
2556 -2341409 -10585391 -12241424 -15528982 -20623269 -26350862 -33834617 -39375311 -38310025
2548 -38310025 -36628632 -42494941 -47588108 -36798652 -15736542 -5495589 -8795323 -6737928
2540 -6737928 6883073 15027427 8007386 -2372057 -7774721 -14808132 -22096725 -16104984
2532 -16104984 -2409348 -8999733 -41550855 -67702665 -65711220 -55447528 -58274859 -62315667
2524 -62315667 -55951000 -57443679 -75934151 -83800542 -72630872 -91650974 -164987354 -207900017
2516 -207900017 -114462761 80220153 217129114 208006061 129104494 91127196 98035788
2509 98035788 89084036 54483624 34911693 40945494 44216207 36366871 38389307 53966702
2501 53966702 61554019 54568882 49140797 48744614 37378260 13423288 -2487001 -1697717
2493 -1697717 -1023803 -11858068 -20838202 -14105358 -777324 2024759 -6308614 -12962695
2485 -12962695 -9807515 1550741 15776618 26984565 30965325 29766492 30042295 33560290
2477 33560290 33793576 25055766 11476376 3833356 8447251 19911122 25063895 16384980
2469 16384980 1504464 -4858823 1292169 10051569 13242001 13779760 15681528 15381375
2461 15381375 9980664 4486932 2707372 465442 -3095793 1742041 18828363 32185139
2453 32185139 24206398 1673944 -12514288 -9832091 -2031650 1763530 6765488 18479335
2445 18479335 31146930 35687122 30057190 18100960 5123033 -3768543 -7294478 -10162933
2437 -10162933 -15828241 -19237958 -13935247 -3454938 2903903 3067141 2119039 2160943 1604232
2428 1604232 1449611 2517913 401257 -6025131 -6379710 7151270 22425281 21128613
2420 21128613 7371357 3192050 15078720 25708945 22920439 15323947 11202527 3764927
2412 3764927 -9264373 -11243590 9224436 34023368 36820471 20221878 10235367 17441510
2404 17441510 25070105 17475863 1143172 -9447847 -11860905 -12141459 -11650299 -7956706
2396 -7956706 -3005264 -786095 301681 4599866 10248373 11110343 7806004 8539080 15960011
2387 15960011 20689666 13580171 -1325594 -13447605 -20693628 -27875082 -32283062 -23559918
2379 -23559918 -1070140 20010087 26195462 20365367 12670857 6263745 618030 -56521
2371 -56521 6486960 11446227 4851341 -9090794 -17680164 -17106573 -12638947 -5414672 7160636
2362 7160636 19713274 22417162 17129841 16197571 22975809 26749631 20279553 9752487
2354 9752487 3073612 121695 -565896 3349688 11020364 16221306 17029372 18297824 20895773
2345 20895773 19335083 14064227 13786765 19821990 20718481 9873983 -3424544 -8837697
2337 -8837697 -9008707 -9333325 -5555456 6789380 20772889 28472650 34095790 43689744
2329 43689744 50054859 42701582 26816945 17020343 15919273 13627467 6392699 1243778
2321 1243778 2632189 7766357 15150306 24638882 28647955 17566353 -2994415 -13680469
2313 -13680469 -5388402 9567378 16188066 15752187 17662608 21312820 17526131 4529486
2305 4529486 -8031475 -11672930 -8025597 -2820992 3205207 12520512 22463900 24957686
2297 24957686 16604897 4624751 -1581676 -1915066 -2948451 -5793888 -4614878 2009533
2289 2009533 6940290 5133531 643231 -1521230 -2940653 -5659659 -6180158 -2562170
2281 -2562170 -277318 -2941919 -4569034 -830306 -520206 -12553887 -26765329 -23755998
2273 -23755998 -3141939 14203770 15110453 9892449 12562221 19258863 17677320 8658338
2265 8658338 4719932 10175183 15074504 10620711 1377808 -2218051 2559205 10570991
2257 10570991 19093449 30567581 43609964 48545636 38246964 19869002 8123081
2250 8123081 7782845 10642260 9721643 6847941 3914123 -2305354 -10576020 -10645590 2611672
2241 2611672 18164750 21892230 14600224 6813514 1392808 -6518879 -15791922 -18479692
2233 -18479692 -12317934 -3314145 4141773 10261699 13501489 10726861 3562647 -3834907
2225 -3834907 -11809595 -21318093 -26391951 -21616036 -13827695 -13042739 -14579723 -6413985
2217 -6413985 6889750 7331196 -6067280 -10823897 5951230 26931470 30106052 19174677
2209 19174677 12489715 13776551 11914288 2564105 -7946381 -17137898 -28077315 -36351542
2201 -36351542 -30386632 -8950781 12426196 18178877 9883245 2372673 5783911 14599941
2193 14599941 14694642 1071040 -13797013 -13946160 -712898 9213658 7857347 6333320
2185 6333320 15017673 25440434 23530215 12145177 6289895 10793485 16935118 18592090
2177 18592090 17264273 11753724 -1855190 -17427098 -20788970 -10271585 -2208012 -7598348
2169 -7598348 -14296521 -3797076 21102418 37942144 32183244 12639284 -2024890 -4090350
2161 -4090350 -611785 -1761733 -10000065 -19090457 -20378573 -10116377 6945342 20250903
2153 20250903 21319424 10816336 -2332762 -9911825 -11886237 -13583415 -17045893 -19012674
2145 -19012674 -17572934 -15927266 -16914629 -17723014 -14085341 -7489333 -4073433 -7169304
2137 -7169304 -14109025 -19878953 -21493568 -19490462 -17101144 -16890880 -16734098 -11300363 283638
2128 283638 10839265 12366224 4984977 -4227486 -9155674 -8413055 -4104370 -913669
2120 -913669 -3558261 -9877853 -8875529 7504598 31204203 43847327 37157817 21250777
2112 21250777 10343607 6930511 4953181 3268191 8043228 22145674 38445449 46133120
2104 46133120 40627454 25510328 7643164 -6952896 -14851934 -17096767 -18694244 -22154154
2096 -22154154 -22043586 -11696655 4045924 11144418 5835418 2728923 14256507 29712856
2088 29712856 28787712 12197845 1539708 6792874 11983377 861167 -19311626 -31652904
2080 -31652904 -34116938 -34828323 -32631170 -20235114 -2559551 5721843 1493219 -2913969
2072 -2913969 324339 3962435 -156309 -7204800 -6412802 4337101 16601692 21177871
2064 21177871 17268941 13459348 18653950 30020295 34218475 25093919 13710396 12411735
2056 12411735 15411953 8065543 -8059450 -14673440 -2543720 16118538 24921933 21604755
2048 21604755 14924204 12860259 17620895 24429014 23810315 13221571 4711167 9400621
2040 9400621 17298677 9872736 -7498105 -7889909 15978011 35886806 26466792 -841644
2032 -841644 -19283445 -24664299 -30420311 -37844398 -35638920 -23664625 -15290320 -17403918
2024 -17403918 -25247231 -34573380 -42230163 -37878320 -13687413 18374832 36465240 36173330
2016 36173330 31299243 28558807 21223923 9497197 5872944 13883573 20473176 17464122
2008 17464122 13062206 13205321 9261313 -3872094 -13501767 -7445506 5932611 10460762
2000 10460762 4580347 -2644471 -7595504 -9285423 -299678 21756239 40249243 35494323
1992 35494323 12085590 -6616302 -9881815 -8772758 -13729044 -20123349 -19773907 -12087779
1984 -12087779 718691 16003020 23878040 12686734 -11166935 -22331369 -5888420
1977 -5888420 22732867 37943224 34756470 26988933 22685098 17150653 7820515 372676
1969 372676 -2429344 -5653717 -11893105 -15931463 -13989878 -9142246 -2648290 10265653
1961 10265653 28101772 35552798 20336756 -6933797 -22775044 -20036281 -14076352 -17420493
1953 -17420493 -21960923 -14123652 3322457 16267324 19533835 19467185 19145911 14143003
1945 14143003 4222824 -2440767 -873173 3763464 5300676 4909387 5476624 4868757 793967
1936 793967 -3464365 -4421396 -4650527 -7541496 -10393694 -9458979 -7911363 -11301782 -17639248
1927 -17639248 -19397694 -14048661 -5969936 1111438 7267576 12505156 15423849 15523844
1919 15523844 12639320 5833822 -2777971 -6588910 -3084766 -109049 -5468598 -13661141
1911 -13661141 -13179016 -5088450 -2152819 -8594568 -13567307 -9006866 -2195323 -3313321
1903 -3313321 -9424888 -9404662 392636 12323568 15989596 6474225 -11621493 -25253048
1895 -25253048 -23644378 -11145280 -3030475 -5522092 -8456199 -2402215 7059510 10269266
1887 10269266 9432781 12454170 17374963 15743313 8558200 6525221 14193061 23827630
1879 23827630 26581070 22265230 16727552 15096969 17970947 20274370 15632462 5568059
1871 5568059 45334 3858560 8879526 7551094 6683885 16187623 30033743 33146003
1863 33146003 24278330 16299925 14610585 12381447 8965598 14307046 28639114 35535177
1855 35535177 25755836 13316560 15229257 27341253 34206233 32899726 31185403 28967017
1847 28967017 18986436 3890664 -3689317 -108007 3365783 -2701482 -13662145 -19780591
1839 -19780591 -19097785 -15844642 -11570863 -3458521 10368705 26664278 37524786 35449260
1831 35449260 20451706 1771721 -10060647 -12180713 -8560311 -3337885 689387 -44408
1823 -44408 -6633703 -13041267 -11747631 -5045001 -3734071 -11799553 -18806463 -12658804 4159680
1814 4159680 17127561 17068835 9212600 3779196 2419399 -1843175 -12743284 -23713938
1806 -23713938 -24886903 -14684826 -1515415 5125125 2639153 -4575173 -9517363 -7133079
1798 -7133079 1725420 9741988 9598373 2302400 -3496160 -1449636 5990116 11984011
1790 11984011 13179905 11609154 11153305 13825492 18421641 22499061 26238970 32159190
1782 32159190 39010027 40119048 32763531 24855065 24568605 27004520 21659546 11005476
1774 11005476 8317214 15924918 20176114 12756166 2808153 141360 -276963 -6432026
1766 -6432026 -13060306 -9866447 2059545 13843856 21764539 25007626 17944467 -1505732
1758 -1505732 -20805909 -24357269 -13750211 -3728976 -36929 5485233 17827821 29537453
1750 29537453 31270672 22783122 11288778 4932585 7618411 14858312 16691486 9646610
1742 9646610 1661544 87362 1943402 3183890 8264093 19559745 26326426 18371170
1734 18371170 3936342 -953239 4668367 9640504 10553009 11784525 10598195 803799
1726 803799 -11399137 -13744908 -8474074 -8384585 -13840445 -12844396 -3634635 2341674 1119303
1717 1119303 1325558 7288302 14273166 20287595 25317347 21566327 4132731 -12578719
1709 -12578719 -11535916 -1354152 -2259466 -9537767 -1994065 17222269 24270453 18425043
1701 18425043 23076501 40735180 49208199 47173117 57115408 75370442 70889052 45200530
1693 45200530 36120372 46548904 36885556 10351945 22275080 63033504 30548530
1686 30548530 -101416705 -182772703 -78318919 104031566 127285165 -51107861 -225281869
1679 -225281869 -230708333 -136402254 -88178235 -96879242 -84645513 -45688090 -39089865
1672 -39089865 -68068248 -76533851 -50274420 -32317282 -40857540 -46749862 -36801112 -35658865
1664 -35658865 -54481687 -69893131 -66192757 -56664975 -52627494 -47226630 -38695081 -37829690
1656 -37829690 -44681758 -45848806 -40215827 -40878869 -48038562 -46916689 -36524070 -33753113
1648 -33753113 -43631540 -51160868 -49076946 -49025258 -56887481 -59850041 -48740840 -34701469
1640 -34701469 -32686762 -42063156 -51927515 -54757899 -49449427 -40112045 -34020799 -32689300
1632 -32689300 -27646202 -14758944 -5813758 -11740972 -22495225 -22002113 -15334118 -18729623
1624 -18729623 -28920491 -28609283 -19285391 -19375209 -28443131 -24204674 -2363046 10728792
1616 10728792 -1755789 -20472458 -20053785 -4868733 3045954 -4216945 -17340851 -26557529
1608 -26557529 -27625107 -20397893 -11302981 -8132656 -6977916 3003353 17843431 19057471
1600 19057471 2060533 -14848787 -18778310 -19342210 -26017013 -29461491 -21064267 -11821817
1592 -11821817 -13350203 -16952181 -11199134 -4772210 -10036996 -17359686 -9981344 5091287
1584 5091287 6020938 -9159641 -20243793 -15420210 -3381489 4561734 5764968 -125838
1576 -125838 -11191673 -16499305 -5948087 12230512 19220400 11505111 3719255 4741298
1568 4741298 6858669 1907556 -6247729 -10101027 -8021271 -1673637 6469153 10895589
1560 10895589 7186039 -1071663 -7790005 -14315999 -23327049 -27055217 -16610836 -1017037
1552 -1017037 479990 -13541098 -23772079 -18893804 -9701246 -8501161 -11597888 -11553061
1544 -11553061 -11697463 -16722945 -20692695 -16798930 -10586363 -12218058 -21775830 -31310731
1536 -31310731 -35580045 -33052517 -22778643 -7993248 3210117 7464358 9729823 11822516
1528 11822516 7046084 -5705161 -13303947 -5949428 5137118 1739875 -15226514 -28402116
1520 -28402116 -29679075 -28004899 -31496436 -36196694 -35808428 -30718513 -22897292 -11439261
1512 -11439261 2019555 11250137 13550434 13738108 16033273 17597178 14025458 6170476
1504 6170476 -2421036 -10401126 -17060651 -19823906 -17550040 -13780198 -13211678 -16752449
1496 -16752449 -22305394 -27916238 -31600461 -30508791 -23401502 -12832954 -2912228 3841766
1488 3841766 6188767 3074784 -4725146 -13214251 -17700675 -16464499 -11333654 -6056828
1480 -6056828 -4678029 -9013726 -15816066 -18241899 -12391592 -1590718 7006499 8582809
1472 8582809 2477647 -9110840 -21174384 -26945775 -23487882 -15981429 -12299024 -13037813
1464 -13037813 -11723546 -6414264 -5097062 -14224061 -25948275 -25151586 -9616377 4981006
1456 4981006 4361382 -6379562 -10664046 -2473952 7529083 7076342 -4416235 -18898111
1448 -18898111 -28633377 -29366969 -21724993 -13919148 -16470831 -28072219 -32334078 -16428491
1440 -16428491 11091772 29701489 30979238 23235152 14059212 1287985 -15730996 -28424636
1432 -28424636 -30125103 -26318711 -25571995 -26695976 -23446277 -16811405 -13229928 -13675721
1424 -13675721 -13631164 -12107435 -11889020 -11855464 -7975401 -1778950 1179357 1783205 6412430
1415 6412430 13461052 11341562 -4988783 -24604929 -34421263 -34954204 -34806128 -36086253
1407 -36086253 -34650374 -30401337 -27029510 -23100151 -13296276 731931 9512021 8142094
1399 8142094 2383831 -717845 -2014162 -5798225 -11129837 -13169712 -10863314 -8115802
1391 -8115802 -7625130 -7766964 -6579975 -5293279 -5302420 -4107697 1067358 5599061 -338515
1382 -338515 -17559407 -31069304 -25727852 -6734437 5409707 1187345 -7920785 -9523219
1374 -9523219 -7592086 -10492187 -13372377 -7207097 1456365 -3046646 -20647731 -33412638
1366 -33412638 -30297077 -19197620 -10466491 -3181363 5159473 8543246 2137684 -7409841
1358 -7409841 -11358091 -11251431 -12735170 -13929179 -9922460 -3280103 278188 2702510
1350 2702510 9956838 19995359 23746219 16898212 3321179 -10945196 -19878299 -17465628
1342 -17465628 -4979926 4470852 -506794 -12235637 -11296184 7357590 26172148 26516384
1334 26516384 9797229 -7458343 -12813983 -7271899 -208633 124568 -7133984 -16278943
1326 -16278943 -22494454 -26703060 -30330476 -29203482 -19352640 -6428271 -723892 -3057285
1318 -3057285 -4183103 948355 7078349 8632070 7349115 7149836 8855158 12185531
1310 12185531 15222637 10547518 -7917065 -31251029 -40354599 -30155997 -17596792 -17797351
1302 -17797351 -24150019 -23281676 -18588311 -22493343 -31522717 -27986952 -7428224 12105379
1294 12105379 13885354 3471994 -1622699 5097371 14874615 18347036 16750452 17876481
1286 17876481 24265087 27453913 15833741 -10366978 -34621443 -38805118 -21539770 1587082
1278 1587082 14420009 12551892 1708031 -9186506 -13082567 -9263333 -4237503 -3789264
1270 -3789264 -4466520 1348854 12673586 20205449 20343883 19849875 23174861 24388692 17843751
1261 17843751 8929723 6137426 8496436 9940862 11331513 17457363 24642170 23260497
1253 23260497 13459442 7015501 10004223 14079428 11121613 7407615 13856966 27700610
1245 27700610 34365743 26309249 11191886 876337 -329815 4438688 9087577 6645279
1237 6645279 -6226166 -22804608 -29711352 -21306954 -6924287 92415 -3410656 -11119729
1229 -11119729 -17175579 -18956623 -13593939 -66722 15433070 23285576 20841958 13835222
1221 13835222 6931640 -1352905 -12856404 -24321386 -30402391 -28817434 -21288408 -12434361
1213 -12434361 -7455404 -6775798 -4076231 4649392 11764238 6330668 -8532475 -17862490
1205 -17862490 -16990426 -18503919 -30290429 -39692502 -31634862 -12660933 -1640141 -2369620
1197 -2369620 -2296190 3119424 2557120 -10468685 -24082688 -23556981 -10703372 350413
1189 350413 547221 -7452986 -15252762 -16056121 -9682278 -3631179 -5231200 -11172199 -10914361
1180 -10914361 -2151353 5456166 5358916 3201660 4833591 5521119 788468 -1060097 9223138
1171 9223138 22914456 21841373 5107763 -8045848 -5448684 2009349 -1181212 -12096431
1163 -12096431 -15275573 -5087174 8613031 14718715 11531125 3392596 -5416695 -11518740
1155 -11518740 -12924787 -11569808 -12064782 -15744920 -18321872 -15173131 -7009127 1247128
1147 1247128 5344471 3630029 -4106603 -16531292 -29348470 -36999771 -37975645 -37076456
1139 -37076456 -39528326 -42945485 -38889293 -24612774 -9616556 -5338484 -9684912 -8715021
1131 -8715021 4414312 19220671 21749796 12866217 4605227 1670999 -2752056 -11961500
1123 -11961500 -17782617 -13326958 -5087716 -4121272 -10679429 -16201827 -16674588 -14666083
1115 -14666083 -10456750 -1436351 9767465 16614044 19298653 23958694 29149826 24624641
1107 24624641 8531213 -5677874 -7340259 -3081113 -3197640 -3550402 5262054 18045777
1099 18045777 21001354 14451723 12134082 17158317 16319801 2952469 -11376290 -16103113
1091 -16103113 -17117106 -21316229 -19309880 13892 25636242 33231840 16501823 -5678059
1083 -5678059 -15151814 -14270960 -15576416 -22649008 -28092496 -24275154 -10249053 8229535
1075 8229535 21440529 21548605 9402349 -5779467 -14740447 -14538730 -7542503 1199420
1067 1199420 4819919 -1677230 -15261766 -25489500 -24121388 -12397022 2323270 14100028
1059 14100028 20887709 22667644 20059289 13702859 3934007 -7370612 -14721571 -12431692
1051 -12431692 -1750520 8551929 11075807 7179574 3786360 5097406 9328191 11619117
1043 11619117 8394703 647841 -5675830 -4523248 3756932 12756072 17625641 19501895
1035 19501895 21258101 22430533 20508732 14159077 3034040 -12283845 -27762474 -37135603
1027 -37135603 -38846713 -38113093 -38458698 -35513316 -24734968 -11774234 -7664546 -14216602
1019 -14216602 -20846076 -17235444 -4497844 7392435 9790206 2809765 -3974221 1110294
1011 1110294 19398255 37182374 38311577 21635098 1041331 -11634880 -17382082 -22653990
1003 -22653990 -28522516 -31088018 -27549409 -17714064 -3392604 9893416 14168170 6117888
995 6117888 -9146002 -23856022 -34091897 -38566965 -35695712 -25900464 -13414259 -2293533
987 -2293533 5894358 8025404 -610216 -17101385 -28072296 -23918276 -11338995 -3405716
979 -3405716 -1815647 577947 3709336 982089 -4220674 1193092 17732855 25874915
971 25874915 11104790 -14341117 -26962435 -21651283 -12373940 -8137184 -4217545 2036508
963 2036508 2381685 -8420094 -21009903 -23178034 -16555729 -12021437 -12690927 -12329736 -9926770
954 -9926770 -13908659 -27045522 -36989341 -31368784 -16971751 -12029644 -19924035 -23451233
946 -23451233 -10311906 7329853 9019910 -6147280 -21049164 -25808080 -26174735 -26324533
938 -26324533 -20292438 -7426177 -1374059 -11535602 -26048656 -27437718 -18180364 -14904776
930 -14904776 -20891624 -22324310 -13602750 -8283720 -16559390 -26467760 -20711813 -3545498
922 -3545498 3976356 -6801646 -21197219 -21949733 -10494308 -1840005 -4686749 -13630182
914 -13630182 -18806902 -16875768 -11426094 -7009933 -5881662 -8765590 -15158373 -22109660
906 -22109660 -25255993 -23103610 -19298914 -18732068 -21588565 -22905630 -18418163 -9744906
898 -9744906 -2967835 -2214809 -5443744 -7730758 -8542540 -12609553 -20943619 -24557377 -14010243
889 -14010243 5202717 15686124 10428088 3659897 11868406 30333686 39179352 30145994
881 30145994 15861640 11191423 15669440 18671772 14222597 5154723 -2445606 -3945739
873 -3945739 1549742 10068315 16366613 20373562 26274136 33479374 33734286 21153678
865 21153678 1567181 -12227920 -12824177 -3892031 3793944 657328 -13463613 -27394737
857 -27394737 -28887782 -18735090 -10066220 -11643028 -18039223 -20111622 -18281654 -18648816
849 -18648816 -21080348 -19827724 -13979001 -9033286 -7642559 -5590097 961149 8807520
841 8807520 10790028 3533895 -8931458 -18259260 -18927250 -13405423 -9171587 -9915225 -12095605
832 -12095605 -11453334 -9472197 -10476645 -14870926 -18480527 -17340365 -11411014 -5160486
824 -5160486 -4681741 -10813373 -15277056 -9313428 3194766 8856264 3220314 -3215518
816 -3215518 -1951775 1172532 -1526981 -5483956 -4132497 -3964443 -13435121 -22591149 -12705089
807 -12705089 13868415 32253653 28291779 16315706 14904655 19170010 10484879 -14137494
799 -14137494 -36074785 -37119570 -18346688 3372765 12005419 5049603 -6836273 -11830443
791 -11830443 -8328771 -2947854 458113 3874344 7451361 6552993 -548602 -8663670
783 -8663670 -13384222 -17046826 -22523317 -26350832 -23571552 -15782971 -9166115 -6898854
775 -6898854 -7615224 -9110552 -10060872 -10225511 -11640636 -16805749 -23070287 -22440622 -10897431
766 -10897431 4480018 11427866 4458531 -10983811 -24339581 -28163262 -22733085 -14354014
758 -14354014 -8294341 -4269409 -1101003 -2484949 -11457641 -20893726 -19063874 -6303362
750 -6303362 3441163 1408132 -5074053 -5990479 -3498741 -4865881 -7919476 -4195128 6902798
741 6902798 16933397 20532061 20869085 22821016 26621467 28870550 25980926 16906719
733 16906719 5267333 -2296242 -1858255 5340721 16408173 28445536 36106739 34187512
725 34187512 25290068 18305793 16511153 14838186 11794816 13551140 20338191 20247208 6071811
716 6071811 -11620260 -19340769 -19494497 -21760340 -24548709 -20733708 -15359804 -19626061
708 -19626061 -29663321 -28950663 -12599323 6361400 16273325 17711276 13798987 5204456
700 5204456 -2200687 227375 9553012 13294191 9482421 9546789 16768872 19174620 11512873
691 11512873 6224677 10576093 10037081 -8507847 -30361939 -30834359 -12597321 -3696822
683 -3696822 -18446877 -39260750 -42193541 -25727972 -6298660 4706525 9767958 15109822
675 15109822 20388204 20575785 14726601 8824348 8105932 9443982 6306166 -71435 -2008582
666 -2008582 1029125 -513996 -10785045 -18913598 -13074342 2224477 12371173 11987347
658 11987347 8028097 5715535 1994452 -5636907 -12420209 -12040842 -4097020 6598733
650 6598733 14678609 16704430 12156819 3737703 -4596537 -10339783 -12975490 -13724652 -15957785
641 -15957785 -22971446 -32806557 -37874305 -32939799 -21692542 -12633223 -10177645 -12241719
633 -12241719 -14600501 -14867853 -13235969 -10946639 -7533660 -672433 8631086 13331784
625 13331784 8866990 2426403 4865158 13744991 15624754 7172511 837453 4227519
617 4227519 7967374 3597601 377857 10770784 29268666 40729959 42205174 40710798
609 40710798 35523292 20535043 1470738 -7177331 -2945153 2757284 4570164 9008028
601 9008028 18040599 23063150 20264094 17572816 20222008 22335239 19224123 15704469
593 15704469 15178077 12317596 4759784 1209516 8536378 19603748 23190799 18918521
585 18918521 14119570 12596026 14187207 18923144 24037359 23114228 15325200 9057575
577 9057575 9667352 11329282 8763354 8198413 15956568 23630107 17900871 1322449 -9583333
568 -9583333 -5991130 4513059 10915690 10554019 6611666 1979079 -2153550 -6437866
560 -6437866 -12305119 -17379439 -15228844 -5196167 1703590 -5322115 -21845092 -33485379
552 -33485379 -33895439 -28502514 -22223326 -14105602 -4864757 348582 -619822 -4555638 -9779068
543 -9779068 -17651923 -25524146 -26696413 -20317770 -13274941 -9051230 -3419469 4136899
535 4136899 4166535 -9077535 -24235524 -23691396 -5924850 12185125 15960349 7937666
527 7937666 -133192 -3157625 -4722393 -7029111 -6702660 -2098883 1766670 714574 -361956
518 -361956 5546478 13788929 11353420 -2874378 -11585486 -1192107 17277594 21380280
510 21380280 7524561 -5761825 -5539587 -1160472 -6846175 -18980345 -21758121 -10228707
502 -10228707 3331863 5960343 -1349584 -7967498 -7240745 -2155504 336327 -2664416
494 -2664416 -7774843 -9261315 -4332306 4475773 11060549 10823079 5731245 3256111 7378366
485 7378366 11895889 7806464 -2739210 -7351317 -1150801 4701731 -1322820 -14210575
477 -14210575 -20460335 -17794785 -15584523 -18175630 -19885918 -16967037 -13118579 -10871376
469 -10871376 -7981468 -5678897 -10405563 -22430587 -31362038 -28625756 -17654120 -7071467
461 -7071467 -579966 1905040 246942 -3439089 -4508662 -2748293 -3521249 -8242137 -11487942
452 -11487942 -11940292 -16542583 -26791674 -30618784 -17878909 3446131 16843367 16937950
444 16937950 9593542 -756075 -11616859 -15845582 -8719513 1109787 1598383 -3158851
436 -3158851 2257631 19800558 32695221 28147675 11965355 -3864299 -15289171 -21734769
428 -21734769 -19734238 -9991506 -1985124 -2549967 -6335437 -5374539 -1778467 -2462278 -6425214
419 -6425214 -6433319 -665225 5110861 5380221 -1059184 -12431122 -23350939 -25581332 -16366566
410 -16366566 -4450230 -1000398 -5434633 -7032720 -325178 8475093 11795191 10424821
402 10424821 9418479 9661472 8527832 6219400 6382623 10461989 14868284 14759035 8814971
393 8814971 -364350 -8750822 -12625774 -9997710 -3187011 1095872 -1567029 -6137244
385 -6137244 -2889907 8179013 13804715 4167254 -11787936 -16465531 -6658524 3729092
377 3729092 4164960 -629804 -2837202 -4254306 -9133517 -13052967 -9254951 -1371977 231213
368 231213 -7180294 -16623026 -22414476 -25024189 -25377576 -22787097 -19807518 -21239153 -25235966
359 -25235966 -21911441 -5504815 15693933 26015685 18144894 103625 -12918501 -12894547
351 -12894547 -5606277 -3141595 -10404959 -21399903 -28728454 -31584698 -31711103 -27732365
343 -27732365 -19715267 -14252026 -16336710 -19198424 -12131115 2557891 11072052 7682427
335 7682427 1884083 2773962 6933136 7329888 4516861 1648424 -3087834 -10263423 -12793525
326 -12793525 -6174011 375774 -5208396 -18970763 -25524112 -20834322 -17060146 -21684289
318 -21684289 -24885363 -15534369 -199252 4772303 -3913686 -12238248 -8099546 3413429
310 3413429 7829411 -50067 -10247451 -10123101 637015 10009970 7990952 -2178622
302 -2178622 -9228927 -7984291 -3998039 -4108373 -7231125 -7382230 -2767938 2111173 2651440
293 2651440 -814079 -4635778 -6369540 -6689813 -7648959 -9701922 -10565587 -7543337 -1369136
284 -1369136 3019834 640168 -8394477 -18148365 -21420052 -15611965 -5042303 2552731
276 2552731 2718523 -2415959 -8058119 -12737111 -17926342 -22313252 -20900037 -12267774 -3293213
267 -3293213 -2297189 -8777451 -14338498 -13812072 -10883850 -11054610 -13350134 -13013912 -10239121
258 -10239121 -10954964 -17635306 -23301412 -18646683 -4429364 7417552 7373374 408680
250 408680 307301 12228009 25755545 27567031 16920598 4540095 -968228 -337910
242 -337910 1221335 267062 -3570745 -7104335 -4189757 7019019 16909469 12804938 -2513563
233 -2513563 -10163204 280010 14480053 12162556 -4313028 -14072516 -8034105 337624
225 337624 -2634472 -12149253 -15834108 -12184319 -8515891 -7846725 -7587886 -7212342 -9075466
216 -9075466 -14071312 -21882243 -31510989 -36788860 -28150641 -6526845 11222883 10902570
208 10902570 -107685 -3707127 3594400 9376859 6641419 1298451 -2233184 -7586099
200 -7586099 -15117150 -18333557 -16691559 -18187251 -23057252 -19412689 -3834617 8223169
192 8223169 4634807 -4095926 -2822075 2557638 -3688353 -17931323 -20899713 -8804452
184 -8804452 540082 -4006201 -11582034 -9126177 -320398 4532545 4763478 5258986 5821306
175 5821306 4558912 4587619 8450272 11949039 11186557 9464740 9835494 7901181 581854
166 581854 -5084573 -2219681 2907381 -94809 -8354432 -10381731 -5317902 -3333537 -7033299
157 -7033299 -7464781 -1821287 -427237 -9196656 -17883770 -15556328 -7758364 -6641542 -11136636
148 -11136636 -10076237 -1595469 4029418 1375518 -2374823 -131920 4580777 5255332
140 5255332 3075981 3461704 6859349 9358469 9293948 7424808 3138301 -3383596 -7008048
131 -7008048 -2635539 5616888 7191110 -942357 -9196341 -7622313 1825935 9600721
123 9600721 10845374 7784281 2846744 -3471039 -8005523 -5164854 5139346 13989276
115 13989276 11641132 -2260708 -18659861 -27731963 -25854592 -15893139 -3730025 5042382
107 5042382 7160594 2981646 -2822201 -2903827 6860334 21010487 26995292 18093238 2317120
98 2317120 -6295652 -4284516 -532505 -1278699 -1636909 4041962 11352014 13154882 12403961
89 12403961 17658539 27658384 31163896 24048182 16534671 18384020 25207201 27094937
81 27094937 24736790 26880383 34032336 35632067 25918155 13727421 11092820 17921014
73 17921014 24271749 24199773 20469128 16951922 13289851 8324623 3590217 1040368 334109
64 334109 -243978 -2500235 -7787175 -14310534 -15916033 -9209735 -1788448 -5512622 -19316660
55 -19316660 -27824423 -22420751 -14198127 -16610820 -23471710 -17885985 955143 15464195
47 15464195 14839554 7632713 5035025 5555237 3730743 2146567 4809310 7352347 4333649
38 4333649 -213768 368547 3604537 3405630 2374170 7003128 14057488 14297670 8425158
29 8425158 6430430 10269324 10184757 1737096 -5609145 -2857961 5683104 11221424 13608328
20 13608328 16792581 17472608 8815592 -6680619 -17584913 -17862532 -13806885 -14214583 -18661571
11 -18661571 -19417237 -12931630 -5348099 -5273074 -13091767 -20341296 -19769963 -12711985 -5032410
2 -5032410 130975 2039335
0 2039335
##END NTUPLES=NMR SPECTRUM
##END=
