##TITLE=31Pdec_LR-579-H1-CR8
 D2O, 24 sc
 24.6.2019
##JCAMPDX= 6.0         $$ Bruker NMR JCAMP-DX V2.0
##DATA TYPE= NMR SPECTRUM
##DATA CLASS= NTUPLES
##ORIGIN= UXNMR, Bruker Analytische Messtechnik GmbH
##OWNER= root
$$ XWIN-NMR		Version 3.5
$$ Mon Jun 24 16:02:50 2019 Russian Standard Time (UT+4h)  she@DPX200
##.OBSERVE FREQUENCY= 81.013821
##.OBSERVE NUCLEUS= ^31P
##.ACQUISITION MODE= SIMULTANEOUS
##.ACQUISITION SCHEME= undefined
##.AVERAGES= 24
##.DIGITISER RES= 17
##SPECTROMETER/DATA SYSTEM= spect
##.PULSE SEQUENCE= zgpg30
##.SOLVENT NAME= D2O
##.SHIFT REFERENCE= (INTERNAL, D2O, 0, 182.463)
##AUDIT TRAIL= $$ (NUMBER, WHEN, WHO, WHERE, WHAT)
$$ ##TITLE= Audit trail, XWIN-NMR		Version 3.5
$$ ##JCAMPDX= 5.01
$$ ##ORIGIN= Bruker BioSpin GmbH
$$ ##OWNER= she
$$ F:/spectra/data/she/nmr/P31/1/pdata/1/auditp.txt
$$ ##AUDIT TRAIL=  $$ (NUMBER, WHEN, WHO, WHERE, WHAT)
(   1,<2019-06-24 16:01:36.75 +0400>,<she>,<DPX200>,
      <created by zg, POWCHK disabled, PULCHK disabled
       configuration hash MD5:
       00 E9 B6 7A A2 85 ED C7 34 08 36 98 17 FE 4E 26
       data hash MD5: 32K
       96 68 BF F6 E3 4E 1B 05 2E 3D E9 08 29 D3 77 DC>)
(   2,<2019-06-24 16:01:41.90 +0400>,<she>,<DPX200>,
      <Start of raw data processing
       efp BC_mod = 2 LB = 1 FT_mod = 6 PKNL = 1 PHC0 = -2567.351 PHC1 = 151.799 SI = 64K 
       data hash MD5: 64K
       C5 EF C7 73 31 B4 BE 07 85 17 BA 9D F4 55 A6 C2>)
(   3,<2019-06-24 16:02:10.06 +0400>,<she>,<DPX200>,
      <pk PHC0 = -94.48347 PHC1 = 158.4 
       data hash MD5: 64K
       58 1B A0 67 55 87 9D 1D 7B 9A 6D 7B 60 38 42 D1>)
$$ ##END=
$$ 
$$ hash MD5
$$ D4 9F CC FD 27 B7 E7 16 DF 58 16 39 0E 39 27 14
##$RELAX= 
##$RELAX= 
##$RELAX= 
##$RELAX= 
##$RELAX= 
##$RELAX= 
##$RELAX= 
##$RELAX= 
$$ Bruker specific parameters
$$ --------------------------
##$DU= <F:/spectra>
##$EXPNO= 1
##$NAME= <P31>
##$PROCNO= 1
##$TYPE= <nmr>
##$USER= <she>
##$AMP= (0..31)
100 100 100 100 100 100 100 100 100 100 100 100 100 100 100 100 100 100 
100 100 100 100 100 100 100 100 100 100 100 100 100 100 
##$AQSEQ= 0
##$AQ_mod= 1
##$AUNM= <au_zg>
##$AUTOPOS= <>
##$BF1= 81.014009
##$BF2= 200.13
##$BF3= 200.13
##$BF4= 200.13
##$BF5= 200.13
##$BF6= 200.13
##$BF7= 200.13
##$BF8= 200.13
##$BYTORDA= 1
##$CFDGTYP= 0
##$CFRGTYP= 5
##$CHEMSTR= <none>
##$CNST= (0..31)
1 1 145 1 1 1 1 1 1 1 1 1 1 1 1 1 1 1 1 1 1 1 1 1 1 1 1 1 1 1 1 1 
##$CPDPRG= <waltz16>
##$CPDPRG1= <>
##$CPDPRG2= <waltz16>
##$CPDPRG3= <>
##$CPDPRG4= <mlev>
##$CPDPRG5= <mlev>
##$CPDPRG6= <mlev>
##$CPDPRG7= <mlev>
##$CPDPRG8= <mlev>
##$CPDPRGB= <>
##$CPDPRGT= <>
##$D= (0..31)
0 1 0 0 0 0 0 0 0 0 0 0.03 2e-05 3e-06 0 0 0 0 0 0 0 0 0 0 0 0 0 0 0 0 
0 0 
##$DATE= 1561377696
##$DBL= (0..7)
120 120 120 11 120 120 24 19 
##$DBP= (0..7)
150 150 150 150 150 150 150 150 
##$DBP07= 0
##$DBPNAM0= <>
##$DBPNAM1= <>
##$DBPNAM2= <>
##$DBPNAM3= <>
##$DBPNAM4= <>
##$DBPNAM5= <>
##$DBPNAM6= <>
##$DBPNAM7= <>
##$DBPOAL= (0..7)
0.5 0.5 0.5 0.5 0.5 0.5 0.5 0.5 
##$DBPOFFS= (0..7)
0 0 0 0 0 0 0 0 
$$ [...]
##$SUBNAM2= <"">
##$SUBNAM3= <"">
##$SUBNAM4= <"">
##$SUBNAM5= <"">
##$SUBNAM6= <"">
##$SUBNAM7= <"">
##$SUBNAM8= <"">
##$SUBNAM9= <"">
##$SW= 369.568048894756
##$SWIBOX= (0..15)
0 1 3 0 0 0 0 0 0 0 0 0 0 0 0 0 
##$SW_h= 29940.119760479
##$TD= 32768
##$TD0= 1
##$TE= 0
##$TE2= 300
##$TE3= 300
##$TEG= 300
##$TL= (0..7)
0 120 53 12 22 120 120 120 
##$TP= (0..7)
150 150 150 150 150 150 150 150 
##$TP07= 0
##$TPNAME0= <>
##$TPNAME1= <>
##$TPNAME2= <>
##$TPNAME3= <>
##$TPNAME4= <>
##$TPNAME5= <>
##$TPNAME6= <>
##$TPNAME7= <>
##$TPOAL= (0..7)
0.5 0.5 0.5 0.5 0.5 0.5 0.5 0.5 
##$TPOFFS= (0..7)
0 0 0 0 0 0 0 0 
##$TUNHIN= 0
##$TUNHOUT= 0
##$TUNXOUT= 0
##$USERA1= <user>
##$USERA2= <user>
##$USERA3= <user>
##$USERA4= <user>
##$USERA5= <user>
##$V9= 5
##$VALIST= <valist>
##$VCLIST= <CCCCCCCCCCCCCCC>
##$VD= 0
##$VDLIST= <DDDDDDDDDDDDDDD>
##$VPLIST= <PPPPPPPPPPPPPPP>
##$VTLIST= <TTTTTTTTTTTTTTT>
##$WBST= 1024
##$WBSW= 4
##$XGAIN= (0..3)
0 0 0 0 
##$XL= 0
##$YL= 0
##$YMAX_a= 5782
##$YMIN_a= -10002
##$ZGOPTNS= <>
##$ZL1= 120
##$ZL2= 120
##$ZL3= 120
##$ZL4= 120
##$ABSF1= 0
##$ABSF2= 0
##$ABSG= 0
##$ABSL= 0
##$ALPHA= 0
##$AQORDER= 0
##$ASSFAC= 0
##$ASSFACI= 0
##$ASSFACX= 0
##$ASSWID= 0
##$AUNMP= <proc_1d>
##$AZFE= 0.1
##$AZFW= 0.5
##$BCFW= 0
##$BC_mod= 2
##$BYTORDP= 0
##$COROFFS= 0
##$CY= -3
##$DATMOD= 1
##$DC= 0
##$DFILT= <>
##$DTYPP= 0
##$F1P= 0
##$F2P= 0
##$FCOR= 1
##$FTSIZE= 65536
##$FT_mod= 6
##$GAMMA= 0
##$GB= 0
##$INTBC= 1
##$INTSCL= 5.30512e-09
##$ISEN= 30
##$LB= 1
##$LEV0= 0
##$LPBIN= 0
##$MAXI= 10000
##$MC2= 0
##$MEAN= 0
##$ME_mod= 0
##$MI= 50
##$NCOEF= 0
##$NC_proc= -9
##$NLEV= 6
##$NOISF1= 182.463
##$NOISF2= 159.3651
##$NSP= 0
##$NTH_PI= 0
##$NZP= 0
##$OFFSET= 182.463
##$PC= 4
##$PHC0= -2661.834
##$PHC1= 310.199
##$PH_mod= 1
##$PKNL= yes
##$PPARMOD= 0
##$PSCAL= 0
##$PSIGN= 0
##$REVERSE= no
##$SF= 81.0140089999434
##$SI= 65536
##$SIGF1= 159.3651
##$SIGF2= -187.1042
##$SINO= 113.3802
##$SIOLD= 16384
##$SREGLST= <1H.CDCl3>
##$SSB= 0
##$STSI= 65536
##$STSR= 0
##$SW_p= 29940.119760479
##$SYMM= 0
##$S_DEV= 0
##$TDeff= 32768
##$TDoff= 0
##$TI= <>
##$TILT= no
##$TM1= 0
##$TM2= 0
##$TOPLEV= 0
##$USERP1= <user>
##$USERP2= <user>
##$USERP3= <user>
##$USERP4= <user>
##$USERP5= <user>
##$WDW= 1
##$XDIM= 65536
##$YMAX_p= 468890755
##$YMIN_p= -289828380
$$ End of Bruker specific parameters
$$ ---------------------------------
##NTUPLES= NMR SPECTRUM
##VAR_NAME=  FREQUENCY,     SPECTRUM/REAL,   SPECTRUM/IMAG
##SYMBOL=    X,             R,               I
##VAR_TYPE=  INDEPENDENT,   DEPENDENT,       DEPENDENT
##VAR_FORM=  AFFN,          ASDF,            ASDF
##VAR_DIM=   65536,         65536,           65536
##UNITS=     HZ,            ARBITRARY UNITS, ARBITRARY UNITS
##FACTOR=    0.456856943014862, 1,           1
##FIRST=     14782.0589164792, 0,            0
##LAST=      -15158.0608439998, 0,           0
##MIN=       -15158.0608439998, -289828380,  0
##MAX=       14782.0589164792, 468890755,    0
$$ Real data points
##PAGE= N=1
##DATA TABLE= (X++(R..R)), XYDATA
$$ [...]
4124B8032657n052191p938273R15830R079065M160489p223014q208913K747684
4116A6513334Q543254r07316j3161594j2348720k379005K294811Q53846M033222
4108C441832J1637688J1133110O4553q616736q344969q117979j2701618j1950130
4100b3454249p63107P713857L062947m016292r41607L993306j813627r029496
4092b5248268j024421J4136334J3362882l258462j1401213j267931Q955358M533027
4084a212694m879969n356592M65143L851407M995178O902507P485201O155315
4076A8405496O112949M660595m437413j4475311r509162Q662628J6727701L299282
4068B9446765j2961338j1587833J225789P364515L630613k559749r550971j6121572
$$ plain form
4124 28032657 22980466 15042193 15958023 25037088 29197577 21974563 13765650 16513334
4116 16513334 25056588 24149272 10987678 -1361042 -3740047 -1445236 -591390 3441832
4108 3441832 15079520 26212630 26277183 17660447 9315478 1197499 -11504119 -23454249
4100 -23454249 -24217356 -16503499 -13440552 -17456844 -18398451 -14405145 -16218772 -25248268
4092 -25248268 -26272689 -12136355 1226527 -2031935 -13433148 -14701079 -5745721 -1212694
4084 -1212694 -6092663 -11449255 -10984112 -7132705 -2137527 4764980 12250181 18405496
4076 18405496 24518445 29179040 24741627 10266316 757154 9419782 26147483 29446765
4068 29446765 16485427 4897594 6123383 13487898 17118511 14558762 5007791 -11113781
4060a1113781j2918548K962040J6515119J5124741Q103346Q192873P647462n158502
4052B9354750j8101007j1172360P845208J2088262k539607j2231462l977767P106710
4044H372727N531024k735878n589365l221660j121414P59332K841346J667495
4036F503607k204563k507661J517325K617048j918128n954516o056313o190940
4028a4194141p795854o544112k146818J2631k38111K774166P956394P365106J769133
4019a1041606J991449J0071927J3707508N958852l527331m783845j758481j369230
4011I249243p19112M410050Q761355O030200k42941l725577n322677p259763n422271
4002E758507K679948R712787Q272390K453318L9184n92957n398034j1814012j2186158
$$ plain form
4060 -11113781 -24032329 -21070289 -4555170 10569571 18672917 26865790 34513252 29354750
4052 29354750 11253743 81383 7926591 20014853 17475246 5243784 1266017 8372727
4044 8372727 13903751 11167873 5578508 2356848 1235434 1994766 4836112 6503607
4036 6503607 4299044 1791383 3308708 5925756 4007628 -1946888 -8003201 -14194141
4028 -14194141 -21989995 -28534107 -30680925 -30668294 -30906405 -28132239 -20175845 -12810739 -11041606
4019 -11041606 -9050157 1021770 14729278 20688130 17160799 12376954 10618473 9249243
4011 9249243 8530131 12940181 21701536 27731736 27488795 23763218 18440541 11180778 5758507
4002 5758507 8438455 18151242 26423632 28876950 28916134 28323177 22925143 11111131 -1075027
3993a075027o879104l236750k747300Q58586R872188J6937614J3751912J068778
3985B8550897j2047653j7189860j3958614q288202l599848K938298J2078534J5783624
3977D267176P405077n000456p406805p39417J040467m994612n343929N686094
3969e086405J4056260R041858J919772O422042J3991777P600765q724800j5425545
3961B3795724q663305m347858r427087j0348426J861841J2716874M379483j5656973
3953e689727k1901813m907992J5522290J5502255l352419j7592961j1975786L869033
3945c0527120J1612155Q194670N024012Q104259J0743923O645756o81674n299953
3937A3816028o591160n152255N84141Q152920R484660K192878m566318k744385
$$ plain form
3993 -1075027 -7954131 -11190881 -13938181 -13079595 -3207407 13730207 27482119 28550897
3985 28550897 16503244 -686616 -14645230 -22933432 -26533280 -23594982 -11516448 4267176
3977 4267176 11672253 6671797 -735008 -1474425 -433958 -5428570 -10772499 -5086405
3969 -5086405 8969855 18011713 19931485 26353527 40345304 47946069 39221269 23795724
3961 23795724 15132419 10784561 1357474 -8990952 -7129111 5587763 9967246 -5689727
3953 -5689727 -27591540 -32499532 -16977242 -1474987 -4827406 -22420367 -34396153 -30527120
3945 -30527120 -18914965 -10720295 -5696283 2407976 13151899 19797655 19115981 13816028
3937 13816028 7224868 2072613 2656754 10809674 20294334 22487212 17920894 15176509
3929A5176509K487408J371428n195041q267541n110459j335099j5196K601326
3921A713335R182185J5254103J3648909K826626j0034226j4288337o275894N267410
3913A7294111P859475p4270p758091o206561J638041O679540M222897l310424
3905B0344718r488897q451687r01972M907104L368910n4597J752923M260610p63461
3896A4973651q241809o761281j48749k400332j0776262p142470R335624J6338618
3888E176990M739546n463772J9971N513933l913403j2661008j885868J4415084
3880E941473J1147933n738958j0929593j951757L334251L047139J0285905J9968416
3872C5104809J2537344q131897j5450861l732518K760184p231313j3446896j993766
$$ plain form
3929 15176509 17663917 19035345 13840304 5572763 462304 -872795 -887991 1713335
3921 1713335 10895520 26149623 39798532 42625158 32590932 18302595 12026701 17294111
3913 17294111 25153586 25079316 17321225 11114664 12752705 19432245 23655142 20344718
3905 20344718 10855821 2404134 1502162 6409266 9778176 9723579 11476502 15737112 14973651
3896 14973651 6731842 -29439 -178188 -2578520 -13354782 -20497252 -11161628 5176990
3888 5176990 9916536 4452764 4472735 9986668 6073265 -6587743 -8473611 5941473
3880 5941473 17089406 11350448 420855 -1530902 1803349 4850488 15136393 35104809
3872 35104809 47642153 39510256 24059395 20326877 23087061 15855748 2408852 415086
3864D15086R428312K727632j0423296j0842118l082585k150955n403223l92840
3856a9723987J0267479J3014561O008524J16392Q18535L019296J819564j728968
3848A3611396m222850l301605K58129J976766m6428K4470N670589O832575n911921
3839A4891121j9302894j1317105J2036632K0180382M767012o325007M330552J3425390
3831C2686083l158706k6483093k2411410M386518J9303737J1437177L107801P387860
3823B6255967J0177540J172101o779712j970205M872369j079573j4185070j7177848
3815A285569n881827P340600J0447569L198041o011323r253719o048723l281409
3807h205222o606711j2528149j2543942m284133N881229J0784895Q930140L930195
$$ plain form
3864 415086 9843398 12571030 2147734 -8694384 -11776969 -13927924 -19331147 -19723987
3856 -19723987 -9456508 3558053 9566577 9682969 10501504 13520800 15340364 13611396
3848 13611396 9388546 6086941 6345070 8321836 8275408 8299878 13970467 20803042 14891121
3839 14891121 -4411773 -15728878 -3692246 16488136 21255148 14930141 19260693 32686083
3831 32686083 29527377 3044284 -19367126 -14980608 4323129 15760306 18868107 26255967
3823 26255967 36433507 37605608 30825896 28855691 33728060 32648487 18463417 1285569
3815 1285569 -4596258 2744342 13191911 16389952 10378629 1124910 -4923813 -8205222
3807 -8205222 -14811933 -27340082 -39884024 -44168157 -38286928 -27502033 -18571893 -14641698
3799a4641698J269939M175831R273648Q774683M71403q009410r065368m773022
3791a2523994j471802K51068L021421M317767n64555q725713j0914042l219600
3783b9829450P925697J3041765Q653418l68607n542211l459262j3939k175158
3775a1767747o619881m243680M047424P202243K473253Q94451P994960J2686907
3767A2667930N568556l987359k050438Q214694J2928710Q111584O64060m747506
3759C7370231p309825n371878k155806p615987k1230846k3518789k331616K2163010
3751a0001506K0729385k941850j7566429r007600N674837J0151159Q390331N804811
3743A1233138l591202j8646776k1154333j300669K1726690K1724108o98093k0645202
$$ plain form
3799 -14641698 -13371759 -9195928 77720 8852403 9323806 1314396 -7750972 -12523994
3791 -12523994 -13995796 -13744728 -10723307 -6405540 -6970095 -15695808 -26609850 -29829450
3783 -29829450 -21903753 -8861988 -208570 -577177 -6119388 -9578650 -9592589 -11767747
3775 -11767747 -18387628 -22631308 -18583884 -11381641 -8908388 -8013937 -18977 12667930
3767 12667930 18236486 14249127 12198689 20413383 33342093 41453677 42117737 37370231
3759 37370231 30060406 24688528 22532722 14916735 -6314111 -29832900 -32164516 -10001506
3751 -10001506 10727879 7786029 -9780400 -18788000 -13113163 -2962004 5428327 11233138
3743 11233138 7641936 -11004840 -32159173 -33459842 -11733152 9990956 9292863 -11352339
3735a1352339j9675606k396491J3868053J6756044Q049681L40732K439950P636789
3727A5666813K999488r872543j4724130m643925O302995K936884r922289j5751089
3719b7007796q426288L522201J0023814Q339050J682769m083351l791902K313780
3711a7427723Q070584P724619J298547o317523q828161k772612P056036R149491
3703b046742j018142j1975459r846370K196779R391637P684248O312885Q557032
3695I255868O375523k512849q428101o363205l639825m145183l21184J0225085
3687D46129J5182338O250300n493307n863715J429472L281602k160894o699408
3679F372517p027676n857662l493492O09232K959287K415819N295154J4242974
$$ plain form
3735 -11352339 -31027945 -33424436 -19556383 -2800339 5249342 5590074 8030024 15666813
3727 15666813 18666301 8793758 -5930372 -10574297 -4271302 -1334418 -11256707 -27007796
3719 -27007796 -35434084 -31911883 -21888069 -13549019 -11866250 -15949601 -19741503 -17427723
3711 -17427723 -9357139 -1632520 -333973 -6651496 -15479657 -18252269 -11196233 -2046742
3703 -2046742 -3064884 -15040343 -24886713 -22689934 -13298297 -5614049 698836 9255868
3695 9255868 15631391 13118542 4690441 -1672764 -5312589 -9457772 -9778956 446129
3687 446129 15628467 21878767 16385460 10521745 11951217 15232819 13071925 6372517
3679 6372517 -655159 -6512821 -10006313 -9397081 -6437794 -4021975 1273179 15516153
3671A5516153J8976550R407883p981704j8356271j7834708j3296540q179189q34937
3663b2582763O371159Q059407M277020p62167n043537o369813N7401J2444898
3655c548395J8325999J0982192K085123M393497R707452J182230j7709989k6011476
3647e93367j5998608k141070K585527J660105K127140K926187K338783L600741
3639c494562O507455M744240k642455p691975o627321n664352p966542n916302
3631b8751814N529680J6839384J4810776M35575j1990007j1219198J51368R318321
3623d875915N821279p101877j4449758o795611P253913J2820952Q843283N592695
3615G108961N578226J991508l934315j621809Q377952J0357767j579498j1068124
$$ plain form
3671 15516153 34492703 43900586 35918882 17562611 -272097 -13568637 -21747826 -22582763
3663 -22582763 -16211604 -8152197 -3875177 -4637344 -9680881 -16050694 -15993293 -3548395
3655 -3548395 14777604 25759796 27844919 32238416 41945868 43128098 25418109 -593367
3647 -593367 -16591975 -18733045 -16147518 -14487413 -12360273 -9434086 -7095303 -3494562
3639 -3494562 3012893 7757133 5114678 -2577297 -9204618 -14868970 -22835512 -28751814
3631 -28751814 -23222134 -6382750 8428026 8863601 -3126406 -14345604 -14194236 -4875915
3623 -4875915 945364 -6156513 -20606271 -27401882 -20147969 -7327017 1516266 7108961
3615 7108961 12687187 14678695 10744380 9122571 17500523 27858290 26278792 15210668
3607A5210668l965115R065976R047058l610851j3621719j4141183r276138m78434
3599a1769738J1910153J7909212O942707j3273290k3432620j8291717r631304
3592c9636597l714729N476208J7132584J7896066M362947o316573j079993Q381014
3584B500927M749666o996755q809743R45530O822109K406453k136239j68947J646815
3575I59816j359883k782184J165401K854758k388136n253804K950388J4567514
3567A0713870J6687978R879732L121794k431968j0033207j4023698p131356K465339
3559I248484J18149j0085019r489439L506144Q733218j312994o186862Q446522
3551B978203K3129091J3202296j0836578j8552301o419678r7058j0757933j8765484
$$ plain form
3607 15210668 11245553 20311529 29358587 25747736 12126017 -2015166 -11291304 -11769738
3599 -11769738 140415 18049627 24992334 11719044 -11713576 -30005293 -39636597
3592 -39636597 -43351326 -37875118 -20742534 -2846468 1516479 -4800094 -5880087 2500927
3584 2500927 7250593 253838 -8555905 -7610375 -788266 1618187 -518052 -686999 959816
3575 959816 -400067 -3182251 -2016850 837908 -1550228 -6804032 -3853644 10713870
3567 10713870 27401848 37281580 40403374 37971406 27938199 13914501 6783145 9248484
3559 9248484 9366633 -718386 -10207825 -6701681 2031537 718543 -5468319 2978203
3551 2978203 26107294 39309590 28473012 9920711 3501033 3403975 -7353958 -26119442
3543b6119442q768606N139777M349444m262123k482696Q270613J1296737L800229
3535h776067P00668Q234617J2213283K33441j7189951j9050867j881323J5707148
3527i809051J6759694N417703j782251J774541P001275M691852j830755l898182
3519A8324826q56956J014191m32281j509170j243736l077864o483303n199839
3511E35868K209446P336876L505920l322929l191332J726685l96484j1748177
3503c344127j8462037r519833N785199R601445J266818j913074P995647J5755333
3495G165371O186493j0619353j3172418q45931P351758M747874N132096J3628593
3487A9574483J3300396n318487k2161431j5543356L423192Q436533p10438j732968
$$ plain form
3543 -26119442 -34888048 -29748271 -25398827 -29660950 -32143646 -23873033 -12576296 -8776067
3535 -8776067 -8075399 159218 12372501 12605942 -4584009 -23634876 -25516199 -9809051
3527 -9809051 6950643 12368346 10586095 12360636 19361911 24053763 22223008 18324826
3519 18324826 17467870 18482061 18049780 16540610 15296874 12219010 5735707 535868
3511 535868 2745314 10082190 13588110 10265181 7073849 8800534 8404050 -3344127
3503 -3344127 -21806164 -31325997 -25540798 -15939353 -14672535 -16585609 -8589962 7165371
3495 7165371 13351864 2732511 -10439907 -11285838 -3934080 813794 5945890 19574483
3487 19574483 32874879 27556392 5394961 -10148395 -6725203 1711330 1000892 -732076
3479g32076J0131262J4863205K922146r585012r019967l688547m349399o212350
3471e670738l162782j382153m652330k807934R734910J9172570J2990977J785643
3463B6008163J680329O810603N84628j4076162j8557212q571732J801877N216083
3455H96577Q592276J3351249R154478n982111j7099966j2893527j225338M752424
3447d53938M272093L609234K999004j084944p181280j0954556j1427045q990429
3439b9211861k344115P141847J3459883J3478620J0700463P146237n83917j0916723
3431H870434j2411407K33356J2818458P998059r012816j6302616o399414M783637
3423i422309M157851L4921M542268J1501851P348701m372263p502793M41816M906015
$$ plain form
3479 -732076 9399186 24262391 27184537 17599525 8579558 4891011 541612 -5670738
3471 -5670738 -8833520 -10215673 -14868003 -17675937 -7941027 11231543 24222520 26008163
3463 26008163 27688492 34499095 35083723 21007561 2450349 -6121383 -4319506 896577
3455 896577 9488853 22840102 31994580 26012469 8912503 -3981024 -5206362 -453938
3447 -453938 3818155 7427389 10426393 9341449 2160169 -8794387 -20221432 -29211861
3439 -29211861 -31555976 -24414129 -10954246 2524374 13224837 20371074 19787157 8870434
3431 8870434 -3540973 -3307617 9510841 17508900 8496084 -7806532 -14205946 -9422309
3423 -9422309 -5264458 -5229537 -687269 10814582 18163283 13791020 6288227 6730043 11636058
3414A1636058p29731n158835r13348J718060n311958r859721N03224J2651026
3406D534775M961279j5455286j8641882K814560K0275938J1089124q800164j0954862
3398a0176518M273063J3337461N776711o635615j2533133j2822419r975001k625081
3390c1380532O426623J0367226R246716R258700R861413M079715o038960p614970
3382D205931M002633J5671310J3050724j348241j2993717j1962637j42606J2185559
3374B2668956J3592522J792747j0853687r747071K179765P195875j557922r846322
3366A5424863m932941M496144K918633p316613j0533393j642909R016601J2722233
3358B0152618J1027081P542644L037471k00847L14492N69337n075996j1795209
$$ plain form
3414 11636058 10906327 5747492 4834144 6552204 1240246 -8619475 -8116251 4534775
3406 4534775 9496054 -5959232 -24601114 -21786554 -1510616 9578508 778344 -10176518
3398 -10176518 -5903455 7434006 13210717 6575102 -5958031 -18780450 -28755451 -31380532
3390 -31380532 -24953909 -14586683 -5339967 3918733 13780146 17859861 11820901 4205931
3382 4205931 8208564 23879874 36930598 35582357 22588640 10626003 10483397 22668956
3374 22668956 36261478 38054225 27200538 17453467 19633232 26829107 25271185 15424863
3366 15424863 10491922 14988066 17906699 10590086 56693 -1586216 7430385 20152618
3358 20152618 31179699 38722343 41759814 41558967 41873459 42442796 37366800 25571591
3350B5571591q975767J253631L991853m980238j0312292j083284R780792M424951
3342A9671237j1315286j6032487n133089L970272K29452o099523l423861K787560
3334a5345725K780774P88520N931359J3162605R636379l257330j0334975n680495
3326b318888j66799k221418n149018p56098O182965O745347K579462J387353L557629
3317I840535L493281J61748l342377p289798j2566613j3675972n557428M747757
3309b4188867N699574p9886Q99795Q865346O615809j2206966k6275343j3285106
3301e3955644J6006066K8828924J3167692q315822j0634662L018221J2073604
3294A88379Q278795J423057L12412J742637J63124k329301j364621N99280k663152
$$ plain form
3350 25571591 16595824 17849455 21841308 16861070 6548778 5465494 15246286 19671237
3342 19671237 8355951 -7676536 -12809625 -8839353 -8609901 -14709424 -18133285 -15345725
3334 -15345725 -12564951 -11776431 -5845072 7317533 16953912 13696582 3361607 -2318888
3326 -2318888 -2485687 -4707105 -9856123 -10612221 -4429256 2316091 4895553 6282906 9840535
3317 9840535 13333816 13495564 10153187 2863389 -9703224 -23379196 -28936624 -24188867
3309 -24188867 -18489293 -18569179 -17669384 -8804038 -2188229 -14395195 -40670538 -53955644
3301 -53955644 -37949578 -9120654 4047038 -4268784 -14903446 -11885225 188379
3294 188379 8467174 9890231 10202643 11945280 12108404 9779103 8414482 9013762 6350610
3285F350610j1289711j7997006j6120446n452228Q655163J8181219J6396795M693107
3277C417503n353808l643302M436818M141631o415116j1030753R30135J6450019
3269B933127J6463958L857278j989793M494969Q328033L0351r663146r318792
3261A5135985n171417p368197j0353833l132804Q763576R577682j079190o675501
3253c03699M31830Q111479N012630k425798k808844J215391j516474j1950633
3245d234118j8719719j3140066J677935J5823676K0658251J3383085m18780r633948
3237E396316q296067k520776j931465o007622n552169K683058J0228194Q034069
3229B033538k110575j0415933r952725k292726N352100P064720L712185J333882
$$ plain form
3285 6350610 -4939101 -22936107 -39056553 -44508781 -35853618 -17672399 -1275604 3417503
3277 3417503 -1936305 -5579607 -1142789 2998842 -3416274 -14447027 -13516892 2933127
3269 2933127 19397085 23254363 21264570 25759539 34087572 34117923 24454777 15135985
3261 15135985 9964568 2596371 -7757462 -10890266 -2126690 7450992 6371802 -303699
3253 -303699 128131 8239610 13252240 10826442 8017598 9232989 7716515 -4234118
3245 -4234118 -22953837 -36093903 -34415968 -18592292 2065959 15449044 15030264 5396316
3237 5396316 -2899751 -5420527 -7351992 -13359614 -18911783 -16228725 -6000531 2033538
3229 2033538 -77037 -10492970 -20445695 -22738421 -17386321 -10321601 -6609416 -5275534
3221e275534K605744K594745l039197r038396o975631J114652M710957P99399
3213a2503261k259661O02701L465927J541446K80503M464135P735428L080262
3205F407480m102105m752722j421660k115242m207381Q32896R435049Q592202
3197H668517k762796j0324786n572259L612810P924991Q713118Q963129N126164
3189B4348888l658763q988599n060487J669887L379165K931395N792484Q038064
3181B8452034L233652m865433p428208l932549l29517K098042N675121P324034
3173C0227176J477530r027789j4494813j0910231l513939J575577K634261M30965
3165a601263k554600k376846J444112L856518K353207K319606P269328R538643
$$ plain form
3221 -5275534 -2669790 -75045 -3114242 -12152638 -19128269 -18013617 -13302660 -12503261
3213 -12503261 -14762922 -14160221 -10694294 -9152848 -8872345 -4408210 3327218 6407480
3205 6407480 2305375 -2447347 -3869007 -5984249 -10191630 -9358734 76315 8668517
3197 8668517 5905721 -4419065 -9991324 -6378514 1546477 10259595 19222724 24348888
3189 24348888 20690125 11701526 6641039 8310926 11690091 14621486 20413970 28452034
3181 28452034 31685686 26820253 19392045 15459496 15129979 17228021 22903142 30227176
3173 30227176 31704706 22676917 8182104 -2728127 -6242066 -4666489 -2032228 -1601263
3165 -1601263 -4155863 -6532709 -5088597 -1232079 1121128 3440734 10710062 20248705
3157B0248705Q49619j2026893j3922344k085908J0594178J2823716N569094l829394
3149A8220773q463912l670680P812661J3377321L918013j1235085j4489311m467901
3141A001879L083459l78963n957729m964547j636369j451016l49963N344764R374621
3132D066136N728751m43496j684911n35949l448531q542875q995925m296749M96800
3123a7656749L512429O566020R381208R539747O325636N86702o072429r105109
3115C077455l687264O276982Q554190j700467j2606522r724735M620662J4101312
3107H911613Q041593q464740k2102901k2905964j0191458O869368J5344932J0332235
3099a4165322O09288q88979Q419372J8368534J7158682L182383j2789708j6697659
$$ plain form
3157 20248705 21098324 9071431 -4850913 -6936821 3657357 16481073 22050167 18220773
3149 18220773 9756861 6086181 13898842 27276163 31194176 19959091 5469780 1001879
3141 1001879 4085338 3706375 -2251354 -7215901 -8852270 -10303286 -10653249 -5308485 4066136
3132 4066136 9794887 9351391 7666480 7130531 3682000 -4860875 -13856800 -18153549 -17656749
3123 -17656749 -14144320 -7578300 1802908 11342655 17668291 18254993 12182564 3077455
3115 3077455 -609809 5667173 14221363 12520896 -85626 -9810361 -5189699 8911613
3107 8911613 16953206 8488466 -13614435 -36520399 -46711857 -39842489 -24497557 -14165322
3099 -14165322 -13556034 -14445013 -6025641 12342893 29501575 32683958 19894250 3196591
3091C196591n063550J0281738J4829079P412491k033372q310964j4241679j7788313
3083a1717979r768482Q917731K0119824R963499j0071987j6035351j945295J4187737
3075C649697J4397602R72868r905429q193187O54654M751870Q70178k837089J99045
3066D560209N351865O029266O026409J1237979J3723151Q00967k0045342k5233495
3058B451009r687990L124710l248163j2719363l693380J5491889K0521011R232078
3050B1471801J174543M136202N635954j365215o625305k433739K444840k656050
3042B1783031j3634193j7742211r553621M328514J2219647P466150m478867j0289041
3034i900591m174949M822127O135662J808901m42241o05384j899245k03083Q457503
$$ plain form
3091 3196591 -1866959 8414779 23243858 30656349 28622977 20312013 6070334 -11717979
3083 -11717979 -21486461 -12568730 7551094 17514593 7442606 -8592745 -10538040 3649697
3075 3649697 18047299 19020167 9114738 921551 1576205 6328075 7198253 4361164 4560209
3066 4560209 9912074 15941340 21967749 33205728 46928879 47729846 27684504 2451009
3058 2451009 -7236981 -4112271 -7360434 -20079797 -23773177 -8281288 12239723 21471801
3050 21471801 22646344 26782546 32418500 31053285 24427980 21994241 24439081 21783031
3042 21783031 8148838 -9593373 -19146994 -14818480 -2598833 4867317 388450 -9900591
3034 -9900591 -14075540 -9253413 -3117751 -1308850 -1751091 -2356475 -4255720 -4458803 3998700
3025C998700J5441178R447706m708312j2080885r342849n727206n328580m214090
3017a2514338k538469l129545p00986R852262J7377436P107341j2208990j6750390
3009a3505679m032743M064058j541154m088857O150361J3456164N738852k895325
3001C345677K325210R945780K952999j0513441j0828897Q12635P280820M384350
2993I705133K192964K911772n39475o108086l441105O156380Q916521N09859o961520
2984A3342443l926411L686985N216982r15862q496752j1491311p954567j182531
2976a1721024K523481J604376K340973Q561882J2689133N930010o011786q493194
2968G423851J452672J1133991J0561824M582210K540379M002340J142638q464988
$$ plain form
3025 3998700 19439878 28887584 24179272 12098387 2755538 -2971668 -8300248 -12514338
3017 -12514338 -15052807 -18182352 -18883338 -9031076 8346360 15453701 3244711 -13505679
3009 -13505679 -17538422 -13474364 -15015518 -19104375 -12954014 502150 6241002 3345677
3001 3345677 5670887 15616667 18569666 8056225 -2772672 -1960037 5320783 9705133
2993 9705133 11898097 14809869 14270394 8162308 4721203 10877583 19794104 20303963 13342443
2984 13342443 9416032 13103017 18319999 17404137 8907385 -2583926 -10538493 -11721024
2976 -11721024 -9197543 -7593167 -5252194 3309688 15998821 21928831 15917045 7423851
2968 7423851 8876523 20010514 30572338 35154548 37694927 41697267 42839905 34374917
2960C4374917j7124636j5311242k678681J0166383J1733628J551348r515812j0844692
2952B351213j820887R264397J2647060M498118q225469j1662163k87844J3251468
2944B0015893J2263927j274726r666419n342355O92531m22248k504486K32073
2936A3994190P18255o449854j1609843m856450O532007R413803M389609N43554
2928A2675271o76212k473765j928146L613774P219819L339960n63632K305107
2920B3512176L280073n814697j3122586m325141R755088P583173p652519j3529310
2912c13743n583571p09646l794899r28192R859888J1028805k500497j1874223
2904d816078o425093o46131n097455o385637O010787J6684651R293696n071064
$$ plain form
2960 34374917 17250281 1939039 -739642 9426741 21160369 22711717 13195905 2351213
2952 2351213 530326 9794723 22441783 26939901 18714432 7052269 6764425 20015893
2944 20015893 32279820 31005094 21338675 15996320 16688851 16266603 13762117 13994190
2936 13994190 14712445 8262591 -3347252 -8203702 -1671695 7742108 12131717 12675271
2928 12675271 11999059 9525294 7597148 11210922 18430741 21770701 21207069 23512176
2920 23512176 26792249 20977552 7854966 3529825 13284913 20868086 13215567 -313743
2912 -313743 -5897314 -6606960 -10401859 -11330051 -1470163 9558642 7058145 -4816078
2904 -4816078 -11241171 -11887302 -16984757 -23370394 -17359607 -674956 8618740 3547676
2896C547676o603718K770967R422010J2600804J6048540J0501659r182321k2510696
2888A6594921q469972J6832757J9164319j838951j3128959j607908P925821k793993
2880C2678035j6175945j1247586J532733P86696r550015r354547L610992J2571634
2872D851997R509203K906413q82065m980939q818508m518507Q071995J5954032
2864B2093621R791934l284287j0751901j0929337j0255949j0017996n329454M078987
2856a4604382J0702499R182651L823107K653668O886767R966422O451329j165385
2848C3896676n588184l226665K113776M238163J873129o51160J07988J789192
2840C4552915n34283p608757j4918391j7794581j5015297p720068J550463P894144
$$ plain form
2896 3547676 -3056042 -285075 9136935 21737739 37786279 48287938 39105617 16594921
2888 16594921 8124949 24957706 44122025 42283074 29154115 27546207 35472028 32678035
2880 32678035 16502090 5254504 6787237 7573933 -1976082 -11330629 -7719637 4851997
2872 4851997 14361200 17267613 16385548 11404609 2586101 -1932406 6139589 22093621
2864 22093621 31885555 28601268 17849367 6920030 -3335919 -13353915 -18683369 -14604382
2856 -14604382 -3901883 5280768 9103875 11757543 18644310 28610732 35062061 33896676
2848 33896676 28308492 25081827 27195603 31433766 33306895 32655735 32763723 34552915
2840 34552915 34018632 26409875 11491484 -6303097 -21318394 -29038462 -27487999 -19593855
2832a9593855O497668j005450o001520k638680M375462O214996K120388q02957
2824a0833948N28718Q21039l181317m593476M429447J8099922J9964809L292865
2816B8528059j7384776k1374196o604274P968663O507410m803800r163152l171575
2808a9497641J476675j418493l452456K786902J0753889J0750687M931201J661370
2800G992134J290654j648016o232900o234282j339103K767311M095199M858014
2792E549011M333371R76768q51416K744553M974771k232038j0979948o069893
2784a554821Q816177J2514529j675465j4977487j2378482l544626k167280k915747
2776a7883202L890069J0330795M715803m109855K23309J1322796P970194r500424
$$ plain form
2832 -19593855 -13096187 -14101637 -20103157 -22741837 -18366375 -12151379 -10030991 -10833948
2824 -10833948 -10305230 -9484191 -12665508 -17258984 -12829537 5270385 25235194 28528059
2816 28528059 11143283 -10230913 -16835187 -8866524 -2359114 -7162914 -16326066 -19497641
2808 -19497641 -18020966 -19439459 -22891915 -20105013 -9351124 1399563 6330764 7992134
2800 7992134 9282788 7634772 1401872 -4832410 -6171513 -3404202 690997 5549011
2792 5549011 9882382 10859150 10007734 12752287 17727058 15495020 4515072 -1554821
2784 -1554821 7261356 19775885 18100420 3122933 -9255549 -12800175 -14967455 -17883202
2776 -17883202 -13993133 -3662338 1053465 -3056390 -2833081 8489715 16459909 6959485
2768F959485j6542721k304888J3825302J3012572L583750L220468J0656072J1500932
2760D3910972K107298q372259j4021336j6069098j4075796o311893J881796J686235
2752i264081n943188r932387m137495M910976Q010959M689493J137244J345334
2744i183145M079666O207016O045108M273133K722073J581281j621265q029730
2736F074137j3070781r958595J094090J0736156J0342341J844608n200745m714703
2728b853492J204082P575391J1617987J1315687M076494q699099j8619328j7832235
2720a2214513r262975l346603l324057p40735J0163702K0411395J7062793K428482
2712B1177489q045376p299958m798729q947304j2462743m668915R185606J3422157
$$ plain form
2768 6959485 -9583236 -11888124 1937178 14949750 18533500 21753968 32410040 43910972
2760 43910972 46018270 37646011 23624675 7555577 -6520219 -12832112 -10950316 -9264081
2752 -9264081 -15207269 -25139656 -29277151 -24366175 -16355216 -11665723 -10528479 -9183145
2744 -9183145 -5103479 1103537 7148645 11421778 14143851 15725132 14103867 6074137
2736 6074137 -6996644 -16955239 -15861149 -5124993 5217348 7061956 1861211 -2853492
2728 -2853492 -1649410 5925981 17543968 28859655 32936149 24237050 5617722 -12214513
2720 -12214513 -21477488 -24824091 -28148148 -28888883 -18725181 1686214 18749007 21177489
2712 21177489 13132113 5832155 1033426 -7913878 -20376621 -25045536 -15859930 -2437773
2704b437773M311925n247945m444514L187992R357603J2345935J3153659R427347
2696C9654229Q19457o378604p626998p238788r469983r259306j716573N483911
2688D267345K020388o817211o458695L744144R521869N287015J828319N438814
2680A8831988O289077l307391j4099935j5044848j0206131p326421j692361J2444625
2672a4111397K4207116J8767022K003138o621696l050884j288359p319793j0265644
2664B319503l578395L156729J095754l902407k759115K836169N916067M566028
2656I650333N67844l748009l226972N277449J2286241L199745j7617205k5203827
2648a8814401o666319J8239801K2634838P236540o165134p049491l616549k337521
$$ plain form
2704 -2437773 1874152 -3373793 -7818307 -4630315 4727288 17073223 30226882 39654229
2696 39654229 40473686 34095082 26468084 19229296 9759313 500007 -1216566 4267345
2688 4267345 6287733 -529478 -6988173 -3244029 6277840 11564855 13393174 18831988
2680 18831988 25121065 21813674 7713739 -7331109 -17537240 -24863661 -26556022 -14111397
2672 -14111397 10095719 28862741 30865879 24244183 21193299 19904940 12585147 2319503
2664 2319503 -1258892 1897837 2993591 -908816 -3667931 -831762 5084305 9650333
2656 9650333 10218177 6470168 3243196 8520645 20806886 24006631 6389426 -18814401
2648 -18814401 -25480720 -7240919 15393919 22630459 16465325 9415834 5799285 3461764
2640C461764M93025N214892L768750o002777j3572576j0254088j366473L207239
2632a5050244L454527O000366J0627065R255245p86396r672579o254066O283843
2624C857761J2082693J853865j4406293j8755506o522553J0040467J8111988J6702934
2616B2965356J1409195M762243l183977r482495r442532k515631N736005Q021387
2608B8269551K427178m161186k953739M061600M144255p711261j7587999j0692021
2600d203622N336295J0025430J06976p531834l597207J957378P58248p47899K306336
2591D410101J478153q157652j4748555p122975O924621J3479207J2431677J1007118
2583A9701695Q233201K84709q115014j1357709j2487310j2377631k119684J7764302
$$ plain form
2640 3461764 3954789 9169681 12938431 6935654 -6636922 -16891010 -18257483 -15050244
2632 -15050244 -11595717 -5595351 5031714 14286959 13500563 3827984 -2426082 3857761
2624 3857761 15940454 17794319 3388026 -15367480 -21890033 -11849566 6262422 22965356
2616 22965356 34374551 39136794 35952817 26470322 17027790 14512159 20248164 28269551
2608 28269551 30696729 26535543 23581804 27643404 31787659 24076398 6488399 -4203622
2600 -4203622 1132673 11158103 11265079 3733245 136038 2093416 2851664 2103765 4410101
2591 4410101 5888254 -2269398 -17017953 -24140928 -17216307 -3737100 8694577 19701695
2583 19701695 27934896 28219605 20104591 8746882 -3740428 -16118059 -18237743 -473441
2575d73441K4705325K908280k5820264k6113101J209196K0471813J2257865l818777
2567E326896l604350Q637716J3827132O920784j966059n068960l674474k216430
2559A8182255l312021o357887q039467o377776l739213k726894j901188L50655
2551a3921536K081997K364858L362961L346266l038880j1764853r526479M287078
2543b2808588J1017353Q83084r188353l190982O114075K2410j1419691n968432
2535c4539124J1160324J5071592J655994r903593r974054m746055M153453J6181985
2527a0939478J6111939m822466k1946232j0080321Q576178k285125k4228456j2429008
2519f2042969J1423030k2668231j02715133j13825077Q2107J32174078J46083403
$$ plain form
2575 -473441 24231884 27140164 1319900 -24793201 -23584005 -3112192 9145673 5326896
2567 5326896 1722546 10360262 24187394 31108178 29142119 24073159 20398685 18182255
2559 18182255 14870234 8512347 472880 -5904896 -9644109 -12371003 -14272191 -13921536
2551 -13921536 -11839539 -9474681 -6111720 -2765454 -5804334 -17569187 -27095666 -22808588
2543 -22808588 -11791235 -10908151 -20096504 -23287486 -17173411 -17151001 -28570692 -34539124
2535 -34539124 -23378800 -8307208 -6651214 -16554807 -26528861 -31274916 -27121463 -10939478
2527 -10939478 5172461 349995 -21596237 -31676558 -23100380 -25385505 -49613961 -62042969
2519 -62042969 -50619939 -73288170 -176003303 -289828380 -289746273 -157572195 -11488792
2512a1488792N6170732j2587736o434397J3397235l316021k5453829j5864691
2505e577499M063314K185841r162280m329312R458734J1622929M319927J3908
2497A2595562l062034q827115q311904J763303N327302p880025k1624748j6853135
2489d6872794L00881J2078225J5170715J5690158J2591371M201429p86406L889425
2481A6263004Q423197J805673r248917j1339800n400153j650477j419256Q91032
2473a675697L853240J713194l059009k972752J662715M273822L420710K504112
2465I720335J159818l041065o621250l504051M674011R380740N696354l646182
2457A3818710j2563460j4667356n720651J0021658J8897473J1142462n841285
$$ plain form
2512 -11488792 44681940 32094204 25659807 39057042 35741021 10287192 -5577499
2505 -5577499 -1514185 671656 -8490624 -12819936 -3361202 8261727 12581654 12595562
2497 12595562 9533528 706413 -7605491 -5842188 -514886 -8394911 -30019659 -46872794
2489 -46872794 -46571913 -34493688 -19322973 -3632815 8958556 13159985 12373579 16263004
2481 16263004 24686201 26491874 17242957 5903157 503004 -1147473 -2566729 -1675697
2473 -1675697 2177543 3890737 831728 -2141024 -478309 3795513 7216223 9720335
2465 9720335 10880153 7839088 1217838 -2286213 2387798 11768538 17464892 13818710
2457 13818710 1255250 -13412106 -19132757 -9111099 9786374 20928836 15087551
2450A5087551j4343884o266886R579898J9533735J7951485P396546o764394j7768525
2442B4405526j8551881q333453K664763J843332r919652j6995264q648890N646210
2434b7889309R256636K730792K036468J2089472J7652262P363332p435835r376727
2426F427091J19420N981035K037675m794242p782018n968179r22249K152998l653450
2417f401919j4338458j3808530K655206J5684301Q876572m139015j244010J1257382
2409a458471J0821385j94084J428339J5684768J5059371q182350k4788239j3711483
2401e340764N350870M656168j0500718j5930935n760015O740899J2644810J1985653
2393C845968N055241m030102m341697O783688J5377500J0306492l92148n359969
$$ plain form
2450 15087551 743667 -5523219 4056679 23590414 41541899 48938445 42174051 24405526
2442 24405526 5853645 -2479808 184955 2028287 -7891365 -24886629 -33535519 -27889309
2434 -27889309 -18632673 -15901881 -13865413 -1775941 15876321 23239653 15803818 6427091
2426 6427091 6546511 12527546 14565221 9770979 1988961 -3979218 -4901467 -2748469 -6401919
2417 -6401919 -20740377 -34548907 -31893701 -16209400 -7332828 -11471843 -12715853 -1458471
2409 -1458471 9362914 9168830 10597169 26281937 41341308 33158958 8370719 -5340764
2401 -5340764 10106 4666274 -5834444 -21765379 -27525394 -20784495 -8139685 3845968
2393 3845968 8901209 4871107 529410 7313098 22690598 32997090 32604942 27244973
2385B7244973q369694j5720167j9071503r059344N441874J0301149Q182098Q968878
2377G918264Q596790j477948j2110952o879500R670637J6353421O545330m903452
2369B3712590n782711N15303O338699P755540J697617r476974j2727317j04516
2361A1928231J3398780P145550j1895435j5745261K347904J5824811L461274k0270398
2353F195456k6394651q796850J2752142J8347370O399409q446897r718966M180751
2345e482236J6132275R866184p792224j5189068n643268N762795P353137N739054
2337A0746649Q633284R300496j31500j2326295j4849125q087414j210674K445068
2329e479511M383516K144302n778075j1078706m982071O102000P396961k188932
$$ plain form
2385 27244973 18875279 3155112 -15916391 -24975735 -19533861 -9232712 -1050614 7918264
2377 7918264 16515054 15037106 2926154 -3953346 5717291 22070712 28616042 23712590
2369 23712590 17929879 18445182 24783881 32539421 34237038 24760064 12032747 11928231
2361 11928231 25327011 32472561 20577126 4831865 7179769 23004580 26465854 6195456
2353 6195456 -20199195 -28996045 -16243903 2103467 8502876 55979 -9662987 -5482236
2345 -5482236 10650039 20516223 12723999 -2465069 -8108337 -2345542 5007595 10746649
2337 10746649 19379933 28680429 28548929 16222634 1373509 -6713905 -7924579 -5479511
2329 -5479511 -1095995 1048307 -4729768 -15808474 -20790545 -14688545 -7291584 -9480516
2321i480516p796953n21436J0623681J3476753Q885087M841245K796877p89590
2313B2035148m341924k961923J245388M22890o521569j1339285q600374k173945
2305a2235594L461196R289618J4254985J1771555J906187k806602M683670J1077200
2297D1402215J113387j6066172j8115627l963064M616218k609050j1098389q687847
2289a3408329l305497l361050k016065N382700Q372484K010790R90306J4030679
2281H696018K2904287J0115189r215913j0060675J689711J636179r532298q604430
2273G628068P495259J5924827P174651k504043l919853q497685j9215923j8715149
2265a4629848j077364J2021204M668720p727640n504551M331438N701460K792861
$$ plain form
2321 -9480516 -17277469 -17798905 -7175224 6301529 15186616 20027861 22824738 22035148
2313 22035148 17693224 14731301 15976689 16399579 9878010 -1461275 -10061649 -12235594
2305 -12235594 -8774398 515220 14770205 26541760 28447947 25641345 30325015 41402215
2297 41402215 42515602 26449430 8333803 4370739 8986957 6377907 -4720482 -13408329
2289 -13408329 -16713826 -20074876 -22090941 -16708241 -8335757 -6324967 -5334661 8696018
2281 8696018 31600305 41715494 32499581 22438906 24128617 25764796 16232498 7628068
2273 7628068 15123327 31048154 38222805 35718762 31798909 23301224 4085301 -14629848
2265 -14629848 -15707212 -3686008 982712 -6744928 -12249479 -7918041 -2216581 576280
2257E76280P448193J2330639L263318j1170518r252622Q252882J7032828N208476
2249C3689476j0990715j2514735j395590P715476P535592J864321l285581n544762
2241A7073482n909847n914838m917578j355367K744830K689622j302055k894047
2233B14202O65130L912812K623881Q11878K264336K209147m534796j2680276j2633895
2224a7147581m154723M036635O009227L460920Q58664J091826M139353O624032
2216D918353N424597L128607M493794O752630K390240o278970p352757N47083
2208A4023577K198344j0380912k1121850j1109154J2953901K7054613K0413517
2201C4032036K993886j2062380j8104196j1326934N847913J8960670J4695800
$$ plain form
2257 576280 8024473 20355112 23618430 12447912 3195290 11448172 28481000 33689476
2249 33689476 22698761 10184026 8788436 16503912 24039504 25903825 22618244 17073482
2241 17073482 11163635 5248797 331219 -1024148 1720682 4410304 3108249 214202
2233 214202 879332 4792144 7416025 8227903 10492239 12701386 8166590 -4513686 -17147581
2224 -17147581 -21302304 -17265669 -11256442 -7795522 -6936858 -5845032 -1705679 4918353
2216 4918353 10342950 13471557 17965351 24717981 27108221 20829251 13476494 14023577
2208 14023577 16221921 5841009 -15280841 -26389995 -13436094 13618519 34032036
2201 34032036 37025922 24963542 6859346 -4467588 1380325 20340995 35036795
2194C5036795K25595m885476L554939R446407R43753j4633339k3677845k0699981
2186a4689152o739780J2514669K2793170J0755906j4995380k6657454j1230815
2179b8248836J0563516J1669615n571575j6323660r070905K878534M881240k87929
2171b9510000j782931L266855R982879J4178324J3812894P465652k218913p562740
2163G632020m555846O84662N66684j940643J939050J1506773J5705346Q787539
2155D0325585k468239r768163j1780606q134114L127641J5329432J3466360m082785
2147C6015111j6559274q608295M680900M62374j4100636j3038466M056080J0036498
2139B944292l791792j2291891M64064J3582980N221965j0079619o438949J0615713
$$ plain form
2194 35036795 35262390 30376914 33931853 43378260 44322013 29688674 6010829 -14689152
2186 -14689152 -21428932 -8914263 13878907 24634813 9639433 -17018021 -28248836
2179 -28248836 -17685320 -6015705 -11587280 -27910940 -36981845 -34103311 -29222071 -29510000
2171 -29510000 -31292931 -28026076 -18043197 -3864873 9948021 17413673 15194760 7632020
2163 7632020 3076174 3760836 4327520 2386877 4325927 15832700 31538046 40325585
2155 40325585 37857346 28089183 16308577 8174463 11302104 26631536 40097896 36015111
2147 36015111 19455837 10847542 15528442 15990816 1890180 -11148286 -7092206 2944292
2139 2944292 -847500 -13139391 -12675327 907653 6129618 -3950001 -10388950 226763
2131B26763J6200875P979580M926830J0472758P671652p998270j8280691j0436202
2123A0763295N505796J4396094J3601066P316759j310271o717159l021691N086033
2115D5619922M896963o824631j8958480k1040852j3547710k437417O485757P925885
2107B119437K147633j661112K382190N255165k826606j1878061m364910J4302369
2099E476105J9109406J956947j6201326j5973564l214968O068939P398650M766273
2091I386462J97692m045846m039492j762729l332002o136247j351972P729812
2083c354322O924790m193105p699874M317688J5478994J0303050l336551r469316
2075H971354o545019j941019K136703M846754J928245l980898k048535P321470
$$ plain form
2131 226763 16427638 24407218 29334048 39806806 47478458 39480188 21199497 10763295
2123 10763295 16269091 30665185 44266251 51583010 50272739 43555580 40533889 45619922
2115 45619922 50516885 43692254 24733774 3692922 -9854788 -12292205 -5806448 2119437
2107 2119437 4267070 2605958 4988148 10243313 7416707 -4461354 -8826264 5476105
2099 5476105 24585511 26542458 10341132 -5632432 -8847400 -2778461 4620189 9386462
2091 9386462 9584154 5538308 1498816 -263913 -3595915 -9732162 -11084134 -3354322
2083 -3354322 3570468 -622637 -8322511 -4004823 11474171 21777221 18440670 8971354
2075 8971354 2426335 485316 2622019 7468773 9397018 5416120 3367585 10689055
2067A0689055Q138765m323880j1261785m28441J1039677L920476j0783504j0558490
2059c568127K233344Q563739O004222O551996R081157K002116j0248417j0427665
2051A0192365K003746R162819L857390k132392q33546K007293K113187J939396
2043B8310258j070878j1797144k1510137j5204741K711146J0974063L150057m404584
2035h841960p70335N101797M703316L293692M411586J329492o328967o667091
2027c768470L362517R500084L909190j195647L971935R213564L845379l862099
2019B4976453l517789k791043j1720982k0473530j3661724L107533J1833063R818685
2011b429334Q139430Q050149P32912j1095943j2691128j295492P473502K614069
$$ plain form
2067 10689055 18827820 14503940 3242155 2813714 13853391 17773867 6990363 -3568127
2059 -3568127 -1334783 7228956 13233178 19785174 28866331 30868447 20620030 10192365
2051 10192365 12196111 21358930 25216320 23083928 22250382 24257675 26370862 28310258
2043 28310258 27239380 15442236 -6067901 -21272642 -18561496 -7587433 -4437376 -8841960
2035 -8841960 -9612295 -4510498 192818 3486510 7898096 9227588 2898621 -3768470
2027 -3768470 -405953 9094131 13003321 11807674 15779609 24993173 28838552 24976453
2019 24976453 21458664 18667621 6946639 -13526891 -27188615 -24081082 -12248019 -2429334
2011 -2429334 5710096 13760245 14493157 3397214 -9293914 -10589406 -3115904 -501835
2003e01835p475035r443470k491939N324277R308113R697991O993228J996164
1995A3407494k330120l224352j294767M02757j50600j581813l86305L894270N635579
1986A4372143l39894r169022r441903J678064J3725840J6165958Q983689k722476
1978C3252399j5038419k1302514j3197030N644746J7118899J0183900l627837
1971A3034144p157934j348459R52322k989607n326791l875034k976032j526020
1963a1213411M087980P634577K86073j0840657r103969N235859J2812201L603173
1955B501826r206984j0373691k666039K170916r7356o612254j3100779j2116690
1947d9501051K771432K3437401K9699315J4402723m923583q924735L4159P594279
$$ plain form
2003 -501835 -7976870 -17420340 -19912279 -14588002 -5279889 4418102 11411330 13407494
1995 13407494 11077374 7853022 6558255 6961012 6810412 5228599 4842294 8736564 14372143
1986 14372143 14032249 4863227 -4578676 -2900612 10825228 26991186 35974875 33252399
1978 33252399 18213980 -3088534 -16285564 -10640818 6478081 16661981 13034144
1971 13034144 5876210 4527751 5480073 2490466 -2836325 -6711359 -9687391 -11213411
1963 -11213411 -7125431 509146 795219 -10045438 -19149407 -13913548 -1101347 2501826
1955 2501826 -6705158 -17078849 -19744888 -17573972 -17671328 -24283582 -37384361 -49501051
1947 -49501051 -46729619 -23292218 6407097 20809820 15886237 6961502 6995661 14589940
1939A4589940Q959588P041824o46753j5878385k6324335j6739148P079568K1751684
1931a66017J5869084K215388k878473N09891K367341j211688o087066p998705
1923B619755n989653j519779J637622j99598n397305p517331l450186K471916
1915a7344559M787419L624035K300835J628229L28921p86403J088317O318646
1907A945440J0858493J0154693M895251J296641L477259O425538J417368j0016783
1899C0453900j4309434l942241Q653437N495330j0980068j8663779m940442J6363564
1891H130267K3116704J0596033q423192k0955066k1491521r226164R778492K0479529
1883A2005082J1986759o328870j3414325l352716P955381O695868q27443j834242
$$ plain form
1939 14589940 23549528 30591352 29944599 14066214 -12258121 -28997269 -21917701 -166017
1931 -166017 15703067 17918455 15039982 15549873 17917214 16705526 10618460 2619755
1923 2619755 -3369898 -4889677 -3252055 -3451653 -8848958 -16366289 -19816475 -17344559
1915 -17344559 -12557140 -8933105 -6632270 -5004041 -4675120 -5461523 -4373206 1945440
1907 1945440 12803933 22958626 27853877 29150518 32627777 39053315 40470683 30453900
1899 30453900 16144466 12202225 20855662 26350992 15370924 -3292855 -8233297 8130267
1891 8130267 31246971 41843004 33419812 12464746 -9026775 -18252939 -8474447 12005082
1883 12005082 23991841 17662971 4248646 895930 8851311 15547179 14719736 12885494
1875A2885494K541018K344793l109213n685168l520162k643927m334345l070870
1867d592380K087527N576321O214183Q192840R071891M61723j4308834j7866033
1859e162762l561351J0559846N630057j0493456j5082046k945415J0162997J3393420
1851B501290J2315296J3257263J2321540N182607m285968j0542369j2348387q990784
1843I410488j04192Q112308P134307k53996j961348L935465M706194n765896j4791732
1834A0421598r750581K716172Q401201O480813M998129L341222m639969j3848582
1826H120003j0982180M276266J5012030Q619969p032416j4150172n862245P675176
1818E676431J1213309L66841j3668185j6339072o487657L920577P461102R600302
$$ plain form
1875 12885494 15426512 17771305 14662092 8976924 5456762 2812835 -1521510 -4592380
1867 -4592380 -2504853 3071468 9285651 17478491 26550382 27012105 12703271 -5162762
1859 -5162762 -8724113 1835733 7465790 -3027666 -18109712 -21055127 -10892130 2501290
1851 2501290 14816586 28073849 40395389 45577996 41292028 30749659 18401272 9410488
1843 9410488 9306296 17418604 24552911 24298915 22337567 26273032 30979226 25213330 10421598
1834 10421598 671017 3387189 11788390 18269203 23267332 26608554 21968585 8120003
1826 8120003 -2862177 1414089 16426119 25046088 18013672 3863500 -1998745 5676431
1818 5676431 16889740 17256581 3588396 -12750676 -19238333 -15317756 -7856654 1743648
1810A743648J4863065J5806178N900406n977930p479293k358104k709478o720960
1802A3067532k393088Q177307Q602037m108089j1522603j881119J1439246J1593672
1794C2974895L400126J295898L488181l035705j6853834k0885328q307417O832860
1786a090324J0418690O018213L368431P25347q093428j5874104q272489J1219505
1778a580159J9677469O177006j0021890o725617P691982Q469609m507778o397300
1770A2783322R242627J5597487n016115k8996320k4178383K933891J8817853J1101862
1762A2286224j911439m722531r44173L686160R852093J2868022M138031j0836873
1754B4415514j5061750n030335M816024N811490M477742M889526J542024n512740
$$ plain form
1810 1743648 16606713 32412891 38313297 32335367 24856074 22497970 19788492 13067532
1802 13067532 10674444 18851751 27453788 23345699 11823096 9941977 21381223 32974895
1794 32974895 36375021 37670919 41159100 38123395 21269561 384233 -7923184 -1090324
1786 -1090324 9328366 15346579 18715010 19440357 11346929 -4527175 -12799664 -1580159
1778 -1580159 18097310 24274316 14252426 7526809 15218791 23688400 19180622 12783322
1770 12783322 22025949 37623436 32607321 3611001 -20567382 -17633491 1184362 12286224
1762 12286224 10374785 5652254 4708081 8394241 18246334 31114356 35252387 24415514
1754 24415514 9353764 4323429 9139453 14950943 19428685 24318211 25860235 20347495
1746B0347495q093258o971323j1004083j5378895m838620J5221460J8270184j456731
1738F096229j4348480O07648K2931086K2618937K981194j1717020j3368626j0703838
1730E097130o950198j58237M511750K887883K505871Q390797J0091425l62111
1722B6014310j1060408q494695N07350L079606K104698N146376O596529J79624
1714B4073390n596180l076779l28329k911625q96956P509110M383608j3727106
1706I429133j9112278J886983J8573237M826123j4847446r185135M008723m859393
1698i280053j7488710l294414J6340153N738578j1819627N691134L1557264J1117227
1690B8561552l0548149k3804803J5874802J4634807k823010O8278138J99624383
$$ plain form
1746 20347495 12254237 5282914 -5721169 -21100064 -25938684 -10717224 7552960 6096229
1738 6096229 -8252251 -7644603 15286483 37905420 40886614 29169594 15800968 5097130
1730 5097130 -1853068 -2011305 2500445 5388328 7894199 16284996 26376421 26014310
1722 26014310 14953902 6459207 6966557 10046163 12150861 17297237 23893766 24073390
1714 24073390 18477210 15400431 15072102 12160477 11263521 18772631 23156239 9429133
1706 9429133 -9683145 -7796162 10777075 15603198 755752 -8429383 -4420660 -9280053
1698 -9280053 -26768763 -30063177 -13723024 -7984446 -19804073 -14112939 17444325 28561552
1690 28561552 -1986597 -25791400 -9916598 4718209 1895199 70173337 269797720
1683B69797720J99093035j1407749k29932883k24432353m5391041O8687150K8691112
1676E5104991l6700559k3613070J5536840J0369147j0881398m522616K970855
1669H264190j8369531l4126733j0176184K0108079J3811992r336129q486526Q861569
1661b9449273J1333503J417364K79567M271791j61621l608354N536140J1032849
1653F51966m260172k2862340j8146809L583459J7365301J7805130J4522506P561733
1645A6220774m812029j0633500k563264M707820j145065o940830Q15110Q077361
1637C726377k328050j7438976j4507247J236073Q243941M523646L374137N057976
1629h112123P22798m897726r47279P527723Q554674N237685O557913O893299k207116
$$ plain form
1683 269797720 468890755 457483006 227550123 3117770 -42273271 26413879 55104991
1676 55104991 18404432 -5208638 10328202 20697349 9815951 5293335 8264190
1669 8264190 -10105341 -44232074 -54408258 -34300179 -20488187 -29824316 -38310842 -29449273
1661 -29449273 -18115770 -16698406 -16418839 -12147048 -12308669 -15917023 -10380883 651966
1653 651966 -3608206 -26470546 -44617355 -41033896 -23668595 -5863465 8659041 16220774
1645 16220774 11408745 775245 -1788019 2919801 1774736 -5166094 -4350984 3726377
1637 3726377 1398327 -16040649 -30547896 -29311823 -21067882 -16544236 -13170099 -8112123
1629 -8112123 -7389325 -12287051 -13234330 -5706607 2848067 8085752 14643665 21536964 19329848
1620A9329848j0803489n164516O644534P507967r21268o788418j2156787k2373258
1612b4725387k3799387k402790K4497740K6717816N967641q644661n749612r79373
1604i118013l083172k986924J395888M543n331672q3174J4258643J7641880M356403
1595A7054402o983229m010217K784239K319804p89703j184245k972951n909342
1587C08758j176263R807962J1297868k319921j5387172j4031251m426177J295169
1579a4631027K468296L843027M823805K946020j852563j0033534j8676536j5966432
1571d7078944M479767K5193912K1766609p10028j2035602j608905Q146949J566604
1563b79638n737825K243587J2610170O447279r267091j5616035j2135145j0318920
$$ plain form
1620 19329848 8526359 3361843 10006377 17514344 16593076 9804658 -2352129 -24725387
1612 -24725387 -48524774 -50927564 -26429824 287992 6255633 -2389028 -8138640 -9118013
1604 -9118013 -12201185 -15188109 -13792221 -13787678 -19119350 -19202524 -4943881 12697999 17054402
1595 17054402 10071173 6060956 8845195 11164999 10375296 9191051 6218100 308758
1587 308758 -867505 8940457 20238325 17918404 2531232 -11500019 -15926196 -14631027
1579 -14631027 -12162731 -8319704 -3495899 -549879 -2402442 -12435976 -31112512 -47078944
1571 -47078944 -42599177 -17405265 4361344 3651316 -8384286 -9993191 -1846242 -279638
1563 -279638 -6017463 -3773876 8836294 15283573 6016482 -9599553 -21734698 -32053618
1555c2053618q773447J773813J6102964J9135626R827148K198411L833772Q117569
1547B0162238P112177M83603p393067j0774660n907786K612962M565889j135524
1539I725832l266853L384190Q063411J920603o589972o594479l111607n614040
1531b082915r166199m152522L981348L293516k907048k164567L774355J832492
1523g591540p830742j0183747J75147J1205197J3445332J1100301Q748985L036217
1515B2105150n936765r207480l050962L015870M64360n797856p413174o235144
1507a2056001q438865j1240115o113369O535254J4737798Q934205o040161j5682921
1499b9364175j1598614l54114N405612L335483L182376J0173405J4683144O434504
$$ plain form
1555 -32053618 -40827065 -39053252 -22950288 -3814662 6012486 8210897 12044669 20162238
1547 20162238 27274415 27758018 20364951 9590291 3682505 6295467 10861356 9725832
1539 9725832 6458979 9843169 17906580 19827183 13237211 6642732 3531125 -2082915
1531 -2082915 -11249114 -15401636 -11420288 -8126772 -11033820 -13198387 -9424032 -7591540
1523 -7591540 -15422282 -25606029 -25430882 -14225685 -780353 10319948 19068933 22105150
1515 22105150 16168385 6960905 3909943 6925813 7390173 1592317 -5820857 -12056001
1507 -12056001 -20494866 -31734981 -37848350 -31313096 -16575298 -7641093 -13681254 -29364175
1499 -29364175 -40962789 -41316903 -35911291 -32575808 -29393432 -19220027 -4536883 1897621
1491A897621o976555p968996N839256J7374255J4082490L950040P73530L738756
1483C2710397K150757n773894j1129475r839645q086753r584839p867604K239593
1475a5181463J3165941J3922239O688029L281963O023973M360455o180920j4246056
1467A1834161r958036j239319j016786o181879l998773N311238R054161M101300
1459G906067J221704M977714O268120K95454m352601k404626k020472p860643
1451D030717q920734L101616J5834980J2838900q62982p094326k637097j183311
1443A5107763q792247j4419727q175864L894458Q926508L703088k884594j301667
1435c942282O571975Q181933l127070j4636724q155382J1555044J8158443Q21021
$$ plain form
1491 1897621 -5078934 -13047930 -7208674 10165581 24248071 28198111 28971641 32710397
1483 32710397 34861154 29087260 17957785 8118140 31387 -9553452 -17421056 -15181463
1475 -15181463 -2015522 11906717 18594746 21876709 27900682 32261137 26080217 11834161
1467 11834161 1876125 636806 -379980 -6561859 -10560632 -5249394 3804767 7906067
1459 7906067 9127771 14105485 20373605 20669059 16316458 13911832 11891360 4030717
1451 4030717 -4890017 -1788401 14046579 26885479 26022497 18928171 16291074 15107763
1443 15107763 6315516 -8104211 -16280075 -12385617 -3459109 243979 -2640615 -3942282
1435 -3942282 2629693 10811626 7684556 -6952168 -15107550 -3552506 14605937 15426958
1427A5426958j7696005j3872241K327701O202337j944866j314466J1968576J9283163
1419B0381157J1398728N41319l681392p548337j5409635j8764975j1925064j769914
1411b6778113O124556J5220765K4227346K1958248N648700j0056349j2376580
1404B3968573n912939l68381L424919N881115J619711q408928j1184025p58291
1396H261754R114433M950856n619232p937026m346255o683738j2772493r552153
1388b4583854L541863J2010517P661269j422013l893077K293884J0999341J3596995
1380B0204925N067256q479507j2459934k092463P976991K705190j1271867j5837695
1372a4187104q074401q84245j47147J182318N856595O597385J083575k702679
$$ plain form
1427 15426958 -2269047 -16141288 -13813587 -7611250 -9556116 -10870582 1097994 20381157
1419 20381157 31779885 32321204 28639812 21091475 5681840 -13083135 -25008199 -26778113
1411 -26778113 -20653557 -5432792 18794554 40752802 46401502 36345153 23968573
1404 23968573 18055634 17687253 21112172 26993287 28612998 20204070 9020045 8261754
1396 8261754 17376187 22327043 16707811 8770785 4424530 -2259208 -15031701 -24583854
1388 -24583854 -21041991 -9031474 -1370205 -2792218 -6685295 -4391411 6607930 20204925
1380 20204925 25272181 16792674 4332740 2240277 10217268 12922458 1650591 -14187104
1372 -14187104 -22261505 -23145750 -23292897 -22110579 -16253984 -9656599 -8573024 -11275703
1364a1275703p46484J287772J110883M253028R951936P759952l661542r186864
1356e07022L12953J1466685P999029m254159p975706k061648n92875p406163j0029899
1347a3048805j087397R836058J1128112M313925j701906k647789M67895N251634
1339A2511727P182971J760348p350033q988632O00712R907731O736104m536608
1331A7824320r228025k681352N417215O317902K193254q83089j504719r61121
1323A6494385P31280K759272K417329l61247j847416r77097j919461o449286r166770
1314A680989n517161J93449J103644j554386j045969M010912Q332000Q171671
1306A5375149M398666j509129q126836j1655871r334966m510304j841944J000013
$$ plain form
1364 -11275703 -12022187 -10734415 -9623532 -5370504 4581432 12341384 8679842 -507022
1356 -507022 -194069 11272616 19271645 15017486 7041780 4980132 4387257 -3018906 -13048805
1347 -13048805 -14136202 -4300144 6827968 11141893 9439987 6792198 7260093 12511727
1339 12511727 19694698 21455046 14105013 5116381 5717093 15624824 22360928 17824320
1331 17824320 8596295 5914943 11332158 17650060 19843314 18960225 17455506 16494385
1323 16494385 17225665 19984937 22402266 22041019 20193603 19216506 17297045 10847759 1680989
1314 1680989 -3836172 -3642723 -2539079 -4093465 -5139434 -1128522 7203478 15375149
1306 15375149 19773815 18264686 10137850 -1518021 -10852987 -15363291 -17205235 -16205222
1298a6205222Q750830J6779428J4221329N64375j0992833j0378003j851387N519714
1290F408231R109817R071212L110320p005360j1469977m291973O209323P600429
1282A8742022j87169o931348o824159k632495J561092L290842K26575n849618
1274A395742o557823K635976J2568807J1267815K168953o33066N518656Q288685
1266C6653745J198513n979750l637108L087637M477558J133816q25490j623082
1258C4485839m453863o066339j819100L319798L2943j0115320j5123458r117817
1250h857317O13726M948664K991365j734107o984454r421182l791381R154010
1242a3080676J8574426J4197010q45340j3191016j4063240o315637K142031O682636
$$ plain form
1298 -16205222 -7454392 9325036 23546365 24110740 13117907 2739904 888517 6408231
1290 6408231 15518048 24589260 27699580 20694220 9224243 4932270 11141593 18742022
1282 18742022 18554853 11623505 4799346 2166851 3727943 7018785 7245360 1395742
1274 1395742 -5162081 -2526105 10042702 21310517 23479470 22846404 28365060 36653745
1266 36653745 37852258 31872508 28235400 31323037 35800595 36934411 36108921 34485839
1258 34485839 30031976 23965637 22146537 25466335 25499278 15383958 260500 -8857317
1250 -8857317 -8243591 -3294927 -303562 -2037669 -9022123 -18443305 -22234686 -13080676
1242 -13080676 5493750 19690760 18845420 5654404 -8408836 -14724473 -12582442 -5899806
1234e899806P123784M977378J794351j298734l271394k178471L498455J0476131
1226A5221694J0755185R37107j0423943j1348387k281768M121512J115935k693406
1218E403929K340503J0567810Q515834m570662j4189980r968072Q83722L647193
1210B630277n499373j5720157j4072388J123201J8523610K4107843J4299436q79098
1202B4513351q715237o720058k338527j544855k574347j515762R62462J620223
1194C687250N60999J334386N079446P022470J134360j1005866j8478465j2116319
1186b2781739L338303J3753257J3021390Q589508P116552M582145k628031p256725
1178A7734660k982979K362132j56529k314189P680616J8869487Q900343j7693787
$$ plain form
1234 -5899806 1223978 6201356 7995707 6696973 3425579 1247108 4745563 15221694
1226 15221694 25976879 26913986 16490043 5141656 2859888 6981400 8097335 5403929
1218 5403929 7744432 18312242 26828076 22257414 8067434 -1900638 -1016916 2630277
1210 2630277 -2869096 -18589253 -32661641 -31538440 -13014830 11093013 25392449 24513351
1202 24513351 15798114 9078056 6739529 5194674 2620327 1104565 2067027 3687250
1194 3687250 4248249 5582635 10662081 17684551 18818911 7813045 -10665420 -22781739
1186 -22781739 -19443436 -5690179 7331211 15920719 23037271 27619416 24991385 17734660
1178 17734660 14751681 17113813 16957284 14643095 22323711 41193198 50093541 32399754
1170C2399754k9098268j1966258Q258839O646466n913021o763326L82260k106169
1162h159723r920930l827994J3681209J8575624L006000j3392165j4449683o617797
1154b1105459n09824N647207J4514898J8813862J2701186J547704p446625j2947909
1146A1215040j2774864l244764R079600R881351j604720q870030l429482K664458
1138B916589n80251l782794K710933R329372M419503l677409j788181L184890
1130A2732652k724744j2204468p100080P985441J0319416k453491o876543O779142
1122F457325J6990543O258893r852963q110072N561375P406308o021439j4587831
1114D102139p207584L410604K838200m664605o027054R26217P167568O802364
$$ plain form
1170 32399754 3301486 -8664772 -405933 6240533 327512 -6435814 -6053554 -8159723
1162 -8159723 -18080653 -21908647 -8227438 10348186 13354186 -37979 -14487662 -21105459
1154 -21105459 -21615283 -15968076 -1453178 17360684 30061870 31609574 24162949 11215040
1146 11215040 -1559824 -4804588 4275012 14156363 12551643 3681613 252131 2916589
1138 2916589 2336338 -1446456 1264477 10593849 15013352 11335943 9547762 12732652
1130 12732652 10007908 -2196560 -9296640 -1311199 9008217 6554726 -321817 6457325
1122 6457325 23447868 29706761 19853798 11743726 17305101 24711409 18689970 4102139
1114 4102139 -3105445 305159 3143359 -1521246 -7548300 -6622083 545485 7347849
1106G347849L044821O30012r04586l610011m815950K13857R246772J2635440N952413
1097B9740617j800957J75030P666439O282496o761710j7298621j4694842o191172
1089b882720l089309l047345K386165J0096339R257704l61054p669179p403800
1081b713199n161301m353505j308376L390913J705732p660850j3286087p091999
1073c6478672L189049O238945L289134K258468L292358J677303j65709L874252
1065a2824872J0777152J1064578L587307l319817n185369m874744k634625M793629
1057A383239J2633536Q777093p799532k0459153j5112806J424791J2117104J1787547
1049D751819Q532563P842374O542933J991891k263623k627579j371222l205836
$$ plain form
1106 7347849 10392670 11022682 10118096 6508085 1692135 1905992 11152764 23788204 29740617
1097 29740617 27939660 28114690 35781129 42063625 35301915 18003294 3308452 -2882720
1089 -2882720 -5972029 -9019374 -6633209 3463130 12720834 12359780 4690601 -2713199
1081 -2713199 -7874500 -12228005 -13536381 -10145468 -8439736 -16100586 -29386673 -36478672
1073 -36478672 -33289623 -27050678 -23761544 -21503076 -18210718 -16533415 -16699124 -12824872
1065 -12824872 -2047720 9016858 12604165 9284348 4098979 -775765 -3410390 1383239
1057 1383239 14016775 22793868 14994336 -5464817 -20577623 -19152832 -7035728 4751819
1049 4751819 13284382 21126756 27669689 29661580 27397957 24770378 23399156 20193320
1041B0193320q364000j1243326o351170L958135R410497L233873p421173q935213
1033e519057K02496O685057J690292o391987n436554K483770O418675L907129
1025D039821J701562K232194J077150k252429j899371L653590P258898L164442
1017A8975857m477391o565867N35864J0753794J2895518J693151j3285817j4832966
1009E692143P18889J5903078J3756289J05904p487717o613042r110936j5900045
1001b935437j3019128K877767J4343260Q124785n366444r481689n006309k476071
993a2939266j675932M645218J3113327J3049664N509361K984184Q560492R801708
985D3048756j515959j5088673j5516953l341239N919327J969084q023202r815457
$$ plain form
1041 20193320 11829320 585994 -5765176 -1807041 7603456 10837329 3416156 -5519057
1033 -5519057 -5316561 1368496 3058788 -3333199 -8769753 -6285983 132692 4039821
1025 4039821 5741383 7973577 9050727 6798298 4898927 8552517 15811415 18975857
1017 18975857 14498466 7932599 8468463 19222257 32117775 33810926 20525109 5692143
1009 5692143 6411032 22314110 36070399 36176303 28688586 22075544 12964608 -2935437
1001 -2935437 -15954565 -13076798 1266462 9391247 4024803 -5456886 -10463195 -12939266
993 -12939266 -14615198 -9969980 3143347 16193011 21702372 24686556 33247048 43048756
985 43048756 41532797 26444124 10927171 7585932 13505259 15474343 7451141 -2364316
977b364316j104171N355456m91798j0667846r312508L697796J0563669R41097
969c382621j1732408q844640O395139J3651387M406704p354903n864836O286155
961f440023J4880975J3627937Q942190P523991O696145J13257j0437269j4740450
953B0166753p758465J473693J065649o230317o592534K888225Q163073L59344
945A3535421q609383m679569M137004l88647j5264221j7386028J066157J8527496
937i061770J5187033J246622j493123N809940L430109j2102640j9755830o006381
929b2746040J3467840J6301298M774865j517591K588359K379750r676814j9796717
921a4225050j3872327J470515J0526130J1059499J1388080J1914521N738208m636506
$$ plain form
977 -2364316 -3468487 1886969 1395171 -9272675 -18585183 -14887387 -4323718 -3382621
969 -3382621 -15115029 -23959669 -17564530 -3913143 493561 -6861342 -12726178 -6440023
961 -6440023 8440952 22068889 31011079 38535070 45231215 45344472 34907203 20166753
953 20166753 12408288 13881981 14947630 8717313 2124779 5013004 13176077 13535421
945 13535421 4926038 246469 4383473 3994826 -11269395 -28655423 -27589266 -9061770
937 -9061770 6125263 7371885 5878762 11688702 15118811 3016171 -16739659 -22746040
929 -22746040 -9278200 7023098 11797963 10280372 12868731 15248481 5571667 -14225050
921 -14225050 -28097377 -26626862 -16100732 -5041233 6346847 18261368 23999576 19363070
913A9363070p628892j627142J001731o480534j4430538j1853150j320943P661376
905a5315022J0669596P652597j35098o065854r93874J2401492J8061923P750835
897C4026595o034512p921633p90451K083009k625288p975867r590737o744839
889e573723K358511J3978881J4826540j219293j8589238j7271891K91747J4495215
881C296749J5699940R837072J633535q947435j5425703r352995K805388N169964
873D716515l453637q185039k545489L567134L299049K152349L608179K972313
865F131374L15926K189725N856055M03516j1087017j0841732M534389J5242682
857A2744918Q528208l239871o634350p582351j2412843j0042774O861463K1114390
$$ plain form
913 19363070 11734178 10107036 11108767 4628233 -9802305 -21655455 -22976398 -15315022
905 -15315022 -4645426 3007171 2872073 -3193781 -4187655 8213837 26275760 34026595
897 34026595 27992083 20070450 19279999 21363008 18737720 10761853 1171116 -5573723
889 -5573723 -3215212 10763669 25590209 24370916 5781678 -11490213 -11198466 3296749
881 3296749 18996689 28833761 30467296 21519861 6094158 -3258837 -453449 4716515
873 4716515 1262878 -6922161 -9467650 -5900516 -2601467 -449118 3159061 6131374
865 6131374 6447300 8637025 14493080 14896596 3809579 -7032153 -2497764 12744918
857 12744918 21273126 18033255 11398905 3816554 -8596289 -18639063 -11777600 9336790
849I336790J4008507m830178j2788231p529327k815296k108599L35817J120213
841e270304n584658j0213369q57558J1881602Q131714p663685j2645083k653093
833b4874434M056249P81781J521613J1165585J4204766K750229q392184o259528
825e045923J308047K760298K17689j393463m809069q926079m240788Q860469J4666415
816C397596O797955P6664M479445O856929m111618j3813997m878867J0781060
808I585167Q684462r181031j8026851q007615O499572J3565733J5771598J4393696
800C3284731M497445r297404j2395391k480935N114771J335498l860257j062309
792A5136149K337726k989303j0289197p234169M157575J1146193Q400572J172801
$$ plain form
849 9336790 23345297 18515119 5726888 -1802439 -4617735 -6726334 -6390517 -5270304
841 -5270304 -10854962 -21068331 -21925889 -10044287 -1912573 -9576258 -22221341 -24874434
833 -24874434 -20818185 -20036404 -18514791 -7349206 6855560 9605789 1213605 -5045923
825 -5045923 -3737876 -977578 -759889 -2153352 -6962421 -15888500 -20129288 -11268819 3397596
816 3397596 10195551 10272215 14751660 21608589 17496971 3682974 -1195893 9585167
808 9585167 18269629 9088598 -8938253 -16945868 -10446296 3119437 18891035 33284731
800 33284731 37782176 28484772 16089381 13608446 18723217 20058715 16198458 15136149
792 15136149 17473875 14484572 4195375 -3038794 1118781 12264974 20665546 21838347
784B1838347n558880j0477312j1156217o007998k3678J60483l465762l002379
776a7693396K478448N363457K441229P17924N705852J0885174O190462o301576
768I787574j3237169p153429M053456Q279781M786288K674885N919526P465295
760B2576207P24537q975604j0209979p35804Q736162P102806m515754j4754290
752e1719j4577216n532989M159654R244459J0769144J0427262O291371j875924
744A8854042o740315q53413R828005R486386n822812j8957205j3010101M670778
736b544635J1730666J465177r310754n431007O291203R145331n9546r399188r415536
727g528289k907760K397115L517447K576453K033217K142698J423598j647132
$$ plain form
784 21838347 16279467 5802155 -5354062 -11362060 -11385738 -11225255 -14691017 -17693396
776 -17693396 -15214948 -9851491 -7410262 -6692338 -986486 9898688 16089150 9787574
768 9787574 -3449595 -10603024 -6549568 1730213 6516501 9191386 15110912 22576207
760 22576207 23300744 14325140 4115161 3379357 12115519 19218325 14702571 -51719
752 -51719 -14628935 -20161924 -16002270 -6757811 4011333 14438595 20729966 18854042
744 18854042 12113727 11260314 21088319 30574705 24751893 5794688 -7215413 -2544635
736 -2544635 9186031 10651208 1340454 -4090553 2200650 11345981 11286435 1887247 -7528289
727 -7528289 -10436049 -8038934 -4521487 -1945034 88183 2230881 3654479 2007347
719B007347o580476j0225024r089037k805028M849293Q637344O385264J493674
711e326643j48629K892502N148643J097945o829965j0539936o169960J917917
703a7958126P147212P041290L207592r83213j828016J717610N419482L901951
695G665782j771681m908022k497463J186822J774566K74019q12853j494522j727179
686b310531q6115K268473J767702r23659j004730J023029j385836p627126o429781
677a4708574O217917J5710478P615644r516255j4521479k830449R514988R922302
669G404572K899864j696734j006198L103539P571327O868301j699287j0031987
661A3413397p444863K317454M872240k474437o681424p65821N850466M749063
$$ plain form
719 2007347 -4573129 -14798153 -23887190 -26692218 -21842925 -13205581 -6820317 -5326643
711 -5326643 -5475272 -2582770 2565873 3663818 -3166147 -13706083 -19876043 -17958126
703 -17958126 -10810914 -3769624 -562032 -1545245 -3373261 -1655651 3763831 7665782
695 7665782 5894101 986079 -1511384 -324562 1450004 1724023 911170 -583352 -2310531
686 -2310531 -2396646 -128173 1639529 715870 -288860 734169 -651667 -8278793 -14708574
677 -14708574 -8490657 7219821 14835465 5319210 -9202269 -12032718 -2517730 7404572
669 7404572 10304436 8607702 7601504 10705043 18276370 25144671 23445384 13413397
661 13413397 5968534 8285988 13158228 10683791 4002367 3236546 9087012 13836075
653A3836075Q23534o54309l762114q872584n566565Q573055J6659400N539337
645B6575829j2173825j6001286p038230j452745l383360l795552k36077J829715
637a5675531L425310R117328J2954982N864378n801260p831412j412499P39771
629A381067j726393J212289O361018P48973j0919439r480840M249441P104754
621a069130o695750j3552357q96306J0538165L135150p316052j377752R124958
613h109074M104024p434338m264209Q314365R422249J425689L831513J4445846
605B1736065J1354201o707406j5597377n944203L307656j52484k988023N228769
597A0237198J0926533J197860j1241657p131588R270061J7234813Q043934q059906
$$ plain form
653 13836075 14659609 14005300 10243186 1370602 -4195963 4377092 21036492 26575829
645 26575829 14402004 -1599282 -8637512 -10090257 -13473617 -17269169 -17505246 -15675531
637 -15675531 -12250221 -3132893 9822089 15686467 9885207 2053795 641296 1381067
629 1381067 -345326 866963 7227981 7976954 -2942485 -12423325 -8173884 -1069130
621 -1069130 -7764880 -21317237 -22213543 -11675378 -8540228 -15856280 -17234032 -8109074
613 -8109074 -4005050 -11439388 -15703597 -7389232 2033017 3458706 7290219 21736065
605 21736065 33090266 26382860 10785483 4841280 8148936 7996452 5008429 10237198
597 10237198 21163731 22361591 11119934 3988346 13258407 30493220 38537154 30477248
589C0477248j7397968j4393501k668945P384960O859833j247198n945089m106727
581a037387k525868k997484O19348O884359M788575n706761q350094L568718J2851612
572H095018M244038j0213919r433798M475948J1877023O412087K09006J076226
564A6741629L063954P98568k207394k578753k703198m385677n524151m731124
556a526146k653642P60329M322564L756903j531325m317121k20358L217194j655718
547A52680p925404m543693L702715L060660m689630l417351R417346J5229074
539A0986397K486559j4050271j3946458J086022J2966198J2601531N996258k73235
531A7853001n906996r352135n580708M405416J0044107L445852q775916j2283247
$$ plain form
589 30477248 13079280 -1314221 -3983166 3401794 10261627 9014429 3069340 -1037387
581 -1037387 -3563255 -6560739 -5941391 942968 5731543 24782 -8325312 -4756594 8095018
572 8095018 12339056 2125137 -7308661 -2832713 9044310 15456397 15665403 16741629
564 16741629 19805583 20604151 18396757 15818004 13114806 8729129 3204978 -1526146
556 -1526146 -4179788 -3419459 903105 4660008 3128683 -1188438 -1408796 1808398 152680
547 152680 -7772724 -12316417 -8613702 -5553042 -10242672 -13660023 -4242677 10986397
539 10986397 13472956 -577315 -14523773 -13437751 -471553 12129978 18126236 17853001
531 17853001 11946005 2593870 -2986838 1418578 11462685 14908537 6132621 -6150626
523f150626k961432P994951R190337L344723M00486O62477m493341j4643928j5928084
514b2584437j441163J4922849J5969979M700476k627185j205776J9322j707236
506F046829J515446R761912R624755m352239j6355232r628346Q624913J5932928
498B1170966M371499j0650616j1900060n54072R061663Q508960K511658j559184
490B0960814m666181j1567438j8497040j4600830J233892J4030096J1139168J34538
482a832981k440495M753009Q389550L061769k244682k135679l313429r157952
474d920890j0511978j151765R675981J1019039O522570N380687N857056J215380
466B3086080m633508k464232M601210L988062n654509j0952511m243933M830620
$$ plain form
523 -6150626 -9112058 -1117107 8073230 11417953 11818439 12480916 7987575 -6656353 -22584437
514 -22584437 -24025600 -9102751 6867228 11567704 8940519 7734743 7754065 6046829
506 6046829 7562275 17324187 26948942 22596703 6241471 -3386875 5238038 21170966
498 21170966 25542465 14891849 2991789 2437717 11499380 20008340 22519998 20960814
490 20960814 16294633 4727195 -13769845 -28370675 -27136783 -13106687 -1967519 -1832981
482 -1832981 -4273476 479533 8869083 11930852 9686170 7550491 4237062 -4920890
474 -4920890 -15432868 -16584633 -6908652 4110387 10632957 16013644 21870700 23086080
466 23086080 18452572 15988340 20589550 24577612 18923103 7970592 3726659 8557279
458H557279M063553m332723q811524m756330J679747L610308J405222L92625L712013
449E520170Q532441R028055L142721m325087o596771k368704L068103L956350
441A9957278K8263l918336l985106k141001l518143p964859q103368j08803P400458
432b353617L597750o750297o971384P047409J7961120J0221423p674939j5212096
424a34631p494607J854281K502046r21401k32955M156182O719322N418371K508238
415A4374846M70289k48012j349300m736774q733236q270396j837585M560151M506893
406a263124n32200m457517m808940k702591J729546P462110R454362M461104k595386
397F747364m698769k157422O53509L546979P347049P387535M30473o229449m188095
$$ plain form
458 8557279 12620832 8288109 -523415 -5279745 -3599998 10310 1415532 1808157 5520170
449 5520170 14052611 23080666 26223387 21898300 15301529 12932825 16000928 19957278
441 19957278 19985541 16067205 12082099 9941098 6422955 -1541904 -9645272 -9754075 -2353617
432 -2353617 1244133 -5506164 -12477548 -5430139 12530981 22752404 15077465 -134631
424 -134631 -7629238 -5774957 -3272911 -4194312 -4427267 -271085 6448237 11866608 14374846
415 14374846 14845135 14597123 13247823 8511049 -222187 -8492583 -10330168 -5770017 -1263124
406 -1263124 -1795324 -6252841 -11061781 -13764372 -12034826 -4572716 4881646 9342750 6747364
397 6747364 2048595 -108827 544682 4091661 11438710 18826245 19256718 13027269 8839174
388H839174J510019N05836l912520k08121Q759512P462260n613960j2607862m007701
379G26637O678556N382334k022458l187658J298458M596382O830035Q464104K616549
370C1382939j1619912j9376211r526914N548195O848404k737860n571882J087716
362c965525L339260l261887o560291M73549Q892978R989117P527430P487334P630547
353C1552512L895282j920211o298678q745935r057223o478947l297234k471467
345b821901j498402L615087R082095P463258M50289l035027j351672j266793m229939
336F406995m005808O27274L655138M045765O578739Q564365J400076j0978104
328A6294440j2553261o09835P183302L22086p908972l816423M260818L119597
$$ plain form
388 8839174 10349193 10855029 6942509 6734388 15493900 22956160 17342200 4734338 726637
379 726637 7405193 12787527 10765069 7577411 8875869 13472251 20302286 28766390 31382939
370 31382939 19763027 386816 -9140098 -3591903 3256501 518641 -5053241 -3965525
362 -3965525 -626265 -3888152 -10448443 -9974894 -1081916 8907201 16434631 23921965 31552512
353 31552512 35447794 33527583 27228905 18482970 9425747 2946800 -350434 -2821901
345 -2821901 -4320303 -705216 8376879 15840137 16290426 13255399 11903727 10636934 6406995
336 6406995 2401187 3028461 6683599 10729364 17308103 25872468 27272544 16294440
328 16294440 3741179 3131344 10314646 10636732 2727760 -1088663 3172155 6291752
320F291752j465321K149812P271586M48861j1349525r464697M442866R547378
312G872712n02733q720666m077921K504101L3919m255095o57600M674301J691777
303a437205m443117j650429Q255370J1988762N486809j389717j673524q12799
295A4324150m948917r004445m460259N568112Q545853N74898o532297j625855
287B441240Q985825J0256553M60152p164218n073667o24538n01848M05982O204239
278A5389720Q742238J252879p213766n396705O30678k041067r722808q169191
270f528022J373598L042637n682937p932741M733595J7254850J3410918j462700
262A8209198j0586303p494836J706072Q731219P774064k039392j2347817j1799650
$$ plain form
320 6291752 4826431 6976243 14247829 14696690 3347165 -6117532 -1674666 7872712
312 7872712 7369979 -1350687 -5428608 -2924507 -2890588 -7145683 -7803283 -3128982 -1437205
303 -1437205 -5880322 -7530751 724619 12713381 18200190 16810473 15136949 14324150
295 14324150 9375233 370788 -4089471 1478641 10024494 10599392 4067095 2441240
287 2441240 11427065 21683618 22143770 14979552 9905885 9281347 8779499 9185481 15389720
278 15389720 24131958 25384837 18171071 12774366 13405044 11363977 1641169 -6528022
270 -6528022 -5154424 -2111787 -7794724 -15727465 -10993870 6260980 19671898 18209198
262 18209198 7622895 128059 1834131 10565350 18339414 16300022 3952205 -7847445
254g847445j488240N194162K094367k126354q11533N19722j613652M00932R011277
245C333236J1090914j439779j3470875p046703R637207J3257823q08j0873708
237D487307o988363K469493N042182J931694O34529K226636K796855O91183k680356
228A0611160n415954o184044n089598l185422L82152P183890J3256977J0579571
220B2138732n57716q312258n244346N45496j004462n504262k651931N802369R668255
211A4879877O893950L326868j98156p036240j3601598j2252173m003909L049684
203h941697N812255O053340K593822m254837n813644L293117J2103446P892319
195A8738121j959601j318251O619541M704738p229928j1350796k883642L030478
$$ plain form
254 -7847445 -9335685 -4141523 -2047156 -4173510 -4985043 -4465321 -6078973 -5678041 3333236
245 3333236 14424150 12984371 -486504 -7533207 2104000 15361823 15361015 4487307
237 4487307 -2501056 -31563 5010619 6942313 7576842 9803478 12600333 13291516 10611160
228 10611160 5195206 -988838 -6078436 -9263858 -8881706 -1697816 11559161 22138732
220 22138732 21581016 13268758 8024412 8569908 7565446 2061184 -590747 5211622 14879877
211 14879877 21773827 25100695 24902539 17866299 4264701 -7987472 -11991381 -8941697
203 -8941697 -3129442 2923898 5517720 1262883 -4550761 -1257644 10845802 18738121
195 18738121 16778520 15460269 22079810 26784548 19554620 8203824 5320182 8350660
187H350660k10405q24179N588944N959214m175013r145297p43543O241622J214880
178A2256883k660602N755368J2348555K193043j2037079j0648080j63755O8542
170G112875p873087o770046L725045Q305677M047145J377345K88331q648168k0184223
161a8619106j6805417K006059J6055871J4245160O859157L475004j26876o229635
153H60217o725193K34159K820551m936400j1707082p535556K10632R75866j520798
144b7323604J495567P404132P996843M331378L401757N196447M461494J734531
136H698545J979001M151844J908055n193125r333326n215699K409214M859954
128D264463L10233m582199l786634K050m36482n394848p053564k274121R03861
$$ plain form
187 8350660 8140255 7316076 12905020 18864234 14689221 5543924 4800381 11042003 12256883
178 12256883 9596281 15351649 27700204 29893247 17856168 7208088 7044333 7112875
170 7112875 -760212 -7530258 -3805213 4500464 8547609 9924954 10213285 1565117 -18619106
161 -18619106 -35424523 -33418464 -17362593 -3117433 3741724 7216728 7089852 860217
153 860217 -5864976 -5630817 -2810266 -7746666 -19453748 -26989304 -26778672 -25802806 -27323604
144 -27323604 -25828037 -18423905 -10427062 -6095684 -2693927 2502520 6964014 8698545
136 8698545 10677546 14829390 16737445 11544320 2210994 -3004705 -595491 4264463
128 4264463 4574696 -7503 -3794137 -3792087 -4228569 -9623417 -16676981 -18951102 -18047241
119a8047241l796103q486614k304931R688692J2252670L392454k565437K266559
111g599951Q110863N203152n78073M57850M473636Q25466r351583j3593351o273381
102a8325372L807880O222976K087134J51358L569798O197192K688120k835553
94C563533l214761o33277m112489j3512815j6360571o259801N796630P907869
86b6825682N427582R352442J4559435P376361q634906j4234443l682042O392011
78a0269242K891384n824340o280782R5353L453809J353112j599492k224435M85009
69a7919624O245602J0348713P529674J868541K518347P237992L975342p068315
61A4736272r686513K126031J1576674M528500q593853j0972852m864525k003710
$$ plain form
119 -18047241 -21843344 -30329958 -32634889 -22946197 -10693527 -7301073 -9866510 -7599951
111 -7599951 510912 5714064 5135991 5593841 10067477 10892943 1541360 -12051991 -18325372
102 -18325372 -14517492 -8294516 -6207382 -6056024 -2486226 3710966 6399086 3563533
94 3563533 348772 -284505 -4396994 -17909809 -34270380 -40530181 -34733551 -26825682
86 -26825682 -21398100 -12045658 2513777 9890138 1255232 -12979211 -16661253 -10269242
78 -10269242 -7377858 -13202198 -19482980 -19387627 -15933818 -14580706 -16180198 -18404633 -17919624
69 -17919624 -11674022 -1325309 6204365 8072906 10591253 17829245 21804587 14736272
61 14736272 5049759 7175790 18752464 23280964 14687111 3714259 -1150266 -3153976
53c153976j456514L763795Q297760L254659m162856r39011P317070M096497q810153
44H207271j2453084j563422P691149M396009k967072m761015l765206k914477
36h129847L169566J4412483J7726698M885322j2747884j8288175j0180474J96569
28h955742M697404L538387m4363k474040j134104J753891R64032k654076j525624
19e834235O140047J0870141M926717n844612r794831l908143N526149J1768079
11A3849312J1334422L598712p093024j2471184q898251j807764K270361L544240
3D326824M516084L449645j364943
0A0927610
$$ plain form
53 -3153976 -4610490 -846695 7451065 10705724 6542868 5603857 12920927 17017424 8207271
44 8207271 -4245813 -5809235 1881914 6277923 3310851 -1450164 -5215370 -8129847
36 -8129847 -4960281 9452202 27178900 32064222 19316338 1028163 -9152311 -8955742
28 -8955742 -4258338 -719951 -764314 -3238354 -4372458 -2618567 -1654535 -4308611 -5834235
19 -5834235 305812 11175953 16102670 10258058 463227 -3444916 2081233 13849312
11 13849312 25183734 28782446 21689422 9218238 319987 -1487777 782584 4326824
3 4326824 8842908 12292553 10927610
0 10927610
$$ Imaginary data points
##PAGE= N=2
##DATA TABLE= (X++(I..I)), XYDATA
65535A0495134j059472r08491J914752l13719q580733j4304216j0507709k42460
65527b3506914Q114552R801724N925664J1522n150321q322728r037966o454127
65519b8618594J40832R107908J6045214J7013899J1790142L562581l541925o602324
65511A8897733n539488l314030k948326m071257l999341j766645J312386M398715
65503B969747P209254P926736N025777R79106l31914R9998k131964o727979q034005
65494F984756l934536P95510K222579K051126J889249n66750n517051p622255
65486c697372l812763R13021R63928j597753j952435o97971q79799j537249r36584
65477a3234977j650801n051729n584273N38433N515293J96906q657422n106009
$$ plain form
65535 10495134 9435662 8527171 10441923 10128204 1547471 -12756745 -23264454 -23506914
65527 -23506914 -15392362 -5590638 335026 346548 -4803773 -13126501 -22164467 -28618594
65519 -28618594 -28477762 -19369854 -3324640 13689259 25479401 29041982 25500057 18897733
65511 18897733 13358245 10044215 7095889 3024632 -974709 -2741354 -1428968 2969747
65503 2969747 10179001 18105737 23131514 24110620 23778706 23878704 21746740 15018761 6984756
65494 6984756 3050220 3845730 6068309 8119435 10008684 9441934 3924883 -3697372
65486 -3697372 -7510135 -6597114 -5633186 -7230939 -9183374 -9881345 -10761144 -12298393 -13234977
65477 -13234977 -14885778 -19937507 -25521780 -24983347 -19468054 -19271148 -27928570 -33034579
65469c3034579J1022866K0312647J0532456n349578p384295M172670J1618397
65462A1890584N180198o398830j0620023o307530n48057K246568K991937L144939
65454A579786K376590P86552J54352J510610K471594j156451r859120j7318060
65446a9454147j5534017m247763P175251R708423M721084Q93209K501073N408983
65438h827904N005219K895283L046427N344337O718041N835909K914187k348116
65430B0583383q077951q348424m60082P505750M568003o964660j2094137l542472
65422f830590P066577N233773n922626j0460418j629514J0495280J3376607N904981
65414A7234070l778845p979665m540062K969288P604328M847820k196756n964893
$$ plain form
65469 -33034579 -22011713 -1699066 8833390 3483812 -3900483 272187 11890584
65462 11890584 17070782 10671952 51929 -6255601 -6803658 -4557090 -1565153 1579786
65454 1579786 3956376 4742928 4897280 6407890 8879484 7723033 -2136087 -19454147
65446 -19454147 -34988164 -39235927 -32060676 -22352253 -17631169 -16737960 -14236887 -8827904
65438 -8827904 -3822685 -927402 2119025 7463362 14181403 20017312 22931499 20583383
65430 20583383 12505432 4157008 3696926 11202676 15770679 8806019 -3288118 -6830590
65422 -6830590 235987 5469760 -452866 -10913284 -12542798 -2047518 11329089 17234070
65414 17234070 13455225 5475560 935498 3904786 11509114 16356934 14160178 8195285
65406H195285l499196N63009O79094l084671o387432n949476k207928K012195
65398i679120M665414O313844P955655P823528L876194m85922Q31987O050535
65390B7352115N221792m701197j2631613q866616J7779K208487n19205J516636
65382I598178O585585M099782n279844r118489m029438j73323j769431l98463
65374d85443O563764Q217792m28711p444224l284571L540055K424171j461493
65366G641340N88801L263814j764157p723209l557100M923714L478651n983126
65358H68728q204581K48222O966317N172101K139268L675894N170770J818172
65350A7854891m408663j0698602j5369024j2931749P01467J6709129J9674490
$$ plain form
65406 8195285 4696089 5259098 5938192 2853521 -3533911 -9483387 -11691315 -9679120
65398 -9679120 -5013706 1300138 9255793 17079321 20955515 20469593 21301580 27352115
65390 27352115 32573907 27872710 15241097 6374481 6392260 8600747 8081542 9598178
65382 9598178 16183763 20283545 15003701 5885212 1855774 1682451 -86980 -485443
65374 -485443 6078321 14296113 13867402 6423178 3138607 6678662 9102833 7641340
65366 7641340 8230141 11493955 9729798 2006589 -1550511 3373203 6851854 868728
65358 868728 -7335853 -7087631 -121314 5050787 7190055 10865949 16036719 17854891
65350 17854891 13446228 2747626 -12621398 -25553147 -24851680 -8142551 11531939
65343A1531939P904390m296047o685414l255830m23757J410513J048782m941006
65335B293570j1802306q170802N609263J3665645O571204n105233p713782l288965
65327g941406j375816k483518j279461J341366P70976j784025j668926J560339
65319a2860471N895139J0802804J3238461P226462n366013j2127865o865563j65010
65311b22056k827263p987558l074116Q128094J1174923M048570j826006j497840
65303E916748j032058k218985O88799O480420N293147l628463p458616j64532
65295C876460O435249J363623p850218p975041j148550N84945l867843l843219
65287a2424594M212941J0584937P768200J287768o5240L194950M877637L881108
$$ plain form
65343 11531939 19436329 15140282 8454868 5199038 4775281 6185794 7234576 2293570
65335 2293570 -9508736 -17679538 -12070275 1595370 8166574 3061341 -4652441 -7941406
65327 -7941406 -9317222 -11800740 -13080201 -11738835 -10967859 -12751884 -14420810 -12860471
65319 -12860471 -6965332 3837472 17075933 24302395 18936382 6808517 -57046 -222056
65311 -222056 -3049319 -11036877 -14110993 -5982899 5192024 9240594 7414588 5916748
65303 5916748 4884690 2665705 3354504 9834924 15128071 11499608 4040992 3876460
65295 3876460 10311709 11675332 3825114 -4149927 -5298477 -4713532 -8581375 -12424594
65287 -12424594 -8211653 2373284 10141484 11429252 11364012 14558962 19436599 23317707
65279B3317707L834305M463909J197428n807452r313245n347323l89354k183385
65271I772590o833304l428160Q488966J5494336Q602089l296134o287163j877404
65263B0635816l461439j3939762j9404052r396921O792296J2455411O071813J455303
65255A208465O633335J2648862P336350o525902j3917620o860118N528110Q557853
65247A4609335o04573j1149148j2505919n204975K703549N518068L582639L95329
65239b655695m83394K498866O715940O902063K009264j748357P15274M073929
65231A8027890j145698j2671299j5656348k668529J2818276J1879649m262741
65224F321200j4979935q008484M605092N381199k547582j140350J3035961K0269171
$$ plain form
65279 23317707 27152012 31615921 32813349 27005897 17692652 12345329 11955975 9772590
65271 9772590 2939286 -488874 8000092 23494428 32096517 28800383 22513220 20635816
65263 20635816 17174377 3234615 -16169437 -25566358 -18774062 -6318651 -246838 1208465
65255 1208465 7841800 20490662 27827012 21301110 7383490 523372 6051482 14609335
65247 14609335 14004762 2855614 -9650305 -14855280 -12151731 -6633663 -3051024 -2655695
65239 -2655695 -3139089 -640223 6075717 12977780 14987044 13238687 13953961 18027890
65231 18027890 16882192 4210893 -11445455 -14113984 -1295708 10583941 6321200
65224 6321200 -8658735 -16667219 -12062127 -6680928 -9228510 -10368860 2667101 22936272
65216B2936272N288044j8275660k3484640n062585J4919515J6595977M536165
65209A7453088m206118l008182J906116M418609L658106l27634o600150j0092806
65201C201029o401581L08047J433424l696811o709648k555186M053596O785782
65193c581348N669736L609452Q12702k850769m456738j982539J300337J109956
65185c69211j072166P225N332699R457503P013572p90136p113343o685648j913446
65176C867049m45135n180429r208905m948187L777530O031745L11626k416526
65168h211232M066468J0501710O296232l311613m814271L385526R917800P810088
65160B5640708J441656l967401q270262r836074m636491L983115N404166k726507
$$ plain form
65216 22936272 28224316 9948656 -13535984 -18598569 -3679054 12916923 17453088
65209 17453088 13246970 10238788 12144904 16563513 20221619 19893985 13293835 3201029
65201 3201029 -3200552 -2892505 -1459081 -5155892 -11865540 -14420726 -10367130 -3581348
65193 -3581348 2088388 5697840 6510542 3659773 -796965 -2779504 -1479167 -369211
65185 -369211 -1441377 -1434152 3898547 13356050 20369622 19579486 12466143 5780495 3867049
65176 3867049 3421914 -1758515 -10967420 -15915607 -12138077 -6106332 -5794706 -8211232
65168 -8211232 -4144764 6356946 12653178 9341565 4527294 7912820 17830620 25640708
65160 25640708 27082364 23114963 14844701 5008627 372136 4355251 9759417 7032910
65152G032910r096946n625923K92205p79393m262582o14308O978183P519441M66225
65143A909812m603091m242741l569202l605576j67467M340897K492465l062601
65135a0507504j217379P476566Q668348j599538p620000R48754J1179744Q201247
65127A5530238J2428K769908J1990358R751791m593772j2713115o341516K005916
65119A8412236J207505l125854k101264J914419K181708j418967n244050p614685
65111D211048o765852r33673N822085O080435K06672l812272l596432m591501
65103c379490o810964k810840O325332P667908k790693j0271113l105120Q406915
65095f768065Q416064l62437m502715k980570m833579q967956m742921P893041
$$ plain form
65152 7032910 -2064036 -7689959 -7397754 -8177147 -12439729 -13054037 -6075854 1443587 1909812
65143 1909812 -2693279 -6936020 -10505222 -14110798 -14278265 -9937368 -7444903 -10507504
65135 -10507504 -11724883 -4248317 4420031 2820493 -4799507 -3850753 7328991 15530238
65127 15530238 15542666 18312574 30302932 40054723 35460951 22747836 16406320 18412236
65119 18412236 19619741 16493887 14392623 16307042 18488750 17069783 11825733 4211048
65111 4211048 -2554804 -3488477 2333608 8414043 8620715 4808443 1212011 -3379490
65103 -3379490 -10190454 -13001294 -6675962 991946 -1798747 -12069860 -15174980 -6768065
65095 -6768065 1647999 1285562 -3217153 -6197723 -11031302 -19999258 -24742179 -16849138
65087a6849138J5345406R855812j164138q040295r658735q374250m245001J785015
65079b1345324O312727P636648O147759J346604n049207n937544J999516Q948463
65071E9642L582406p942148q883915J921712P204924j257875r160235k613700
65063a7089189J0091340J2262312L471070l755857m749247n351280p042743l865274
65055a6028868M826180J0334668O866935m48292l564656j618907N60376k00044
65047G27392k934233m782915l201934K196540Q025687Q881691K856185n255306
65039F513107q102347l491277L320122N802757L339463L95844m91564j346095
65031E940010l576439m304445q35948M290523O430233M693946R96969m068808
$$ plain form
65087 -16849138 -1503732 8352080 7187942 -852353 -10511088 -18885338 -23130339 -21345324
65079 -21345324 -15032597 -7395949 -1248190 98414 -4950793 -10888337 -8888821 59642
65071 59642 3642048 -4300100 -13184015 -11262303 -4057379 -5315254 -14475489 -17089189
65063 -17089189 -6997849 5264463 8735533 4979676 230429 -5120851 -12163594 -16028868
65055 -16028868 -11202688 -868020 5998915 5550623 1985967 367060 927436 727392
65047 727392 -2206841 -6989756 -10191690 -7995150 30537 8912228 11768413 6513107
65039 6513107 -1589240 -5080517 -1760395 4042362 7381825 7777669 7286105 5940010
65031 5940010 2363571 -1940874 -2776822 1513701 7943934 12637880 13634849 9566041
65023I566041r542224j0482623k443342J0229824J6049702Q262072p451922j7645387
65015c457859j2592511M425259J7585461J2720257n731462j7726897j2130180
65008a6907932l13135K356339j023797J844084Q695458O682165k909165m565542
65000f141525M662214Q878786K20573p842481m311915P60320m214507j0006381
64992a7994916j539458J5719899K3015646J5479709M725739j539738n796245q575207
64984B3495429o167596j353258k472130r337001j1731362m988061K877437L421861
64976f254681m95357L61967Q925991J6994847J2909381m337226j9528580j6574983
64968g998641l12421Q043181J122069l984972N136097J3682299L815983j3311903
$$ plain form
65023 9566041 23817 -10458806 -12902148 -2672324 13377378 21639450 14187528 -3457859
65015 -3457859 -16050370 -11625111 5960350 18680607 12949145 -4777752 -16907932
65008 -16907932 -17221067 -14864728 -15888525 -14044441 -5348983 1333182 -1575983 -6141525
65000 -6141525 -1479311 7399475 7620048 -222433 -4534348 -3774028 -7988535 -17994916
64992 -17994916 -19534374 -3814475 19201171 34680880 39406619 37866881 32070636 23495429
64984 23495429 17327833 15974575 13502445 4165444 -7565918 -12553979 -9676542 -6254681
64976 -6254681 -6750038 -6388071 2537920 19532767 32442148 28104922 8576342 -7998641
64968 -7998641 -8311062 -267881 854188 -3130784 2005313 15687612 19503595 6191692
64960F191692j3857980k43903M065235m860743o303465O446243J2693556J6211
64952D146846j3849232j0140746K736057P873746P241522J0644479J3409847O546051
64944B8608570k721390j807102M694198L561860l405288m521673p97512k509046
64936B1102617p695951n723011K09329l267789j3386732j1961027L883286J4592741
64928b246537Q909436l2941N67243K909159l287331j0394418p212278P17968K869182
64919g200517L803442J2171197J9230642J0383891o729539q882244P072258J7020511
64911D6869641M250802j7108445k3084387j0595567L760116O472015j372399r663607
64903d71831r131877j71428M637278n805447k2101057k0740873L777036K6398113
$$ plain form
64960 6191692 -7666288 -7910191 -3844956 -8705699 -15009164 -8562921 4130635 4146846
64952 4146846 -9702386 -19843132 -17107075 -9233329 -1991807 8652672 22062519 28608570
64944 28608570 25887180 24080078 28774276 32336136 28930848 24409175 23611663 21102617
64936 21102617 13406666 7683655 7892984 4625195 -8761537 -20722564 -16839278 -2246537
64928 -2246537 6662899 6629958 7197201 10106360 6819029 -3575389 -10787667 -10069699 -7200517
64919 -7200517 -3397075 8774122 28004764 38388655 31659116 22776872 29849130 46869641
64911 46869641 51120443 34011998 10927611 332044 4092160 10564175 9191776 -471831
64903 -471831 -9603708 -9775136 -5137858 -10943305 -33044362 -53785235 -50008199 -23610086
64895b3610086K2992489K896862o202095K340013R710152L781832n600296p230573
64887i21702n341343p123777q302974k133713P315862J1132633P778964J507077
64879C911027m433421o294972K04235J0871206J2691463J262786j0152369r036910
64871i76955k023682k452174p968006o238808K453021N702612K76934m036966
64863a5264024k582963j548657k967184Q5557Q469428J1834119N103197k611281
64855E18192k505033K076438M988439O746233P275861J293131j0116502j4944956
64847d668197p637910J18358k310512o613040m64582R557192P958201l063932
64839g124422o777726L38669M212011j155106l345192N912223J5053077J0980552
$$ plain form
64895 -23610086 -617597 2279265 -3922830 -1582817 8127335 11909167 6308871 -921702
64887 -921702 -6263045 -13386822 -21689796 -23823509 -16507647 -5375014 2403950 3911027
64879 3911027 -522394 -6817366 -6613131 4258075 16949538 18212324 8059955 -976955
64871 -976955 -3000637 -5452811 -13420817 -19659625 -17206604 -11503992 -11227058 -15264024
64863 -15264024 -17846987 -19395644 -22362828 -22277271 -13807843 -1973724 3129473 518192
64855 518192 -1986841 89597 5078036 11824269 19100130 20393261 10276759 -4668197
64847 -4668197 -12306107 -12187749 -14498261 -21111301 -21575883 -12018691 -4060490 -7124422
64839 -7124422 -13902148 -13563479 -9351468 -10506574 -13851766 -7939543 7113534 18094086
64831A8094086J11731k648087K327704J525331q897139j6538259j0972987K321822
64823a4675798J0959093J0981196P251719L625256J61518j723779P27504M896062
64815B2202771L164620n997560j3497266j2135053p940251j0133241j4167043
64808c8503023p254410R843266K0762593J6945342R145872Q485698R491386K894795
64800C1811519o192899o915172j415444k02333m244602o145996m855465m604913
64792b765305l065926L852845Q836950K190701q352126o486799M586142N371602
64784D168084o098132r077853L227941Q711757o467073k0822066j0317586J1803102
$$ plain form
64831 18094086 18205817 15557730 17885434 19410765 10513626 -6024633 -16997620 -14675798
64823 -14675798 -3716705 7264491 14516210 18141466 18302984 16579205 17306709 22202771
64815 22202771 25367391 19369831 5872565 -6262488 -14202739 -24335980 -38503023
64808 -38503023 -45757433 -35914167 -15151574 1793768 10939640 19425338 28916724 31811519
64800 31811519 25618620 18703448 17288004 17085671 12841069 6695073 1839608 -2765305
64792 -2765305 -5831231 -1978386 6858564 9049265 697139 -5789660 -1203518 4168084
64784 4168084 -1930048 -11007901 -7779960 931797 -5535276 -26357342 -36674928 -24871826
$$ [...]
##END NTUPLES=NMR SPECTRUM
##END=
