##TITLE=31Pdec_LR-579-H1-CR6
 D2O, 24 sc
 24.6.2019
##JCAMPDX= 6.0         $$ Bruker NMR JCAMP-DX V2.0
##DATA TYPE= NMR SPECTRUM
##DATA CLASS= NTUPLES
##ORIGIN= UXNMR, Bruker Analytische Messtechnik GmbH
##OWNER= root
$$ XWIN-NMR		Version 3.5
$$ Mon Jun 24 16:23:34 2019 Russian Standard Time (UT+4h)  she@DPX200
##.OBSERVE FREQUENCY= 81.013821
##.OBSERVE NUCLEUS= ^31P
##.ACQUISITION MODE= SIMULTANEOUS
##.ACQUISITION SCHEME= undefined
##.AVERAGES= 24
##.DIGITISER RES= 17
##SPECTROMETER/DATA SYSTEM= spect
##.PULSE SEQUENCE= zgpg30
##.SOLVENT NAME= D2O
##.SHIFT REFERENCE= (INTERNAL, D2O, 0, 182.463)
##AUDIT TRAIL= $$ (NUMBER, WHEN, WHO, WHERE, WHAT)
$$ ##TITLE= Audit trail, XWIN-NMR		Version 3.5
$$ ##JCAMPDX= 5.01
$$ ##ORIGIN= Bruker BioSpin GmbH
$$ ##OWNER= she
$$ F:/spectra/data/she/nmr/P31/1/pdata/1/auditp.txt
$$ ##AUDIT TRAIL=  $$ (NUMBER, WHEN, WHO, WHERE, WHAT)
(   1,<2019-06-24 16:21:26.35 +0400>,<she>,<DPX200>,
      <created by zg, POWCHK disabled, PULCHK disabled
       configuration hash MD5:
       00 E9 B6 7A A2 85 ED C7 34 08 36 98 17 FE 4E 26
       data hash MD5: 32K
       26 9E 0A D3 E3 A1 BF F6 50 4F 1F FA DC 8F 74 02>)
(   2,<2019-06-24 16:21:28.96 +0400>,<she>,<DPX200>,
      <Start of raw data processing
       efp BC_mod = 2 LB = 1 FT_mod = 6 PKNL = 1 PHC0 = -2661.834 PHC1 = 310.199 SI = 64K 
       data hash MD5: 64K
       A2 A0 9A C7 E5 0E C5 77 55 63 B2 F4 57 EA 16 FC>)
(   3,<2019-06-24 16:21:50.93 +0400>,<she>,<DPX200>,
      <pk PHC0 = -56.21724 PHC1 = 168.2 
       data hash MD5: 64K
       F6 06 9B 85 7E 0F 9E 35 50 ED 28 64 74 9E 18 6F>)
(   4,<2019-06-24 16:21:54.71 +0400>,<she>,<DPX200>,
      <abs ABSG = 5 
       data hash MD5: 64K
       30 06 D3 EC 52 9C 50 B5 5D 25 03 9E 4C 17 14 C8>)
$$ ##END=
$$ 
$$ hash MD5
$$ ED 2A 43 89 D2 20 D1 D1 C3 53 64 F3 5D CF 74 A7
##$RELAX= 
##$RELAX= 
##$RELAX= 
##$RELAX= 
##$RELAX= 
##$RELAX= 
##$RELAX= 
##$RELAX= 
$$ Bruker specific parameters
$$ --------------------------
##$DU= <F:/spectra>
##$EXPNO= 1
##$NAME= <P31>
##$PROCNO= 1
##$TYPE= <nmr>
##$USER= <she>
##$AMP= (0..31)
100 100 100 100 100 100 100 100 100 100 100 100 100 100 100 100 100 100 
100 100 100 100 100 100 100 100 100 100 100 100 100 100 
##$AQSEQ= 0
##$AQ_mod= 1
##$AUNM= <au_zg>
##$AUTOPOS= <>
##$BF1= 81.014009
##$BF2= 200.13
##$BF3= 200.13
##$BF4= 200.13
##$BF5= 200.13
##$BF6= 200.13
##$BF7= 200.13
##$BF8= 200.13
##$BYTORDA= 1
##$CFDGTYP= 0
##$CFRGTYP= 5
##$CHEMSTR= <none>
##$CNST= (0..31)
1 1 145 1 1 1 1 1 1 1 1 1 1 1 1 1 1 1 1 1 1 1 1 1 1 1 1 1 1 1 1 1 
##$CPDPRG= <waltz16>
##$CPDPRG1= <>
##$CPDPRG2= <waltz16>
##$CPDPRG3= <>
##$CPDPRG4= <mlev>
##$CPDPRG5= <mlev>
##$CPDPRG6= <mlev>
##$CPDPRG7= <mlev>
##$CPDPRG8= <mlev>
##$CPDPRGB= <>
##$CPDPRGT= <>
##$D= (0..31)
0 1 0 0 0 0 0 0 0 0 0 0.03 2e-05 3e-06 0 0 0 0 0 0 0 0 0 0 0 0 0 0 0 0 
0 0 
##$DATE= 1561378885
##$DBL= (0..7)
120 120 120 11 120 120 24 19 
##$DBP= (0..7)
150 150 150 150 150 150 150 150 
##$DBP07= 0
##$DBPNAM0= <>
##$DBPNAM1= <>
##$DBPNAM2= <>
$$ [...]
##$SUBNAM3= <"">
##$SUBNAM4= <"">
##$SUBNAM5= <"">
##$SUBNAM6= <"">
##$SUBNAM7= <"">
##$SUBNAM8= <"">
##$SUBNAM9= <"">
##$SW= 369.568048894756
##$SWIBOX= (0..15)
0 1 3 0 0 0 0 0 0 0 0 0 0 0 0 0 
##$SW_h= 29940.119760479
##$TD= 32768
##$TD0= 1
##$TE= 0
##$TE2= 300
##$TE3= 300
##$TEG= 300
##$TL= (0..7)
0 120 53 12 22 120 120 120 
##$TP= (0..7)
150 150 150 150 150 150 150 150 
##$TP07= 0
##$TPNAME0= <>
##$TPNAME1= <>
##$TPNAME2= <>
##$TPNAME3= <>
##$TPNAME4= <>
##$TPNAME5= <>
##$TPNAME6= <>
##$TPNAME7= <>
##$TPOAL= (0..7)
0.5 0.5 0.5 0.5 0.5 0.5 0.5 0.5 
##$TPOFFS= (0..7)
0 0 0 0 0 0 0 0 
##$TUNHIN= 0
##$TUNHOUT= 0
##$TUNXOUT= 0
##$USERA1= <user>
##$USERA2= <user>
##$USERA3= <user>
##$USERA4= <user>
##$USERA5= <user>
##$V9= 5
##$VALIST= <valist>
##$VCLIST= <CCCCCCCCCCCCCCC>
##$VD= 0
##$VDLIST= <DDDDDDDDDDDDDDD>
##$VPLIST= <PPPPPPPPPPPPPPP>
##$VTLIST= <TTTTTTTTTTTTTTT>
##$WBST= 1024
##$WBSW= 4
##$XGAIN= (0..3)
0 0 0 0 
##$XL= 0
##$YL= 0
##$YMAX_a= 17652
##$YMIN_a= -18331
##$ZGOPTNS= <>
##$ZL1= 120
##$ZL2= 120
##$ZL3= 120
##$ZL4= 120
##$ABSF1= 182.463
##$ABSF2= -187.1042
##$ABSG= 5
##$ABSL= 3
##$ALPHA= 0
##$AQORDER= 0
##$ASSFAC= 0
##$ASSFACI= 0
##$ASSFACX= 0
##$ASSWID= 0
##$AUNMP= <proc_1d>
##$AZFE= 0.1
##$AZFW= 0.5
##$BCFW= 0
##$BC_mod= 2
##$BYTORDP= 0
##$COROFFS= 0
##$CY= -3
##$DATMOD= 1
##$DC= 0
##$DFILT= <>
##$DTYPP= 0
##$F1P= 0
##$F2P= 0
##$FCOR= 1
##$FTSIZE= 65536
##$FT_mod= 6
##$GAMMA= 0
##$GB= 0
##$INTBC= 1
##$INTSCL= 5.30512e-09
##$ISEN= 30
##$LB= 1
##$LEV0= 0
##$LPBIN= 0
##$MAXI= 10000
##$MC2= 0
##$MEAN= 0
##$ME_mod= 0
##$MI= 50
##$NCOEF= 0
##$NC_proc= -5
##$NLEV= 6
##$NOISF1= 182.463
##$NOISF2= 159.3651
##$NSP= 0
##$NTH_PI= 0
##$NZP= 0
##$OFFSET= 182.463
##$PC= 4
##$PHC0= -2718.051
##$PHC1= 478.399
##$PH_mod= 1
##$PKNL= yes
##$PPARMOD= 0
##$PSCAL= 0
##$PSIGN= 0
##$REVERSE= no
##$SF= 81.0140089999434
##$SI= 65536
##$SIGF1= 159.3651
##$SIGF2= -187.1042
##$SINO= 113.3802
##$SIOLD= 16384
##$SREGLST= <1H.CDCl3>
##$SSB= 0
##$STSI= 65536
##$STSR= 0
##$SW_p= 29940.119760479
##$SYMM= 0
##$S_DEV= 0
##$TDeff= 32768
##$TDoff= 0
##$TI= <>
##$TILT= no
##$TM1= 0
##$TM2= 0
##$TOPLEV= 0
##$USERP1= <user>
##$USERP2= <user>
##$USERP3= <user>
##$USERP4= <user>
##$USERP5= <user>
##$WDW= 1
##$XDIM= 65536
##$YMAX_p= 303512278
##$YMIN_p= -6259426
$$ End of Bruker specific parameters
$$ ---------------------------------
##NTUPLES= NMR SPECTRUM
##VAR_NAME=  FREQUENCY,     SPECTRUM/REAL,   SPECTRUM/IMAG
##SYMBOL=    X,             R,               I
##VAR_TYPE=  INDEPENDENT,   DEPENDENT,       DEPENDENT
##VAR_FORM=  AFFN,          ASDF,            ASDF
##VAR_DIM=   65536,         65536,           65536
##UNITS=     HZ,            ARBITRARY UNITS, ARBITRARY UNITS
##FACTOR=    0.456856943014862, 1,           1
##FIRST=     14782.0589164792, 0,            0
##LAST=      -15158.0608439998, 0,           0
##MIN=       -15158.0608439998, -6259426,    0
##MAX=       14782.0589164792, 303512278,    0
$$ Real data points
##PAGE= N=1
##DATA TABLE= (X++(R..R)), XYDATA
$$ [...]
42734g90242P43449J47655k74598M6261N85027N69475K9991l80980k75251P7104
42724D77891J39194k25777n13168j54681O50600J042270O04534p1203k44293J3412
42714A718779J66849R2446J3187r8494l86800o08417m27323n7265K7845j28615
42704C12192j37861n0733k17895m66344k53560L33642N95683L62656K35139M32308
42694A145227L15390m70485j193965j025850k30228L04718K79443O7792o4211
42685h72169j50808j38997P4958L14440L39023L09556N54467R18929Q23417L1913
42675B204729r90755j553011j334635n47865K52824N85039N00681N26066Q99581
42666E42654J093360N09381n31163j073991p96153l60761l55459n14130l52585
$$ y = [-790242, -46793, 100862, -173736, -127475, 457552, 1027027, 1057018, 676038, 400787, 477891, 617085, 391308, -121860, -276541, 374059, 1416329, 2020863, 1949660, 1705367, 1718779, 1885628, 1978074, 1991261, 1892767, 1505967, 897550, 470227, 412962, 440807, 312192, 174331, 123598, -94297, -560641, -814201, -480559, 115124, 477780, 712919, 1145227, 1460617, 990132, -203833, -1229683, -1459911, -1155193, -875750, -807958, -872169, -1022977, -1161974, -1087016, -772576, -433553, -123997, 430470, 1349399, 2172816, 2204729, 1213974, -339037, -1673672, -2221537, -1968713, -1383674, -882993, -356927, 542654, 1636014, 2145395, 1614232, 540241, -255912, -616673, -972132, -1486262, -1838847]
42657a838847p103J25314J81159N66040J075616J022925K90336m35904o67391
42648C12145o82982p80810o51821o3422M22110K07643k44332r095P77875J029269
42638C16580M13469j31087N9093L80301J49753j93373qK64435k17229j008630
42628C3304q74131K89570J213880J063243L50589j87273n19385p10379m40014
42619B19404K30410M99746j7650n16468j89442M59036M27615j58663l28581P7037
42609G02444J87756l57085p25104j83002P26808R18524K15707n33623o00706j13042
42599B38677L55993N20025M99668M07221J20485m13921q40215o66319O8653O81671
42589I71938N93583J995m14828l27640m2926l2486m05862q39161q78371l56785
$$ y = [-1838847, -1845950, -1720636, -1539477, -973437, 102179, 1125104, 1415440, 979536, 312145, -370837, -1151647, -1803468, -1866890, -1444780, -1237137, -1481469, -1490564, -712689, 316580, 730049, 598962, 658055, 1038356, 1188109, 994736, 994728, 1259163, 1041934, 33304, -840827, -551257, 662623, 1725866, 2076455, 1889182, 1369797, 659418, 219404, 449814, 949560, 931910, 415442, 226000, 685036, 1112651, 953988, 625407, 702444, 890200, 533115, -191989, -374991, 351817, 1270341, 1486048, 952425, 351719, 238677, 594670, 1114695, 1614363, 2021584, 2142069, 1728148, 887933, 221614, 290267, 971938, 1565521, 1567516, 1152688, 825048, 782122, 749636, 343774, -495387, -1373758, -1730543]
42579a730543L65455O65495L07442k61938m17978n7370L77771M74466K36930n7838
42569i8108j88209j28309L2199K31274M38045M93190J37185n59832r64113n20703
42559a127381L90097P72361L06710k56251k27097J37879K90065K77679L63493
42550I27555L11374j53767n72225l24127K55669K68179l32051o73410l88712j12695
42540g94210k86968m12343j86N01783L96054j62126m08188l3268N31133P25483
42530E7164L64692l08859p57777n13988K98188R58566R00621K94956k87033n43619
42520D62911n54236m59288k97922m1510L56505Q02568R46331N38781n1427j33186
42510A569527L26269N15941r9665r30554r91944j80902O57928P79791K37230l85176
$$ y = [-1730543, -1365088, -699593, -392151, -654089, -1072067, -1129437, -751666, -277200, -40270, -98108, -286317, -414626, -382427, -151153, 286892, 780082, 917267, 357435, -606678, -1127381, -737284, 35077, 341787, 85536, -141561, -3682, 286383, 564062, 927555, 1238929, 1085162, 512937, 188810, 444479, 712658, 380607, -292803, -681515, -794210, -1081178, -1493521, -1493707, -991924, -595870, -757996, -1166184, -1199452, -668319, 57164, 421856, 112997, -644780, -1158768, -860580, 97986, 998607, 1293563, 1006530, 462911, -91325, -550613, -848535, -890045, -533540, 269028, 1215359, 1754140, 1702713, 1569527, 1895796, 2411737, 2312072, 1381518, 389574, 208672, 866600, 1646391, 1883621, 1498445]
42500A498445n88125l17861P6653K35307J67061J34316K26311L12152L40855L00922
42490B386036l2264p69370j374501j153837l32987J45934L3727M7258M80375O44765
42480G5136K01783j11757J50791K17529m52432r18827k59018O76053N47048k37233
42470a10927k99643K98419L48888j58423n1882O89548P26949k30722q56195n36729
42460a80717k57029m73699j93676Q26104J031969l60941j611139r80885N35146
42451a664867R20439K74950J33266O16006N33150j79911l58222J65941K61104
42442G01856m18205q41814m18954J62322K91989K58127L21254K03971j14227j93571
42432d7252k5376p9895k69215J7605O47237P03804o918o04089n87131m27001l70375
$$ y = [1498445, 910320, 592459, 669112, 904419, 1071480, 1205796, 1432107, 1744259, 2085114, 2386036, 2353772, 1584402, 209901, -943936, -1276923, -1130989, -1097262, -1050004, -569629, 75136, 276919, 165162, 315953, 533482, 81050, -837777, -1096795, -420742, 126306, -110927, -410570, -112151, 236737, 78314, 26432, 715980, 1442929, 1212207, 356012, -180717, -437746, -911445, -1105121, -279017, 752952, 392011, -1219128, -2200013, -1664867, -744428, -469478, -336212, 279794, 812944, 633033, 274811, 440752, 701856, 283651, -558163, -977117, -814795, -522806, -264679, 56575, 260546, 146319, -47252, -72628, -152523, -421738, -404133, 243104, 946908, 939990, 335901, -251230, -678231, -1048606]
42421a048606K6168O81944O63753k40338q75538m57988J98583R2125l94784l32115
42411a686796K43859O60072P00496M61693j35507q05981o71355M59756J347846
42402E74083Q91910k72015q02783n52813k54648k0653M54934P21595J17946p65812
42392I1744o64799L69440R68168N16947j43660l13187l81929p33792q95789m43028
42382a629885J58727L13990K38824M78579R36607R95684M19235k79884l63762
42373A268115L27177J074590R66811K0140p61768p38388m77976o97856j001551
42364b0706n78222L26008P33049M38332O3897j61807m51256m70655K69906J049838
42354A198384N52589q92397j352976j54250R69084N00003o28685p00858J55442
$$ y = [-1048606, -1022438, -340494, 323259, 82921, -792617, -1250605, -1052022, -959897, -1354681, -1686796, -1442937, -782865, -82369, 379324, 243817, -562164, -1233519, -773763, 574083, 1465993, 1193978, 391195, -161618, -416266, -436919, 18015, 739610, 857556, 91744, -573055, -203615, 764553, 1281500, 1137840, 824653, 442724, -291068, -1186857, -1629885, -1471158, -1157168, -918344, -439765, 496842, 1492526, 1911761, 1631877, 1268115, 1595292, 2669882, 3636693, 3656833, 2895065, 2156677, 1678701, 980845, -20706, -598928, -272920, 460129, 898461, 962358, 800551, 349295, -121360, 148546, 1198384, 1750973, 858576, -494400, -648650, 320434, 820437, 191752, -509106, -353664]
42345c53664N38254J06831k48943j26035k3141j68605j56634K06800O05915P54065
42335A134843N39391j55377j069768j341791n12965N51395O65964j8266l58474
42326e65048j3338K25590j19903n48757n29974j36414M60440J174695J481570
42317A428861P50512n24353q72668J74719J185015O82040q37873j655789j075075
42308g44611N1242P44496Q52512N88309M2723n55940p59507m60564j14274q4176
42298d39790j38172N8203K94029J41035k70109l66526k5519K13721P927k45527
42288g70728o3334L66462N48055M50068L55403K12687j88956n53130l48037K59377
42278B67867N23043K56303J9394J1572k47805p62562o54925L80593J195969P38485
$$ y = [-353664, 184590, 291421, 42478, -83557, -106698, -275303, -431937, -225137, 380778, 1134843, 1674234, 1518857, 449089, -892702, -1405667, -854272, -188308, -206574, -565048, -578386, -352796, -472699, -1021456, -1551430, -1687844, -1227404, -52709, 1428861, 2179373, 1655020, 782352, 957071, 2142086, 2824126, 1986253, 330464, -744611, -693369, 51127, 903639, 1491948, 1534671, 978731, 219224, -241340, -355614, -439790, -577962, -519759, -225730, -84695, -354804, -721330, -746849, -533128, -525201, -770728, -834062, -467600, 80455, 530523, 885926, 1098613, 909657, 356527, 8490, 267867, 790910, 1047213, 1066607, 1078179, 830374, 67812, -587113, -206520, 989449, 1727934]
42268A727934l05783n67738q6018l597n15517n98267J56618Q44131P58409L96194
42258A806366L78862L85991j05351p74325r33154n59746j57142O5775K35390K87533
42248F30199K9780l38353k91045L30017R77735R03890l1383j076146j215019k29608
42238c09933R66363J268174N41225m13163q47794o23510R578O03916N96387j42563
42228A648680q53503o64800J65681N66071K57418O3403L45873K62964p20269j571548
42218e00030r91308O20785J601453J165995J24235m60678m13611j42407L8636
42209A043070J3229k16067m83491o06636o05782n33036k29062L77728Q91915Q45247
42199D97115L79632N9456O8931Q4830j01522l46340n08309n17761j36923P23609
$$ y = [1727934, 1422151, 854413, 768395, 764798, 249281, -348986, -192368, 651763, 1410172, 1806366, 2185228, 2571219, 2465868, 1691543, 758389, 198643, 41501, 107276, 342666, 630199, 659979, 321626, 30581, 360598, 1338333, 2242223, 2210840, 1134694, -80325, -309933, 656430, 1924604, 2465829, 2052666, 1204872, 581362, 590940, 1194856, 1791243, 1648680, 795177, 130377, 296058, 862129, 1119547, 1182950, 1528823, 1791787, 1071518, -500030, -1491338, -870553, 730900, 1896895, 2021130, 1560452, 1146841, 1004434, 1043070, 1056299, 840232, 356741, -249895, -855677, -1388713, -1617775, -1240047, -348132, 497115, 876747, 936203, 1005134, 1089964, 988442, 642102, 133793, -383968, -520891, 202718]
42189B02718J426704J085750j65636j095321r20867k63998p3891k57666j20753
42180a82960L03839L15741j77223l80185J68151Q48603Q53946K90049j25042j13801
42170A801118k9140j41631k85776k56822j11932N1336K48076L76355J91720k44278
42160A599026m22146n5852L51992R7004o69198j015988m92852J94137J16112n86717
42150h84482q30921J0107J236105J574845O55309n40524p83659K1495Q12161O96403
42140A966839n2786n40279m45173k23383k69511m36838m69338l89538k27466J84824
42130i02649Q06037J131366P74214Q2231k59923j14461N2076o3342k31850j70653
42120A103046J5371O9538j7666p5543m7591p595Q388l554j04955l03219m07976
$$ y = [202718, 1629422, 2715172, 2549536, 1454215, 533348, 269350, 195459, -62207, -182960, 120879, 436620, 259397, -120788, 47363, 895966, 1749912, 2039961, 1914919, 1801118, 1771978, 1630347, 1344571, 1087749, 975817, 1027153, 1275229, 1651584, 1843304, 1599026, 1176880, 1121028, 1473020, 1570024, 900826, -115162, -608014, -413877, -297765, -884482, -1715403, -1705296, -469191, 1105654, 1760963, 1220439, 436780, 458275, 1270436, 1966839, 1914053, 1373774, 928601, 705218, 435707, -1131, -470469, -860007, -1087473, -902649, -96612, 1034754, 1808968, 1891199, 1631276, 1516815, 1568891, 1505549, 1273699, 1103046, 1118417, 1187955, 1170289, 1094746, 1047155, 1039560, 1047948, 1044394, 939439, 636220, 228244]
42109B28244k29822P6455J32059j06220j82061K34720P78035P95349K32609l03429
42099A655939m02348l32683m83535p23950o59255k82272n314j33576n54270q67448
42089b788712o75816P7128Q92414J079779N49287k2784m2371L19932N71444O00212
42079E60513N13273K04913l28659n93335j98212L92854M21605m0742k75199p4219
42069E82792Q9194j1191r2684m7724o8914m3893L32105P69016O07183m1238l27655
42058A746991m9532R838n48053j046056q77379l78740j2148L94545R37417J020351
42048A197234K15365q88496j347945q67063K43872J402687J737041P00214q45955
42039A546954j251329l28278K71838l55457r01055j09990R80559P24035l94864
$$ y = [228244, -1578, 74877, 206936, 100716, -81345, 153375, 931410, 1726759, 1959368, 1655939, 1253591, 920908, 437373, -286577, -945832, -1228104, -1233418, -1366994, -1921264, -2788712, -3464528, -3387400, -2494986, -1415207, -865920, -888704, -931075, -611143, -39699, 560513, 1073786, 1278699, 950040, 356705, 158493, 551347, 972952, 932210, 657011, 582792, 671986, 660795, 568111, 520387, 451473, 407580, 739685, 1508701, 2115884, 2074646, 1746991, 1697459, 1707297, 1159244, 113188, -764191, -1142931, -1155079, -760534, 176883, 1197234, 1412599, 524103, -823842, -1690905, -1447033, -44346, 1692695, 2392909, 1546954, 295625, -32653, 239185, -116272, -1017327, -1127317, -146758, 577277, 182413]
42030A82413o43302J21424N36988K32266J86911O59252O89172p0723o83375m78081
42020G32945P9066L85453L84967O3747n71523r10296l32854N60925N86987j32652
42010H46765l17013L40682P21966K53568k16141k767L75088L28146R0118q3979
42000B336433m02362p09042m02828L14166L85287l66695p79600k24701M32278
41991E82936M39005L15620N54886N41690k00368r01981p67389k39159l5870L7956
41981C27326L36200M66915J38437j12347J4440j04290o67794o81367L13165J046032
41971A076717M43304n05188l88495K52794n678r43930j153209m00438L16662O33500
41961f73961R66541J147041O35843j29351k25176J26369l6119o29769p28043l09585
$$ y = [182413, -460889, -339465, 197523, 429789, 616700, 1275952, 1965124, 1894401, 1211026, 732945, 812011, 1197464, 1582431, 1646178, 1074655, 164359, -168495, 392430, 979417, 846765, 529752, 870434, 1592400, 1845968, 1629827, 1627060, 2002148, 2330294, 2420412, 2336433, 1934071, 1225029, 822201, 1136367, 1521654, 1154959, 375359, 150658, 582936, 1021941, 1337561, 1892447, 2434137, 2233769, 1331788, 564399, 325240, 289370, 327326, 663526, 1130441, 1268878, 1156531, 1170971, 1066681, 398887, -282480, 30685, 1076717, 1520021, 1014833, 626338, 879132, 873454, -70476, -1223685, -1624123, -1307461, -673961, 292580, 1439621, 2075464, 1946113, 1720937, 1847306, 1811187, 1181418, 453375, 143790]
41951A43790j94748m20331k89261J23033J30070q3760J88407N68174J38357o10310
41941c06579l81013M78421L31449q29398j185818k12361M59765J7148j83809O51821
41931a160374J081112J3197j156804q30323J74932K70686j53787K14783R79869
41922e66709P38287k85965n24463L02837Q24345K82897n45079q40901p00694l97181
41912a712626P0350M57678L52673l8449p3376K69668L74612O5997j68287j06936
41902e08696r1129k42041j66159L31643Q65054R98889O92707J44308l53896m17701
41892A252979P4417O34905O38653J19261l21525l12450k680L03845L54612l5412
41882B706605o77503q96527k69185O64619R76355N12647o2883k62784k08485j20908
$$ y = [143790, -50958, -471289, -760550, -637517, -507447, -591207, -402800, 165374, 303731, -306579, -687592, -209171, 122278, -707120, -1892938, -2105299, -1645534, -1628386, -1812195, -1160374, -79262, -66065, -1222869, -2053192, -1878260, -1607574, -1761361, -1546578, -566709, 171578, -114387, -638850, -336013, 488332, 771229, 226150, -614751, -1315445, -1712626, -1642276, -1184598, -831925, -870374, -943750, -674082, -299470, -233473, -401760, -508696, -599825, -841866, -1008025, -676382, 188672, 1187561, 1880268, 2024576, 1670680, 1252979, 1327396, 1962301, 2600954, 2720215, 2398690, 2086240, 2083560, 2387405, 2742017, 2706605, 2029102, 1132575, 863390, 1528009, 2504364, 3017011, 2954128, 2691344, 2482859, 2361951]
41872B361951K4582K65653N13570O79100O57057L64068J02354M89389J487332
41863F945056J950713R57238p15545j416855p99243j00139j88633n14110l94989
41854E723493k11093n36687r51599p13107j07358q5972p34341j104418o84914
41845E94004j33739j60427m20381j72111M30966N35367l1953m33220j12477L41170
41835D37199J51640m13324n20024j19242N9900k40029m70133l03002j08587j06329
41825a631931J15686P45124J131960O71861k09521o03852l04683J29378K29219
41816B73241K8464j75301q5055L62222P74407O41162Q4645k13676n4449k2368
41806A613292l93296n34131J2268O06586M58901j50725m54718m28855n10279n80867
$$ y = [2361951, 2386533, 2652186, 3165756, 3844856, 4501913, 4865981, 4968335, 5457724, 6945056, 8895769, 9853007, 9137462, 7720607, 6921364, 6821225, 6632592, 6118482, 5723493, 5512400, 4975713, 4024114, 3311007, 3203649, 3117677, 2383336, 1278918, 594004, 460265, 299838, -120543, -292654, 138312, 673679, 641726, 208506, 96029, 437199, 588839, 175515, -344509, -463751, -403851, -643880, -1114013, -1417015, -1525602, -1631931, -1516245, -771121, 360839, 1032700, 823179, 219327, -85356, 44022, 273241, 301705, 126404, 41349, 403571, 1177978, 1819140, 1903785, 1690109, 1635660, 1613292, 1219996, 685865, 698133, 1304719, 1763620, 1612895, 1158177, 729322, 219043, -361824]
41796c61824k42566K49346L16219M4950o1180m963o3115k8060L18130M14966k33212
41785C48691q55900m12280N49583N83497k66863n09150K48985O39143p9912p59857
41775e14063l56754L70857K71381l51877n18730k16865m5017K3513L11712M51943
41765e73900p1941p49993n44544N41958J328527R49884j47610p86116k87428Q35154
41755D93991J295284M12577r20953j210534l22448L75711M8526n10012l51717
41746f89575J54662J96164p1091k1843K49563L01225K88654M81730M40652j94366
41736A135775o81784k27278M67582J73140p16689o71048M09937Q99490M0818q90348
41726f0405p14416q1250o4338l30536r758N38556K88185n92040q59514j27660
$$ y = [-361824, -604390, -355044, -38825, 6125, -55055, -60018, -123133, -151193, 166937, 581903, 348691, -507209, -919489, -369906, 213591, -53272, -562422, -313437, 325706, 245794, -514063, -870817, -499960, -228579, -580456, -1099186, -1316051, -1361068, -1337555, -1025843, -573900, -645841, -1395834, -1940378, -1398420, -69893, 879991, 732381, -53735, -341163, 493991, 1789275, 2201852, 1280899, 70365, -252083, 123628, 172154, -337858, -689575, -534913, -338749, -409840, -431683, -182120, 119105, 407759, 889489, 1330141, 1135775, 453991, 226713, 694295, 867435, 150746, -520302, -110365, 789125, 829943, -60405, -774821, -856071, -920409, -1250945, -1260703, -722147, -433962, -1026002, -1885516, -2013176]
41716b013176N64708L67835j92571j29331N86777J116633R30359L54588o310j5159
41706A564353l5892l62168p69035p35794j33253M64185L64431l65961q84339n72659
41696a466132J77879M71074P5716l10277n0683N73263P96642M03114p9697j47429
41686D43470R5073J92242o1275l86273l15137K40566P05223L87857n38491j024341
41676b61086m94731K35509N3345p87790r88931q6803R75944J294090J016169N90350
41666A546066p058p08798q91955k55249M56970L88088k36576n80907m49780k97008
41656a036207k81603j16335K38896M14213K08040j23275j96709J11462N40662
41647b40856O31712K72871m515K24455L77752l67541j397262j086185O36807J663101
$$ y = [-2013176, -1448468, -1080633, -1273204, -1402535, -815758, 300875, 1231234, 1585822, 1579512, 1564353, 1528461, 1166293, 397258, -338536, -471789, -7604, 356827, -9134, -893473, -1466132, -1288253, -817179, -741463, -1051740, -1102423, -529160, 267482, 670596, 590899, 443470, 538543, 730785, 669510, 283237, -31900, 208666, 913889, 1301746, 763255, -261086, -755817, -520308, -466963, -1254753, -2243684, -2330487, -1354543, -60453, 955716, 1546066, 1539008, 830210, -61745, -316994, 139976, 528064, 291488, -289419, -739199, -1036207, -1317810, -1434145, -1195249, -781036, -572996, -696271, -892980, -781518, -240856, 390856, 663727, 659212, 883667, 1261419, 893878, -503384, -1589569, -952762, 710339]
41637G10339O39460r08382q46897L90306P66831o4958n90511k08360L6783l48765
41627d24154m49608J84528O15481K09687k97541k46437j60107n03063o18882K9728
41617a660368O38738K60177n73770o10410K50453R35826P81033K02908j21056
41608A03531l1579J96013K79401K05684J95342L17108K62431j75447o11293n97086
41598A44105l92575m60209m60360K31988J175117J261523M73000j22552k29719
41589A620318o08389j201008q03707O63801J411852M60769o31309j98599Q77719
41580A591447P30339m62213r87896l78409K84793L89660K80529o410p53080j414292
41570g25532j072391k0626N56035M09518L11873M50056K86914l6820J94210O94313
$$ y = [710339, 1349799, 441417, -405480, -15174, 751657, 686699, 96188, -112172, -75389, -424154, -873762, -689234, -73753, 135934, -161607, -408044, -568151, -1071214, -1690096, -1660368, -1021630, -761453, -1335223, -1945633, -1695180, -759354, 21679, 224587, 103531, 71952, 267965, 547366, 753050, 948392, 1265500, 1527931, 1352484, 741191, 144105, -248470, -708679, -1169039, -937051, 238066, 1499589, 1972589, 1850037, 1620318, 1011929, -189079, -992786, -328985, 1082867, 1543636, 912327, 713728, 1591447, 2321786, 1859573, 871677, 493268, 778061, 1167721, 1448250, 1441840, 688760, -725532, -1797923, -1818549, -1262514, -852996, -541123, -91067, 195847, 159027, 353237, 1047550]
41560A047550L98777n30892o78971K49311Q14363K48366k94548J57443O78214
41551B089613J07109q97526r46387j57907J66843m02139r97644q46022n7581Q19707
41541a121934J237245Q21935j94303r08791o89013N0345M91971M78349L85802
41532E51606L26170J31287j28374k37324k71906m08900m80466k30615J48873K32383
41522c67266k858j83970j02512P9984J10314j10088m35990n15579j69088K10380
41512a486673Q2048l08182p7142Q94593J468668P76723m18641p54949k12821N306
41502c1070n88870j027824l77872Q54398J380277P88917l4583j12683M43244O99975
41492A993909J64679o27260r12928o71889l93523k14490P3234L22802J24167l61479
$$ y = [1047550, 1446327, 915435, 236464, 485775, 1300138, 1548504, 1253956, 1411399, 2089613, 2196722, 1299196, 352809, 194902, 361745, -40394, -1038038, -1884060, -1941641, -1121934, 115311, 937246, 742943, -165848, -854861, -804516, -312545, 165804, 551606, 877776, 1009063, 880689, 643365, 371459, -37441, -517907, -748522, -599649, -367266, -370124, -554094, -656606, -576622, -466308, -576396, -1012386, -1527965, -1697053, -1486673, -1404625, -1712807, -1789949, -895356, 573312, 1350035, 931394, 176445, -36376, -31070, -619940, -1647764, -2025636, -1171238, 209039, 997956, 963373, 850690, 1293934, 1993909, 2158588, 1531328, 618400, -53489, -447012, -661502, -588268, -265466, -141299, -502778]
41482e02778m48102K6835M70793N43416N35344M79102r9562j051698j289755l58349
41472a694754O44051O26724R4525R9271M32628J84245m95888o44615j83263M6064
41462h91012j88274k86109p9669J8287J44375Q44926J647252J277100k65708j307032
41452I14136q45452M8925O1152l81561j19771O82485Q61014J53608m99640m34569
41442D40327K27K36426K00682R1928K3802K8913N5708m9352k76759l02498P2725
41431E22129N03876N01148J09621j96639j91269q0988p4745j31899j52933j49914
41421F58387j94142l40305n59914o65649m49021K656L20882L00364J04199o0392
41411h82935j50758o1192L69220Q74984P79937p9814q63683p03759J15723N50456
$$ y = [-502778, -950880, -924045, -453252, 90164, 625508, 1104610, 1005048, -46650, -1336405, -1694754, -1050703, -423979, -329454, -230183, 202445, 386690, -109198, -753813, -937076, -891012, -1079286, -1365395, -1445064, -1426777, -1282402, -437476, 1209776, 2486876, 2221168, 914136, 68684, 117609, 178761, -202800, -322571, 359914, 1220928, 1374536, 874896, 440327, 440554, 676980, 877662, 969590, 993392, 1022305, 1078013, 1028661, 751902, 449404, 522129, 1026005, 1527153, 1636774, 1440135, 1248866, 1167878, 1093133, 961234, 808301, 658387, 464245, 123940, -435974, -1101623, -1550644, -1547988, -1227106, -926742, -822543, -882935, -1033693, -1094885, -725665, 149319, 929256, 849442, -14241, -718000, -602277, -51821]
41401e1821J94421l34802l79844k2059K54144K28165P5397Q3306L46240N97642
41391I90789L97800l06767r29564q50750j96686L17459K76462m6147j74092M3049
41381d78447M24020O76603N79220J95125r4460k3785J49875j270l77546m43710
41371F05625n8800K68594J38574j70215j99762l6442j21270n02829p00419l51953
41361a128897K80174N79068K52312l41392n49471j05553N85604Q90325O01085
41352A063255L0169m59584p66604q79511o99028k14476L28104O36175O44517M36070
41342A19087M8797m19723o59330m29405K3246J75123n9586j80893J28432M54411
41332g99841K74101j44161o4764N31796P91061K60400l46892j92335M08031M87719
$$ y = [-51821, 142600, -192202, -572046, -594105, -339961, -111796, -36399, 46907, 393147, 990789, 1388589, 1081822, 152258, -698492, -895178, -577719, -301257, -347404, -521496, -478447, -54427, 622176, 1201396, 1396521, 1302061, 1278276, 1428151, 1426881, 1049335, 605625, 546825, 815419, 953993, 783778, 584016, 547574, 426304, -76525, -776944, -1128897, -848723, -269655, -17343, -358735, -908206, -1013759, -428155, 462170, 1063255, 1093424, 633840, -132764, -1012275, -1711303, -1925779, -1597675, -961500, -316983, 119087, 167884, -251839, -911169, -1340574, -1317328, -1142205, -1201791, -1382684, -1254252, -799841, -525740, -669901, -734665, -202869, 588192, 848592, 501700, 309365, 717396, 1205115]
41322A205115r7969n80703n84459n60168p09827m51948M82873J226486Q65956
41313G95356j36416n21653m797M49310J55483l51544k39071L95791P23920L01504
41303A567883m71511r35970q78116n72603l09395o9190K80758O19594O43023L12955
41293A87428k6746q9850L9464J46928J55780J6486l10100n53670k60403M47256
41283b47427P21396J08965o33381n30072J70974L99667q6971m33113j19923L05881
41273c44004K55383k916M0095K72802K71989J3501k27306l33694k83216M2349
41263b95017N75576Q81882O39727O3713m38658p32946q11190n70663j06868J41943
41253f52501l4684k34995o5238K04067J19282j39014n5147K98091L33612n8099
$$ y = [1205115, 1107146, 526443, -58016, -618184, -1328011, -1779959, -1297086, -70600, 795356, 658940, 137287, 132490, 581800, 737283, 385739, 146668, 542459, 1266379, 1567883, 1096372, 160402, -717714, -1290317, -1599712, -1668902, -1388144, -768550, -125527, 187428, 160682, 70832, 110296, 257224, 413004, 429490, 119390, -434280, -694683, -247427, 473969, 582934, -50447, -580519, -409545, -9878, -96849, -529962, -649885, -344004, -88621, -91537, -51442, 221360, 493349, 506850, 279544, -54150, -337366, -295017, 280559, 1162441, 1802168, 1865881, 1427223, 694277, -116913, -687576, -794444, -652501, -687185, -922180, -987418, -783351, -664069, -803083, -858230, -560139, -226527, -284626]
41243b84626k54321J76895Q05913Q84245K69719m55331o83112m29589k45558m78350
41233f94115p54679m68378K69748O65807L86452P0838K94550O28801M02931j02319
41223F99636j36216J46957j18064r32890j191711l62988O00003O40475P5580q2281
41213f61499L17023N80399M19616K53255L02604K24755j58693m36968k52111J04211
41203F92592J23562j85971l80154k27403P5859K70468K88897J32201j92909m92414
41193A04728m06264J47243O82813N85942j43449q00598p22812j2264N71838M03459
41183D10636l48763q42423m23552N90434J175321P93067M9875j66479Q7175M8986
41173A374277m21047n84923q6324L82562J63471l42037m00845j09868k2983q1647
$$ y = [-284626, -538947, -362052, 443861, 1328106, 1597825, 1142494, 459382, 29793, -215765, -694115, -1448794, -1917172, -1647424, -981617, -595165, -524327, -229777, 399024, 801955, 699636, 563420, 710377, 592313, -340577, -1532288, -1895276, -1295273, -654798, -579218, -661499, -344476, 235923, 655539, 908794, 1211398, 1436153, 1277460, 840492, 588381, 692592, 816154, 630183, 250029, 22626, 98485, 368953, 657850, 790051, 597142, 104728, -301536, -154293, 528520, 1114462, 971013, 170415, -552397, -564661, 7177, 410636, 61873, -780550, -1204102, -613668, 561653, 1354720, 1404595, 1238116, 1325291, 1374277, 953230, 368307, 281983, 664545, 828016, 485979, 85134, -24734, -47717, -129364]
41163a29364J42943M34364J94062l65329l50783L70896Q92489O94965L40947K96831
41153B522021O9447p59054j475196j167658j84907L43276J63667P1588M55693
41144C8877O62678J25558o44658p31264m1747O80256Q71424O47776K94508j97436
41134A705972p84918r68285l24526O31662Q02173l3707p57335m09918M23337M96737
41124G81192k35873o34443j20617O35891Q90210O58833J34581o77105j310116
41115A22553r11070L66804J045633K59740q90950r42613j89605N9075l04481k38219
41105a623133M50973P49987K31806k36629j3947L20188J06120k72091j51699K65817
41095a72608L09562j00466m52034l89338L9695O10693R92429Q55475K65515k58120
$$ y = [-129364, 13579, 447943, 642005, 276676, -74107, 296789, 1189278, 1884243, 2225190, 2522021, 2591468, 1832414, 357218, -810440, -995347, -652071, -488404, -416816, 38877, 701555, 827113, 182455, -548809, -590556, 89700, 961124, 1608900, 1903408, 1705972, 921054, -47231, -371757, 259905, 1062078, 1028371, 271036, -138882, 284455, 781192, 545319, -89124, -209741, 426150, 1316360, 1975193, 2109774, 1432669, 122553, -788517, -421713, 623920, 883660, -7290, -949903, -1139508, -1080433, -1384914, -1623133, -1172160, -422173, -190367, -426996, -440943, -120755, -14635, -286726, -438425, -172608, 136954, 36488, -415546, -804884, -765189, -154496, 837933, 1693408, 1958923, 1700803]
41085A700803l27433p2956K12145M32704M91604J76079m37317q39753o85742k24710
41075D25424J29651L16461M40666M41395K75590J17416P4220M53j70470k73023
41065A777783l10876n43968q80013p24949J10662Q68170P69530P0029m19620m85115
41055B31633n04831n89981m76609j44588J41933L52567O29572P69765M02593l02829
41045E09225o95456m59314J15966O42877Q85494N90649k72115j093101j125074
41036i00849m86489j237L3672J48133N88270P74194K96588l08759l60687o370
41026b23534K02446J86396J69569J08485l4180J23955P59305J158050N37400o47122
41016B340770j145390o22604K3438J46623J31150L47564L50595k05250o61001
$$ y = [1700803, 1373370, 1300414, 1512559, 1945263, 2436867, 2612946, 2175629, 1335876, 650134, 425424, 555075, 871536, 1312202, 1753597, 2029187, 2146603, 2220823, 2221276, 2050806, 1777783, 1466907, 922939, 42926, -682023, -571361, 296809, 1066339, 1136368, 716748, 231633, -273198, -863179, -1339788, -1484376, -1342443, -989876, -360304, 409461, 812054, 509225, -186231, -645545, -529579, 113298, 998792, 1589441, 1317326, 224225, -900849, -1387338, -1388575, -1354903, -1206770, -618500, 155694, 452282, 143523, -217164, -223534, -21088, 165308, 334877, 443362, 409182, 533137, 1292442, 2450492, 2987892, 2340770, 1195380, 572776, 596214, 742837, 873987, 1221551, 1572146, 1366896, 705895]
41007G05895k65914N13799N70324j96931p67844n33403k8867Q4075l7274Q5842
40997A29702M05284N03314K35621k07570o02433p08698l02085M20461P62389L05290
40987I41275m47475o46976j44217M68255O78016M53549n412m06339l82877R5839
40977F03638M53757J93964l05651l34084K412K3570k30679k5901O05073O33013
40967A619112k65697r63421o05048K710k41230q82208p01069K63712Q66290P00670
40957b06179M28650L67097Q8456m62844p04976n15841m53337n89208k72368N35860
40947a784690Q54781K28012l95014j15354M97993L90990k89157n33471n5706M72322
40937g29294N59804L73044J19386k79059p91012j088449q86447k08812O32200
$$ y = [705895, 439981, 953780, 1524104, 1327173, 559329, 25926, -2941, 81134, 43860, 129702, 534986, 1038300, 1273921, 1066351, 463918, -244780, -546865, -126404, 635985, 941275, 493800, -153176, -297393, 170862, 848878, 1302427, 1297015, 890676, 507799, 603638, 1057395, 1251359, 945708, 611624, 614036, 637606, 406927, 381026, 986099, 1619112, 1353415, 389994, -215054, -212344, -453574, -1335782, -2036851, -1773139, -906849, -206179, 222471, 589568, 678024, 215180, -489796, -1005637, -1458974, -2048182, -2320550, -1784690, -929909, -701897, -1096911, -1212265, -714272, -323282, -612439, -1145910, -1201616, -729294, -169490, 203554, 322940, 43881, -747131, -1835580, -2722027, -2930839, -2298639]
40928b298639J133629R10593J64232m12205m19542j14336J89911N41230Q57532
40919E52405O88025N737m15121j19926J54264l81649j115975q53450K51656Q56671
40909c77363M90297J56352N93624J110250P36316l31312j095543j008046l29913
40900e5338L12692L49115l11834r61254o87038L98105J085362O15381k89243m64055
40890h107J41304O13832M49875O8179M2853L93683O76080M34344l74169j137016
40880A300858r78716K06971J311034J125725j42400j046933p11390J07402J44634
40871A317185o12551r50503j88066P93839P28480k75630q93521m39112K84646
40862b35233L12602j08840j57810J65572K20923k7102l665L11385L01725p3672
$$ y = [-2298639, -1165010, -254417, -90185, -502390, -921932, -1036268, -846357, -305127, 552405, 1240430, 1246167, 831046, 711120, 865384, 483735, -632240, -1485690, -1234034, -377363, 112934, 269286, 862910, 1973160, 2709476, 2378164, 1282621, 274575, -55338, 257354, 606469, 294635, -666619, -1353657, -955552, 129810, 745191, 455948, -8107, 133197, 747029, 1196904, 1265083, 1307936, 1701619, 2377699, 2812043, 2437874, 1300858, 322142, 529113, 1840147, 2965872, 2823472, 1776539, 1065149, 1172551, 1317185, 704634, -245869, -433935, 359904, 1088384, 812754, -80767, -519879, -235233, 77369, -31471, -189281, -23709, 197214, 170112, 166447, 477832, 779557, 705885]
40852G05885j02795L10572K48472o34347j212980n06851O88750R26351K41811
40843F64868j18646K14375K98264l86464j047986q86554k90528p6604k17485o5666
40833a912426N03427Q68737N54818j35873n14647k88715K08476M95173M68430
40824B47400L37184J73440j40125m88374m85755r9358J10365k22649n96368k97209
40814a461449N07158R58309O98430K25644J6911o8404l11614n99606o66122m95758
40804a196501k21798Q7058L25176L19036J11466J4750J61734K58276M7962j92257
40794b85098K6158O47018R89864N69270k22112n20379o6498M30977K07705n46703
40784A230202r85822p58513l13018n4328J29884L12837K30580p0135k8439M15260
$$ y = [705885, 603090, 913662, 1162134, 527787, -685193, -1192044, -503294, 423057, 664868, 546222, 760597, 1058861, 672397, -375589, -1262143, -1552671, -1629275, -1846760, -1912426, -1408999, -540262, 14556, -121317, -635964, -924679, -716203, -221030, 247400, 584584, 758024, 617899, 129525, -356230, -455588, -345223, -567872, -1164240, -1461449, -954291, 4018, 702448, 928092, 945003, 876599, 564985, -34621, -700743, -1196501, -1418299, -1331241, -1006065, -687029, -575563, -560813, -399079, -140803, -92841, -285098, -258940, 388078, 1377942, 1947212, 1725100, 1204721, 1138223, 1569200, 1776905, 1230202, 244380, -514133, -827151, -881479, -751595, -438758, -208178, -278313, -306752, 108508]
40774A08508L72256n86659j290248m12986J364886K001456Q34486o50356r86970
40765G54373m03021Q8479J18215j43193n80202r21213o50938K16805Q70844P50637
40755A00786K74430M4300L449o5653Q1335N86485R25475O43138J20980j05072
40745B609653k55585p52736j243763j046204k33944N13688Q42845P83415K73871
40736A491240n49360r62277m65613L03340L91292l5743j01533K00289N8830n57473
40726b27008o60394J26094Q74628P68574J97921j27158k72018n90633q33183n24595
40716a267772J50553N16436K93790j32270k28524J53519O37871O44422O7773m32211
40706D03587k18009L57344L80153k56011o87421m16160M5965J77045K06860L76139
$$ y = [108508, 480764, -105895, -1396143, -1809129, -444243, 1557213, 2391699, 1741343, 754373, 351352, 439831, 558046, 414853, -165349, -1086562, -1737500, -1520695, -649851, 100786, 375216, 419516, 422965, 357312, 438647, 1025132, 1950607, 2593745, 2714725, 2609653, 2354068, 1601332, 357569, -688635, -922579, -408891, 433954, 1217369, 1491240, 941880, -20397, -486010, -182670, 208622, 172879, 71346, 271635, 330465, -227008, -887402, -761308, 113320, 881894, 1079815, 952657, 680639, 90006, -743177, -1267772, -1117219, -600783, -306993, -439263, -667787, -514268, 123603, 768025, 835798, 403587, 185578, 542922, 923075, 667064, -20357, -436517, -390552, -213507, -6647, 369492]
40696C69492K81779l20961p68075m00891K82961L12503k56643m63206Q7350P65110
40686a10581R34736O27184J09583m49851p02672k41438O53662R97226K86510p30465
40676A373894r65565l55655K25583K48049Q8221K12854L86934J14651m52797o13968
40666B62201j21077M15450L35185k31873o29149n09522q7718K36612K03429j44873
40656b71335l33448J85370J138723J339900J69860j228200j206110Q9320Q29687
40647G13767P6091r92942r42832k3398N92417N69231L51947L7724n03478p90325
40637i11798k45622N92076N75408k56521n67904K54856J080489O91170m00018
40628H12136p26335j4526M75793j91360j301189j474218m64896O80392J112279
$$ y = [369492, 651271, 330310, -437765, -838656, -555695, -243192, -499835, -963041, -875691, -110581, 824155, 1451339, 1560922, 1111071, 408399, 166961, 820623, 1817849, 2104359, 1373894, 408329, 52674, 278257, 526306, 614527, 827381, 1214315, 1328966, 876169, 262201, 141124, 556574, 891759, 659886, 30737, -478785, -566503, -329891, -126462, -271335, -604783, -419413, 719310, 2059210, 2229070, 1000870, -205240, -115920, 713767, 789858, -203084, -1145916, -1169314, -576897, -7666, 344281, 382005, -121473, -911798, -1157420, -565344, 10064, -246457, -814361, -559505, 520984, 1212154, 812136, 85801, 71275, 547068, 355708, -945481, -2419699, -2884595, -2204203, -1091924]
40619a091924J079602J101132R58338K07132p36157r59972m33252m4325j26241
40610d5667J296O08249P88025p7657j033699q39191J17072M38555j27348m94787
40600f65152j11460L10229J71613r9223m065J23042j82471n91383m37040K79611
40590a206299Q81971Q30223K12116m42151o67495m97308l69283m51507l20735
40581b030468L13689R11014P74900J75836k0258K88082L87045N0596j54412l9721
40571F56303j61079o20155o00170K73905J081756Q91226R5854l42228k78426j57044
40561H39942l8397K01708K25123k22975n37354n6818O68797N25575m03310q89324
40551C12967m45625m500l49654q92756o55002K35872P88086N49692P3613p079
$$ y = [-1091924, -12322, 1088810, 2047148, 2254280, 1518123, 558151, 124899, 80574, -45667, -44371, 563878, 1351903, 1274246, 240547, -598644, -481572, -43017, -170365, -665152, -776612, -466383, -294770, -393993, -398058, -275016, -457487, -1048870, -1485910, -1206299, -324328, 505895, 718011, 275860, -391635, -888943, -1258226, -1709733, -2030468, -1716779, -805765, -30865, 144971, 124713, 412795, 799840, 850436, 696024, 656303, 495224, -124931, -725101, -451196, 630560, 1521786, 1617640, 1275412, 996986, 839942, 801545, 1003253, 1228376, 1005401, 468047, 411229, 1080026, 1605601, 1202291, 312967, -132658, -137158, -486812, -1379568, -2034570, -1798698, -1010612, -460920, -387307, -394386]
40541c94386J50790p8388p63765j072721k34018J261646J916354R20866q11338
40532H95040j699446j257548l06235L11645N59478P51676Q93369P46453K59420
40523A153852k85119m97197k72265J9462m8567k90073p5066O19255R04039K13502
40513A441823p17140q33396k60608Q5477M8164K72993P85611P61295q570n59429
40503A016220k05628L94260L06406k97987n90677l48831O299K34303L92427L89302
40493A296094J01768k31418l13676l10934n08652o54870k92798L69541O18285
40484G3340K78101p8272q1008m1503k04200j68943M24734J077102R47980N7528
40474B284859o55550n71099j46434j42516n05461n37896l8160L51956J29825k67137
$$ y = [-394386, -243596, -321984, -1085749, -2158470, -2392488, -1130842, 785512, 1706378, 895040, -804406, -2061954, -2368189, -2056544, -1497066, -745390, 147979, 894432, 1153852, 868733, 371536, 99271, 118733, 70166, -219907, -294973, 324282, 1228321, 1441823, 724683, -108713, -369321, -283844, -235680, 37313, 822924, 1584219, 1575649, 1016220, 810592, 1204852, 1511258, 1213271, 622594, 273763, 280062, 514365, 906792, 1296094, 1397862, 1166444, 852768, 541834, 33182, -621688, -914486, -544945, 73340, 351441, 273169, 192161, 150658, -53542, -222485, 202249, 1279351, 2227331, 2284859, 1629309, 1058210, 911776, 769260, 263799, -274097, -312257, 39699, 169524, -97613]
40464i7613j08529M89611O82581J23523n24849n10889L6781L91206J78858l02182
40454C58498n50546l41960J63294N42022M12951j53268n87120l99916K16166N66183
40444B26304K49660l69356n51286O46P44114Q00758l7551r19975q51120K2546
40434f85260M95276j18608r75268p81245M22709J265346Q42934k00792p04695
40425d39603n04370l27254n01465n32115m8174N10201N65626L25617M42318R12693
40415D03474R67134J92787p78890j037761m73684K83294P09064P42670N06558
40406A514646J54882p5709r2495j63628m99274p35746l77796L01009M66808n5999
40396D36698m68818j75084L95677N63211L87223L07663K80590l0499m84940n85190
$$ y = [-97613, -206142, 283469, 966050, 1089573, 564724, 53835, 90616, 481822, 660680, 358498, -192048, -534008, -370714, 171308, 584259, 430991, -156129, -556045, -339879, 226304, 475964, 106608, -444678, -444032, 300082, 1100840, 1063289, 143314, -707806, -685260, -189984, -308592, -1283860, -2065105, -1642396, -377050, 465884, 265092, -439603, -943973, -1271227, -1772692, -2304807, -2352981, -1842780, -1277154, -951537, -509219, 403474, 1370608, 1563395, 784505, -253256, -726940, -443646, 265418, 1008088, 1514646, 1669528, 1593819, 1501324, 1337696, 838422, 102676, -275120, 25889, 492697, 436698, -32120, -207204, 188473, 751684, 1138907, 1446570, 1727160, 1696661, 1211721, 626531]
40386F26531k64051L9780N3982p8557j74145j66375L7869L82332M31047j35553
40376G52860q29539p73719R6350Q29188O42807j86629q25786q12586k64249L99057
40366i72246O76867L17293l25633n97062l66726j26192j03721J26155P92684J289168
40356G10587R62071J08877m39902m15259j58794J17118L92839L91445j01446n47780
40346A019756j81346O97145Q89456M8792o82023l16385N35341O43785o2528o30991
40336A961002o05407m05824l09993n6501L74769M59665j9317m72187k99866K55819
40326H82160M87419J45842l66331n19113j37772M30390N12614j99475j046810
40317A88924r66846J07649R66796O48254l02632o92251l27205j570r6289j15985
$$ y = [626531, 362480, 402260, 456242, 377685, 203540, 37165, 75034, 457366, 888413, 752860, -76679, -850398, -754048, 75140, 717947, 531318, -294468, -1107054, -1371303, -972246, -295379, 21914, -303719, -900781, -1267507, -1393699, -1497420, -1371265, -578581, 710587, 1672658, 1781535, 1341633, 926374, 767580, 884698, 1277537, 1668982, 1567536, 1019756, 838410, 1535555, 2425011, 2473803, 1791780, 1475395, 2010736, 2654521, 2591993, 1961002, 1355595, 949771, 639778, 583277, 958046, 1417711, 1398394, 926207, 626341, 882160, 1369579, 1515421, 1149090, 629977, 492205, 922595, 1435209, 1235734, 188924, -777922, -670273, 296523, 944777, 642145, -50106, -377311, -378881, -475170, -591155]
40307e91155L05923P55841O92083J81475l15477m83993k60660K15731N65787M46086
40297A511641L6095j05950J88807M70105L51979j3018l32013n75642p24035n74881
40287B33088j44363J51525P7451m3396R7645K44535L8216l44381n13263n05369
40277g08312n62908n54305k14456K40307L63241K23545K79980N65194O18235K49841
40267E00362k08606m65082n11811k80341L12932Q73535P68810Q9859l05112m0632
40257G33914J77670k79858q63747o45910K14081O82794L73325l7200o658R6409
40247D44820k12310o34039n69453j02408J47945L79j04894O9009J75165k2129
40237h07915j26855K42605O72533M48146l19192p30692l40808K73793M33182K73147
$$ y = [-591155, -285232, 470609, 1162692, 1344167, 1028690, 544697, 284037, 499768, 1065555, 1511641, 1547736, 1441786, 1630593, 2100698, 2452677, 2439659, 2107646, 1532004, 807969, 233088, 88725, 240250, 317701, 274305, 371950, 616485, 654701, 310320, -202943, -708312, -1271220, -1825525, -2039981, -1799674, -1436433, -1212888, -932908, -367714, 250521, 500362, 291756, -173326, -685137, -965478, -652546, 220989, 989799, 1079658, 774546, 733914, 911584, 631726, -232021, -877931, -663850, 18944, 392269, 355069, 348411, 444820, 232510, -401529, -970982, -1073390, -925445, -925066, -1029960, -960951, -785786, -807915, -934770, -692165, -19632, 428514, 109322, -621370, -962178, -688385, -255203, 17944]
40227A7944L31705O46530P74985M78156o4131n57590p44810m62900O1922K24854
40217G06665j92589n31459j14134O21601N87635l91330j258088j112885k04775
40208a889359P02964J248619J375292R69937J52060n08777n98119l91349l58132
40199G03136m42863k87993J01040L89072M15461K48436p0095m38836n69338l43105
40189b95085o2697M8960K57124O93104P34700j65748j268738j198529J01888J113664
40179d1357Q09383k3288j76141J61298j5710o95534q25948m0848P29744O63648
40169E45247J43962l0428J77400K75076J73800K01899L99982M08843K5275n54801
40159A766255r92595r76069l23695O41149J035232L49933o62486p60723R4212
$$ y = [17944, 349649, 996179, 1771164, 2249320, 2185189, 1627599, 882789, 419889, 481811, 706665, 514076, -17383, -131517, 490084, 1077719, 686389, -571699, -1684584, -1889359, -1186395, 62224, 1437516, 2407453, 2559513, 2050736, 1452617, 1061268, 703136, 260273, -27720, 73320, 462392, 877853, 1126289, 1056194, 617358, 48020, -295085, -357782, -308822, -51698, 641406, 1376106, 1210358, -58380, -1256909, -1155021, -41357, 768026, 744738, 568597, 729895, 714185, 18651, -807297, -848145, -118401, 545247, 689209, 658781, 836181, 1111257, 1285057, 1486956, 1886938, 2295781, 2321056, 1766255, 773660, -202409, -526104, 115045, 1150277, 1500210, 837724, 77001, 171213]
40150A71213O46610J78673m69928k68645M33892N73085N4861k54981j4608J63197
40140A213369j32177m28738j87160L55250N51991J55060n23528r50295p28821
40131f75049M4087P00574O52901J46802q6024R5499J42882j32600j95781K19877
40121I13168N31883K43166k01993j44776K31176K90382n43j64700q8440m1102
40111A568221L049K80352N32934J79610p00755j262842r86254k86638J93459L50074
40101a28790L76117K65740j0302j76807L8220M26457N14158J93954j75080l06121
40091A017546l41189n41070p97514o99978j23292M79553N94145L28843K43210
40082A60254N06387O71174M39937J63164K21882L62046J67220j58034j35760P3945
$$ y = [171213, 817823, 996496, 526568, 257923, 691815, 1264900, 1319761, 1064780, 1050172, 1213369, 1081192, 652454, 465294, 820544, 1372535, 1527595, 1004067, 53772, -675049, -630962, 69612, 722513, 869315, 783291, 878790, 1021672, 889072, 693291, 913168, 1445051, 1688217, 1486224, 1341448, 1572624, 1863006, 1862463, 1697763, 1609323, 1568221, 1571270, 1851622, 2384556, 2564166, 1863411, 600569, -385685, -672323, -478864, -128790, 247327, 513067, 502765, 325958, 364178, 790635, 1304793, 1498747, 1323667, 1017546, 676357, 135287, -662227, -1362205, -1485497, -1005944, -411799, -82956, 160254, 666641, 1337815, 1777752, 1940916, 2162798, 2524844, 2692064, 2534030, 2398270, 2472215]
40072B472215j29015p12440r34940m97414j2031n748j51794L6466L37436K58614
40062F61349o9574j11611J70600K78861O73k87828k11684J42562M52334N04856
40052A530538K45830k03645n09574m11889j30784j71866o03012q46220m02706
40043a503328M63880J019886Q73426K63376l28994o09180n73173l97374k30598
40034a022079j9085L56916P21025O48658P5182m62241n30516m05109m56993l11303
40024a405545N29445J404687J011625n33451j383077m26847J028805J119590M6732
40015A391964n64110k90000j72714n33727m01534N03136R69493L03596l70210
40006H35894P0506Q54570O03955l64151n23945M89722J390947J064884j97178
$$ y = [2472215, 2343200, 1630760, 695820, 198406, 186375, 180627, 28833, 65299, 402735, 661349, 591775, 480164, 650764, 929625, 930298, 642470, 430786, 573348, 1025682, 1530538, 1776368, 1572723, 1063149, 651260, 520476, 348610, -254402, -1100622, -1503328, -1039448, -19562, 853864, 1117240, 788246, 179066, -394107, -791481, -1022079, -1041164, -684248, 36777, 685435, 760617, 298376, -232140, -637249, -1094242, -1405545, -876100, 528587, 1540212, 1006761, -376316, -803163, 225642, 1345232, 1391964, 827854, 537854, 365140, -168587, -570121, -66985, 902508, 1206104, 835894, 906400, 1760970, 2364925, 2000774, 1476829, 1966551, 3357498, 4422382, 4225204]
39997D225204j317655j482709o27153M57961O75233j13446p14866j54987R19831
39988A867413J242022P26247J74753k40788q10265j026770j69232R73617P73751
39979C510748o04844j078386K62264J686636J393790p467p94058o23548l40037
39970C405098k22374J19013O39454R30546J051060J248937J213308N69546k42161
39961H712427n23351m05037m70956o75592o07495m73875p56403j122884p80283
39952B896551J76919Q17243P70843N89302O44881O25169K92523j00267l62457
39943F350707o17662q48206q41113o74416o14501n28019j13025L21990J74065
39934B609820l06174j47691Q20762J525671J131206J44120m42220l89012p7960
$$ y = [4225204, 2907549, 1424840, 797687, 1255648, 1930881, 1817435, 1102569, 947582, 1867413, 3109435, 3835682, 4010435, 3769647, 2959382, 1932612, 1763380, 2736997, 3510748, 2905904, 1827518, 2089782, 3776418, 5170208, 5162741, 4368683, 3745135, 3405098, 3182724, 3301737, 3941191, 4871737, 5922797, 7171734, 8385042, 8954588, 8712427, 8189076, 7784039, 7313083, 6637491, 6029996, 5556121, 4799718, 3676834, 2896551, 3073470, 3890713, 4661556, 5250858, 5895739, 6520908, 6813431, 6713164, 6350707, 5733045, 4884839, 4043726, 3369310, 2754809, 2226790, 2113765, 2435755, 2609820, 2303646, 2155955, 2976717, 4502388, 5633594, 5777714, 5335494, 4946482, 4868522]
39925D868522K29946M24897L24097k9387j92178J14246N74863P55131O54170M80805
39915H205112K66592K3567r1485q1716k00941m51877m07427J54818Q49273J216784
39905I482700J231610R94068M57542j47165j91866M89952J103447Q77401J70025
39896A4467714o1329M01600R06551R53367P09449N96523Q90968J611789K330325
39887B2806957K321558J474209P86105J228600K322347K748760K354361K475154
39879C8518051L910167N579438N959148N188668M809266N675500P073581Q026593
39871H4740412Q656450R777609J1629353J3658168J5453076J7265864J9360903
39864A80541835K1292650K2257334K1922269K0409059J7573827J2947817O567487
$$ y = [4868522, 5098468, 5523365, 5847462, 5818075, 5625897, 5740143, 6315006, 7070137, 7724307, 8205112, 8471704, 8495271, 8403786, 8322070, 8121129, 7669252, 7261825, 7416643, 8265916, 9482700, 10714310, 11708378, 12165920, 12018755, 11826889, 12316841, 13420288, 14297689, 14467714, 14406385, 14807985, 15714536, 16667903, 17377352, 17973875, 18864843, 20476632, 22806957, 25128515, 26602724, 27388829, 28617429, 30939776, 33688536, 36042897, 38518051, 42428218, 48007656, 53966804, 59155472, 63964738, 69640238, 76713819, 84740412, 93396862, 103174471, 114803824, 128461992, 143915068, 161180932, 180541835, 201834485, 224091819, 246014088, 266423147, 283996974, 296944791, 303512278]
39857C03512278o70704p744799j4097274j9199963k2201303k2724008k1666003
39850A95208224k0436878j9492945j8253880j6326954j4065177j1917987j0009399
39843H4705004q496483p587484o969998n976990m655899l898543m030269m071113
39835C9018225l140338j916714j710009k482783k902430k277879j370624j097967
39827B2119481j390514j708855j868791j840414j401141o00717p6127k79237p55991
39818A2197694p89738m37869k93777m87925o40713o55002p91453r65982p37816
39809F397419j24236K90618K59410J75276K13615m5679o90431r59301l59232L46895
39799E504354J69769n37201n76361K33627Q15330N28421R17r1360n7269l82401
$$ y = [303512278, 302841574, 295096775, 280999501, 261799538, 239598235, 216874227, 195208224, 174771346, 155278401, 137024521, 120697567, 106632390, 94714403, 84705004, 76208521, 68621037, 61651039, 55674049, 51018150, 47119607, 43089338, 39018225, 35877887, 33961173, 32251164, 29768381, 26865951, 24588072, 23217448, 22119481, 20728967, 19020112, 17151321, 15310907, 13909766, 13309049, 13232922, 12953685, 12197694, 11407956, 10970087, 10676310, 10188385, 9547672, 8892670, 8101217, 7135235, 6397419, 6273183, 6563801, 6823211, 6998487, 7212102, 7166423, 6475992, 5516691, 5157459, 5504354, 5674123, 5136922, 4560561, 4794188, 5609518, 6137939, 6138856, 6047496, 5990227, 5607826]
39789E607826p30948n79351k43148l32619n59471j22473Q09273J065365J80089
39780E094543p98732p32254P4094M44779J123n17673m41126N8576M52877N14639
39770D150846L04300j1543j09797K64371P66567O40858j79904o80990p7866R15759
39760E982601R79578J16099l55182J75505P12488K73301o14050q53679m42282
39751E974379j65962j71183k038J97359k29002j095064j318970n75922P5088k18238
39741B470447q09437o03370L01294Q73774O21588j5782m90655o26078m09879K5200
39731A337102K66285L0302l28766k31948K65321N60462M22350K42316K87418K76558
39721C127400o9671n14974o51751m59947k34911j50761j41612j02826j4538Q8040
$$ y = [5607826, 4876878, 4297527, 4054379, 3721760, 3162289, 3039816, 3849089, 4914454, 5094543, 4295811, 3563557, 3637651, 4082430, 4083553, 3565880, 3124754, 3183330, 3636207, 4150846, 4455146, 4443603, 4333806, 4598177, 5364744, 6005602, 5825698, 5144708, 5066842, 5982601, 6962179, 7078278, 6723096, 6898601, 7611089, 7884390, 7270340, 6416661, 5974379, 5808417, 5637234, 5635196, 5832555, 5603553, 4508489, 3189519, 2613597, 2688685, 2470447, 1661010, 1057640, 1358934, 2232708, 2854296, 2838514, 2347859, 1721781, 1311902, 1337102, 1603387, 1633689, 1304923, 1072975, 1338296, 1898758, 2321108, 2563424, 2850842, 3127400, 3057729, 2542755, 1891004, 1431057, 1196146, 1045385, 903773, 800947, 786409, 874449]
39711H74449J52252J45545J06110J18087K12782L16999K93395N4597k72933l39239
39701A662044N4098N44653N02509j19177o07566m54513r7874k24464o74966p23549
39691a38805k93236q3966l70869m78934J30712Q88791Q56957Q3501m56910k03763
39681f6522L17813L27499j61725m72577k43749J27593J20747j46205j28183K67340
39671e7969M68206Q1038m70200n35208j65232O9275J5332O6782L59853N10357
39661C42234L43123K44770M40229M93815K9772n19083n03952p9182P3962j12115
39651G53573L631O29964J021490M56007p24951j458129j109558J414J028848J295622
39641A897911P39430o6937m25892k09155Q4221N9313q2583k8146K6676k67536
$$ y = [874449, 1026701, 1172246, 1278356, 1396443, 1609225, 1926224, 2219619, 2274216, 2001283, 1662044, 1716142, 2260795, 2763304, 2644127, 2036561, 1582048, 1484174, 1259710, 584744, -138805, -432041, -516007, -886876, -1365810, -1235098, -346307, 510650, 594151, 137241, -66522, 251291, 578790, 417065, -55512, -299261, -171668, -50921, -197126, -325309, -57969, 410237, 491275, 21075, -514133, -679365, -610090, -594758, -527976, -168123, 342234, 685357, 930127, 1370356, 1864171, 1893943, 1374860, 870908, 791726, 865688, 753573, 757204, 1387168, 2408658, 2864665, 2139714, 681585, -427973, -426559, 602289, 1897911, 2637341, 2570404, 2144512, 1935357, 2019578, 2078891, 1996308, 1968162, 1994838, 1727302]
39631A727302o45160m61002K69522P19976L93320j67133k15409J34460K35370
39622A991246m7260k70129k30677j76869j97472n4514K35375K54814j15944l68751
39612A019819q5575M13536N22660J61157k31765l11973j30612L2679p9976m59134
39602H50816p09934m40372J36011L73812J07713j27706k7397j4082l56660m79699
39592f87498J21313Q35878P17019o4951n15679l27551p3383j4923J65542L91650
39582E47417J16171n20717n86154J66407P85298O23992K79835L30263K26707n53855
39572A415364j214164p80080J21303O4984r02142j253817k73838J006947J453789
39563c61654J197480Q65399M87228j29378o75423p32703m40448j99761r2119n0990
$$ y = [1727302, 1082142, 621140, 890662, 1610638, 2003958, 1836825, 1621416, 1755876, 1991246, 1943986, 1673857, 1443180, 1266311, 1068839, 1014325, 1249700, 1504514, 1388570, 1019819, 934244, 1347780, 1870440, 2031597, 1799832, 1487859, 1357247, 1389926, 1309950, 850816, 140882, -299490, -163479, 210333, 318046, 190340, 162943, 148861, -207799, -687498, -566185, 269693, 986712, 921761, 406082, 78531, 5148, -9775, 155767, 547417, 663588, 142871, -443283, -276876, 508422, 1132414, 1412249, 1742512, 1969219, 1415364, 201200, -578880, -457577, -392593, -1294735, -2548552, -2822390, -1815443, -361654, 835826, 1701225, 2188453, 2059075, 1383652, 650949, 210501, 10740, -81379, -132369]
39553a32369j85007m40495l72221J81588N73914J53212o70426q61909j39750P54738
39543a138725J115102R05282L10614n62496j269462j047326J99965J402692J418503
39534A334149L93235m94497m85154R5010N32403N04857O7309n97836j136413j102035
39524h88972m20813M06623Q07476O90560L36649k8673l08384l98992l04623k49847
39514c58996l57562l41210Q8085N70691L58617o15761j375686r69712L15617J212962
39504a472955R30175J5413l70592J84366R81832J156580O43151J9692l25747m71623
39494A290292n20740m04619k38227l55705p21363p71348k18462M17130N45582
39485i77460L52227L19824L16913n6928n00227l21064L48494O13237J87727k44066
$$ y = [-132369, -317376, -757871, -1130092, -948504, -374590, -221378, -891804, -1753713, -1893463, -1138725, -23623, 881659, 1192273, 629777, -639685, -1687011, -1487046, -84354, 1334149, 1727384, 1232887, 747733, 842743, 1375146, 1880003, 1947312, 1349476, 213063, -888972, -1309785, -903162, -95686, 594874, 931523, 902850, 594466, 195474, -109149, -358996, -716558, -1057768, -969683, -398992, -40375, -656136, -2031822, -3001534, -2685917, -1472955, -542780, -527367, -897959, -713593, 268239, 1424819, 2067970, 2087662, 1761915, 1290292, 769552, 364933, 126706, -228999, -950362, -1721710, -1940172, -1523042, -977460, -625233, -305409, 11504, -45424, -545651, -866715, -518221, 95016, 282743, 38677]
39475C8677k44003k01378l49077k25259L20044N54433M9489m32827j33195L97458
39465b25638K35185l01896j92643N17927P73273K26676l07313k32119Q0753J52534
39455G26739O9573M597j36664l14589k90283j42778j70990k09956J42240N55231
39445B33120K33569o34316q23976P5846Q89296O08322j30266k05984K59154L83178
39435H87943L2548k47401k93789k66904J3700O12477P93720m5435j104201j079303
39425f96645q5552O35358P17650Q59104J032863L00859j157248j635010m29012
39416d57633Q03656M36507p19760q72301k0157M56625K65307L58390Q69990P81017
39406A901641j39381p41940l70171J06937j56493o13325l72071L25746O11883
$$ y = [38677, -205326, -406704, -755781, -981040, -660996, -106563, -57074, -489901, -623096, -225638, 9547, -292349, -484992, 32935, 806208, 1032884, 725571, 493452, 574205, 726739, 796312, 800909, 664245, 349656, 59373, -83405, -254395, -464351, -322111, 233120, 466689, -167627, -991603, -915757, -26461, 581861, 451595, 245611, 504765, 887943, 920491, 673090, 379301, 112397, 126097, 738574, 1532294, 1486859, 382658, -696645, -782197, -146839, 570811, 1429915, 2462778, 2763637, 1606389, -28621, -457633, 346023, 782530, 62770, -809531, -829688, -373063, -107756, 250634, 1120624, 1901641, 1762260, 1020320, 650149, 757086, 600593, -12732, -384803, -59057, 552826]
39397E52826L03678j68308o22931j060163j109073m03395O40369J121779P12131
39388c3087n9156n03105m06089q7064n5218m04812m76640L76882J549636J512949
39378A414296j27841j738699j601477o0838J192028J354558R21808L59567l02825
39369A410577p36473m87588N9434P4551k94803j09970O17813P17217k26343j045070
39359b0655o96729L27031R82705J045753P82680K31523l82795m01485K44105N58667
39349B670800j18431j024367j155387p18210m17006j29281N10117R25590L93290
39340I37115m57729l79837M98680Q23943J05116o96824p77356m42822k25869j38673
39330g54256q1390o5867J39793O81648Q95129P973j310884j382689R8078J364128
$$ y = [552826, 856504, 688196, 65265, -994898, -2103971, -2507366, -1866997, -745218, -33087, -92243, -595348, -1001437, -1088501, -1143719, -1548531, -2025171, -1648289, -98653, 1414296, 1286455, -452244, -2053721, -2114559, -922531, 432027, 1353835, 1713402, 1410577, 674104, 186516, 245950, 320501, 25698, -84272, 533541, 1250758, 1024415, -20655, -717384, -390353, 592352, 1638105, 2420785, 2652308, 2269513, 1868028, 2112133, 2670800, 2552369, 1528002, 372615, -345595, -762601, -891882, -381765, 543825, 937115, 479386, 99549, 598229, 1422172, 1527288, 830464, 53108, -389714, -615583, -754256, -835646, -901513, -761720, -80072, 815057, 823030, -487854, -1870543, -1772465, -408337]
39320d08337R23702m91980j175650p21399m2937K45579L55591M66781L29324j45699
39310f65025n28521l69384J93272N25175K33778k53741j25555O52650J062296
39301G24945L86638o31268p65776q0900L04299L5877j27996J21303Q0678n24413
39291d76613p99764j09609P82890Q29319J44158m42634n71494l59344R2380M77657
39281d33054K64412l89812m46069N01661J319778R02997j14252l68984J34998
39272A371675K74578k27298n00517j54701J02686k73784q23689q50572l02537
39263a384159L76155P14238M38731k31804n35646J0014P97690P81963j03732q61624
39253A826p58937o0242O08431R36296Q33802K80767n04019j137345j407451j249363
$$ y = [-408337, 515365, 23385, -1152265, -1873664, -1916601, -1671022, -1315431, -848650, -519326, -665025, -1193546, -1562930, -1369658, -844483, -610705, -864446, -990001, -337351, 724945, 1111583, 480315, -285461, -366361, -62062, -26185, -154181, -32878, 47800, -476613, -1276377, -1385986, -603096, 226223, 370381, -72253, -643747, -1003091, -910711, -433054, -168642, -558454, -1004523, -502862, 816916, 1719913, 1605661, 1236677, 1371675, 1646253, 1418955, 918438, 763737, 866423, 592639, -231050, -1081622, -1384159, -1008004, -293766, 144965, -86839, -622485, -612471, 185219, 967182, 863450, 1826, -757111, -817353, -208922, 727374, 1561176, 1841943, 1337924, 200579, -1206872, -2456235]
39243b456235n55803N23432J292912J127932K93281l97881o02863n59867l93403
39234a728495j4911M06164N77486N95099O58245M80938k14768q33879n15843M67790
39224a22174R57865N83586J19592M2311j06618n77706p69089k81117L29822M51401
39214F27873K58639R4299j90883o54148p71317k45928L08049K02175l12009n20401
39204a203651k82838L3384K46217L87826L93208K78771K82668M02188K45361k17096
39194E66038l20507K88348Q64375N08278n13856j134874q66322j24067N36294
39185a96293Q00416M58438l58679r28911o27787J76253N30877J62974k64690j65117
39175d12519K69099M65545J47271m70218q59604n90224J78360P31747N93944Q0004
$$ y = [-2456235, -3012038, -2488606, -1195694, -67762, 225519, -172362, -775225, -1335092, -1728495, -1743406, -1337242, -759756, -164657, 493588, 974526, 759758, -74121, -589964, -122174, 835691, 1419277, 1538869, 1581180, 1474562, 896856, 127767, -153350, 176472, 627873, 886512, 980811, 789928, 135780, -635537, -881465, -573416, -371241, -683250, -1203651, -1486489, -1453105, -1206888, -819062, -425854, -147083, 135585, 537773, 783134, 566038, 245531, 533879, 1398254, 1906532, 1392676, 257802, -608520, -732587, -196293, 604123, 1062561, 703882, -225029, -852816, -676563, -145686, 17288, -247402, -412519, -143420, 322125, 469396, -822, -860426, -1450650, -1272290, -540543, 53401, 133405]
39165A33405k20911j82939K5911M37722J006336J163485M13455p54635j290785
39156G31044r10041k99905J8160K71983O90445R05266N34240j12005l76728j00812
39146A351647K15429L1926n94759r76553m68625O96490J446113J028256o5253
39137B664671p37644o37534l05402j21520J12407M28561L54068k62118p40960
39128G54529m78344J02317J59551k98079m79854p3242K99907P7649m01878m47118
39118g84562k56L99918M41622L30507K82932K01691r620j96581k35461k58257
39108A71933l57671l50898j05641J83739L44631N14786P05245N02315k01210n98578
39098H08651L5246R93413Q67387l69817j216960q63212k62447l48621m65747K96179
$$ y = [133405, -87506, -270445, -244534, 193188, 1199524, 2363009, 2776464, 2021829, 731044, -178997, -478902, -460742, -188759, 501686, 1406952, 1941192, 1829187, 1452459, 1351647, 1567076, 1599002, 1004243, 27690, -440935, 255555, 1701668, 2729924, 2664671, 1927027, 1289493, 984091, 862571, 974978, 1403539, 1757607, 1495489, 754529, 276185, 378502, 538053, 239974, -239880, -313122, -13215, 64434, -337444, -784562, -784818, -384900, 56722, 387229, 670161, 871852, 862232, 665651, 430190, 171933, -185738, -536636, -642277, -458538, -113907, 400879, 1106124, 1608439, 1407229, 808651, 843897, 1837310, 2704697, 2334880, 1117920, 254708, -7739, -356360, -822107, -525928]
39088e25928J201339Q10147o43089j366693n45384N98926O56698j44832n84671
39079e43487j99782L15004J93251m46672p97554l61233L88656N61310O3789k30271
39069a056989K00622O50564K55920n70129o79589P4470O47596M01522n5086O8522
39059f2577N92294P40188K21100m76407o84385k50751K96141L28156p7847k47009
39049C78903l758n3218p41059j125368k34566J235536J663917P32840l14686o09454
39039I29087n53860o09353m97025n7376K29141J26903Q0823K74934K18271k31959
39029i0414m32824j00729J25317j07070j64416K95702M53817k68532r44514m81636
39019a715299N87196R55431N62749L89044O39586N49783j18380o72018o60314
$$ y = [-525928, 675411, 1485558, 842469, -524224, -1069608, -470682, 186016, 41184, -543487, -743269, -428265, -235014, -681686, -1479240, -1840473, -1451817, -890507, -826718, -1056989, -856367, -205803, 50117, -520012, -1199601, -1125131, -477535, -76013, -131099, -62577, 529717, 1269905, 1491005, 1014598, 330213, 79462, 375603, 703759, 625912, 378903, 375145, 321927, -419132, -1544500, -1779066, -543530, 1120387, 1853227, 1538541, 929087, 375227, -234126, -731151, -788527, -559386, -432483, -351660, -76726, 141545, -90414, -523238, -623967, -498650, -605720, -770136, -474434, -20617, -289149, -1233663, -1715299, -1128103, -172672, 390077, 779121, 1418707, 1968490, 1850110, 1178092, 517778]
39010E17778l90223j61303R3575K93449J53733k33443m28991k85074J1295L79420
39000d9784P15986O10427o1911n75689k46369M31260M98249M8015j01229N8191
38990A327146j31260m70702p9606Q02001Q26694k40226r33895l92608L03531J6424
38980A027499o60530o58010k37167j97864k83730J66760P23404N00920k25501
38971A55781m66689j86538j22552k71164k3263L91539J52284m76303l17956O55985
38961e08876J052644K92613m50998k38905K05857p99l48592q5381K41874j79721
38951b0284p60899m43441L37366L03003m15676m53578L88926P41842J8877n79324
38941h83188j49288M27419J63910k34573L23414J217297R87335k19338p81271
$$ y = [517778, 127555, -33748, 59827, 353276, 507009, 273566, -155425, -440499, -429204, -49784, 666202, 1276629, 1214718, 639029, 392660, 823920, 1322169, 1370184, 1268955, 1327146, 1195886, 725184, 645578, 1447579, 2274273, 2034047, 1100152, 707544, 1011075, 1027499, 366969, -291041, -528208, -726072, -1009802, -843042, -119638, 381282, 155781, -310908, -497446, -619998, -891162, -914425, -522886, -370602, -846905, -1164861, -508876, 543768, 836381, 385383, 146478, 352335, 351536, 2944, -82437, 159437, -20284, -781183, -1224624, -887258, -584255, -999931, -1453509, -1064583, -322741, -303864, -883188, -1032476, -605057, -441147, -675720, -352306, 864991, 1852326, 1632988, 851717]
38932H51717j05190O09419L98684j16415k9271L89507L95688R3160P9153K69396
38922B835848L6063o71790j175902j060001o58418m15519k67630Q0398N65960
38913g30991P57126L91304k43560n71465l73369k4620M4579n4979O9485L62079
38903c74411L40099q9485l63857n3860N30663Q21157O64837K04817m52481j007026
38893B20453q51837J68657J140582R18065m36133j605422j475694k20162J075899
38884a065592J464312P96419k54911p57295l88897K50989M22725J57483K1055
38875F46288J89659L16002K13525N5827j07352l99392o23185m03485L5076o227
38865h3264n01090m48688O14887J605948J244986p6868p97457l68890J27931k65923
$$ y = [851717, 746527, 1355946, 1754630, 1638215, 1608944, 1998451, 2394139, 2487299, 2566452, 2835848, 2871911, 2200121, 1024219, -35782, -694200, -1109719, -1377349, -1296951, -730991, 26135, 417439, 173879, -397586, -770955, -795575, -750996, -805975, -736490, -374411, -34312, -123797, -487654, -541514, -10851, 810306, 1475143, 1679960, 1227479, 220453, -631384, -462727, 677855, 1595920, 1159787, -445635, -1921329, -2141491, -1065592, 398720, 1195139, 940228, 182933, -205964, 45025, 467750, 625233, 646288, 835947, 1151949, 1365474, 1421301, 1313949, 914557, 291372, -112113, -77037, -83264, -584354, -1033042, -418155, 1187793, 2432779, 2355911, 1558454, 1189564, 1317495, 1051572]
38855A051572j014244j020917k42970L95403L77479J05538M6308N4743j81527
38846d28615n00991m85285j01901K47361K56632K104k77235m17457l33587l4560
38836b073534L05168M77115M69096L83959J77221k20312n24259k75115M30733
38827h49928Q10128L36053m88025p11799j28278N48528O47757K61968r9756k31718
38817I4930l24848m59141l50355J80496O72051M26920m21885p98229q7926Q56355
38807b11632Q65076J86026j3056L36673J17668q20586j043490J30111J182317
38798G29107N85709p69698r52905O7826O81859L39712N9734L10226L02613k73621
38788A080562n34822j6312M48516J40689m84606p94171q82051q52801l51708M89519
$$ y = [1051572, 37328, -983589, -1226559, -831156, -453677, -348139, -301831, -247088, -428615, -929606, -1414891, -1516792, -1269431, -1012799, -1010695, -1287930, -1705387, -2038974, -2073534, -1768366, -1291251, -822155, -438196, -260975, -481287, -1005546, -1280661, -849928, -39800, 296253, -191772, -903571, -1031849, -483321, 164436, 426404, 326648, 94930, -229918, -689059, -1039414, -858918, -186867, 240053, -181832, -980061, -1067987, -211632, 653444, 839470, 826414, 1163087, 1280755, 460169, -583321, -453210, 729107, 1314816, 545118, -407787, -339961, 341898, 681610, 741344, 1051570, 1354183, 1080562, 545740, 529428, 977944, 1118633, 634027, -160144, -1042195, -1894996, -2246704, -1757185]
38778a757185P42492Q1293n33471l22748J91133L06057K79586M44389L02928m11639
38768f77165q12465k17244N12353L08313k97390j65140M14459L15450l20966l14378
38758a254173M62778R03516N57605J38492M0049j67182n48547n11235M808L08058
38748f5831K02362K25911M16779J57767m52695m88480J03341J66931o36680r61597
38738a332192Q5481J274225R84493l88322j128879o43936J16779L04722L4695
38729f92934k52025l13184n0636L49670L80731p4289l22038J63202P50296N07654
38719D46447k83764n05384L7458L29673k19239q69148o92686J60571Q70321J051192
38709C25441Q81899M97974j23056p45442q65681l11715M01995N83618J96949p9458
$$ y = [-1757185, -1014693, -933400, -1466871, -1789619, -1598486, -1292429, -1012843, -568454, -265526, -677165, -1489630, -1706874, -1194521, -886208, -1183598, -1348738, -934279, -618829, -939795, -1254173, -791395, 112121, 669726, 808218, 848267, 681085, 132538, -378697, -373889, -65831, 136531, 362442, 779221, 936988, 484293, -4187, 99154, 266085, -370595, -1332192, -1246711, 27514, 1012007, 623685, -505194, -1149130, -1032351, -727629, -692934, -944959, -1258143, -1308779, -959109, -578378, -652667, -974705, -811503, -61207, 446447, 162683, -342701, -305243, 24430, -194809, -1063957, -1756643, -1596072, -725751, 325441, 1207340, 1705314, 1582258, 836816, -28865, -340580, 61415, 645033, 841982, 762524]
38699G62524K27896O75088M93709k46590o56459l12987J24285m4413m94189m65093
38689F3771L623K01172n7950j67266K37949O71259N23025p5896m74429l17031
38679F08227J54338M62320L45696n8045l39715j91442K68047N97759M94999Q5500
38669B427684k56012l10704k35460l87009q55676j194363q40171R4140P51967
38660h05604N35340q4308j87171L27484O72962M03369L8062J25603K95063j00382
38650A220418p57894p29571L8143M25338j76771p73407j93535J012315J273503
38641A338539L66796k81846J18764N59415N0257p07524o23612j38577l37458q49998
38631e05244l96940Q34244J211247K22854p44589o63623k17131j84070j04789
$$ y = [762524, 990420, 1665508, 2159217, 1912627, 1256168, 943181, 1067466, 1023053, 528864, 63771, 67394, 268566, 210616, 43350, 281299, 952558, 1475583, 1399687, 925258, 608227, 762565, 1224885, 1570581, 1512536, 1172821, 981379, 1249426, 1847185, 2342184, 2427684, 2171672, 1860968, 1625508, 1238499, 382823, -811540, -1651711, -1557571, -805604, -270264, -354572, -541743, -214259, 458703, 862072, 900134, 1025737, 1320800, 1220418, 462524, -267047, -228904, 196434, 19663, -753744, -947279, 65036, 1338539, 1705335, 1423489, 1542253, 2101668, 2151925, 1444401, 820789, 682212, 344754, -505244, -902184, -67940, 1143307, 1366161, 621572, -42051, -259182, -443252, -548041]
38622e48041M29889O40395j8473n57354n29Q34828O47557j77604l84491o4603
38612H01574k14183o27160k56493N65939M00743o97947r83276J23581J026516
38603A39294N83462j88406j10942K14905j58621o53930l31240K49811M2922n00438
38593g13183k45454M62083L36579m50475l66947Q71725J640766Q60579m78791
38584A916882r87612p23919m72216l17444j7533P2470l60107o12463J28066J236114
38574a37762J284619J81866o14450k89549J78964k66638r87609o88735M19372
38565i19922Q43051Q4016o27181k56397N03337M02069m49667q42508k90393M26958
38555a126637N45934K54118R2298J19019P9762m0581n5320P0297K11399K80357
$$ y = [-548041, -118152, 522243, 503770, -53584, -54113, 780715, 1428272, 1250668, 866177, 801574, 587391, -39769, -296262, 269677, 670420, -27527, -1010803, -887222, 139294, 722756, 534350, 423408, 638313, 479692, -174238, -505478, -255667, -212745, -713183, -958637, -496554, -159975, -610450, -977397, -105672, 1535094, 2395673, 1916882, 929270, 205351, -266865, -584309, -601842, -529372, -889479, -1501942, -1373876, -137762, 1146857, 1328723, 714273, 424724, 603688, 337050, -650559, -1339294, -919922, -76871, 7145, -620036, -876433, -373096, 28973, -420694, -1263202, -1553595, -1126637, -580703, -326585, -234287, -115268, -35506, -76087, -131407, -61110, 150289, 430646]
38545D30646K40681Q5737n4230K5848K80948L31016j08056p92329j098687o33324
38535a291750L00568Q78666N76660j51774l56566R5668K31356n41964j266071
38526a525207o68097P95279J353430M29745n72159m38859J59896J8981n94241
38517a041232n11116L31575P75135K35704n17001n84245q2761K74291J54972j86407
38507a151085l40575j13486L65190P73293Q94222P38621L51043k39727p55342
38498E22154p50852k50597J03286q5181l84165k85518m6961j20482j98054K75844
38488a220526R16153P70540j19689n85303k4423O98820N13750m27426j116643
38479e94747r57218j56968P37018J223276J067853N45423K28632K58009J25889
$$ y = [430646, 671327, 757064, 702834, 728682, 1009630, 1340646, 1232590, 440261, -658426, -1291750, -991182, -112516, 464144, 312370, -44196, 51472, 282828, -259136, -1525207, -2193304, -1398025, -44595, 385150, -187009, -625868, -465972, -446991, -1041232, -1552348, -1220773, -445638, -209934, -726935, -1311180, -1393941, -1119650, -964678, -1151085, -1491660, -1605146, -1239956, -466663, 427559, 1166180, 1517223, 1277496, 522154, -228698, -479295, -376009, -461190, -845355, -1130873, -1177834, -1298316, -1496370, -1220526, -304373, 466167, 346478, -238825, -263248, 435572, 949322, 521896, -594747, -1551965, -1708933, -971915, 251361, 1319214, 1864637, 2093269, 2351278, 2477167]
38470B477167n26727j257891j359922p67646k1538M55833O15611M77175N7852
38461A49914l85401m73342k07006n8192l58924p77844o54483J58209J007583J130164
38451d69322N00083k05838m12734j37717L04389O78876P66129L51655l90506q40900
38441A44115o32670j11234K64745N82556J012437J105068L43959p89052j157911
38432G62013m31803N31154Q46221M63015k13369q20582r81594m66344L23224O29489
38422F41424K99353j15875l00264m69541o22181m02528L6013L983n09226o19872
38412b058714n1945K62918j99443n18132P1249O53156Q4041r12672p50297M37464
38402b982375R77860K94269l79477j36728L78177M04464K91488N36031P56215
$$ y = [2477167, 1950440, 692549, -667373, -1435019, -1456557, -1000724, -385113, 92062, 149914, -235487, -708829, -915835, -974027, -1332951, -2110795, -2765278, -2607069, -1599486, -469322, 30761, -175077, -587811, -725528, -421139, 257737, 1023866, 1375521, 985015, 144115, -488555, -599789, -335044, 247512, 1259949, 2365017, 2708976, 1919924, 762013, 330210, 861364, 1707585, 2170600, 1957231, 1136649, 155055, -311289, 11935, 641424, 940777, 824902, 524638, 55097, -567084, -969612, -933599, -929616, -1438842, -2058714, -2110659, -1847741, -2047184, -2565316, -2494067, -1840911, -1756870, -2669542, -3419839, -2982375, -2004515, -1710246, -2089723, -2226451, -1848274, -1443810, -1152322, -616291, 139924]
38393A39924M96551J63776K84645N21502K70071l00297n92859n36722m63396m05136
38383d21941k22208j08667k74026l88963m0980M83820N83376L18759K47636L83394
38373E60200J65349m59893p84377m49535m4166j48635m32064k82170J71122L46319
38363a357850J89259J27803K33088J98750J09537L90069Q46132O49014l23995
38354A061807r86407n36297K85035L12773k51649k95179L02365N36256O6956k24335
38344B71325J48984M00076r8046o35754l79525J52455k7901o68133o97752q874
38334a543145M40748K29804P271K61308N58593L51740j96103n45030m33488J7285
38324h51017M60492N24740K28060R0546M01300O21499J31320o98693r69900n82864
$$ y = [139924, 636475, 800251, 1084896, 1606398, 1876469, 1576172, 983313, 446591, -16805, -421941, -644149, -752816, -1026842, -1415805, -1456785, -972965, -389589, -70830, 176806, 560200, 725549, 265656, -518721, -968256, -1012422, -1161057, -1593121, -1875291, -1704169, -1357850, -1168591, -1040788, -807700, -608950, -499413, -109344, 736788, 1385802, 1061807, 75400, -460897, -175862, 136911, -114738, -409917, -107552, 428704, 495660, 271325, 420309, 820385, 722339, 86585, -292940, -140485, -168386, -836519, -1534271, -1543145, -1102397, -872593, -865322, -604014, -45421, 306319, 110216, -434814, -868302, -851017, -390525, 134215, 362275, 452821, 854121, 1475620, 1606940, 908247, -61653, -644517]
38314f44517k07421q5019J03043K32054k06622q90700p54866L27605J130504Q52914
38304a43025J78669n0501o8528k94971l22075J75852M58398j64899r51198p19651
38294a901929K72935P37788L34823l7539J48509L90848K75016J66015M05043O31341
38284A422850L65102k46045o47313n64382k48878j64032m42013o17455j68185
38275a310351N81572O46800j85863p94374k56799O92275P08035j21564m73885
38266e14154J18346O50709L33615k68826k95236J29032L25958J65015M5837J16003
38256H06299J00468j77784m94717m85561q4091L22551K68679j73491l73316L2753
38246b58210N70202N51127P311m67281n68851m35134j54161K49721M68281K01656
$$ y = [-644517, -851938, -936957, -833914, -601860, -808482, -1699182, -2454048, -2126443, -995939, -143025, 35644, -14857, -83385, -378356, -700431, -524579, -66181, -231080, -1182278, -1901929, -1628994, -891206, -556383, -593922, -445413, -54565, 220451, 386466, 791509, 1422850, 1787952, 1541907, 894594, 330212, 81334, -82698, -524711, -1142166, -1310351, -728779, -81979, -267842, -1062216, -1319015, -626740, 81295, -40269, -514154, -395808, 254901, 588516, 319690, 24454, 153486, 479444, 644459, 690296, 806299, 906767, 728983, 234266, -251295, -335386, -12835, 255844, 82353, -290963, -258210, 311992, 863119, 870430, 403149, -165702, -600836, -754997, -505276, -36995, 164661]
38236A64661k59478l64332j45434r0881k59568k45971l391N9729j34657j89858
38226a469180K5006J85775J49349R8893K3857k14438l16451J05659O15598L84285
38216d11647l82333n70216N2783L98221j23177n70014k56J024260J353848Q40979
38206A612448J40344l72631o38977n00123n5080J20722j84941l75310q6665R6878
38196b43335k63379n18159n4077M79200K34434k82929o9119N65470N16105j73335
38186A90876m40541j02093l4827m08777l13053N37912J162121Q61373J62588l07515
38176A308064o87636j016229o82574M31231J247929Q82452j7851k73269Q1550
38167A273667O5642n84057j030593o06505L12318Q63506O51305o820n11089n42943
$$ y = [164661, -94817, -459149, -604583, -695464, -955032, -1201003, -1204394, -1144665, -1279322, -1469180, -1444174, -1258399, -1109050, -1010157, -986300, -1200738, -1517189, -1411530, -795932, -411647, -793980, -1364196, -1311413, -913192, -1036369, -1606383, -1606639, -582379, 771469, 1612448, 1752792, 1380161, 741184, 241061, 185981, 306703, 121762, -253548, -340213, -243335, -506714, -1024873, -1078950, -599750, -365316, -648245, -717364, -151894, 364211, 190876, -249665, -351758, -386585, -795362, -1108415, -570503, 591618, 1452991, 1615579, 1308064, 620428, -395801, -1078375, -647144, 600785, 1483237, 1465386, 1192117, 1273667, 1339309, 755252, -275341, -881846, -569528, 293978, 945283, 938463, 427374, -115569]
38157a15569k77464m7834R5822K75947L70204J44175k22508k86121r0873j49188
38147c03409m82023l85055M42535J191005R62086K3693o12543n42946k35058j39649
38137h1364k14742l07180m17548m85847l52567m4688K33006M52766P64977J046997
38127E93810Q19837j16086j170757j432674o69521L87988Q82284P31654M47208
38118D73743K47120j21356o14395o16208J11734P48661M08968m93763p32837l1785
38108f20118N73253K89364l92981n89381k14593K01115L18950J28251k58096n09350
38098a073586k30961L73269M93597j49413o81482k10798Q39266J261582O75301
38089A296775j29326l75553j66628q2531l84863p73289p32178j26083M96979M61642
$$ y = [-115569, -393033, -440867, -345045, -69098, 301106, 445281, 222773, -63348, -154221, -303409, -785432, -1170487, -727952, 463053, 1425139, 1448832, 836289, 293343, 58285, -81364, -296106, -603286, -1020834, -1506681, -1859248, -1903936, -1670930, -1218164, -453187, 593810, 1413647, 1297561, 126804, -1305870, -1975391, -1587403, -705119, 26535, 473743, 720863, 599507, -14888, -631096, -519362, 229299, 638267, 144504, -588333, -620118, -46865, 242499, -150482, -739863, -954456, -753341, -434391, -306140, -564236, -1073586, -1304547, -931278, -437681, -587094, -1268576, -1479374, -640108, 621474, 1296775, 1167449, 791896, 625268, 542737, 157874, -615415, -1347593, -1473676, -976697, -515055]
38079e15055q9463k92227J68968N40535K22508j95248J03436P53843P84894K32305
38069A714496K7122L77046M40721k09898q86381r10104n18074j98417N5761L09515
38059B01787K47700j93762l52800K97476J204183J329378M78794n25510q73285
38050A813961n11123M5322K52164q0626o78362j072043j056056p59119l14866
38041b360748J86236M32617J31782l45992k13914N35560Q91189K90142l93170
38032h46298r6586P93379J057879N18235J38595L58723N37067K61726M5040K16442
38022B984202J69171n35522j152328p92122Q3154K59637l93735p53051j50074
38013b80668P05118Q20447J90956m66124p00634n64947k22699J82374M35443M13244
$$ y = [-515055, -604518, -896745, -727777, -187242, 35266, -159982, -56546, 697297, 1482191, 1714496, 1741618, 2118664, 2559385, 2349487, 1463106, 553002, 34928, -163489, -107728, 201787, 449487, 255725, -97075, 200401, 1404584, 2733962, 3212756, 2687246, 1813961, 1302838, 1348160, 1600324, 1519698, 841336, -230707, -1286763, -2045882, -2360748, -2174512, -1741895, -1610113, -1956105, -2170019, -1634459, -743270, -453128, -846298, -942884, -149505, 908374, 1426609, 1565204, 1923927, 2460994, 2722720, 2767760, 2984202, 3153373, 2617851, 1465523, 673401, 756555, 1016192, 622457, -130594, -280668, 424450, 1244897, 1435853, 969729, 269095, -295852, -518551, -336177, 99266, 512510]
38003E12510K51310J07535p2329l00180k91981J43248O08866M80968k24721p71857
37993D43369o08958r481L62556K41167j02674k98883k02042J23999N11888P56668
37983A217609O95674K98898k71311o76906o16646j79262J26287o4299m53004m44158
37973c67118R893L44137K33930L6970J51790L80111K98862o8227l61577m14519
37963B44252k76831L7325L97305M10929o6792n15796m10408n6497o5008k03929
37953e05450K72202J145142J217788J45346q27292o55235k6612j16545o33284
37944A6060m28970M04356N73158k61402q42685k75902O46708P96553L43125J25324
37934A096325J85260j1773l92196l96065n9336L0305j97620k00674J37262K41744
$$ y = [512510, 763820, 871355, 799026, 498846, 206865, 350113, 958979, 1439947, 1215226, 443369, -165589, -175070, 187486, 428653, 325979, 27096, -174946, -50947, 460941, 1217609, 1913283, 2212181, 1940870, 1263964, 647318, 468056, 594343, 530044, 77040, -367118, -357225, -13088, 220842, 257812, 409602, 789713, 1088575, 1020348, 658771, 244252, -32579, 4746, 402051, 812980, 746188, 230392, -180016, -236513, -301521, -505450, -233248, 911894, 2129682, 2275028, 1447736, 792501, 765889, 649344, 16060, -412910, -8554, 564604, 303202, -539483, -815385, -168677, 627876, 971001, 1096325, 1281585, 1269812, 877616, 481551, 422215, 452520, 254900, 54226, 191488, 433232]
37924D33232j76416o34580o31825k58813J75762N19352N60259Q3921n79566o95862
37914a204536j21035M62898N84197N26065M99533J64664m46036m58205N08359
37905E15904J323688P60571o52725j373400j016035n08715l41675o9277M11322
37896i50342M87322N4764j22200K68960N05870Q8526m19127l87547o4729Q3206
37886d55297J52231L13965L24464J14760J02165L28601J32306o50895j056353
37877f94053l99560N20951N92410J8415k50030m4027J56192K75034M09553J23733
37867G08618p61566j209206k40936J215086J347957J58420n80402j35204K32452
37858G35219l91451j020478m95564O15314J004303N59001J61275J69315J54596
$$ y = [433232, 256816, -377764, -1009589, -1268402, -1092640, -573288, -13029, 70892, -508674, -1204536, -1325571, -862673, -278476, 247589, 747122, 911786, 465750, 7545, 515904, 1839592, 2600163, 1947438, 574038, -441997, -950712, -1292387, -1361664, -950342, -463020, -408256, -530456, -261496, 244374, 332900, -86227, -473774, -538503, -455297, -303066, 10899, 335363, 450123, 552288, 880889, 1013195, 362300, -694053, -1093613, -572662, 19748, 38163, -211867, -255894, -99702, 175332, 584885, 708618, -52948, -1262154, -1503090, -288004, 1059953, 1218373, 637971, 502767, 735219, 343768, -676710, -1172274, -556960, 447343, 1006344, 1167619, 1336934, 1491530]
37849A491530j72523o11983q87341q57987n02230m4037J77894J93095L38803N58510
37839c16269L76482j81553l88708N5659M71148L18841J02554M12537P67710L52975
37829A971376n64597r78617o72606l99126n26574m62594K60266J038752Q86326
37820E52606k02807j071181p03253N18517J199000O40484k81374l74367J71476
37811D49101J76010o07307j059851m56917M16376N27927R7814J3365L76289N35255
37801D68062K26001j21301p3738L56985Q01904P20558j60242j258534j476137
37792e16442n44258N01565O42114O2107m78891p20168o69269q1908R19815J374384
37782D89049O51835m23830o42086r5421K59799K05722K08623K13042j45190m25519
$$ y = [1491530, 1319007, 707024, -180317, -1038304, -1540534, -1584571, -1406677, -1213582, -874779, -316269, 60213, -121340, -510048, -454389, 16759, 335600, 438154, 850691, 1618401, 1971376, 1406779, 428162, -244444, -643570, -1170144, -1632738, -1372472, -333720, 552606, 349799, -721382, -1424635, -906118, 292882, 933366, 651992, 277625, 449101, 625111, 17804, -1042047, -1498964, -1082588, -554661, -456847, -443482, -67193, 468062, 694063, 572762, 499024, 856009, 1657913, 2378471, 2218229, 959695, -516442, -1060700, -559135, 82979, 145086, -333805, -1053973, -1723242, -1805150, -885335, 489049, 1140884, 717054, 74968, -20453, 239346, 445068, 653691, 866733, 721543, 296024]
37772B96024O6318P76353M86313n84743q62923J31955R80143N12492o23843j174393
37762C696q41955l6247P99824J036079J91529r70935r12794M29468J192421K82640
37752A173726q67264n04696P27520R16642j36413q62726m66770K12707L73911
37743E66637K48030J82093J3748k64451k54184O0300J53358q0326n1067M55099
37733A029237P33213J96540o84720j030004o50327J2197O25514J066363J054288
37724B352301L37058p39319j336409r91530j36957M12954L46001M4385k9934J26180
37714C84730K48837K81408L23111K17334l23971j058854j172399k75868Q71327
37705e04345J121848L07455n96022o68868j3493N85490O33098L11901M1139p2320
$$ y = [296024, 362342, 1138695, 1625008, 1040265, 177342, 309297, 1289440, 1801932, 1178089, 3696, -838259, -874506, -74682, 961397, 1152926, 181991, -730803, -301335, 891086, 1173726, 306462, -198234, 529286, 1445928, 1309515, 446789, -19981, 192726, 566637, 814667, 996760, 1010508, 746057, 491873, 552173, 705531, 625205, 574138, 1029237, 1762450, 1958990, 1274270, 244266, -406061, -393864, 231650, 1298013, 2352301, 2689359, 1950040, 613631, -377899, -514856, -101902, 244099, 288484, 258550, 384730, 633567, 914975, 1238086, 1455420, 1131449, 72595, -1099804, -1375672, -504345, 617503, 924958, 328936, -339932, -353425, 232065, 865163, 1177064, 1218203, 1145883]
37695A145883k24901m71924n47502k70577O9366M1189k85202l88521j7751N07262
37685d42678P99011P99609N23727j25182r46447j246942n66726N43738R46803
37676B84913J87988r39943j229001l54664P55599R21634O5147o72047l46792N68843
37666g58323Q47750J52435o46012p47935k74448K91942P44705R39168O63574J19124
37656A331980j08615O7706N9578l14489l98131R2527L31517l03365r85109n74971
37646h01372N93329J237488J018761O75315N05530K6500q16967j320828j141298
37637b3542p31767m15645K4006N50974O12964P3029m00068k87511J24566L87536
37627h5458M75263L73395j56621r21120j089693k40105Q93154J260093O98389
$$ y = [1145883, 920982, 449058, -98444, -369021, -299655, -258466, -543668, -932189, -949940, -442678, 356333, 1155942, 1679669, 1554487, 608040, -638902, -1205628, -661890, 284913, 472901, -467042, -1696043, -2050707, -1295108, -373474, -308327, -980374, -1327166, -758323, 89427, 241862, -404150, -1152085, -1426533, -1134591, -389886, 549282, 1212856, 1331980, 1223365, 1291071, 1350649, 1036160, 638029, 730556, 1062073, 758708, -226401, -801372, -208043, 1029445, 2048206, 2723521, 3229051, 3255551, 2438584, 1117756, -23542, -755309, -1170954, -1146948, -595974, 16990, 90019, -310049, -597560, -472994, -85458, 389805, 763200, 606579, -314541, -1404234, -1644339, -751185, 508908, 1207297]
37618A207297j35149o26719n75507j00620L73579L50149j51357n35057m37024
37609f30408k03718k54579m16220l15693n6641j7876k17108k98903j6407N50658
37599a876895J092939J218512P52089J8273m65845o23867p27259o92760j51309
37590a456122O49387Q36529J76105m53370l49859M2084P0499l3314J66732K90721
37580f0608j57739o43988l27825M30400N26350r1075l45119J94331P02510N36950
37570G64187J35605K6043m6527l95960o39293l63468Q3178J66295N5003K45615
37560C0678O31757O26376O0613n95989q64334o91962k90942J31179M48672N93984
37550H0032M78864p43o83177r81316m63984L82011N62718o8885n37177j86165
$$ y = [1207297, 1072148, 445429, -130078, -230698, 142881, 493030, 341673, -193384, -630408, -834126, -1088705, -1504925, -1820618, -1877259, -1895135, -2112243, -2411146, -2427553, -1876895, -783956, 434556, 1186645, 1204918, 739073, 115206, -612053, -1304813, -1456122, -806735, 29794, 205899, -247471, -597330, -555246, -484747, -518061, -351329, -60608, -218347, -862335, -1190160, -759760, -233410, -324485, -669604, -475273, 227237, 764187, 899792, 925835, 879308, 483348, -155945, -519413, -436235, -269940, -214937, 30678, 662435, 1288811, 1349424, 753435, -110899, -802861, -1093803, -962624, -513952, 80032, 558896, 558153, -125024, -1106340, -1570324, -1188313, -625595, -694480, -1231657, -1417822]
37540a417822L22457R5676n30006n31203J43932M91745J3952n97958n71451n1610
37530b632288L62652M46141L14481P5023q8537R3914N26915O80708L43164K4815
37520A46988J81176M54659K56955k35096l48241Q418K55407J06757r0526r6480
37510F40017j72811m61742n65056j67338L33990K91805l05790p93039n76570K96991
37500a479543J204246J434259Q03864q4900m29818j70404j3722l77872p69356
37491A16754n51057Q8141M26983K13722j38906k27764o8205J16063J48503r193
37481A15041j76635j09304Q4740R745k94003k13587L96337O59606p7477j011574
37471f17111r34946j35012L7403o10898p60567K74807J431991J540790R00267
$$ y = [-1417822, -1095365, -999689, -1529695, -2060898, -1916966, -1425221, -1411269, -2009227, -2580678, -2632288, -2269636, -1823495, -1509014, -1433991, -1522528, -1428614, -901699, -220991, 122173, 146988, 328164, 782823, 1039778, 804682, 456441, 464859, 720266, 827023, 736497, 640017, 467206, 5464, -559592, -726930, -392940, -101135, -406925, -1199964, -1776534, -1479543, -275297, 1158962, 1962826, 1877926, 1448108, 1277704, 1263982, 886110, 116754, -434303, -346162, 80821, 294543, 155637, -72127, -140332, -24269, 124234, 115041, -61594, -170898, -86158, -76413, -370416, -584003, -187666, 471940, 394463, -617111, -1552057, -1687069, -1649666, -2260564, -3021131, -2746324, -1314333, 226457, 1126724]
37462A126724M27757K35454m3928l21371l71276m34231o32101m24759M44272J105124
37452A111665O88987k63781o23726l94931l90784n96558k68342M80024O50763
37443C93317N5586l33131k4295K86852Q8088j09775J01222J97637k22793n45327
37433a12619j62320M10275L51521j67059m08635k76209j79638j00715K88973Q17607
37423D61181R55140O16759J25434m09685r49262j012840k03438Q35142R12950
37414A331381j06259j007018p94648J02819N43306O2935p95173j191077p48826
37405b602560J45890O60023L53782k78388m10870M5297M43497M25944L21881M08306
37395d87198M50010K78053K07271M41901N79801K14470l75481o53321n89498m69759
$$ y = [1126724, 1554481, 1789935, 1746007, 1424636, 1053360, 619129, -12972, -437731, 6541, 1111665, 1800652, 1536871, 913145, 518214, 127430, -469128, -737470, -257446, 393317, 448903, 115772, 91477, 378329, 466417, 356642, 457864, 655501, 432708, -112619, -274939, 135336, 486857, 319798, -88837, -365046, -544684, -645399, -356426, 461181, 1416321, 2033080, 2158514, 1748829, 799567, -213273, -416711, 418431, 1331381, 1225122, 218104, -576544, -473725, 69581, 132516, -662657, -1853734, -2602560, -2456670, -1796647, -1442865, -1721253, -2132123, -2086826, -1643329, -1217385, -895504, -487198, -37188, 240865, 448136, 890037, 1469838, 1684308, 1308827, 655506, 66008, -403751]
37385d03751k74240J32808M48256K66605j42177j09899L54934M84481q2813p10744
37375c6540o63194p9529L34651K30551j39114l49977j80702K43322M68093J09226
37365f3213n81047q38969l02443N16782R18830Q05385M69585L0187m27831n13935
37355A3331J0806O27499N92145O583l31336j58664o3981l83419n67673j13488
37345c68197M99427M46238k34798p35845o29102k98944j90102j66555J42041O79673
37335h56164R63127O81802R3312k57045j35259J96083M02288M68519M93488L30631
37325B380782j68339o52458n36350J28006N47875K04460m71954p64009n89561
37316G8452l37091j40064J28245L45046K37399l2021M5484N17466P39979K12767
$$ y = [-403751, -677991, -545183, -96927, 169678, 27501, -82398, 272536, 757017, 674204, -36540, -699734, -779263, -444612, -214061, -353175, -703152, -883854, -640532, -172439, -63213, -644260, -1483229, -1785672, -1268890, -350060, 455325, 924910, 955097, 527266, 13331, 24137, 651636, 1243781, 1250364, 919028, 760364, 696383, 312964, -254709, -368197, 131230, 577468, 342670, -393175, -1022277, -1321221, -1511323, -1677878, -1535837, -856164, 106963, 788765, 882077, 625032, 489773, 685856, 1088144, 1556663, 2050151, 2380782, 2212443, 1559985, 1023635, 1151641, 1699516, 1903976, 1432022, 668013, 78452, -258639, -398703, -270458, 74588, 311987, 279966, 325450, 842916, 1582895, 1795662]
37306A795662o95027j163411q68642k03479L45355O71236Q09448N94847n1098
37297A234891o31951m37774M17951Q68680K53141o61715o97735L7810L90241l2812
37287G40727l98330j94090n7289m75775p41855j28565P05428O02040l00288p83901
37277a031898l23047M10197P25033O31027L44288o0954l79907l60895j66865j71347
37267c84368l00480j61271K48896N67319O66951N98342J70041o40871j130650
37258c66091o68042J64840L08273p5998P6084P51132P08617l90351j241545r04959
37248a638040j33756J22750K10101P11705J070879N36889l74326o42267l16794
37239d52859j18559m1753L75462Q19522N63171j49244l29244J79818M87846R0607
$$ y = [1795662, 1100635, -62776, -931418, -1134897, -789542, -118306, 691142, 1285989, 1234891, 602940, 165166, 583117, 1451797, 1704938, 1043223, 345488, 383298, 773539, 740727, 342397, 148307, 91018, -384757, -1126612, -1255177, -549749, 52291, -247997, -1031898, -1354945, -944748, -219715, 411312, 755600, 694646, 314739, -46156, -213021, -384368, -684848, -846119, -597223, -29904, 637047, 1235389, 1405430, 764559, -366091, -1034133, -869293, -561020, -637018, -560934, 190198, 898815, 508464, -733081, -1638040, -1771796, -1649046, -1438945, -727240, 343639, 880528, 506202, -136065, -452859, -571418, -613171, -237709, 581813, 1144984, 995740, 666496, 846314, 1334160, 1424767]
37229A424767m94405o67247m42965n8228L37476M52608K6376o30613q95043o98697
37219a645971n16194m78714k15268L32716O71822N44842L18670L20330L34576
37210c33191P0253k99120l84451j27230J33066N0960l06171m21825P4201P17140
37200h26368N88674l48445r23085l14634O86169P89378N1402m23305k64788j14673
37190a099675k30700r7172L83139N19647P7446j67452L19378R07288P71891Q5740
37180A469530m12059m81004l90566l03540k28808k58718l52432j73251L94723
37171g36125Q21080M93593m16923j050670q09669J9061O06644M50641j24199l81220
37161a127787o8387L49573M40515L57552L55480K61858o9299k73724r7777j279
$$ y = [1424767, 930362, 263115, -179850, -238078, 99398, 552006, 578382, -52231, -947274, -1645971, -2162165, -2640879, -2856147, -2523431, -1851609, -1306767, -988097, -667767, -333191, -262938, -562058, -946509, -1073739, -940673, -889713, -1195884, -1617709, -1543508, -826368, -237694, -586139, -1509224, -1823858, -1137689, -348311, -296909, -720214, -985002, -1099675, -1330375, -1427547, -1044408, -524761, -447315, -614767, -295389, 611899, 1383790, 1469530, 1057471, 576467, 185901, -117639, -346447, -605165, -957597, -1130848, -736125, 84955, 578548, 161625, -889045, -1698714, -1679653, -1073009, -622368, -746567, -1127787, -1196174, -846601, -406086, -48534, 306946, 568804, 499505, 225781, 128004, 126725]
37151A26725l36437m59261K81966J134457Q50525k38205n67279K17087P53467
37142A763045K12283n31088n44249j91135q1950l33K59297J92198l59601n67698
37132A50769K0882N53847K73016k41123k67092k56832p21516q87567N3422J208092
37122a14102J088188j24160r45268p88104l22625O275L50986N65414L25785K4853
37112F7242K92149P83700O59917L9305k83930l08202o40514j060048p40844J62511
37102a028714O09871L52762R6094K4077l15450o59274k23018O21149O02043k43489
37092a63949m43054L85658P91322j1051p95108m88496R2523q0060m39242j28087
37082a279544K84722m1842n24404k29581L50152K55838o5677L84889J105550P79704
$$ y = [126725, -209712, -668973, -387007, 747450, 1597975, 1359770, 792491, 1009578, 1763045, 1975328, 1444240, 899991, 708856, 626906, 626573, 885870, 1078068, 718467, 150769, 171651, 725498, 998514, 757391, 490299, 233467, -488049, -1375616, -1322194, -114102, 974086, 849926, -95342, -883446, -1206071, -1199796, -848810, -283396, 42389, 67242, 359391, 1143091, 1803008, 1842313, 1558383, 1250181, 609667, -450381, -1191225, -1028714, -418843, -66081, 30013, 54090, -261360, -920634, -1143652, -522503, 79540, -163949, -607003, -221345, 569977, 558926, -236182, -724678, -632155, -712215, -1151457, -1279544, -994822, -1036664, -1561068, -1790649, -1440497, -1184659, -1250336, -865447, 240103, 1019807]
37072A019807l46151o62274K57424J070337Q49342K57044R7645P9489l32069q61236
37062A429358q96731l70494K78050N31191N0653r05382j324019m61857R45126
37053g24105J383672N78807k02610j18243J24861k87374p90857m10466N06228
37044E9913P29215N3585m17458k3080M85292K22629m05055l81939K42488L73393
37034I38983l75071r32571l15477Q19447J014739K9483r30807r31724l32926N8712
37024i57212J4131k37159m28326k43526M43538J056515P94037j09219n02948p3054
37014b43223J22823m93899q48842M2537J221435J104936o1827o68294k83356o9135
37004a76845o13149r36604j55833J069663J438233O54204l70386o04908O0053
$$ y = [1019807, 673656, 11382, 268806, 1339143, 2188485, 2445529, 2543174, 2622663, 2290594, 1429358, 532627, 162133, 440183, 971374, 1022027, 116645, -1207374, -1669231, -724105, 659567, 1238374, 1035764, 917521, 1042382, 755008, -35849, -446315, 59913, 789128, 842713, 425255, 402175, 887467, 1110096, 705041, 323102, 565590, 938983, 563912, -368659, -684136, 135311, 1150050, 1179533, 248726, -682998, -1015924, -957212, -943081, -1180240, -1608566, -1852092, -1408554, -352039, 441998, 332779, -170169, -243223, -120400, -614299, -1463141, -1420604, -199169, 905767, 843940, 175646, -107710, -176845, -789994, -1726598, -1882431, -812768, 625465, 1279669, 909283, 304375, 364428]
36995C64428O76116K53960q96514j353252n29018L60178Q6189o97717n87938K84796
$$ y = [364428, 1040544, 1294504, 397990, -955262, -1484280, -1124102, -1037913, -1735630, -2323568, -2038772]
$$ [...]
##END NTUPLES=NMR SPECTRUM
##END=
