##TITLE=31Pdec_LR-579-H1-CR5
 D2O, 24 sc
 24.6.2019
##JCAMPDX= 6.0         $$ Bruker NMR JCAMP-DX V2.0
##DATA TYPE= NMR SPECTRUM
##DATA CLASS= NTUPLES
##ORIGIN= UXNMR, Bruker Analytische Messtechnik GmbH
##OWNER= root
$$ XWIN-NMR		Version 3.5
$$ Mon Jun 24 14:18:18 2019 Russian Standard Time (UT+4h)  she@DPX200
##.OBSERVE FREQUENCY= 81.013821
##.OBSERVE NUCLEUS= ^31P
##.ACQUISITION MODE= SIMULTANEOUS
##.ACQUISITION SCHEME= undefined
##.AVERAGES= 24
##.DIGITISER RES= 17
##SPECTROMETER/DATA SYSTEM= spect
##.PULSE SEQUENCE= zgpg30
##.SOLVENT NAME= D2O
##.SHIFT REFERENCE= (INTERNAL, D2O, 0, 182.463)
##AUDIT TRAIL= $$ (NUMBER, WHEN, WHO, WHERE, WHAT)
$$ ##TITLE= Audit trail, XWIN-NMR		Version 3.5
$$ ##JCAMPDX= 5.01
$$ ##ORIGIN= Bruker BioSpin GmbH
$$ ##OWNER= she
$$ F:/spectra/data/she/nmr/P31/1/pdata/1/auditp.txt
$$ ##AUDIT TRAIL=  $$ (NUMBER, WHEN, WHO, WHERE, WHAT)
(   1,<2019-06-24 14:17:28.42 +0400>,<she>,<DPX200>,
      <created by zg, POWCHK disabled, PULCHK disabled
       configuration hash MD5:
       00 E9 B6 7A A2 85 ED C7 34 08 36 98 17 FE 4E 26
       data hash MD5: 32K
       2D 0A D2 84 5E 91 61 FA 04 18 7A 6A 43 CA A4 97>)
(   2,<2019-06-24 14:17:30.81 +0400>,<she>,<DPX200>,
      <Start of raw data processing
       efp BC_mod = 2 LB = 1 FT_mod = 6 PKNL = 1 PHC0 = -2595.36 PHC1 = 200.599 SI = 64K 
       data hash MD5: 64K
       6A 4B AF 9B 36 81 8A 00 3A 02 C6 4F D6 34 5A E6>)
(   3,<2019-06-24 14:17:44.51 +0400>,<she>,<DPX200>,
      <pk PHC0 = -13.44376 PHC1 = 0 
       data hash MD5: 64K
       2E 4A 26 99 61 D1 F5 32 27 5E 36 8C 8F 42 52 6E>)
(   4,<2019-06-24 14:17:47.46 +0400>,<she>,<DPX200>,
      <abs ABSG = 5 
       data hash MD5: 64K
       D3 31 C5 47 5F 5A A6 8B 8B 20 5E ED 4F 59 3B 16>)
$$ ##END=
$$ 
$$ hash MD5
$$ 76 7B 52 D1 3E 46 81 53 75 70 90 17 06 9B A3 A8
##$RELAX= 
##$RELAX= 
##$RELAX= 
##$RELAX= 
##$RELAX= 
##$RELAX= 
##$RELAX= 
##$RELAX= 
$$ Bruker specific parameters
$$ --------------------------
##$DU= <F:/spectra>
##$EXPNO= 1
##$NAME= <P31>
##$PROCNO= 1
##$TYPE= <nmr>
##$USER= <she>
##$AMP= (0..31)
100 100 100 100 100 100 100 100 100 100 100 100 100 100 100 100 100 100 
100 100 100 100 100 100 100 100 100 100 100 100 100 100 
##$AQSEQ= 0
##$AQ_mod= 1
##$AUNM= <au_zg>
##$AUTOPOS= <>
##$BF1= 81.014009
##$BF2= 200.13
##$BF3= 200.13
##$BF4= 200.13
##$BF5= 200.13
##$BF6= 200.13
##$BF7= 200.13
##$BF8= 200.13
##$BYTORDA= 1
##$CFDGTYP= 0
##$CFRGTYP= 5
##$CHEMSTR= <none>
##$CNST= (0..31)
1 1 145 1 1 1 1 1 1 1 1 1 1 1 1 1 1 1 1 1 1 1 1 1 1 1 1 1 1 1 1 1 
##$CPDPRG= <waltz16>
##$CPDPRG1= <>
##$CPDPRG2= <waltz16>
##$CPDPRG3= <>
##$CPDPRG4= <mlev>
##$CPDPRG5= <mlev>
##$CPDPRG6= <mlev>
##$CPDPRG7= <mlev>
##$CPDPRG8= <mlev>
##$CPDPRGB= <>
##$CPDPRGT= <>
##$D= (0..31)
0 1 0 0 0 0 0 0 0 0 0 0.03 2e-05 3e-06 0 0 0 0 0 0 0 0 0 0 0 0 0 0 0 0 
0 0 
##$DATE= 1561371447
##$DBL= (0..7)
120 120 120 11 120 120 24 19 
##$DBP= (0..7)
150 150 150 150 150 150 150 150 
##$DBP07= 0
##$DBPNAM0= <>
##$DBPNAM1= <>
##$DBPNAM2= <>
$$ [...]
##$SUBNAM3= <"">
##$SUBNAM4= <"">
##$SUBNAM5= <"">
##$SUBNAM6= <"">
##$SUBNAM7= <"">
##$SUBNAM8= <"">
##$SUBNAM9= <"">
##$SW= 369.568048894756
##$SWIBOX= (0..15)
0 1 3 0 0 0 0 0 0 0 0 0 0 0 0 0 
##$SW_h= 29940.119760479
##$TD= 32768
##$TD0= 1
##$TE= 0
##$TE2= 300
##$TE3= 300
##$TEG= 300
##$TL= (0..7)
0 120 53 12 22 120 120 120 
##$TP= (0..7)
150 150 150 150 150 150 150 150 
##$TP07= 0
##$TPNAME0= <>
##$TPNAME1= <>
##$TPNAME2= <>
##$TPNAME3= <>
##$TPNAME4= <>
##$TPNAME5= <>
##$TPNAME6= <>
##$TPNAME7= <>
##$TPOAL= (0..7)
0.5 0.5 0.5 0.5 0.5 0.5 0.5 0.5 
##$TPOFFS= (0..7)
0 0 0 0 0 0 0 0 
##$TUNHIN= 0
##$TUNHOUT= 0
##$TUNXOUT= 0
##$USERA1= <user>
##$USERA2= <user>
##$USERA3= <user>
##$USERA4= <user>
##$USERA5= <user>
##$V9= 5
##$VALIST= <valist>
##$VCLIST= <CCCCCCCCCCCCCCC>
##$VD= 0
##$VDLIST= <DDDDDDDDDDDDDDD>
##$VPLIST= <PPPPPPPPPPPPPPP>
##$VTLIST= <TTTTTTTTTTTTTTT>
##$WBST= 1024
##$WBSW= 4
##$XGAIN= (0..3)
0 0 0 0 
##$XL= 0
##$YL= 0
##$YMAX_a= 22371
##$YMIN_a= -22943
##$ZGOPTNS= <>
##$ZL1= 120
##$ZL2= 120
##$ZL3= 120
##$ZL4= 120
##$ABSF1= 182.463
##$ABSF2= -187.1042
##$ABSG= 5
##$ABSL= 3
##$ALPHA= 0
##$AQORDER= 0
##$ASSFAC= 0
##$ASSFACI= 0
##$ASSFACX= 0
##$ASSWID= 0
##$AUNMP= <proc_1d>
##$AZFE= 0.1
##$AZFW= 0.5
##$BCFW= 0
##$BC_mod= 2
##$BYTORDP= 0
##$COROFFS= 0
##$CY= -3
##$DATMOD= 1
##$DC= 0
##$DFILT= <>
##$DTYPP= 0
##$F1P= 0
##$F2P= 0
##$FCOR= 1
##$FTSIZE= 65536
##$FT_mod= 6
##$GAMMA= 0
##$GB= 0
##$INTBC= 1
##$INTSCL= 5.30512e-09
##$ISEN= 30
##$LB= 1
##$LEV0= 0
##$LPBIN= 0
##$MAXI= 10000
##$MC2= 0
##$MEAN= 0
##$ME_mod= 0
##$MI= 50
##$NCOEF= 0
##$NC_proc= -5
##$NLEV= 6
##$NOISF1= 182.463
##$NOISF2= 159.3651
##$NSP= 0
##$NTH_PI= 0
##$NZP= 0
##$OFFSET= 182.463
##$PC= 4
##$PHC0= -2608.804
##$PHC1= 200.599
##$PH_mod= 1
##$PKNL= yes
##$PPARMOD= 0
##$PSCAL= 0
##$PSIGN= 0
##$REVERSE= no
##$SF= 81.0140089999434
##$SI= 65536
##$SIGF1= 159.3651
##$SIGF2= -187.1042
##$SINO= 113.3802
##$SIOLD= 16384
##$SREGLST= <1H.CDCl3>
##$SSB= 0
##$STSI= 65536
##$STSR= 0
##$SW_p= 29940.119760479
##$SYMM= 0
##$S_DEV= 0
##$TDeff= 32768
##$TDoff= 0
##$TI= <>
##$TILT= no
##$TM1= 0
##$TM2= 0
##$TOPLEV= 0
##$USERP1= <user>
##$USERP2= <user>
##$USERP3= <user>
##$USERP4= <user>
##$USERP5= <user>
##$WDW= 1
##$XDIM= 65536
##$YMAX_p= 300067839
##$YMIN_p= -19357082
$$ End of Bruker specific parameters
$$ ---------------------------------
##NTUPLES= NMR SPECTRUM
##VAR_NAME=  FREQUENCY,     SPECTRUM/REAL,   SPECTRUM/IMAG
##SYMBOL=    X,             R,               I
##VAR_TYPE=  INDEPENDENT,   DEPENDENT,       DEPENDENT
##VAR_FORM=  AFFN,          ASDF,            ASDF
##VAR_DIM=   65536,         65536,           65536
##UNITS=     HZ,            ARBITRARY UNITS, ARBITRARY UNITS
##FACTOR=    0.456856943014862, 1,           1
##FIRST=     14782.0589164792, 0,            0
##LAST=      -15158.0608439998, 0,           0
##MIN=       -15158.0608439998, -19357082,   0
##MAX=       14782.0589164792, 300067839,    0
$$ Real data points
##PAGE= N=1
##DATA TABLE= (X++(R..R)), XYDATA
$$ [...]
42827c67139N91688R07688N8882j158215j199886n2816O32240N6034n45677o312
42817a083513Q79692P39744k05693p24440n40399l08370j63620K83248P99428
42808c23923P06714P4077m21453o49397q90670p95547J61185J267084J125758
42799B53828j53569q05665O2951J185877J102993J66242l81776l19945l01669
42790H09267m87677m97858l53651l99125m58089l0867P01938R36070M01852k60909
42780C60951m43415k51289m4941J20212K78842K39228j26224n50021o80083n41690
42770a638430l87004k47020J3626K78700K30581j04881k55653K3371L00292O9652
42760a716766l97055l15244M88521J232562J156284M07479l20934o37151n62490
$$ y = [-367139, 224549, 1132237, 1191119, 32904, -1166982, -1219798, -587558, -531524, -1077201, -1083513, -203821, 535923, 330230, -394210, -934609, -1242979, -1406599, -1123351, -323923, 382791, 456868, 35415, -613982, -1504652, -2300199, -2139014, -871930, 253828, 100259, -705406, -642455, 543422, 1646415, 1812657, 1430881, 1110936, 809267, 321590, -176268, -529919, -929044, -1387133, -1418000, -716062, 220008, 621860, 360951, -82464, -333753, -378694, -258482, 20360, 259588, 133364, -416657, -1096740, -1638430, -2025434, -2272454, -2258828, -1980128, -1749547, -1854428, -2110081, -2086710, -1786418, -1716766, -2113821, -2429065, -1940544, -707982, 448302, 855781, 534847, -102304, -664794]
42751f64794j75419L38473N32329J77290k34404o5206M52196M52619k31485p09534
42741a27935l08161M41834N87777N4087m17737l41811Q3904M89351P07958O22848
42731A792115J44566m82642p09951k72199M16966O54674J82755n63573r04164
42722B58547n68244N8707L26353L676m40884l38912L72334R70633P16521k41038
42712A117693r37627o86153R4726M21077J9904l72951j30764L31651J95045n04415
42702d51814r04139n83059j23936j49804l70930q5985O98231J224626R99712L60328
42692F13230o5336q9265K5231K5271j04831k82322m74774o66445p67508o30968
42682b417717j94648L88966Q21396R20938P76637N56845K41178k49516o62666
$$ y = [-664794, -840213, -501740, 30589, 207879, -26525, -91731, 360465, 813084, 581599, -127935, -436096, 5738, 593515, 647602, 229865, -111946, -28042, 461309, 1169267, 1792115, 1936681, 1454039, 744088, 471889, 888855, 1543529, 1726284, 1162711, 258547, -309697, -250990, 75363, 79039, -361845, -700757, -328423, 642210, 1358731, 1117693, 180066, -506087, -411361, 9716, 29620, -343331, -474095, -142444, 52601, -451814, -1355953, -1939012, -2062948, -2212752, -2583682, -2669667, -1971436, -746810, 252902, 613230, 547894, 458629, 483860, 509131, 404300, 121978, -352796, -1019241, -1786749, -2417717, -2612365, -2223399, -1402003, -481065, 295572, 852417, 1093595, 844079, 181413]
42673A81413n02299K46596P79266L38898o74650j068122m52261K06167M0012l99285
42663a304265p0123P99321R98779K87433j95883J89350N25355p6566q66725n88147
42653c01471M42507P41337o0374o88804j98707O93699P82760L2356o02665n06614
42643C34024O9602N66239P09609N96483M38774K48840j68140p65684j014417n23481
42633D91849K47934M69766P9356k16933j00529r588j64243r6890M01008O80035
42623A781765K46830k90817j20078M05254K33387p32044j381298r18168J17689
42614f57480O40202L16954k72133m83965k55451O8416K90365N34466Q47985R08372
42604A937731M45543j99028m15493k10438j72602m49060m45355J25984N94312
$$ y = [181413, -320886, -74290, 704976, 1043874, 369224, -698898, -1151159, -944992, -904980, -1304265, -1374388, -575067, 423712, 711145, 515262, 704612, 1229967, 1153401, 286676, -301471, 141036, 882373, 821999, 133195, -65512, 628187, 1410947, 1443303, 840638, 334024, 403626, 969865, 1679474, 2275957, 2714731, 2963571, 2795431, 2029747, 1015330, 491849, 739783, 1209549, 1288905, 1071972, 971443, 961855, 797612, 700722, 1101730, 1781765, 2028595, 1737778, 1617700, 2022954, 2256341, 1524297, 142999, -775169, -657480, -17278, 299676, 27543, -456422, -711873, -643457, -353092, 181374, 1029359, 1937731, 2383274, 2184246, 1768753, 1558315, 1385713, 936653, 491298, 617282, 1211594]
42595A211594K99130l43393m52228K957K48020j02626n88195o20087j31444M86453
42585A0181P03107J92599p75144j415696j222427m82356K40480P19400Q17132
42576a212724K51327p28056j020762K2988J381585J497942M04528m14316j99122
42567a6610K67018J70749k09983l02690j22480J37496N03579P24217K46629p68820
42557F29105j254468o72902J42525K59659j3641J30006N91521O33465J00924n10620
42547C5574q81116r76028o68593l9316K83223q6592m79064o4086P21389P16559
42537a438050r9079m83277J27728P21445K85785o56523q40254J6809J042945J437467
42527A14996J178591O30862L6596m99220q50119q57858m55908J57034N14588K90263
$$ y = [1211594, 1510724, 1167331, 715103, 718060, 966080, 863454, 275259, -344828, -476272, 10181, 713288, 905887, 130743, -1284953, -2507380, -2989736, -2749256, -2029856, -1212724, -961397, -1689453, -2710215, -2687227, -1305642, 192300, 596828, 182512, -16610, 250408, 421157, 211174, -91516, -213996, -76500, 427079, 1151296, 1397925, 629105, -625363, -1298265, -1155740, -896081, -909722, -779716, -188195, 445270, 546194, 35574, -845542, -1821570, -2490163, -2529479, -2246256, -2332848, -2811912, -2875998, -2154609, -1438050, -1537129, -2020406, -1892678, -1171233, -885448, -1541971, -2382225, -2365416, -1322471, 114996, 1293587, 1924449, 1961045, 1461825, 611706, -246152, -702060, -545026, -30438, 259825]
42517B59825k41884m37584r1012K96090K40166p3349j97208j86291m35818q31174
42507a698239o59491L59387J377814J262715M5538r77473p79626J69065O02653
42498b97657J26709m08424k22016L67604N92033L94643L24526N09561M53535n7025
42488A783489m73319k49738L14550M33300j33448q02278r24372n03555m1770J07699
42478d89442K0881p3671j02953j13523j14932r6893p7110j56K49247N47768M73664
42467B22880j16581o51665m83607J39000L58650p913k24454J05609L63678K827
42457b91576m53326k48881L53976N43369K60043P7450N3940k56488p22181o22751
42447a306425J23371O58762L90327k87278p15792o86011k30162N10305R90515
$$ y = [259825, 17941, -419643, -510655, -214565, 25601, -47748, -244956, -431247, -867065, -1698239, -2357730, -1998343, -620529, 642186, 687724, -289749, -1069375, -900310, -297657, -170948, -579372, -801388, -433784, 158249, 552892, 877418, 1386979, 1840514, 1783489, 1310170, 1060432, 1374982, 1808282, 1674834, 872556, -51816, -555371, -597141, -489442, -468561, -542232, -645185, -758708, -873640, -970533, -1047643, -1047799, -798552, -250784, 222880, 106299, -545366, -1028973, -889973, -531323, -539236, -763690, -658081, -294403, -291576, -744902, -993783, -639807, -96438, 163605, 241055, 294995, 38507, -683674, -1306425, -1183054, -524292, -133965, -421243, -1137035, -1823046, -2053208, -1542903, -552388]
42438e52388O73337k1162r9703L95235K89730p08290j188102j60986J165958J056168
42428H49797j71280p44370j28634M85385K63989k35865l24214j34306P2478M27641
42418C60621Q03496O15250j78542o95126l27321L34338L50606k99375q11822n65011
42408d12886L12665J064322Q53429l56346j413706j110619K03510R29859L35938
42399D06166n68764o53105j53136J02951L1385N749j5428j57841m9577N01623
42389e49977Q18736L15712l93563m00647Q504j7876k42022K30326J078646R61060
42379A808899k55025j051668n38413K90983L03799j02269n3455J92206j02744
42370D92313o60555o08821K2714L85556J95879k642R0033J35762o1176j75858
$$ y = [-552388, 120949, 99787, 84, 395319, 685049, -23241, -1211343, -1372329, -206371, 849797, 678517, -65853, -194487, 290898, 554887, 319022, -5192, -139498, -67020, 360621, 1164117, 1779367, 1600825, 905699, 578378, 912716, 1263322, 963947, 152125, -412886, -100221, 964101, 1817530, 1461184, 47478, -1063141, -859631, 70228, 406166, -162598, -815703, -968839, -865888, -834503, -828754, -844182, -1002023, -1051600, -549977, 268759, 584471, 190908, -209739, -201235, -219111, -461133, -230807, 847839, 1808899, 1553874, 502206, -36207, 254776, 558575, 456306, 402851, 595057, 492313, -168242, -777063, -754349, -368793, -172914, -175556, -85523, 50239, -10937, -186795]
42360a86795P309J79855j7410m88385q19727o73328j8381P71461J104633P45319
42350F04551J38166j12435L5711J74075J16564M9918R0260J06905k615j88266
42340A012834l84845n00280l52167P9522M36429L41684j18314n57355p50923o07064
42330a400479J7195R35484J331229N75734p07189j169384m53723L62523K88023
42321b20587l49678o20603l08122R6556K95270M04704M48016K39334j82854m53454
42311f51418l40338k9707J59148J46076O1209q634o9576n0131K01700O01266O82070
42300G01665J17415o30708o72430Q5243N99374M8378r24434j029891j17131P22973
42290a099546P81235M99363L92964J65403n26011j145372r07040K7408P01086
$$ y = [-186795, -179486, 369, -17041, -505426, -1325153, -1998481, -2016862, -1245401, -140768, 604551, 742717, 630282, 665993, 840068, 956632, 1006550, 1096810, 1203715, 1201100, 1012834, 627989, 127709, -224458, -144936, 291493, 633177, 514863, -42492, -793415, -1400479, -1383284, -447800, 883429, 1459163, 751974, -417410, -871133, -508610, -220587, -570265, -1190868, -1498990, -1402434, -1107164, -702460, -254444, -15110, -197964, -651418, -991756, -1021463, -862315, -716239, -655030, -663664, -733240, -783371, -581671, 19595, 701665, 819080, 188372, -484058, -398815, 200559, 248937, -675497, -1705388, -1822519, -1099546, -318311, 181052, 574016, 739419, 213408, -931964, -1839004, -1811596, -1110510]
42281a110510N91199J25530n964L76791Q91423J018533N55365j81271o39233o10960
42271A010903m02061l51302m12497l41880m8269M04097Q83021J113226Q12565
42262B667803J24556l69394l23180o3670j16581n39515r57311j014861n88432
42253a180585J63158P36903O06222j28238p28479p15757m00715k31198q7285L14219
42243a651755P36812P32677L52066k9294l54293p52614r54243n21132L44913Q49050
42233a247813N82174j3938k83136p8841K66214L94453K27442j4760o0845Q1228
42223a47822J73073J85321L71269P20880P56664K26254l92871n35054l40896k89717
42213G27101l69257k40496J001q1208m80912o79227l81282J56473N27243N14318
$$ y = [-1110510, -519311, -393781, -399745, -22954, 868469, 1887002, 2442367, 2261096, 1621863, 1010903, 608842, 257540, -154957, -496837, -545106, -141009, 742012, 1855238, 2667803, 2792359, 2422965, 2099785, 2036115, 1919534, 1380019, 422708, -592153, -1180585, -1017427, -280524, 325698, 197460, -531019, -1246776, -1647491, -1878689, -1965974, -1651755, -914943, -182266, 169800, 140506, -213787, -966401, -1920644, -2441776, -2096863, -1247813, -665639, -679577, -962713, -1041554, -775340, -380887, -153445, -168205, -229050, -147822, 25251, 210572, 581841, 1302721, 2059385, 2285639, 1892768, 1357714, 1016818, 727101, 357844, 117348, 118349, 37141, -443771, -1122998, -1504280, -1347807, -820564, -306246]
42203c06246J29480l14666l37122J36672N67734N29804K80779J95258J26798j02830
42193I05661j49356J87347L23442j98105p28282m69885J53508K74589J45725M83270
42183I27914P75321K8969j070309q00196O95187J308020K61772o82316k01378
42174A242984N29528Q2576p91412o55283J57454L78589O635q6839R0388l0610
42164I24010j99159J21229M54789R9800l95999j41776L12830j55257j073352r75450
42154a028335O9653N05087j15514n38127j04299K59463r0744l92910n38M77001
42144i59263M44618M27187R24201J253953O06416n49441j112173q38359l39624
42135a42485m3129Q9853J24416N5456k2139j2926Q4942K90980N18725L92113k60298
$$ y = [-306246, -176766, -491432, -828554, -691882, -124148, 405656, 686435, 881693, 1008491, 905661, 756305, 943652, 1267094, 1068989, 340707, -129178, 24330, 298919, 444644, 927914, 1703235, 1732204, 661895, -138301, 556886, 1864906, 2126678, 1444362, 1242984, 1772512, 1855088, 1063676, 408393, 565847, 944436, 951071, 864232, 954620, 924010, 724851, 846080, 1300869, 1400669, 1004670, 862894, 1175724, 1020467, -52885, -1028335, -958682, -453595, -569109, -1107236, -1211535, -952072, -1042816, -1435726, -1436264, -959263, -514645, -87458, 836743, 2090696, 2697112, 2147671, 1035498, 197139, -142485, -185614, -95761, 28655, 84111, 61972, 49046, 133988, 424968, 943693, 1335806, 1075508]
42124A075508q04672m64668M11144O60172J0079n35425k88055J90832J80768j66599
42114B69084m21639n87170o53361l16628K92276M68012O6790j45795J58445K44420
42104f25566k71037n55000m0625M04743k8360n38316p7425O92267M72655l64683
42094i31347l86121M14372O62807M3023k50012K75732N99208J20594l00669k3922
42084B23665J74891m08058r82432n10572N52424R65877N17395J2933j03651q3055
42074C59417j02796r5343j72425m26905m85552j8384M92578L16436l10978m37588
42064h81540J00565L83617j01584n98996k92036L57312L05762m39620q19305l18375
42054b304200L17098K69596j53740j01006M66981P33592K80949l00743k86382
$$ y = [1075508, 270836, -193832, 217312, 877484, 887563, 352138, 64083, 254915, 435683, 269084, -152555, -739725, -1393086, -1709714, -1417438, -949426, -882636, -1028431, -869986, -625566, -896603, -1451603, -1492228, -1087485, -1115845, -1654161, -1731586, -1039319, -566664, -931347, -1317468, -903096, -240289, -197266, -447278, -171546, 427662, 548256, 247587, 223665, 398556, -9502, -991934, -1502506, -950082, 15795, 533190, 546123, 442472, 359417, 256621, 161278, -11147, -438052, -923604, -941988, -449410, -132974, -443952, -881540, -780975, -397358, -498942, -1097938, -1389974, -1032662, -726900, -1166520, -1985825, -2304200, -1987102, -1717506, -1871246, -1972252, -1505271, -771679, -490730, -791473, -1077855]
42045a077855K19980N74887N06120K71082P2410j82383m89343n46421j72943L15356
42035e09110M30214J36741r0217J14434N19682N86076J38939m67658q45862r42258
42025i29019q05750l38663M10506R80532R61162N60680K45081j9298n40372j004949
42015d80090o36919N44861J436805J243582M59235n6769k86253o36930r38760
42006F48762p71577m15026m91100q28349o67132m113K61189k38991o68039k14358
41996c388734P09588J098394P34898L12607L72555O79585P00162L16878j13558
41987A422375k54452j43931l8105o4706j83510l59875n01663l24077K84930P76797
41977F13783M25057n39414r76873l82681L70510L98293J09834K87240N96068K10327
$$ y = [-1077855, -857875, -282988, 223132, 494214, 566624, 384241, -105102, -651523, -824466, -509110, -78896, 57845, -32372, 82062, 601744, 1187820, 1326759, 859101, 13239, -929019, -1734769, -2073432, -1662926, -682394, 278768, 839448, 1084529, 1065231, 524859, -480090, -1117009, -572148, 864657, 2108239, 2567474, 2510705, 2224452, 1587522, 648762, -122815, -537841, -1028941, -1857290, -2524422, -2528535, -2267346, -2506337, -3174376, -3388734, -2679146, -1580752, -845854, -533247, -160692, 518893, 1219055, 1535933, 1422375, 1167923, 1023992, 985887, 921181, 737671, 377796, -123867, -447944, -163014, 613783, 1038840, 499426, -477447, -860128, -489618, -91325, 18509, 305749, 901817, 1112144]
41967A112144n50686o03563L1322J91019m45934p61613m9168Q15776P53408k994
41957D89711n40738n76824l49931Q5642O53771Q96431N62163J02304m3892j55382
41947A123255n85311r48740o90655k4905M24850N22843M44464M7712p29169j202181
41937a617837o47379M77445R63624N01570k071J21497M17919K22516k71507l97155
41927b31378m5635K45227J26319p8199J25335O14056O86880K7065o71888m88822
41917C08960M38158J026190P26308J73194P0065J78681m2645m56989o10855n62870
41907A248197n79474m13148K79390J073077J169439N14464k19002o03774o67119
41898A802050l21902N31463J372554J395792N86790k40755n31055m32043j91204
$$ y = [1112144, 561458, -42105, -10783, 180236, -265698, -1027311, -1076479, -260703, 492705, 489711, -51027, -627851, -977782, -892140, -238369, 658062, 1220225, 1322529, 1278637, 1123255, 537944, -410796, -1101451, -1126356, -701506, -178663, 265801, 313513, -415656, -1617837, -2265216, -1787771, -824147, -322577, -324648, -203151, 214768, 437284, 165777, -231378, -277013, -31786, 94533, 16334, 141669, 755725, 1442605, 1469670, 797782, 308960, 747118, 1773308, 2499616, 2672810, 2742875, 2921556, 2878911, 2421922, 1811067, 1248197, 668723, 255575, 534965, 1608042, 2777481, 3291945, 3072943, 2469169, 1802050, 1480148, 2011611, 3384165, 4779957, 5366747, 5125992, 4594937, 4162894, 3971690]
41889C971690J13822K26798p9409l82891o0272N51225M01417o30399j347504r19479
41879A844998k0089K87034k7890l21451l60909l08880j62156P2541N8831l55804
41869G06225o84477m84804j18849j63922m16663k45665K92213N10168K32069Q1869
41859b91836M45384P92269M10567n53772j193059q81965M3104P07279O56838K16492
41849C51301j08238k70924m65571n68690l25070L7814K6312k58150j83320L20001
41839a444535N08024L2854l83167p1242M71604L69641k34386m43742R641N00075
41829f85233N22099K12706j17657l02789j61508L52495Q00555O33331l1984n29277
41819F92738n46624l68512k25071k3879J95980J82114l265J6682K23625J35866
$$ y = [3971690, 4085512, 4312310, 4232901, 3850010, 3789738, 4340963, 4742380, 4111981, 2764477, 1844998, 1824909, 2111943, 2084053, 1762602, 1401693, 1092813, 930657, 1003198, 1062029, 706225, 21748, -463056, -581905, -745827, -1162490, -1408155, -1115942, -605774, -373705, -291836, 153548, 945817, 1356384, 802612, -390447, -1272412, -1229308, -522029, 134809, 351301, 243063, -27861, -493432, -1062122, -1387192, -1349378, -1323066, -1581216, -1764536, -1444535, -936511, -903657, -1286824, -1358066, -886462, -516821, -751207, -1194949, -1185308, -685233, -163134, 49572, -68085, -370874, -532382, -179887, 620668, 1253999, 1222015, 692738, 146114, -222398, -447469, -471348, -275368, -93254, -96519, -79837, 143788, 279654]
41809B79654k88423l58185L06765J035423R75471K59243l00609l44013j63788
41800A401538j8055Q4924L3435k73930m67197n2322O66145P36056o7876p32404
41790A310314m05953K99971K04046o27628r53905k41599N43405M02626k99246
41781B32031n49350j71015K03530K68787L00766M08841L41531Q5248m3745j3519
41771A063105j45630m47161n10150k34778L372J00058M03780Q45184O92369k73141
41761A497008j050438o49222M57131R20911K98342n28611o22011k7281M97993
41752G93822L39758m27015j084051r45088j39810N42194P07688P40641Q87343
41743A415482P04480l7290o61432o02196m26328q33314j242576o27169O48498
$$ y = [279654, -8769, -366954, -60189, 975234, 1950705, 2209948, 1909339, 1565326, 1401538, 1383483, 1468407, 1501842, 1227912, 760715, 708393, 1374538, 2110594, 2042718, 1310314, 904361, 1204332, 1408378, 780750, -173155, -414754, 128651, 531277, 232031, -317319, -488334, -284804, -16017, 284749, 693590, 1035121, 1120369, 1076624, 1063105, 917475, 470314, -39836, -274614, -271242, -171184, 232596, 1077780, 1770149, 1497008, 446570, -202652, 254479, 1175390, 1473732, 945121, 323110, 295829, 793822, 1133580, 706565, -377486, -1322574, -1462384, -920190, -212502, 528139, 1415482, 2119962, 2082672, 1421240, 819044, 392716, -440598, -1683174, -2310343, -1661845]
41734a661845J228297Q24071L98787L00358j46656q84891p11446O06509J411662
41725A364846N25267p84086o56467N18686Q16773j78509q45809j30700R10320
41716A540321P69597m20288j273692j035967k91837M8771j33957k48695R1604
41707i54143N73954O95832M62515J99277j20812p23619j221964q08122M08368
41698a488714J113711M89921n24563n39253K92762O50733J01645m14312j90697
41689e08767K85409L27115P5575O623Q3076p535j93817j59427P3007J51579o9071
41678F3767l02034j76123K95777O44053M32380j44844m08515j16594J31757j93764
41668B25860o46899m64171J68713L80527M0625p9422K97484M49880n4156n63335
$$ y = [-1661845, -433548, 390523, 789310, 1089668, 943012, 58121, -653325, -46816, 1364846, 1890113, 1106027, 449560, 968246, 1785019, 1606510, 760701, 630001, 1540321, 2309918, 1889630, 615938, -420029, -711866, -663095, -797052, -1045747, -954143, -380189, 315643, 778158, 977435, 856623, 133004, -1088960, -1897082, -1488714, -375003, 114918, -409645, -948898, -656136, -5403, 96242, -318070, -508767, -223358, 103757, 179332, 185955, 269031, 261496, 67679, -91748, -18741, 132838, 63767, -238267, -414390, -118613, 525440, 957820, 812976, 404461, 287867, 419624, 225860, -421039, -885210, -716497, -335970, -295345, -374767, -77283, 372597, 318441, -244894]
41658b44894m43818q1498m2313n6572K58151M17453p6151n18159K8703R41610
41648A82512P46163m39914q32650K63981J257367O70829o55044r94746l12047
41639a13549R2241j27105n5819O08556R21400K60617o84839j011711p57829m22870
41629a290908j16060K25517L90250K61562J54765K66272K58446r0951l29431l4308
41619c04846L88186L30081K4451J23370M79279L02863m51746q06834j65968P55592
41609F74428Q66455P0969p54590q62738l18304K71234M14858J45160j24153j32910
41599B50409m7571p9759p8371J57588L65976J21222m27231o53687l24988J41880
41589e74532L57851L79481L42511K06566L2105J5461O7362j55158o10376p71342
$$ y = [-244894, -688712, -770210, -812523, -869095, -610944, -193491, -269642, -787801, -759098, 182512, 928675, 488761, -343889, -79908, 1177459, 1848288, 1193244, 198498, -113549, -21308, -148413, -204232, 404324, 1325724, 1586341, 901502, -110209, -868038, -1290908, -1406968, -1181451, -791201, -529639, -374874, -108602, 149844, 58893, -270538, -304846, 83340, 413421, 437872, 561242, 1040521, 1343384, 891638, 84804, -81164, 674428, 1540883, 1611852, 857262, -5476, -323780, -52546, 362312, 507472, 383319, 250409, 202838, 123079, 44708, 202296, 568272, 689494, 262263, -391424, -716412, -574532, -216681, 162800, 505311, 711877, 743982, 759443, 826805, 671647, 61271, -710071]
41579g10071l85636J51294M01179L70801K01350p6896k64083p8652K27601M1447
41569a21666n16324n00038L61587R73618M51455m23275l37830N67016J007780
41560A462323N01103k02722n12379o43442p57116n36221M3902L99536K14514m8595
41550g9097P6582L40708K61995j06321l23772k13219o535M1685l3624L2823L76016
41539C67241O80916M38026l09193p96159m83451J45484K61351q7776j12683M28834
41529E32590Q08372L72759n33989r81821n21219L24471N58683j99915j094411
41520g34480q98716L28865J136538O60502j34824k6608N27583L10764m52032m86290
41510B31302J94161K05003p48785j190520k77442Q04990P81124J45546j9741J90605
$$ y = [-710071, -1095707, -944413, -543234, -172433, 28917, -47979, -312062, -390714, -163113, -121666, -637990, -1138028, -776441, 197177, 648632, 225357, -112473, 454543, 1462323, 1963426, 1760704, 1248325, 604883, -152233, -688454, -644552, -245016, -30502, -79097, -2515, 338193, 600188, 493867, 170095, -43124, -49659, -7974, -41598, -8775, 367241, 1048157, 1486183, 1176990, 380831, -102620, 42864, 304215, 216439, 103756, 532590, 1340962, 1713721, 1179732, 197911, -323308, 1163, 559846, 359931, -734480, -1633196, -1304331, -167793, 492709, 357885, 331277, 858860, 1169624, 717592, 231302, 425463, 630466, -118319, -1308839, -1586281, -781291, -167, 145379, 125638, 316243]
41500C16243J71224J49756N07908O46426m5063p88774m75967L91351L50359p23044
41490E00419j488222j229252n96820j68791K96187Q50796R14996L52969q0917
41481f48635Q6698L57901K58562J15929K45976K25583k86342p24610m47804J60692
41471f56050K90405j3078p9761J41258O6680l36693l72874J47756M47893N2729
41461c11735l13050J32927Q12666N44848n46149j049222l48880M59710K84835
41452c34050l51209l28405K11305K30651l59622n57979O349M93090L24402O6750
41442e98718K61967M13456m3349n71006l16681M40070O43089N3356m38901j29435
41432b86152O15135R75347O68744P1212l78442o38664q98590j057137o89529K01103
$$ y = [316243, 487467, 637223, 1145131, 1791557, 1746494, 957720, 481753, 873104, 1223463, 500419, -987803, -2217055, -2813875, -2982666, -2686479, -1835683, -920687, -567718, -648635, -561937, -204036, 54526, 170455, 416431, 642014, 355672, -368938, -816742, -656050, -365645, -378723, -458484, -317226, -250546, -587239, -960113, -812357, -364464, -311735, -624785, -491858, 320808, 865656, 319507, -729715, -1078595, -618885, -334050, -685259, -1013664, -802359, -571708, -931330, -1489309, -1482960, -989870, -665468, -598718, -336751, 76705, 33356, -537650, -854331, -414261, 228828, 282184, -156717, -286152, 328983, 1304330, 1973074, 2044286, 1665844, 1027180, 128590, -928547, -1618076, -1416973]
41422a416973P84665M09707k61664r0709O45227M84246p91565j429594k59308
41413a925968J360875J433568J54768o55450k91928K90983L77812L27889M37830
41404A510379L51420j12556n98342q80975j002133p28857J29088Q79062N60694
41395A07780m89892q63390r4802P22547O98551L36309L99232O62019N38830J31894
41385B149078j14871k00443l16502k93326Q2929N38985N90812J20084n85613j079621
41375H91512r45991j79971N47479N19747q6267m67690l70718k51700k68120l8080
41365f49799M31455N50711J82753o8720M4513N448l52904l46597L41982Q94942
41355A033784N34971l18986p76088o37439j93706L88520Q11788N54288k42304
$$ y = [-1416973, -632308, -222601, -484265, -574974, 70253, 554499, -237066, -1666660, -1925968, -565093, 868475, 1023243, 367793, 75865, 366848, 744660, 1072549, 1510379, 1861799, 1749243, 1150901, 269926, -732207, -1461064, -1331976, -452914, 107780, -382112, -1245502, -1340304, -617757, 80794, 417103, 816335, 1478354, 2017184, 2149078, 2034207, 1833764, 1517262, 1223936, 1306865, 1845850, 2436662, 2556746, 1971133, 891512, -54479, -234450, 313029, 832776, 746509, 278819, -91899, -343599, -611719, -649799, -218344, 332367, 515120, 446400, 490913, 496361, 143457, -203140, 138842, 1033784, 1568755, 1249769, 473681, -163758, -357464, 31056, 842844, 1397132, 1154828]
41346A154828n50913J12398Q08083N51939k05377m32096j30454k6187k23390k80501
41336G78330j96048k56201k65807N0753K42095k38334r14626q63085j46084L76606
41326a432401M30795M41694M68413J78869j90473r819N60170O61788J39686k12480
41316A036242M787K32383J7403l01885l35331k40613k14193j07634J02328J15608
41306C09095j18113k48659j91098k83370n28597l94999K74007Q29160P37053L40902
41296G25381K14754K75435R3797k90369m48464k54986J4922J90328L48214M27887
41286A296899J28287n72013j053291o40633M05084R49038L76927m97658n43207
41277a50567K5242O7503n20967n81711K60962P76059J52503n32020j01132O59541
$$ y = [1154828, 603915, 716313, 1524396, 2076335, 1870958, 1438862, 1308408, 1282221, 1058831, 778330, 582282, 326081, 60274, 111027, 353122, 114788, -799838, -1662923, -1809007, -1432401, -1001606, -559912, -91499, 87370, -103103, -112922, 447248, 1109036, 1248722, 1036242, 1041029, 1273412, 1290815, 988930, 653599, 412986, 198793, 91159, 193487, 309095, 190982, -57677, -248775, -532145, -1060742, -1455741, -1181734, -352574, 384479, 725381, 940135, 1215570, 1309367, 1018998, 570534, 315548, 330470, 520798, 869012, 1296899, 1425186, 853173, -200118, -840751, -435667, 513371, 890298, 392640, -150567, -125325, -57822, -578789, -1160500, -899538, -123479, 29024, -502996, -604128, 55413]
41267E5413L30875o57911p49287P2052L37534l16288o33874l6477M82879K62663
41257h52421J7906K89563M35205j4597m22229l34369l55693p91937p44253L28385
41247b444440J341417J131298K43259j43409j47564n60466j017067m68654Q24961
41238a240665J393775P17901r4002o8926L53454K81349k73329o08923m16192r4599
41228e0157j13932l93909m39406p0941K02673j25626o39654l95812O60451J419721
41218E3408J100975K93684l0928R9145k7862n70667r64091p70272j36831M43844
41208e09595N04912K2491l42719N7906P41147M94703p20160j321620l26018J027293
41198c71660R95458j74088q44149m91987p3750j38422j46232K13344M16896J61306
$$ y = [55413, 386288, -271623, -1020910, -948858, -611324, -927612, -1561486, -1597963, -1115084, -852421, -834515, -544952, -109747, -124344, -546573, -880942, -1236635, -2028572, -2772825, -2444440, -1103023, 28275, 271534, 128125, -19439, -579905, -1596972, -2065626, -1240665, 153110, 871011, 777009, 708083, 1061537, 1342886, 1069557, 460634, 44442, -50157, -164089, -557998, -997404, -1068345, -865672, -991298, -1630952, -2026764, -1366313, 53408, 1154383, 1448067, 1417139, 1516284, 1488422, 917755, -46336, -816608, -953439, -509595, -4683, 17808, -324911, -267005, 474142, 968845, 248685, -1072935, -1398953, -371660, 623798, 449710, -394439, -886426, -960176, -1098598, -1244830, -1031486, -614590, -453284]
41188d53284j11725j09605j26859k54778q8350M10239O39487L61569J53272L95179
41178H15145N72652J24609o32581r74625o92273r8294M63439P37470N94564K79232
41168A189338K23945L73292J81918m58748q84053o25072j15609P2282J30794M96284
41158E84371Q87836O79534R4l90935l12353m01912r25294j148320m47142N30439
41148i43682O14258j85110o12680K687P07453L23090p29405r54151O7637J095267
41138f14636J010987K35298j51422O7961L13019K62727P5509j29411k98155j73075
41128E98802L42373P49125N42760N4742N960L72399M72407J29117r5714N8824
41118C230795J00741l30744q17147q01590l76245l4022K350j32105k32386j10862
$$ y = [-453284, -565009, -674614, -801473, -1056251, -1144601, -734362, -94875, 266694, 419966, 815145, 1387797, 1512406, 879825, -94800, -787073, -885367, -421928, 315542, 910106, 1189338, 1413283, 1786575, 1968493, 1509745, 625692, 620, -114989, -42707, 88087, 584371, 1472207, 2151741, 2151835, 1760900, 1448547, 1046635, 121341, -1026979, -1474121, -943682, -329424, -514534, -1127214, -1124527, -417074, -93984, -823389, -1777540, -1709903, -614636, 396351, 631649, 480227, 548188, 861207, 1123934, 1199443, 1070032, 771877, 598802, 941175, 1690300, 2233060, 2287802, 2293762, 2666161, 3138568, 3267685, 3171971, 3230795, 3331536, 3000792, 2183645, 1382055, 1005810, 971788, 974138, 842033, 609647, 498785]
41108D98785L43314R08782J033470L86032o52325j254010r46251p8102N72155
41099H11850O46441M94000M74712L03394l88595j067323p76323K72739O50364
41090A421259k43579j139303p44766L34126O67838K03337j9054J80121L5049m78523
41080B16505m75948J76019M98609K0089n57296o79411o69803o99005k70126O77467
41070a762900J270436R60348L09765o0166l21864o45288n78356M8311N22253L10517
41060E3056j09072j63863o2477o1795J90891P68044Q58046r717r93538j158230
41050f88655q15878o34449l28152N19498J156357O61647l17182l49382N88336
41041b07860J182084Q48649K71387p3791m62860q61293p10551p8491K27717N4369
$$ y = [498785, 842099, 1750881, 2784351, 3170383, 2518058, 1264048, 317797, 239695, 811850, 1458291, 1952291, 2427003, 2730397, 2341802, 1274479, 498156, 770895, 1421259, 1177680, 38377, -706389, -372263, 295575, 498912, 479858, 659979, 695028, 216505, -259443, -83424, 415185, 435274, -122022, -801433, -1471236, -2170241, -2440367, -1762900, -492464, 467884, 777649, 717483, 395619, -249669, -828025, -779714, -257461, 53056, -56016, -219879, -282356, -344151, -153260, 614784, 1472830, 1463113, 469575, -688655, -1504533, -2138982, -2467134, -1947636, -791279, -129632, -446814, -796196, -207860, 974224, 1822873, 2094260, 2020469, 1557609, 696316, -14235, -92726, 134991, 189360]
41031A89360K04073Q92632J090952J03477j169519j382484m98034L84366N00490
41022C15313M6385l61257k84227K85865Q65962Q41017J72265m63436m85393j20229
41012H12265l7280m66725r46586q66536j09852P97750J151618P69394J79000k8935
41002A254113R4256M8495l32759o48564n03725k8933K71020O8342m06176n32856
40992g16787j2423O18322N45137j89603o54123l53521P8119k6333k76256K9052
40982i58416O33160P44723L68448K05618L93411L50295j24274n33185n53209l83071
40972A43500j47270K08346L61585j22105q14228o89966L10106R31695L10112p98046
40962c06271j086353l62989M76576O85633L12012j04961p9617L75632O81452L52494
$$ y = [189360, 393433, 1286065, 2377017, 2480494, 1310975, -71509, -569543, -185177, 315313, 361698, 441, -283786, 2079, 868041, 1709058, 1881323, 1417887, 932494, 812265, 774985, 308260, -638326, -1504862, -1614714, -816964, 334654, 1104048, 1283048, 1254113, 1348369, 1396864, 1064105, 415541, -88184, -117117, 153903, 222245, -183931, -716787, -729210, -110888, 434249, 244646, -409477, -762998, -684879, -711212, -987468, -958416, -325256, 419467, 787915, 993533, 1386944, 1737239, 1612965, 1079780, 526571, 143500, -3770, 204576, 566161, 444056, -370172, -1060138, -750032, 181663, 491775, -306271, -1392624, -1755613, -1279037, -593404, -281392, -386353, -465970, -90338, 591114, 943608]
40952I43608k77150m70666j80079k8110j95194k13937k0278j60403n77378l35033
40942a514620P64914J387853M85507r84172j355918o12903q7209k00192k0522
40933b137262Q56684J430583Q26045l49262q75662m67589K06885N73349N69212
40924F32983K94137j35629m30952k99263J52835M75854L97496P3216k08900l30231
40914F21546k67571J1551L66670M18839L970m28328k88887K95648N96702L39188
40904A669328M2158N0085p1435o29440r74375m41682L61237K95535m87761o60274
40894h46624K45728J089996Q16810j27912o53686m68267j1027L80240N50165K97352
40884A272775k74769n78124k77279J71564K16524O269m8285l9394k28177l31586
$$ y = [943608, 666458, 195792, 15713, -12397, -207591, -421528, -441806, -602209, -1179587, -1514620, -749706, 638147, 1123654, 139482, -1216436, -1829339, -1916548, -2116740, -2137262, -1280578, 150005, 976050, 626788, -248874, -716463, -509578, 63771, 632983, 927120, 791491, 360539, 61276, 214111, 689965, 1087461, 1160677, 951777, 621546, 353975, 365526, 732196, 1151035, 1155005, 726677, 437790, 733438, 1330140, 1669328, 1711486, 1761571, 1690136, 1060696, 86321, -355361, 5876, 301411, -186350, -846624, -600896, 489100, 1305910, 1177998, 524312, 56045, 45018, 425258, 975423, 1272775, 998006, 419882, 142603, 314167, 530691, 536960, 488675, 449281, 221104, -110482]
40874a10482Q9835P22516P27359j00160r76765j063117l82555L05439L64153n0964
40864d74741j98952K80928Q03920O23288l1943k95660o1512r1973n61310n96089
40854f04044K15949R32892O71643j3110j22788K00949J76835j56701j64682J20190
40844A257133J17253j86602l27239l55066o76174j061628q61520j28364M38904
40835a783303N82975N95919M89101L8721m58792m62542j05694J01858K36930N68785
40825a96042N72676l06810j196572p33245O06719R39742m9664n39867M20081J332067
40815H49085P54087l99042n10404J88750L60065j38604l39031M0213L55187K63065
40805A423371M01k76444m79843l15884J45369J90227m06318p22768j54010L69252
$$ y = [-110482, -20647, 701869, 1429228, 1329068, 352303, -710814, -1093369, -787930, -423777, -474741, -673693, -392765, 411155, 1034443, 1002500, 706840, 645328, 553355, -7955, -604044, -388095, 544797, 1216440, 1203330, 1080542, 1281491, 1458326, 1301625, 1136943, 1257133, 1374386, 1187784, 860545, 505479, -170695, -1232323, -2093843, -2222207, -1783303, -1200328, -604409, -115308, -76587, -535379, -997921, -1103615, -1001757, -764827, -196042, 376634, 69824, -1126748, -1859993, -1253274, -313532, -363196, -903063, -482982, 849085, 1603172, 1204130, 693726, 882476, 1242541, 1103937, 764906, 805119, 1160306, 1423371, 1423772, 1147328, 667485, 351601, 496970, 687197, 280879, -441889, -595899, -226647]
40795b26647r7078o81318m0274J178729J177774l8205o46059J8502N92308K13244
40785A450976j54934K49641N26295j27295p64662k43508P46968P45421j92700
40776B236202p62311m63646K2028K38808M08872N28936K23099l42121m15481J71545
40766A845931O04832K16699n87568r05115m40314K76012N41789J67425l75271
40757A344420m60804n7982J90269j68374p11598o94309p3920M88966N42625K59279
40747F58572k4452j68793p8344L11713P34355O99461J43695l34204j56771M78177
40737B263409P61904J74290q96977j504513j146329l17139J60574K33331N28679
40728B57229J101617J044841j29733j412086j451461l59392N91902P68156N93870
$$ y = [-226647, -323725, -1005043, -1045317, 133412, 1311186, 1272981, 626922, 645424, 1237732, 1450976, 1296042, 1545683, 2071978, 1944683, 1180021, 936513, 1683481, 2428902, 2236202, 1473891, 1010245, 1032273, 1271081, 1679953, 2208889, 2431988, 2089867, 1674386, 1845931, 2450763, 2667462, 2079894, 1174779, 734465, 1010477, 1552266, 1719691, 1344420, 883616, 825634, 1015903, 847529, 135931, -558378, -632298, -143332, 399293, 658572, 634120, 465327, 386983, 698696, 1433051, 2132512, 2276207, 1942003, 1785232, 2263409, 3025313, 3199603, 2302626, 798113, -348216, -665355, -504781, -271450, 257229, 1358846, 2403687, 2273954, 861868, -589593, -948985, -357083, 411073, 1004943]
40719A004943L49626j81423p51849o51361n0540n7489q49484j050829J49395J481496
40709f07515J374216K35692m17898k99531k48862l57369M9110P33186O15439l06223
40699G70245p45300k14846K34904o5370k89547K20578O00832l5356q75780n98486
40689i98126M75498Q92678L27492j16284J96849N66525K54097m16121p15591n42869
40679g5852l19378l07219m17211m31633j81028K99883O69849N49345J041m36688
40669f48891l12089K26407N52523K28890m24225n69308J34345R50284R44234K97439
40659A379609K5923L47149K83092o86674j557805j214221j47889K95290r3444
40650a368970l14460J24018O01452N87118L79199L28405J95586k60353o69913
$$ y = [1004943, 1354569, 1173146, 421297, -230064, -280604, -338093, -1187577, -2238406, -2089011, -607515, 766701, 1002393, 584495, 284964, 36102, -321267, -272157, 461029, 1076468, 770245, 24945, -189901, 45003, -20367, -309914, -89336, 511496, 476140, -399640, -998126, -522628, 370050, 697542, 581258, 778107, 1344632, 1598729, 1182608, 467017, -75852, -395230, -702449, -1119660, -1551293, -1732321, -1432438, -762589, -213244, -212203, -648891, -960980, -734573, -182050, 46840, -377385, -946693, -812348, 137936, 1082170, 1379609, 1405532, 1752681, 2035773, 1349099, -208706, -1422927, -1570816, -1275526, -1368970, -1683430, -1559412, -957960, -370842, 8357, 336762, 532348, 271995, -397918]
40641c97918n10615J44616O57742M73767l01388q44790l64723Q25431J392019
40632A074141O41781l98623l60672M59829N96236k95186r61208n45183K41620
40623D52735M35242J86863J33361K95446L56036L58726M17796K77215k06538o26424
40613B080458o25168m38349l25394l8882N26376P39576P0275q90242j053731k66443
40603b21524N80519P24362K13119m42428p31628l66690M30634R22913N75906k78615
40593A406568q52993q39112n59927l39708j61505P6506L19215M26843L26346J02556
40583i5211k9458K5650N8434j33496l52471l24143k70132n33895p34111j70474
40573b559307Q33009J043466J53963n79950j79268O12818O07055p103j96365K22462
$$ y = [-397918, -908533, -763917, -106175, 367592, 66204, -778586, -1143309, -317878, 1074141, 1715922, 1317299, 956627, 1416456, 2012692, 1717506, 756298, 211115, 452735, 887977, 1074840, 1208201, 1503647, 1859683, 2218409, 2636205, 2913420, 2706882, 2080458, 1455290, 1016941, 691547, 652665, 1179041, 1918617, 1988892, 1098650, 44919, -221524, 358995, 1083357, 1296476, 854048, 122420, -244270, 186364, 1109277, 1685183, 1406568, 553575, -285537, -845464, -1185172, -1346677, -1270171, -950956, -524113, -197767, -95211, -124669, -99019, -40585, -174081, -526552, -850695, -1120827, -1654722, -2388833, -2559307, -1726298, -682832, -528869, -1108819, -1288087, -675269, -68214, -75317, -271682, -49220]
40563d9220N71246N48840L89252J10680l64881o21419k73480J77069p644n54488
40553g4045o04254j33867J43553J08428K76366N74441L16305m65325q21106k90500
40543i70004M87703Q15433O67569K09178m47872q01315k85642O62687Q51633r480
40533A179890q53837q24413l18898j6926J58647N03047P87613P08612M25289J20318
40523A869342l40306q56579q95000l04205L52088O84348R19485J040059M51263
40514B920495q26983j577754q99181M30099J018214O63744J50980j64854m83592
40505A231168o74183l97755L8173j7685m16702l11622M84716J087569P62010q6851
40495A698838n05296j81597K99436K56146k73872o27941m25944j14291k65642
$$ y = [-49220, 522026, 1070866, 1460118, 1570798, 1205917, 584498, 311018, 488087, 480443, -74045, -678299, -812166, -668613, -560185, -283819, 290622, 606927, 141602, -679504, -970004, -482301, 333132, 1000701, 1209879, 762007, -39308, -324950, 337737, 1189370, 1179890, 326053, -498360, -817258, -834184, -675537, -172490, 615123, 1323735, 1749024, 1869342, 1529036, 672457, -222543, -526748, -174660, 509688, 1429173, 2469232, 2920495, 2093512, 515758, -383423, 46676, 1064890, 1728634, 1879614, 1714760, 1231168, 556985, 159230, 197403, 179718, -236984, -548606, -63890, 1023679, 1785689, 1698838, 1193542, 1011945, 1311381, 1567527, 1293655, 665714, 239770, 125479, -140163]
40486a40163n92212l36971M09334O68722O1998n96466n93701k62503o8591K57582
40476a192971Q79288J076946L30260n92250p16730l38352k35265j22049O60555
40467b50568J451973R86728l55626p81027K28022J119608O66712l70080p23509
40458A972233m49874l21648l99738k52524O6991J97839J72071J84779P4572k91819
40448I52882n09804j83184L32413L67748j01101m84726l94532L7763M76677O16142
40438A110278K87296l02015o28376m54501j21031K4282J11066L04892L27929m4152
40428F15668l79194j50511L28526K72438l30200o06135r9974N10505L97570k18232
40418C40461l97122K02117Q65668P46957j26217r55625j072064n01133K64011
$$ y = [-140163, -732375, -1069346, -660012, 8710, 70708, -525758, -1119459, -1381962, -1450553, -1192971, -313683, 763263, 1093523, 501273, -215457, -553809, -789074, -911123, -250568, 1201405, 2188133, 1832507, 1051480, 1279502, 2399110, 3065822, 2695742, 1972233, 1522359, 1200711, 800973, 548449, 615440, 813279, 985350, 1170129, 1244701, 952882, 443078, 259894, 592307, 960055, 858954, 374228, -20304, 17459, 494136, 1110278, 1397574, 1095559, 467183, 12682, -108349, -84067, 26999, 331891, 659820, 615668, 236474, 85963, 414489, 686927, 356727, -249408, -349382, 161123, 558693, 340461, -56661, 145456, 1011124, 1758081, 1631864, 676239, -395825, -896958, -632947]
40409f32947P66998Q12806M50931o1564l87248l70151j34683J30102L35770L73017
40399A283031R8169l43515m61798l8409M20270K84103k94443n80536l10010J8023
40389G4885j1173j38739N2353M44200N42821J38301m19236n34305N4801Q80739
40379A084647J071109L55454m47973m27953J13695O5263p77184j279407o17716
40370h60065M57773O89577R0916j95090L69053R47849N08479p67959j640017j223807
40360a623291N9097J056187J198410Q97814O49777L16943l04746p57541n08385
40351I84265N8042J30620j96752j08346M12250M26546l08167p54951k40990M49877
40341H52394L99884p2244k82132m18251p82184p05456L80171J467447J143239
$$ y = [-632947, 134051, 946857, 1397788, 1336224, 948976, 578825, 444142, 574244, 910014, 1283031, 1381200, 1037685, 575887, 537478, 957748, 1241851, 947408, 366872, 56862, 74885, 63712, -75027, -22674, 421526, 964347, 1102648, 683412, 149107, 203908, 1084647, 2155756, 2511210, 2063237, 1635284, 1748979, 1814242, 1037058, -242349, -860065, -402292, 287285, 378201, 183111, 552164, 1500013, 2008492, 1240533, -399484, -1623291, -1564194, -508007, 690403, 1588217, 2237994, 2554937, 2250191, 1492650, 984265, 1042307, 1172927, 976175, 867829, 1280079, 1706625, 1398458, 643507, 402517, 852394, 1252278, 1180034, 897902, 479651, -302533, -1007989, -627818, 839629, 1982868]
40332A982868j32741n47895L35732R99058L58235p60043j055810m29315L94832
40323A144921R00421Q37661J26379p31482r12348m12774j46029m93225o83372
40314c69848j48216M84874M77870J56593J43690K18668q8232m27213j85282L95804
40304F58708O54049N97517N59552K62465n99577j247410o64714N94586R07041
40295A722217Q82o05630J8512Q67225P64008J52305L5101J67839l24298j130522
40285A667639j018437J96895J238735J134099L52720j64419k22473j22935O8752
40276C130576L42055L06936l31114j066785j040945j98447N62099N33444K9609
40267B267428j90667R857N0400m79855j183149j255392m23203O75993J129072
$$ y = [1982868, 1850127, 1302232, 1637964, 2637022, 2995257, 2235214, 1179404, 750089, 1144921, 2045342, 2883003, 3009382, 2277900, 1365552, 952778, 806749, 313524, -369848, -518064, -33190, 444680, 601273, 744963, 963631, 875399, 448186, 262904, 658708, 1312757, 1910274, 2469826, 2732291, 2132714, 885304, 220590, 815176, 1722217, 1723099, 1117469, 1135981, 2003206, 2767214, 2919519, 2954620, 3122459, 2798161, 1667639, 649202, 846097, 2084832, 3218931, 3571651, 3407232, 3184759, 3061824, 3130576, 3472631, 3779567, 3448453, 2381668, 1340723, 1142276, 1704375, 2237819, 2267428, 2076761, 2086618, 2137018, 1657163, 474014, -781378, -1204581, -528588, 600484]
40258F00484P14239P3534j33616Q97k7441k54153k24645J33480K41424k23220
40248I00983p08261n95448j86174j85745m90188l42761L37853O99624K66154l27186
40238f31149l34961P5225L48624M65904O61615P16479L10217k38314l65203j85558
40228H22879k49069n29637m91181r6868J39322J54037M16451Q00152M37756p76013
40218F27829j528489p69674O98985J306944Q61143M79793O42382N84820j66146
40209B737587q35787o01319Q3554J86938l35695n32680J01419R38487J120150
40200B862654N65619j99706p74493j048096r38988m67247m618L6578j67862N9
40190a36100O46142J039323O12013j41904l42664k0973l569n43631q71854l74737
$$ y = [600484, 1314723, 1388257, 1254641, 1255538, 1228097, 973944, 749299, 882779, 1124203, 900983, 192722, -402726, -588900, -774645, -1264833, -1607594, -1269741, -570117, -303963, -631149, -966110, -890885, -542261, -76357, 585258, 1301737, 1611954, 1373640, 1008437, 822879, 573810, 44173, -447008, -543876, -404554, -250517, 165934, 966086, 1403842, 627829, -900660, -1670334, -971349, 335595, 1196738, 1676531, 2318913, 2903733, 2737587, 1901800, 1300481, 1384035, 1570973, 1235278, 702598, 804017, 1742504, 2862654, 3428273, 3228567, 2454074, 1405978, 466990, -257, -4875, 31703, -136159, -136100, 510042, 1549365, 2161378, 2019474, 1676810, 1655837, 1652268, 1108637, 236783, -137954]
40180a37954M70855P90831M38110o0464k86469j61987K66164P38614P30523L0397
40170B818620p94052r95863n40868N9970N35689Q71731Q06058J03469p41828q97954
40160A224972l51216J16188J85145L39822P31712P11212K913n81513l43142J66831
40150B202924R3530k74348o0444O00320O87723o2790p53486p14611l13720o4616
40140A340482J73988O05836Q28659M19238k49532m14968O3140O12528P55801N66578
40130D701750L40449J69579o1678m28032p91471q91056o72476m59115n61470p37769
40120F08711m13209M43689J080763Q95333K60310l741K55977M56753K55224J7739
40110C857549J38564L58126J55983l96284o33077k03863L75253L36598l48748
$$ y = [-137954, 332901, 1123732, 1561842, 1501378, 1214909, 1052922, 1319086, 2057700, 2788223, 2818620, 2024568, 1028705, 487837, 547807, 1083496, 1955227, 2761285, 2864754, 2122926, 1224972, 873756, 989944, 1175089, 1514911, 2246623, 2957835, 2960748, 2379235, 2036093, 2202924, 2296454, 2022106, 1961662, 2561982, 3249705, 3186915, 2433429, 1718818, 1405098, 1340482, 1514470, 2120306, 2948965, 3368203, 3118671, 2703703, 2766843, 3379371, 4135172, 4701750, 5042199, 5211778, 5150100, 4722068, 3930597, 3039541, 2367065, 1907950, 1346480, 608711, 195502, 639191, 1719954, 2615287, 2875597, 2871856, 3127833, 3584586, 3839810, 3857549, 3996113, 4354239, 4510222, 4113938, 3480861, 3276998, 3652251, 3988849, 3640101]
40101C640101r35246q54254l37123O5888K18790L04832K91805K2534k65306j01723
40091B050298M59256Q11539O93844N38078O51979O70780K71915j47823j34868
40082E864998j6164k78373m96642J09988J179601J385967L44517o97646n68611
40073F827635L17159Q20045O97523N06796M18805J33983k38361k13825J01517
40064I371277k5978p74907j313321r48789j46153J50464j53681k66458K75383
40055F167837Q96307P20965k24445q96438m38589P18844J333455R26253L50086
40046I554275M72536Q72229N70703l04102o06046N4728O93196M82012o8824j06670
40036A1614037K05234J73324j75940k82959j20122j08290j85649O9258M62963
$$ y = [3640101, 2704855, 1850601, 1513478, 1579366, 1798156, 2102988, 2394793, 2417327, 2152021, 2050298, 2509554, 3321093, 4014937, 4553015, 5204994, 5875774, 6147689, 5999866, 5864998, 5848834, 5570461, 5073819, 5183807, 6363408, 7749375, 8093892, 7396246, 6827635, 7144794, 7964839, 8662362, 9169158, 9587963, 9721946, 9483585, 9269760, 9371277, 9345299, 8570392, 7257071, 6308282, 6162129, 6312593, 6158912, 5892454, 6167837, 7064144, 7785109, 7560664, 6664226, 6225637, 6944481, 8277936, 9204189, 9554275, 10026811, 10899040, 11469743, 11165641, 10559595, 10614323, 11307519, 11789531, 11720707, 11614037, 11819271, 11992595, 11816655, 11533696, 11413574, 11305284, 11119635, 11188893, 11651856]
40027A1651856L23619k92561m74744K09292J086749J408855J241551R45317M99197
40018A6599131j29932n11771k18207N71110J315531J649592J457952Q86309M95034
40009B2114749Q06223J419793J294940L16355k37873N75487J967532K597494K431177
40000C3285877K341742K413708J985797J216032J222654K385178L612447L785370
39992E2248805L140194K742340L167067M125766M982162N309880N227743N347426
39984H6291383O141734P391445Q566823R555837J0531117J1377443J1952634J2658019
39976A64466435J3860520J4958127J5125042J4873228J5465814J6572576J6100275
39969B71422017J3021519Q840315N211922J572066l333617q697518j2397162j4023156
$$ y = [11651856, 11975475, 11682914, 11208170, 11417462, 12504211, 13913066, 15154617, 16099934, 16599131, 16469199, 15957428, 15739221, 16310331, 17625862, 19275454, 20733406, 21619715, 22114749, 22920972, 24340765, 25635705, 25952060, 25714187, 26289674, 28257206, 30854700, 33285877, 35627619, 38041327, 40027124, 41243156, 42465810, 44850988, 48463435, 52248805, 55388999, 58131339, 61298406, 65424172, 70406334, 75716214, 80943957, 86291383, 92433117, 99824562, 108391385, 117947222, 128478339, 139855782, 151808416, 164466435, 178326955, 193285082, 208410124, 223283352, 238749166, 255321742, 271422017, 284443536, 293283851, 298495773, 300067839, 296734222, 288036704, 275639542, 261616386]
39961B61616386j5203038j6854883j7933044j7407262j5956635j4845940j4203516
39954A49212068j3341597j2062810j0755275r617353q556137p629739o990566
39947H0258591o519317n959721n300975m689322m111791l485541k923398k619907
39939D4648619k586753k725092k983992l193138k962398k146225j305412j238697
39931B5506912j943805k424900j803661m17606N10982K67963o06812j085516q74083
39922A7129474n54206o57209j054709j355407j450916j382614j045387m58090
39914I170936o5695k33698n67859l47861L32894N28801k03039j033408r34126
39905F646945o3745N48533M38770J06601K0631p989k20723l64303k21309j67324
$$ y = [261616386, 246413348, 229558465, 211625421, 194218159, 178261524, 163415584, 149212068, 135870471, 123807661, 113052386, 103435033, 94878896, 87249157, 80258591, 73739274, 67779553, 62478578, 57789256, 53677465, 50191924, 47268526, 44648619, 42061866, 39336774, 36352782, 33159644, 30197246, 28051021, 26745609, 25506912, 23563107, 21138207, 19334546, 18916940, 19427922, 19695885, 19089073, 18003557, 17129474, 16575268, 15918059, 14863350, 13507943, 12057027, 10674413, 9629026, 9170936, 9105241, 8871543, 8303684, 7955823, 8288717, 8817518, 8614479, 7581071, 6646945, 6583200, 7131733, 7570503, 7677104, 7697735, 7689746, 7469023, 7104720, 6883411, 6716087]
39895F716087n67224r64641o40459J59647M20307j07422m62908L5372P12324O38833
39885E939916J01526Q501K90007O5640o92828q97138l8465R31683R76705L62680
39875G048227l1741r9566l44009p53318p32406o9986P21561J071036Q73527L61778
39865H045103j37116l37404k28927j25200k11878k28096N8742K98484j3149o67964
39855F452595q75196l19434L97072N32915O6842m10802m18084j6234L35313K43615
39845E988602k29982o25300n84955k44771k8825j43021m19428o02737o10805m81179
39835B017599j98060K71081P14704O37692j78241j080158j043957m0473O98938
39826A799125L15327m25662l71942J49780q611o84806n87415L52986O40112k82037
$$ y = [6716087, 6148863, 5184222, 4543763, 4703410, 5123717, 5016295, 4553387, 4588759, 5301083, 5939916, 6041442, 6049943, 6339950, 6405590, 5712762, 4815624, 4777159, 5708842, 6685547, 7048227, 7016486, 6916920, 6572911, 5819593, 5087187, 5017201, 5738762, 6809798, 7683325, 8045103, 7907987, 7570583, 7341656, 7216456, 7004578, 6776482, 6835224, 7133708, 7120559, 6452595, 5577399, 5257965, 5655037, 6187952, 6254794, 5843992, 5425908, 5409674, 5744987, 5988602, 5758620, 5133320, 4548365, 4303594, 4274769, 4131748, 3712320, 3109583, 2498778, 2017599, 1819539, 2090620, 2805324, 3443016, 3264775, 2184617, 1140660, 1100187, 1799125, 2114452, 1688790, 1316848, 1466628, 1458017, 773211, 185796, 538782, 1178894, 896857]
39816H96857r98464m83004K57109J17519j74771L54978Q93432L06952n38040r2754
39806E39814J068460J069259j28417p74088l50856j47181o37701o69731J83788
39797A53347O60148L3999o21044l59534J56222J13703o9528J23277K19280j25078
39787B84792k30214K96781O00123L0190o20062m67218J0289M6474j472M05708
39777C55391O83560J63873m47505j20243O97391P80346Q2608m15169l85984l36228
39767A058040m16799l04374m7545N3356J45990M32293M86895n838l35878K32779
39757A298919J008157P33910m08914j025822n74721J21265L72485L38020J92221
39748B055520j79349m91454k00326M66408O48541J94713j37600O221R4266k08899
$$ y = [896857, -101607, -584611, -327502, -209983, -384754, -29776, 863656, 1170608, 632568, 539814, 1608274, 2677533, 2549116, 1775028, 1424172, 1276991, 639290, -30441, 153347, 813495, 847494, 226450, -133084, 23138, 136841, 67313, 190590, 409870, 284792, 54578, 351359, 951482, 981672, 361610, -105608, -95319, -48845, -50317, 355391, 1038951, 1202824, 755319, 635076, 1332467, 2112813, 2195421, 1780252, 1394268, 1058040, 641241, 336867, 289322, 342678, 488668, 920961, 1407856, 1402018, 1066140, 1298919, 2307076, 3040986, 2632072, 1606250, 1031529, 1152794, 1525279, 1863299, 2055520, 1876171, 1384717, 1184391, 1650799, 2299340, 2494053, 2356453, 2362674, 2456940, 2248041]
39738B248041m76502m02713l46863n46826n65678l7745O27997Q06615N26548L33661
39728B166535M86660O17124K10761o42693j129358o43731K36242L38920m02856
39719A237604p11737J31783J106551R55117o50n66342m82431l86005n15881o07141
39709A60868o39671o23530j37966Q39186J277600N03984m30642k28980N22233
39700A243082L98457l45406l29232L17724J66826p52709q23040K43149P63927
39691H82778L306o00933m9492N82433L04851m3730L55143N55843l79556j403855
39681B06788j068606J05827N98009K72665R3685K04944j2947m51766l88029J67889
39671b71541N00586L55529O0323k10189m01006k35306K55928M03287o7637l52049
$$ y = [2248041, 1771539, 1368826, 1021963, 475137, -90541, -128286, 499711, 1306326, 1832874, 2166535, 2653195, 3270319, 3481080, 2838387, 1709029, 1065298, 1301540, 1640460, 1237604, 525867, 657650, 1764201, 2719318, 2718668, 2152326, 1669895, 1283890, 768009, 160868, -478803, -1102333, -1240299, -401113, 876487, 1380471, 949829, 720849, 1243082, 1641539, 1296133, 966901, 1284625, 1451451, 698742, -124298, 118851, 882778, 886084, 285151, 235659, 818092, 1122943, 1079213, 1434356, 1990199, 1610643, 206788, -861818, -755991, -157982, 114683, 208368, 413312, 400365, -51401, -439430, -271541, 229045, 584574, 644897, 434708, 33702, -201604, 54324, 457611, 389974, 37925]
39661C7925J56108O90680L50596k65628l5830O83971N81612m08862j000928o26382
39651A63262j35343k00358l31876M7674N60178M99711r8815n20900k51329M39168
39641A71372P27893J63557o21850n61524L46511Q94267L98331k74192j05081M89199
39631A628483M58715j58781m90342l83780m74832q36272p24285J86157J197887
39622D02950J436127P35084l54603j007871p23346R2893M08379j56323p44132
39613H9158m32781N31925J239690J278077P70300r2146q37897p52395O0170M26855
39603B280956j78383n92144K02921J181681P68856n62585j021905l43908P9540
39594A815029k58682l61626J63491L85366m3686j24547N50051P78115k59162j382029
$$ y = [37925, 194033, 884713, 1235309, 969681, 933851, 1617822, 2199434, 1790572, 789644, 163262, 27919, -172439, -504315, -456641, 103537, 603248, 504433, -16467, -267796, 171372, 899265, 1062822, 440972, -120552, 225959, 1120226, 1518557, 1244365, 1139284, 1628483, 2087198, 1928417, 1438075, 1054295, 579463, -256809, -981094, -794937, 402950, 1839077, 2574161, 2219558, 1211687, 488341, 581234, 989613, 833290, 89158, -343623, 188302, 1427992, 2706069, 3476369, 3384223, 2546326, 1793931, 1854101, 2280956, 2102573, 1510429, 1713350, 2895031, 3663887, 3101302, 2079397, 1735489, 1815029, 1556347, 1194721, 1358212, 1743578, 1699892, 1575345, 2125396, 2903511, 2644349, 1262320]
39584A262320j077196K02119P39972J3958p92713o01127K29730N97418J32045
39575G06526m03869j77410N17148N72375l24109j066283o28907M58085R46946
39566F00502O38544K82388J16484k82205q49118r59940n53238k25921j28466J94277
39556a166693P79698J083155R16539N80329P8107p40787j312914q58405K03785
39547d37186O16001J85286j1299M48775O25977j03251r78875j084713n45660P2920
39537a212025N66863P81167M38013k42277n80767m24032k60801k30711o042K80395
39527h90217J40785j82474o587M05093J99172l25750n2442P76479P04979k87562
39517D81476n00770M76474Q24879l82563j451515r02616J45502J66613j94835
$$ y = [1262320, 185124, 387243, 1127215, 1141173, 348460, -252667, -22937, 574481, 706526, 302657, 125247, 642395, 1214770, 890661, -175622, -804529, -346444, 600502, 1239046, 1521434, 1637918, 1355713, 506595, -453345, -1006583, -1232504, -1360970, -1166693, -386995, 696160, 1612699, 2193028, 2271135, 1530348, 217434, -640971, -437186, 178815, 364101, 352802, 801577, 1427554, 1324303, 345428, -739285, -1284945, -1212025, -645162, 136005, 574018, 331741, -249026, -673058, -933859, -1164570, -1170612, -890217, -749432, -931906, -938493, -533400, -334228, -659978, -712420, 64059, 769038, 481476, -19294, 457180, 1282059, 899496, -552019, -1454635, -1309133, -1142520, -1337355]
39508a337355K74929R29893O02557r3617n115L00332k43119q81821l10017P41377
39498b1956O60028r8080J86931J270508J221019k08307j114558n81092J37601
39489A452094K7402k80661j46550j8991j75436n6952M19595M08141k91546n99671
39479G37425J35302R88819P97858k81005j194485j251623n39470K95296M91290
39470A79407k4416l88217j7910L54882j44426q89836o62044K50374N20816J04898
39460g16472K33229J079075J387254P21690J56074K19013L1019q06807j259832
39451A044243o84345J9117K7889j37908N1319K3229n77649q52648j38584O96131
39441e29206O56647J79588P7456O6043l33882m96713K30874J032559P34963k52420
$$ y = [-1337355, -1062426, -132533, 470024, 376407, 371292, 671624, 428505, -453316, -763333, -21956, 638072, 539992, 726923, 1997431, 3218450, 3010143, 1895585, 1314493, 1452094, 1479496, 1198835, 1052285, 1033294, 857858, 800906, 1220501, 1628642, 1337096, 737425, 872727, 1861546, 2659404, 2378399, 1183914, -67709, -607179, -311883, 179407, 154991, -233226, -251136, 103746, -40680, -930516, -1592560, -1342186, -821370, -716472, -483243, 595832, 1983086, 2704776, 2860850, 3079863, 3110882, 2304075, 1044243, 359898, 379015, 406904, 268996, 320315, 343544, -234105, -1086753, -1225337, -529206, 127441, 307029, 384485, 450528, 116646, -380067, -149193, 883366, 1618329, 1365909]
39431A365909o07176j70029J23378k6979r4485q415k07973n32566l84963N1170
39421d92129M6826k25495J63124J125976J319220J79411j008087q58092J97589
39412D48343O64519R4242n46463m38676P7875K72459J04401K2797N3584k33099
39402E19982q26037j007152l21575O92924J216453J151987Q46294K68268o91817
39393A849327j415181j106567j27868K88585j90655n93481k98677L3584k48590
39384a809523o05043k30867N87131R19638N27140j9756k34806j19322R0981J47982
39374g46445m060k1277M47335J026167Q88186j4441p15828n61759k4132J97434
39364D71180J00872o4009l64778p32201o77548p8959M20246L66396J58569K24481
$$ y = [1365909, 758733, 588704, 712082, 685103, 590618, 582203, 374230, -158336, -543299, -492129, -445303, -670798, -507674, 618302, 1937522, 2116933, 1108846, 250754, 448343, 1112862, 1207104, 660641, 221965, 299840, 572299, 676700, 699497, 753081, 519982, -306055, -1313207, -1634782, -941858, 274595, 1426582, 2272876, 2541144, 1849327, 434146, -672421, -800289, -511704, -702359, -1295840, -1594517, -1560933, -1809523, -2414566, -2645433, -2058302, -1138664, -611524, -631280, -866086, -985408, -894427, -746445, -750505, -771782, -324447, 701720, 1589906, 1575465, 859637, 297878, 273746, 471180, 572052, 508043, 143265, -588936, -1266484, -1345443, -925197, -558801, -400232, -175751]
39354a75751L12073J89316K11715N15093M96009j40814o54911m07531R7373J56338
39344E98910l378N1509k798m56447o89299k21368K05341j69694o58352k31086
39334a576662O39235P26115M9036l98859m24445n70973o91127k04901M97395N25689
39324a429497J56948L99021J039169Q52702k20261q43609m44645L6058j08917
39315e63031l76790k34321Q7933L62427O84606P73107J99292n40849n20365n184
39305a33175p6714n96485l33122O70834Q58373j98725r49190m40182K53970J84668
39295g59748J25861P34544R95490P5562r05743o74370M8297k6059m60733j45731
39285i92630M61529K04453m91973l07108N70513P93387K61289J31624N49137L73806
$$ y = [-175751, 136322, 325638, 537353, 1052446, 1548455, 1407641, 752730, 345199, 442572, 598910, 595532, 647041, 644243, 187796, -501503, -722871, -517530, -687224, -1345576, -1576662, -937427, -211312, -162276, -561135, -985580, -1556553, -2247680, -2452581, -1955186, -1429497, -1272549, -873528, 165641, 1018343, 798082, -45527, -490172, -454114, -563031, -939821, -1174142, -1086209, -723782, -39176, 733931, 933223, 392374, -127991, -133175, -209889, -806374, -1139496, -468662, 389711, 190986, -758204, -1198386, -944416, -759748, -633887, 100657, 1096147, 1171709, 265966, -408404, -360107, -386166, -846899, -992630, -531101, -326648, -818621, -1125729, -555216, 238171, 499460, 631084, 1180221, 1554027]
39275A554027o62977j363100r82423j76857L44133O75547Q45719M59903l05723
39266C88249n67542p6103L83547L32597K46402M36032L88605k19768q27069q79314
39256c94364n77388k39066K21712O84956O09378L0760j13861O06310J190837N67282
39246B586556p55594j354425q06122J9719L80355M25658M74044L49539j82318
39237A137412q00154r16575m53924M2394J44660R0392L05724O18061N03419R2494
39227G63903J49442P56934R10039O8332p68858n33041J64975R8428m08361j10315
39217A091478O83509L50260j119975j658536l87876P78258J61490r57951n18838
39208a578181Q99544J099111j67984j033493o30622r6020k63582m21208O2273
$$ y = [1554027, 891050, -472050, -1454473, -1631330, -1287197, -611650, 234069, 693972, 388249, -179293, -255396, 128151, 460748, 707150, 1143182, 1531787, 1312019, 484950, -394364, -971752, -1210818, -989106, -304150, 305228, 335988, 222127, 828437, 2019274, 2586556, 1830962, 476537, -329585, -309866, 70489, 496147, 970191, 1319730, 1137412, 337258, -579317, -1033241, -990847, -846187, -755795, -450071, 167990, 671409, 763903, 913345, 1670279, 2580318, 2648650, 1879792, 1346751, 1511726, 1610154, 1201793, 1091478, 1774987, 2125247, 1005272, -653264, -1041140, -262882, -101392, -1059343, -1578181, -678637, 420474, 252490, -781003, -1411625, -1507645, -1771227, -2192435, -2130162]
39199b130162O01851O30816N39829O20914L62952l69895o43962R8062R08276O94731
39189A313412j21803m10628j18423o9399m06251m34584Q4314N17860L35400k57246
39179D32652p44203p83812k69977N50837J045319P68882M3924m42015m66423k67545
39169a32361L0100L92554M82958j2487p25846r23064m61454J48670N37191O66623
39159B884L75880m04726r85291m57584Q53411J453716O40578m96708o38696J3987
39149C57451L45666M3642k44456j37753M2717K7282K845J30306K17733N8231k52228
39138E91436m54064l84004j01339J17373N4730n8883K52432Q98467J052396K33735
39128B202279q26124j007793k53626M54538M35945m2885m40438n78017m82096
$$ y = [-2130162, -1528311, -897495, -357666, 263248, 626200, 256305, -387657, -289595, 618681, 1313412, 1191609, 780981, 662558, 593159, 186908, -247676, -163362, 354498, 689898, 432652, -311551, -1095363, -1365340, -814503, 230816, 999698, 1043622, 601607, 135184, -132361, -102261, 290293, 773251, 760764, 34918, -888146, -1349600, -1200930, -663739, 2884, 378764, -25962, -1011253, -1468837, -615426, 838290, 1478868, 982160, 343464, 357451, 703117, 746759, 502303, 364550, 407267, 434549, 437394, 567700, 785433, 843664, 591436, 137372, -246632, -347971, -230598, -175868, -234751, 17681, 916148, 1968544, 2202279, 1376155, 368362, 114736, 569274, 1005219, 962334, 521896, -56121, -538217]
39119e38217j84545J17114J76299J45635M51893J055222J317293Q57405R9553
39110C497652l38353m08893m23102m00219r8863M22398P01267M02693k73457q01131
39100B279992q45635n20744j70848K2929J25349J69829L8850k44031l62108j30574
39090C63009J30261K2601k77774k66808M9506J14081k76587n70745k49566M00603
39080e61419O73061L37734j91968m18863j80961L55019P95459O76457j30016j070153
39070B84350j247946l62667P86701J028188J33992q63857r09271k07181J77122
39061a180569j62055n40032l69231K3571J88676L86772Q93137J095887L09802
39052F45958q38418r89988k7363O59928J76230o47537n87677K39043P56572N32773
$$ y = [-538217, -722762, -605648, -429349, -283714, 168179, 1223401, 2540694, 3398099, 3497652, 3159299, 2750406, 2327304, 1927085, 1828222, 2250620, 2951887, 3354580, 3081123, 2279992, 1434357, 913613, 742765, 765694, 891043, 1060872, 1099722, 855691, 493583, 363009, 493270, 515871, 238097, -28711, 20795, 134876, -141711, -712456, -962022, -561419, 111642, 449376, 257408, -161455, -342416, 12603, 808062, 1484519, 1354503, 284350, -963596, -1326263, -539562, 488626, 622618, -241239, -1150510, -1357691, -1180569, -1342624, -1882656, -2251887, -2228316, -2039640, -1652868, -759731, 336156, 645958, -192460, -1182448, -1209811, -549883, -373653, -1021190, -1608867, -1369824, -613252, -80479]
39042h0479J56033J59925L09894J33558k95614m40757o6546L77875L25977j20263
39032D59603l56636k24412k27107n66638o35960j8887O30165N02142p5862k34158
39022g47750n1240k93670q67947q27896j565O58522O06414L78637L89622K54227
39012e02646j97164l78924l1614K13896r962j16318K98290O50448M50699J82661
39002E59366K96691L27247j03187l99334r0736J70015k09713n42114m2256O55252
38992F21231N10151j61310l62363j90286m29236q97683p64813j62897M2336j56346
38982a951216j8089M47930N45023K75418K35901L29075N0641j90602L23282R19685
38972I67048L08452r89082j042792L96154J329195O12697m56491n29172j81820
$$ y = [-80479, 75554, 235479, 545373, 678931, 383317, -57440, -123986, 253889, 579866, 459603, 102967, -121445, -348552, -915190, -1551150, -1570037, -939872, -437730, -513592, -747750, -798990, -1092660, -1960607, -2788503, -2790068, -2131546, -1525132, -1146495, -756873, -502646, -699810, -1078734, -1110348, -896452, -906414, -1022732, -724442, -73994, 376705, 559366, 856057, 1183304, 1080117, 680783, 590047, 760062, 550349, 8235, -34021, 621231, 1131382, 970072, 607709, 417423, -11813, -909496, -1674309, -1837206, -1794870, -1951216, -1969305, -1521375, -976352, -700934, -465033, -135958, -85317, -275919, 47363, 967048, 1275500, 286418, -756374, -360220, 968975, 1581672, 1125181, 596009, 414189]
38963D14189l30969m81268L88L84460o6037m87338J81975J179541J018915p3785
38953A740071n26056J29279P30808L59351n54323j091460q61838q6882O37958
38944D76908P11578J76731k24255o6311J52959q3641m47236m62664l82867n40904
38934f89702n01343J66984Q54138P12291L0290k76130j38894j78254m14345l22632
38924g57597M4554J53992M7256J58277K45258k62651r52357q05189N0839L66732
38914a710886j95608m75820K38568J026698Q63406J91321K1954L44345M43557
38905G47535J92116K2713j3816k42985n89620n82186j09510L99015N45086L03991
38895F72339j29297m71328m33271k8772K93934J53174k30405l23526j9272K70527
$$ y = [414189, 83220, -398048, -397660, -13200, -79237, -566575, -384600, 794941, 1813856, 1740071, 1214015, 1343294, 2074102, 2433453, 1879130, 787670, -74168, -161050, 476908, 1188486, 1365217, 1140962, 1074651, 1227610, 1143969, 696733, 234069, -148798, -689702, -1191045, -1024061, -169923, 542368, 572658, 296528, 157634, -20620, -434965, -757597, -713043, -559051, -511795, -353518, -108260, -370911, -1323268, -2128457, -2077618, -1710886, -1906494, -2382314, -2143746, -1117048, -253642, -62321, -40367, 303978, 747535, 939651, 962364, 948548, 705563, 115943, -466243, -575753, -176738, 368348, 672339, 543042, 71714, -361557, -390329, -96395, 56779, -173626, -497152, -516424, -245897]
38885b45897K61600J88031L96752P54835P02983m1247r67909j208052n76366J01335
38875f33935J5918n03409m40145L78155R03300L23591p26460j004297l35277K66765
38865a755794P7389m38676m09101K86028R81219J050618M46384l77228p77918
38856i17079l57207N63060J038003M99289m24360o12896O590L19107l15854j034612
38846a235959p42785K25770O87336M60749M35287Q07682O02362n63684j464263
38837g87505r29524L58803Q56536L68257K3470K91284L64618k58537p93214m05211
38827i11023M19370N84941J4030l26318M7377M16654j202p94507q73210m3383
38817a467271O67700M53527j79509k85052Q8022J47853k25231l18188J03477L59520
$$ y = [-245897, 15703, 203734, 600486, 1355321, 2058304, 2017057, 1049148, -158904, -735270, -633935, -618017, -1121426, -1561571, -1183416, -280116, 43475, -682985, -1687282, -2022559, -1755794, -1678405, -2117081, -2526182, -2240154, -1258935, -208317, 238067, -139161, -917079, -1274286, -711226, 326777, 826066, 401706, -211190, -204600, 114507, -201347, -1235959, -1978744, -1752974, -1065638, -604889, -169602, 638080, 1240442, 676758, -787505, -1717029, -1358226, -501690, -133433, -109963, 181321, 545939, 287402, -505812, -911023, -491653, 93288, 107318, -219000, -171623, 245031, 243829, -550678, -1423888, -1467271, -799571, -346044, -525553, -810605, -722583, -574730, -799961, -1118149, -1014672, -655152]
38807f55152P5914j40758J67416L98537q6348p59041p08642j10565J30412j13356
38797a801583j21903L30009O00610K95809j05851j7481M75203Q21694N79915k52543
38787H03879j078844j013525J14601J245966J226784K95187l39177k68038k64011
38778G22822p84499j135205n86488M73704J096872R67831N05845J31828p4485
38769A318225j68190j61931l6153J84815L27710J47695l04912n78132l70510K6615
38759C85232J84825J35010O2058j97934p10094q82254k00084P59112R92811N48384
38749A077066K87480L29993k7558p83321r60508k21029M77760L41142k41525o46861
38739c67361q99523j015871n54072M59492J140426J020092P51956Q21638O35451
$$ y = [-655152, -579238, -719996, -552580, -154043, -240391, -999432, -1708074, -1818639, -1688227, -1801583, -1923486, -1593477, -992867, -697058, -802909, -820390, -345187, 476507, 1056422, 803879, -274965, -1288490, -1173889, 72077, 1298861, 1594048, 1254871, 986833, 722822, -61677, -1196882, -1783370, -1309666, -212794, 755037, 1260882, 1392710, 1318225, 1150035, 988104, 951951, 1136766, 1464476, 1612171, 1307259, 729127, 358617, 385232, 570057, 705067, 767125, 569191, -140903, -1023157, -1223241, -464129, 528682, 1077066, 1364546, 1694539, 1666981, 883660, -76848, -297877, 179883, 521025, 279500, -367361, -1266884, -2282755, -2836827, -2377335, -1236909, -216817, 535139, 1356777, 1992228]
38730A992228j89871p47495k61519L67750j33821j263955j433382l97754N46181
38721a521638O63839N89714Q78202J077825O64016r9025o66582q72757p76785
38712f3191m51269j44652j37975l09704l04881j39204j20903k17467q4295K86305
38702a687236N32832N55629O12567P59443P41236M80754J80683o5262k90053l35310
38692A485283k8893L57648L37056j28694o32889q95509q89639n87273r3793J79449
38682h97254L7367o3746K77213O06436L09242k31281j57632L89446M52344j06892
38672F15243l46490J69175O73557M87373j2054j93223n4034J70448M35372M55493
38662B400860k57246j361396j596108m50969Q78926J034560K82635j62193k212
$$ y = [1992228, 1802357, 1054862, 793343, 1161093, 1027272, -236683, -1670065, -2067819, -1521638, -857799, -268085, 610117, 1687942, 2351958, 2252933, 1586351, 713594, -63191, -514460, -659112, -797087, -1106791, -1411672, -1550876, -1671779, -1889246, -1973541, -1687236, -1154404, -598775, 13792, 773235, 1514471, 1995225, 2175908, 2110646, 1820593, 1485283, 1456390, 1814038, 2151094, 2022400, 1389511, 494002, -395637, -982910, -1076703, -897254, -859887, -923633, -646420, -39984, 269258, 37977, -119655, 269791, 722135, 615243, 268753, 437928, 1111485, 1598858, 1586804, 1393581, 1339547, 1509995, 1945367, 2400860, 2143614, 782218, -813890, -1264859, -385933, 648627, 931262, 769069, 766857]
38653G66857M6728l04059m94729j49503L65383N75964M43891J41399j95981l89405
38643H06545l24673k00122k82415m18698k17209K61517M47731K9046n94045p96411
38633a288734m09463K35744P12652P64462L45610l40405q42874p20523J7821P60177
38623g65533P99149J16323n20411m40999J26650M41451K65126L5930P2559J60115
38613B90360Q0705K9377J89278L08772R1825k84473m43130l85770l81064l98897
38603i03017j10849M87619Q43114M81860k90927o46521k51979K64958J71930k71081
38593b24893j64735N57714Q34802R6729o57580k88995O23997N99762l82837q00757
38583A93207L038Q09572M70619m58885q62832p14298n62439k93899L90157Q98511
$$ y = [766857, 813585, 509526, 14797, -134706, 230677, 806641, 1250532, 1391931, 1195950, 806545, 481872, 281750, -665, -419363, -636572, -375055, 72676, 101722, -492323, -1288734, -1698197, -1462453, -749801, 14661, 360271, 19866, -823008, -1543531, -1525710, -765533, 33616, 149939, -370472, -811471, -684821, -243370, 21756, 57686, 130245, 290360, 371065, 400442, 589720, 898492, 990317, 705844, 262714, -123056, -504120, -903017, -1013866, -526247, 316867, 798727, 507800, -138721, -390700, -125742, 46188, -224893, -389628, 168086, 1002888, 1099617, 442037, 153042, 777039, 1376801, 993964, 193207, 196245, 1005817, 1476436, 1017551, 154719, -559579, -1122018, -1415917, -1025760, -127249]
38573a27249M29531n87374r11050k53105M04537K74573l37638o86856m21081L00009
38563a915703R35883Q57704M8028o54114n57054m9236J49541K17746P25814J269157
38553A027766Q99322j39664m98156K01592P36503K50026m39415k91644L01360
38544B047690L29609j97467n24996m91283m96917n01817j27019M03580M18398
38535H59778j05828m76382l85875k71348m12606m37383l3100M76547O54192N69140
38525D37135M84541K96753k35009q79652j022002m13037M51162Q29580N01188
38516D50659p7305l43280k27154q8422j57124k76687k36012p6678R5751L41764
38506e94488O50123O78110J17796p34704j147780p52793Q5481P29447Q56366N64326
$$ y = [-127249, 302282, -285092, -1196142, -1449247, -1044710, -770137, -1107775, -1794631, -2215712, -1915703, -979820, -122116, -74088, -728202, -1285256, -1334492, -1184951, -967205, -241391, 1027766, 1927088, 1787424, 1289268, 1490860, 2227363, 2477389, 2037974, 1746330, 2047690, 2377299, 2179832, 1654836, 1163553, 666636, 164819, 37800, 441380, 859778, 753950, 277568, -108307, -379655, -792261, -1229644, -1262744, -786197, -132005, 437135, 921676, 1218429, 983420, 103768, -918234, -1331271, -880109, -50529, 450659, 373354, 30074, -197080, -285502, -442626, -719313, -955325, -1032003, -936252, -594488, 55635, 733745, 851541, 116837, -1030943, -1783736, -1698255, -968808, -112442, 451884]
38496D51884J53132j23814k60979m51985o81877n31479K45678J077621J067353
38487I45534K03783n18910m22554K0331O3662j98963k12817Q547Q075k14352k41688
38476e59352q3112j46584l45144j08551N27480P40291J96072l59222l12350j41410
38466e91882m34090p35033l56214K69359K24677k64245j44374O14945Q67268J94425
38456c55164m00308k07051Q4475k18407n01917l4747N04320O3939q44509p76528
38446b685897L31537J032238O49000J68466M03969O83510J94009n15460m55857
38437a94485J82916N07967M75811P03527R90623M03477r88231j723902q72903
38428e15200O05398J157145N95426o7770k65606l70279o72232q23848n42602j65421
$$ y = [451884, 605016, 481202, 220223, -231762, -913639, -1445118, -1199440, -121819, 945534, 1149317, 630407, 207853, 228184, 291846, 92883, -119934, -111387, -103312, -317664, -559352, -642464, -789048, -1134192, -1242743, -715263, 25028, 221100, -138122, -450472, -591882, -1025972, -1761005, -2117219, -1847860, -1623183, -1887428, -2031802, -1416857, -549589, -355164, -755472, -962523, -878048, -1096455, -1598372, -1633119, -1128799, -1064860, -1909369, -2685897, -2354360, -1322122, -673122, -504656, -100687, 582823, 776832, 261372, -194485, -11569, 496398, 972209, 1675736, 2666359, 3069836, 2081605, 357703, -515200, 90198, 1247343, 1842769, 1774999, 1509393, 1139114, 466882, -356966, -899568, -1064989]
38418a064989j12737k52273j84132J35448M07288M39655K97633J34017R0295K32967
38408A23172M07328L19579m3541k60797K1678N77224Q21550M50826l05212r20559
38398A191248r32313l07360L70196L83098k12888n45816j21149M06334J89399
38389D20749n17908p68011l34799J35722K57994K71731K62047j7448l63399j44444
38379g97766N41094O77867j59393r64902o63874L65679Q95935M79441k50883n51493
38369d28295k13692M48192P62128K44352n99024n96202M43647J142176L82973
38360A586255r93804j355732n54755J64905J48108r6811j51641j84900j32035
38351a570410L52248R18341P03830k10548o93639k79890J96336J59146K15447
$$ y = [-1064989, -1177726, -1429999, -1614131, -1478683, -1071395, -631740, -334107, -200090, -109795, 123172, 530500, 850079, 806538, 545741, 567419, 1144643, 1966193, 2417019, 2111807, 1191248, 258935, -48425, 321771, 704869, 491981, -53835, -174984, 231350, 420749, -97159, -865170, -1199969, -1064247, -806253, -534522, -272475, -289923, -653322, -797766, -256672, 421195, 261802, -703100, -1366974, -1001295, -105360, 374081, 123198, -428295, -641987, -193795, 568333, 812685, 213661, -382541, 61106, 1203282, 1586255, 592451, -763281, -1318036, -1153131, -1005023, -1101834, -1253475, -1438375, -1570410, -1218162, -299821, 404009, 193461, -500178, -780068, -583732, -424586, -209139]
38342b09139P76960R86159J04000r94226r84782r9901L68786J58019J92096P25278
38332A023250P82864j41119j043878q18199J28180N40455J34881j92303J25968
38323E40099N16255K58556l97155o72582m22124j70387j40690q367K76752K26306
38313F663k43673l55633L91135J219701J050266P6170n63120m49862k31250l58014
38303E42383n18043m73200m82561o02450m36342P9714M38998M37047M84352P19936
38293A89834O76223K34172N596K42673K85104k61154p08523m43339k7472j95296
38283b182n28100k40440L32779K76834k74261l40387K26445N22694J35098k42125
38273a33645k0061M05907M12714Q2759p9909O6247J88249k3440m25421m86272
$$ y = [-209139, 567821, 1553980, 1657980, 663754, -321028, -420929, -52143, 105876, 297972, 1023250, 1806114, 1664995, 621117, -197082, -68902, 471553, 606434, 414131, 540099, 1056354, 1314910, 917755, 245173, -176951, -347338, -488028, -496395, -219643, 6663, -237010, -592643, -201508, 1018193, 2068459, 2144629, 1581509, 1131647, 900397, 542383, 24340, -448860, -931421, -1533871, -1970213, -1890499, -1451501, -1014454, -530102, 189834, 866057, 1100229, 1105825, 1348498, 1633602, 1372448, 663925, 220586, 193114, -2182, -530282, -770722, -437943, -161109, -435370, -775757, -549312, -26618, 108480, -133645, -153706, 252201, 664915, 747674, 667765, 734012, 922261, 898821, 473400, -12872]
38263a2872P5652O96218M59586n87827j228788o43721M52696Q87888N90911K42177
38253I31920p23l70251n92281l22530r8352n51450r70565j58521J356015J637681
38243H60943J70140j251281j045807J82821R65689R32310N09803j80332r89827
38234A54459j168520k81976Q55616J154742O81304K42323N2510k44807o21582
38225H24069o83179m23514j58313R4065M50828O30743L13718j81083k98981j32708
38215D35645j64274l02245n011O41725P82539m3557j175226j562288r15662P8605
38205b229749N55148L90236K84156P80270J356782J026356j42112q92572n07628
38196F20887J75886R6705m70199n52416n8470L06501K98634K70050L03355K10828
$$ y = [-12872, 62780, 758998, 1218584, 630757, -598031, -1241752, -789056, 98832, 689743, 931920, 931197, 560946, -31335, -353865, -452217, -1003667, -1974232, -2132753, -776738, 860943, 1031083, -220198, -1266005, -1083184, -117495, 814815, 1324618, 1144286, 154459, -1014061, -1296037, -440421, 714321, 1395625, 1637948, 1690458, 1445651, 824069, 140890, -282624, -440937, -346872, 103956, 734699, 1048417, 867334, 568353, 435645, 271371, -30874, -35885, 605840, 1388379, 1344822, 169596, -1392692, -2308354, -2229749, -1674601, -1284365, -1000209, -219939, 1136843, 2163199, 2021087, 1128515, 620887, 796773, 893478, 423279, -129137, -187607, 118894, 417528, 687578, 990933, 1201761]
38186A201761J90701M84496N90339q0039r19938p65200J82373M55019m00591j078581
38176a39660o18528J24632K9109m45834j74720O65464Q87927K09948l79384j78170
38166a9216L22972L31747j80912o28061n81708j42075K37734J76083k51052n59197
38156a293685m05954K1535L07224L12335J90075Q2683K3090j4677j25367l28734
38146a231475l17273K76128J151838J372300N39297m96980o84814j75191M2600
38137D76430l09858n00198j02551K86830O4231l52334j52028N83857R06772K66803
38127A167954p69111j204230p11936J22456N18307L07381J3538J69419O58600
38118B72378Q87865N74415O8103k37673m68766q81844j170191p51859K23059P84560
$$ y = [1201761, 1392462, 1876958, 2467297, 2387258, 1467320, 702120, 884493, 1339512, 938921, -139660, -758188, -633556, -604447, -1050281, -1225001, -559537, 328390, 538338, 158954, -19216, 303756, 635503, 454591, -173470, -755178, -897253, -659519, -483436, -734488, -1293685, -1699639, -1678104, -1370880, -1058545, -868470, -785787, -762697, -777374, -902741, -1231475, -1548748, -1272620, -120782, 1251518, 1790815, 1293835, 609021, 433830, 476430, 166572, -333626, -436177, -149347, -85116, -437450, -589478, -5621, 901151, 1167954, 398843, -805387, -1517323, -1394867, -876560, -569179, -555641, -386222, 272378, 1160243, 1734658, 1802761, 1565088, 1096322, 214478, -955713, -1707572, -1484513, -699953]
38108f99953L66087m03207n94675k45099r0502l09942l31253J21871N99277P46155
38098h41241P98546Q95137O11268k61000j040878r39460j30609N84275Q35579
38089E11617P69326M26656j89059o42945m59070J07234L84758K50711Q1642n2090
38079A188780l05053l72440R6115N01557j01574j323732j645395o07536N09500
38070b059778O89881N19179P69058R62030M19810l36126m46774j44399j28473
38061B44408k57732p4329P4194k72606n28355K2547P48408O14795N1875J87991
38051H11196O75593K36625q36844r08527J25085M73858m78733j069984l10941
38042a282672L31964l84917j082811p5084J510667J323042m61969j451029p08271
$$ y = [-699953, -333866, -737073, -1331748, -1576847, -1667349, -1977291, -2308544, -2186673, -1587396, -841241, -42695, 852442, 1463710, 1202710, 161832, -777628, -908237, -323962, 511617, 1280943, 1707599, 1518540, 875595, 416525, 523759, 908517, 1159228, 1240870, 1188780, 883727, 511287, 607402, 1108959, 1007385, -316347, -1961742, -2569278, -2059778, -1369897, -850718, -81660, 880370, 1300180, 964054, 517280, 372881, 244408, -13324, -87653, -13459, -286065, -814420, -791873, -43465, 571330, 623205, 811196, 1486789, 1723414, 886570, -21957, 103128, 576986, 98253, -971731, -1282672, -950708, -1335625, -2418436, -2493520, -982853, 340189, -121780, -1572809, -2281080]
38033b281080K47779K08203j47536N3607M64891N80788P14434J033696Q40434
38024A715216k31861j249181j175965l50337J37712j54j90454r3883J04978L09630
38014a024299O32963R22106P88580K09633l35776m34842j60709J12771Q9210k50568
38004E49069o16060n94051p4967N15537O14933J82552k24545j13966L47681N43140
37994A129323J46296n16231q78801p30416k66110K56348O28220O01224J30107
37985D99960k89150m9035O31452P63914o1076r39363q30037j5705L53250q2903
37975a8693n20160k72587L40273N90315K57834k82785n12430j84321L84508M72609
37965B54563j92293q61280o08542L45029Q60164M51580j63408k58920j3112J23323
$$ y = [-2281080, -2033301, -1825098, -1972634, -1919027, -1454136, -873348, -158914, 874782, 1715216, 1483355, 234174, -941791, -1292128, -1154416, -1154570, -1345024, -1438907, -1333929, -1024299, -391336, 530770, 1319350, 1528983, 1193207, 758365, 597656, 710427, 799637, 549069, -66991, -661042, -736009, -220472, 394461, 577013, 352468, 238502, 586183, 1129323, 1275619, 759388, -119413, -849829, -1115939, -859591, -231371, 369853, 499960, 210810, 161775, 793227, 1557141, 1496065, 556702, -273335, -289040, 64210, -18693, -538853, -811440, -471167, 119148, 376982, 94197, -418233, -602554, -218046, 254563, 62270, -799010, -1407552, -1062523, -202359, 249221, 85813, -173107, -186219, -62896]
37955f2896J91264L47486L73545J36529K0349L16897O20198L96432k13114o93693
37945A432997q89232q79364n09974K81465R30293P48570j04151p44317o43700
37936c77413j02265L16923L59287R8165j90606j56452K64713O12238L48258m41154
37926G31694j063150r61472k67363L67892L88543j23762m88346j92515M24435
37917a184044O16842K95581L7525j413l19662r10739q62623K11566J240492J109098
37907B32623K50071k39053l73196q57086j381928r04963M49987J276698Q76762
37898f70085M1651m15812n97824o15998r5562Q02288J080105L81299k96292j47498
37888e33728K18725P995l18662L1966O33387N06890j76499l69783J29340M69861
$$ y = [-62896, 128368, 475854, 849399, 985928, 1006277, 1323174, 1943372, 2339804, 2126690, 1432997, 543765, -335599, -845573, -564108, 366185, 1114755, 1010604, 266287, -377413, -479678, -162755, 196532, 294697, 104091, -52361, 212352, 824590, 1172848, 731694, -331456, -1292928, -1560291, -1192399, -803856, -927618, -1415964, -1608479, -1184044, -567202, -271621, -234096, -235509, -555171, -1465910, -2328533, -2116967, -876475, 232623, 482694, 243641, -129555, -986641, -2368569, -3273532, -2823545, -1546847, -670085, -628434, -1044246, -1642070, -2258068, -2353630, -1551342, -471237, -89938, -386230, -533728, -315003, -307008, -625670, -593704, 39683, 546573, 370074, 291, 129631, 599492]
37878E99492K15859j01425l2258J44267N6916k18067m68298o02283m83437p5373
37868i64607K04277j09908p20544q16433k26838L50992M28475L09338L30922K60785
37858i53541q4482k46533K15919Q81022R42625L30486k71873m48551m60381n37724
37848f33033l85040K26814P88547N52546l68653r64894n80458K54145O13279M31961
37838f4786L78445O27306N21528l16084j185577j118300j23342Q56445J042286
37829F17921M85233k03694m29240l6070N40098O46195J37722m60503o76950o18860
37819A852n24709k77813J75698L95517O7607l25321j84717J76283M2547m05116
37809h58172l17013L52259O99222L65762N9833K10814K16875l51490q20158n13312
$$ y = [599492, 815351, 713926, 681668, 825935, 882851, 664784, 196486, -405797, -889234, -964607, -760330, -870238, -1590782, -2407215, -2634053, -2283061, -1854586, -1545248, -1214326, -953541, -1038023, -1284556, -1068637, -187615, 755010, 1085496, 813623, 365072, -95309, -633033, -1018073, -791259, -2712, 549834, 181181, -783713, -1364171, -1110026, -496747, -64786, 313659, 940965, 1462493, 1146409, -39168, -1157468, -1280810, -424365, 617921, 1103154, 899460, 470220, 434150, 974248, 1620443, 1758165, 1297662, 620712, 1852, -522857, -800670, -624972, -229455, -161848, -487169, -671886, -495603, -453056, -858172, -1175185, -822926, -123704, 242058, 301891, 512705, 729580, 378090, -442068, -955380]
37799i55380P6510J79970P1973L92478P52500L28124n04418n62667J67329M34657
37789C81076j55894m49422K12125P13412O531r77169o99291M98799R40805K94080
37779G65052o7494M87144P98528l576r07300o35402K76668M01506k89287n51301
37769B74538J0093M46915K04015m5121K50269N11737Q8149n69758o27121j62477
37759C81239R2117n7112j41638N2554J64577q8838m57837n05677j39949K96219
37749d04345L77699Q0761j14701J74171N94213M49953k52298p53082o73310m73944
37739i94883m79568k85731K98251N75319Q1866l67933J36923R34404O16589p10276
37729a95039j370351m43210J072660J719544J170544L7688r41138j143707l86144
$$ y = [-955380, -878870, -698900, -626927, -234449, 518051, 846175, 341757, -220910, -53581, 381076, 225182, -224240, -12115, 701297, 707828, -269341, -968632, -469833, 470972, 765052, 697558, 1184702, 1983230, 1979654, 1072354, 436952, 713620, 1115126, 825839, 274538, 284631, 731546, 935561, 890440, 1140709, 1652446, 1740595, 1170837, 543716, 381239, 473356, 416244, 274606, 327160, 491737, 402899, -54938, -560615, -700564, -404345, -26646, 54115, -60586, 113585, 707798, 1157751, 905453, 152371, -520939, -994883, -1474451, -1760182, -1461931, -886612, -804746, -1172679, -1035756, -101352, 515237, -195039, -1565390, -2008600, -935940, 783604, 1954148, 1991836, 1050698, -93009, -479153]
37720d79153N80362O90120K13l66414J442K03697k68993m92441K76052J049109
37710A193994N07827p90945j115667j56303N86861J04398p88694q62787j58506
37701a479822L81940K75869j62324m58315m01315r268N19175Q54049P63572L10022
37691E93583k20064n20095m39889j01450J87430K61644K65750L58646M07854K12098
37681A005507j09202k42706j17981N9082J28421N6900j83764m87397m88750K536
37671c77354N13299L63573l49818p76542m71706N5063K57576M02449R08361J311270
37661A836171P66513n16609j264416q20241l4180J9685m76141o15428k53525J0837
37651a347334P9872M50079R84268P70721l61435j270216j108310n08316l21323
$$ y = [-479153, 101209, 791329, 791542, 425128, 426570, 630267, 361274, -131167, 144885, 1193994, 1701821, 910876, -204791, -361094, 225767, 330165, -458529, -1321316, -1479822, -1097882, -822013, -984337, -1442652, -1843967, -1853235, -1334060, -480011, 283561, 593583, 373519, -146576, -586465, -687915, -500485, -238841, 26909, 385555, 793409, 1005507, 896305, 653599, 535618, 594700, 723121, 780021, 596257, 108860, -379890, -377354, 135945, 499518, 149700, -626842, -1098548, -1043485, -785909, -383460, 524901, 1836171, 2602684, 2086075, 821659, 1418, -32762, -13077, -489218, -1104646, -1358171, -1347334, -1267462, -817383, 166885, 937606, 576171, -694045, -1802355, -2310671, -2631994]
37642b631994j78255N13793J036039M00070o25390l63898J009586J486539L13570
37633I60060q54360o28416Q7029r6762p47740o12420J93854O04220M71578M49442
37623a73515M83944k9716q15628r05271k46482J81478l3933k13649J24894N09201
37613a118677L70955j45229n14041l76509L08576J080786J081574N9720r34923
37604a87768p33683K92751P90488M37783J33290K07029n2077p54701q39092J26217
37594e79763R16333M27605o01075p80191j36933K51339J01600P7168L46040K78023
37584C00146l06189o69516l05231K58035K85538p9831j37453K38069M08678O916
37574h38l81504l9000O43125M97384o67854j461287p03828P92171J216615K17430
$$ y = [-2631994, -2810249, -2296456, -1260417, -860347, -1485737, -1849635, -840049, 646490, 960060, 105700, -522716, -435687, -532449, -1280189, -1892609, -1698755, -1094535, -622957, -173515, 310429, 280713, -534915, -1440186, -1686668, -1505190, -1539123, -1752772, -1627878, -1118677, -747722, -892951, -1406992, -1783501, -1474925, -394139, 687435, 747155, -187768, -921451, -628700, 161788, 599571, 732861, 939890, 887813, 133112, -705980, -579763, 336570, 764175, 163100, -617091, -754024, -502685, -401085, -323917, 22123, 300146, -6043, -675559, -980790, -722755, -437217, -517048, -654501, -416432, -7754, -838, -382342, -421342, 221783, 719167, 51313, -1409974, -2113802, -1321631, -105016, 112414]
37564A12414p70877o44745J03575N30279N21785L63436j6490o16835q87148m66696
37554a771302J04810J29243k13477k44158J51414M93155M91494K89025J12873
37545d56923J34699M39912P60674N72412j50427o71761m39132J17895K43061q9600
37535D60810l35499k47540j0957J88223J97100j70515p07565p32575n5806M29455
37525i84869p4667q83087o25201P02989J559483R29116l57314q26440k16515M46971
37515c29534K91422m35577q33141m43165L09259P03940N10420K2078m37607o39025
37505a280930k81845O39065J340872R42014j93578o92739p1675N85282L51278
37496A337744k22018l04088k26922o03477r29672m46844K79656J59922m93408
$$ y = [112414, -658463, -1303208, -1199633, -669354, -147569, 215867, 199377, -417458, -1304606, -1771302, -1666492, -1537249, -1750726, -1994884, -1843470, -1350315, -858821, -569796, -456923, -322224, 117688, 878362, 1450774, 1300347, 628586, 189454, 307349, 550410, 460810, 125311, -122229, -133186, 55037, 252137, 81622, -625943, -1358518, -1414324, -984869, -1059536, -1942623, -2567824, -1864835, -305352, 623764, 266450, -559990, -776505, -329534, -38112, -473689, -1306830, -1749995, -1440736, -736796, -226376, -204298, -641905, -1280930, -1562775, -923710, 417162, 1359176, 1165598, 472859, 401184, 986466, 1337744, 1115726, 811638, 584716, -18761, -948433, -1395277, -1115621, -955699, -1449107]
37487a449107m36992L38915N97727M5077j62281N50180J195964Q86283J30215
37478A695981k41293l11985m62608m75814q0132L38726L12510K2870j12281o8675
37468F17299P048J15801J65161r465j52555J69596O42455M22677m31086p99439
37458G47492k38829K45523j50690p14779m78025J81108L07850j5014k3464K89232
37448A50404K88101p1690k45740j51674j98927l58270j45823M50376Q47205P38056
37438A302018M15995J82079J3914j47707k76859m24203o04817o15881l17438Q1132
37428c91767L39764N16594O43919M53003j71447q49319j201541j229459q76935
37419b767188P1225J175879J340205L93139k73432L01890R85977L01482j001086
$$ y = [-1449107, -1886099, -1547184, -949457, -904380, -1066661, -516481, 679483, 1565766, 1695981, 1454688, 1142703, 680095, 204281, 124149, 462875, 775385, 798255, 685974, 617299, 624347, 740148, 905309, 895844, 743289, 912885, 1555340, 1978017, 1546931, 747492, 508663, 754186, 603496, -111283, -589308, -408200, -100350, -115364, -138828, 150404, 438505, 366815, 121075, -30599, -229526, -587796, -733619, -283243, 563962, 1302018, 1718013, 1900092, 1914006, 1766299, 1489440, 1065237, 460420, -155461, -472899, -391767, -52003, 464591, 1108510, 1561513, 1390066, 540747, -660794, -1890253, -2767188, -2695963, -1520084, -179879, 213260, -60172, 241718, 1227695, 1529177, 528091]
37410E28091r81150L18584Q60172j06203q80855j31095J022164Q94672k22167
37401A302213q06452m66273j50885m37693q13329o09540J56649R32438J177147
37392B84275Q00513K61153M5545J7148k95002p65233p18078o6397L82829R4182
37382D0935m83316p67823q20831p74529l10126N96333J123027O17769l56935p65043
37372a900539m25867J26632O17788J031091J052514M46501k50617k97740J23611
37363E23374J74830l23162o51227l15263L03890N55899K49138l05906n92956l00806
37353f82189K06546R1427q09610j416222o94126P90125J485315Q82440k6070l23097
37343d95461j89774j05094K3154M15345P79276O66475R7055n18928p78829m58892
$$ y = [528091, -453059, -134475, 725697, 619494, -261361, -392456, 629708, 1524380, 1302213, 495761, 29488, -121397, -559090, -1372419, -1981959, -1825310, -892872, 284275, 1084788, 1345941, 1391486, 1408634, 1113632, 348399, -369679, -436076, -53247, 40935, -442381, -1210204, -2031035, -2805564, -3115690, -2519357, -1396330, -778561, -1135496, -1900539, -2326406, -2199774, -1581986, -550895, 501619, 948120, 697503, 399763, 523374, 698204, 375042, -276185, -591448, -287558, 268341, 517479, 211573, -381383, -682189, -475643, -384216, -1193826, -2610048, -3304174, -2514049, -1028734, -146294, -172364, -495461, -685235, -790329, -767175, -351830, 427446, 1093921, 1190976, 672048, -106781, -565673]
37333e65673K93009Q27327N59152k13031o02722l50296p1949j35261j07917K99325
37323f8036N74299K79587j43621j74974j80697o95004j219617p92252M24449J163203
37313h32663P63171l5270k63020Q5006M27809N36417N46823M24367p70n88382
37303A063488r47839r48399q08388o23925j75346N86040J151854R59488K08571
37294D65544k76232j13717J70012M1269j74943Q5056N08150K71266n45099q79040
37284d47734k83670L25790O3170n80333n38853K44581Q89902Q86421M86094k597
37274A042771m87031p26481m60793O1876L15209K36492J42374K5169l34351o45374
37264h30139l73501K38638L64654l6218p5642N00661P11242o2442q91531o26557
$$ y = [-565673, -272664, 554663, 1113815, 900784, 298062, -52234, -124183, -259444, -367361, -68036, 506263, 785850, 642229, 467255, 286558, -408446, -1628063, -2420315, -1995866, -832663, -69492, -104762, -367782, -282776, 145033, 681450, 1228273, 1652640, 1651870, 1063488, 115649, -832750, -1641138, -2265063, -2440409, -1854369, -702515, 256973, 465544, 189312, 75595, 245607, 286876, 111933, 196989, 705139, 976405, 431306, -447734, -731404, -405614, -342444, -922777, -1461630, -1217049, -327147, 559274, 1045368, 1042771, 555740, -170741, -631534, -569658, -254449, -17957, 124417, 149586, -184765, -830139, -1203640, -965002, -600348, -636566, -712208, -211547, 499695, 437253, -454278, -1080835]
37254a080835L75964Q95148O38857K76164O6729l24242p54404n60439K31812O99805
37244D64559L55073k08402l63619k92951l06307j51511L12740M60322j97726r11864
37234h39686n17101P73095J412422N67496p52307j068759k79906M99113N20510
37225C14877P5284l04914n51814p43796o72899j62367M91064Q07990P02072M29758
37215C85255J29340k03419l94733j97772K74957O27067P16101P20691O54936K99946
37205C012369k72636o18907n65074m44005m59121l45510J1300J80029j27554m73128
37195a02237l48070J9561J10255l2525m5130K5974m6886n2724K48857M03722j31243
37184D9554q74757q41104q5298L73184K09023J76684O05403P59345K03500l51189
$$ y = [-1080835, -704871, 190277, 829134, 1105298, 1172027, 847785, 93381, -467058, -235246, 464559, 819632, 611230, 247611, -45340, -351647, -503158, -190418, 269904, 72178, -839686, -1356787, -583692, 828730, 1396226, 643919, -424840, -704746, -205633, 314877, 390161, 85247, -466567, -1210363, -1883262, -2045629, -1554565, -746575, -44503, 385255, 514595, 311176, -83557, -281329, -6372, 620695, 1336796, 2057487, 2712423, 3012369, 2739733, 2120826, 1555752, 1111747, 652626, 307116, 318416, 498445, 370891, -102237, -450307, -430746, -320491, -353016, -398146, -372172, -419058, -471782, -222925, 180797, 49554, -825203, -1666307, -1751605, -1378421, -1169398, -992714, -387311, 372034, 575534, 224345]
37174B24345k60550K0691q7295k31994L2784K02686l11570r55428q14385j10815
37164b291531K51496K19920M14936P01383L17849n73577q43762j68921M18929
37155a553278K12157j11999K09753O83609M41033k41133l54100K33147N86046
37146A05235J53259m40868l75141J63220K80132k91489p08411j12955J116970
37137a10048J707951J058443p8608o79854o53920n33229m86738l14796j07868
37128a98667j48639k86742j35690J66064J17157k33239k94584O7950L16339J79075
37118d50976M6398J91482L34977K83138K89840M44901M01960R4921J2820L03422
37108A952883L12059m08336j246486j327445o56517J21459O13195P31663L70215
$$ y = [224345, -36205, -15514, -102809, -334803, -302019, -99333, -410903, -1366331, -2180716, -2291531, -2040035, -1820115, -1405179, -703796, -385947, -959524, -1803286, -1972207, -1553278, -1341121, -1453120, -1243367, -559758, -118725, -359858, -713958, -480811, 105235, 258494, -182374, -557515, -394295, -114163, -405652, -1114063, -1227018, -110048, 1597903, 2656346, 2577738, 1897884, 1243964, 710735, 223997, -90799, -198667, -347306, -634048, -769738, -603674, -486517, -719756, -1014340, -946390, -630051, -450976, -404578, -213096, 121881, 405019, 694859, 1139760, 1541720, 1636641, 1649461, 1952883, 2264942, 1856606, 610120, -717325, -1373842, -1252383, -639188, 92475, 462690]
$$ [...]
##END NTUPLES=NMR SPECTRUM
##END=
