##TITLE=31Pdec_LR-579-H1-CR4
 D2O, 24 sc
 24.6.2019
##JCAMPDX= 6.0         $$ Bruker NMR JCAMP-DX V2.0
##DATA TYPE= NMR SPECTRUM
##DATA CLASS= NTUPLES
##ORIGIN= UXNMR, Bruker Analytische Messtechnik GmbH
##OWNER= root
$$ XWIN-NMR		Version 3.5
$$ Mon Jun 24 14:27:07 2019 Russian Standard Time (UT+4h)  she@DPX200
##.OBSERVE FREQUENCY= 81.013821
##.OBSERVE NUCLEUS= ^31P
##.ACQUISITION MODE= SIMULTANEOUS
##.ACQUISITION SCHEME= undefined
##.AVERAGES= 24
##.DIGITISER RES= 17
##SPECTROMETER/DATA SYSTEM= spect
##.PULSE SEQUENCE= zgpg30
##.SOLVENT NAME= D2O
##.SHIFT REFERENCE= (INTERNAL, D2O, 0, 182.463)
##AUDIT TRAIL= $$ (NUMBER, WHEN, WHO, WHERE, WHAT)
$$ ##TITLE= Audit trail, XWIN-NMR		Version 3.5
$$ ##JCAMPDX= 5.01
$$ ##ORIGIN= Bruker BioSpin GmbH
$$ ##OWNER= she
$$ F:/spectra/data/she/nmr/P31/1/pdata/1/auditp.txt
$$ ##AUDIT TRAIL=  $$ (NUMBER, WHEN, WHO, WHERE, WHAT)
(   1,<2019-06-24 14:26:05.96 +0400>,<she>,<DPX200>,
      <created by zg, POWCHK disabled, PULCHK disabled
       configuration hash MD5:
       00 E9 B6 7A A2 85 ED C7 34 08 36 98 17 FE 4E 26
       data hash MD5: 32K
       D9 3E E9 D4 91 48 9A 6A 0E 56 ED CC 04 4F 66 9E>)
(   2,<2019-06-24 14:26:08.57 +0400>,<she>,<DPX200>,
      <Start of raw data processing
       efp BC_mod = 2 LB = 1 FT_mod = 6 PKNL = 1 PHC0 = -2608.804 PHC1 = 200.599 SI = 64K 
       data hash MD5: 64K
       31 6F 29 11 47 E8 3A 02 16 1C F8 76 0D EC 0C 5A>)
(   3,<2019-06-24 14:26:31.39 +0400>,<she>,<DPX200>,
      <pk PHC0 = 21.35571 PHC1 = -48.8 
       data hash MD5: 64K
       1A 0B 06 B9 F6 99 74 10 B6 8B 64 42 F9 D9 31 F9>)
(   4,<2019-06-24 14:26:34.48 +0400>,<she>,<DPX200>,
      <abs ABSG = 5 
       data hash MD5: 64K
       D3 4C 98 91 8B 61 E9 0B E2 DF A5 36 1F 81 93 AA>)
$$ ##END=
$$ 
$$ hash MD5
$$ D9 DB E7 5E 30 BC F1 CD D2 6E FD 62 CB E8 9C 5E
##$RELAX= 
##$RELAX= 
##$RELAX= 
##$RELAX= 
##$RELAX= 
##$RELAX= 
##$RELAX= 
##$RELAX= 
$$ Bruker specific parameters
$$ --------------------------
##$DU= <F:/spectra>
##$EXPNO= 1
##$NAME= <P31>
##$PROCNO= 1
##$TYPE= <nmr>
##$USER= <she>
##$AMP= (0..31)
100 100 100 100 100 100 100 100 100 100 100 100 100 100 100 100 100 100 
100 100 100 100 100 100 100 100 100 100 100 100 100 100 
##$AQSEQ= 0
##$AQ_mod= 1
##$AUNM= <au_zg>
##$AUTOPOS= <>
##$BF1= 81.014009
##$BF2= 200.13
##$BF3= 200.13
##$BF4= 200.13
##$BF5= 200.13
##$BF6= 200.13
##$BF7= 200.13
##$BF8= 200.13
##$BYTORDA= 1
##$CFDGTYP= 0
##$CFRGTYP= 5
##$CHEMSTR= <none>
##$CNST= (0..31)
1 1 145 1 1 1 1 1 1 1 1 1 1 1 1 1 1 1 1 1 1 1 1 1 1 1 1 1 1 1 1 1 
##$CPDPRG= <waltz16>
##$CPDPRG1= <>
##$CPDPRG2= <waltz16>
##$CPDPRG3= <>
##$CPDPRG4= <mlev>
##$CPDPRG5= <mlev>
##$CPDPRG6= <mlev>
##$CPDPRG7= <mlev>
##$CPDPRG8= <mlev>
##$CPDPRGB= <>
##$CPDPRGT= <>
##$D= (0..31)
0 1 0 0 0 0 0 0 0 0 0 0.03 2e-05 3e-06 0 0 0 0 0 0 0 0 0 0 0 0 0 0 0 0 
0 0 
##$DATE= 1561371965
##$DBL= (0..7)
120 120 120 11 120 120 24 19 
##$DBP= (0..7)
150 150 150 150 150 150 150 150 
##$DBP07= 0
##$DBPNAM0= <>
##$DBPNAM1= <>
##$DBPNAM2= <>
$$ [...]
##$SUBNAM3= <"">
##$SUBNAM4= <"">
##$SUBNAM5= <"">
##$SUBNAM6= <"">
##$SUBNAM7= <"">
##$SUBNAM8= <"">
##$SUBNAM9= <"">
##$SW= 369.568048894756
##$SWIBOX= (0..15)
0 1 3 0 0 0 0 0 0 0 0 0 0 0 0 0 
##$SW_h= 29940.119760479
##$TD= 32768
##$TD0= 1
##$TE= 0
##$TE2= 300
##$TE3= 300
##$TEG= 300
##$TL= (0..7)
0 120 53 12 22 120 120 120 
##$TP= (0..7)
150 150 150 150 150 150 150 150 
##$TP07= 0
##$TPNAME0= <>
##$TPNAME1= <>
##$TPNAME2= <>
##$TPNAME3= <>
##$TPNAME4= <>
##$TPNAME5= <>
##$TPNAME6= <>
##$TPNAME7= <>
##$TPOAL= (0..7)
0.5 0.5 0.5 0.5 0.5 0.5 0.5 0.5 
##$TPOFFS= (0..7)
0 0 0 0 0 0 0 0 
##$TUNHIN= 0
##$TUNHOUT= 0
##$TUNXOUT= 0
##$USERA1= <user>
##$USERA2= <user>
##$USERA3= <user>
##$USERA4= <user>
##$USERA5= <user>
##$V9= 5
##$VALIST= <valist>
##$VCLIST= <CCCCCCCCCCCCCCC>
##$VD= 0
##$VDLIST= <DDDDDDDDDDDDDDD>
##$VPLIST= <PPPPPPPPPPPPPPP>
##$VTLIST= <TTTTTTTTTTTTTTT>
##$WBST= 1024
##$WBSW= 4
##$XGAIN= (0..3)
0 0 0 0 
##$XL= 0
##$YL= 0
##$YMAX_a= 8802
##$YMIN_a= -8789
##$ZGOPTNS= <>
##$ZL1= 120
##$ZL2= 120
##$ZL3= 120
##$ZL4= 120
##$ABSF1= 182.463
##$ABSF2= -187.1042
##$ABSG= 5
##$ABSL= 3
##$ALPHA= 0
##$AQORDER= 0
##$ASSFAC= 0
##$ASSFACI= 0
##$ASSFACX= 0
##$ASSWID= 0
##$AUNMP= <proc_1d>
##$AZFE= 0.1
##$AZFW= 0.5
##$BCFW= 0
##$BC_mod= 2
##$BYTORDP= 0
##$COROFFS= 0
##$CY= -3
##$DATMOD= 1
##$DC= 0
##$DFILT= <>
##$DTYPP= 0
##$F1P= 0
##$F2P= 0
##$FCOR= 1
##$FTSIZE= 65536
##$FT_mod= 6
##$GAMMA= 0
##$GB= 0
##$INTBC= 1
##$INTSCL= 5.30512e-09
##$ISEN= 30
##$LB= 1
##$LEV0= 0
##$LPBIN= 0
##$MAXI= 10000
##$MC2= 0
##$MEAN= 0
##$ME_mod= 0
##$MI= 50
##$NCOEF= 0
##$NC_proc= -5
##$NLEV= 6
##$NOISF1= 182.463
##$NOISF2= 159.3651
##$NSP= 0
##$NTH_PI= 0
##$NZP= 0
##$OFFSET= 182.463
##$PC= 4
##$PHC0= -2587.448
##$PHC1= 151.799
##$PH_mod= 1
##$PKNL= yes
##$PPARMOD= 0
##$PSCAL= 0
##$PSIGN= 0
##$REVERSE= no
##$SF= 81.0140089999434
##$SI= 65536
##$SIGF1= 159.3651
##$SIGF2= -187.1042
##$SINO= 113.3802
##$SIOLD= 16384
##$SREGLST= <1H.CDCl3>
##$SSB= 0
##$STSI= 65536
##$STSR= 0
##$SW_p= 29940.119760479
##$SYMM= 0
##$S_DEV= 0
##$TDeff= 32768
##$TDoff= 0
##$TI= <>
##$TILT= no
##$TM1= 0
##$TM2= 0
##$TOPLEV= 0
##$USERP1= <user>
##$USERP2= <user>
##$USERP3= <user>
##$USERP4= <user>
##$USERP5= <user>
##$WDW= 1
##$XDIM= 65536
##$YMAX_p= 315676226
##$YMIN_p= -9083045
$$ End of Bruker specific parameters
$$ ---------------------------------
##NTUPLES= NMR SPECTRUM
##VAR_NAME=  FREQUENCY,     SPECTRUM/REAL,   SPECTRUM/IMAG
##SYMBOL=    X,             R,               I
##VAR_TYPE=  INDEPENDENT,   DEPENDENT,       DEPENDENT
##VAR_FORM=  AFFN,          ASDF,            ASDF
##VAR_DIM=   65536,         65536,           65536
##UNITS=     HZ,            ARBITRARY UNITS, ARBITRARY UNITS
##FACTOR=    0.456856943014862, 1,           1
##FIRST=     14782.0589164792, 0,            0
##LAST=      -15158.0608439998, 0,           0
##MIN=       -15158.0608439998, -9083045,    0
##MAX=       14782.0589164792, 315676226,    0
$$ Real data points
##PAGE= N=1
##DATA TABLE= (X++(R..R)), XYDATA
$$ [...]
42063A242586j2201q34579q18068q0194N33586N14310K9771m95840o80334k94777
42053h95740M68094R75641P73501J03981m58679o82352o94759n79133l37070r6251
42043a422767P152N5655J77709K75590J91248O079o9376M7086L57933Q36322J174947
42032A637578Q25032k83602j312922j330330m52308L14514L39015k0666j27108
42023d10797R5327K53242J03366j89443l01197j00559K14019K96800K5101l35079
42013c49220m01463p1548M04856O59214M61020j00181n85660n41452k3168L71830
42003a75772J78057l75428o62053l77475K36692P56931R41616Q08508N40576K93405
41993B165057M4770k45337l56825k6081M78108M54709k75348r61534q93442l72818
$$ plain form
42063 1242586 1230385 395806 -422262 -502456 31130 545440 575211 79371 -600963 -895740
42053 -895740 -427646 547995 1321496 1425477 966798 284446 -410313 -989446 -1326516 -1422767
42043 -1422767 -1415615 -1359960 -1182251 -906661 -715413 -709334 -778710 -731624 -373691 462631 1637578
42032 1637578 2462610 2179008 866086 -464244 -916552 -602038 -263023 -283689 -410797
42023 -410797 -315470 -62228 41138 -148305 -449502 -550061 -336042 -39242 -14141 -349220
42013 -349220 -750683 -822231 -417375 241839 702859 602678 17018 -524434 -547602 -175772
42003 -175772 2285 -373143 -1035196 -1412671 -1175979 -419048 522568 1331076 1871652 2165057
41993 2165057 2209827 1964490 1607665 1581584 2059692 2514401 2239053 1277519 384077 11259
41983A1259j54625k57013p6041M49119O35220J86757k28070N5347O92094Q12662
41973B126709K25761l81838l91335J6052J98015r5996m17813k04794M36908P39852
41963B251521J74507q29599j293020p52466L07196J046901J050721N07708j06946
41954B356523m18857l93200k99205l69855n05365m33782j22274J70890K69978
41945B54853L00173M49730O64103O80346L00661m00820j070697j283897q90771
41936i96319k09910K22465J75229m0963P6013O23459J102644R11625M6010q17992
41926A092261j036316o56501k05234Q836Q1217J21236Q8176K4485M2151K3162
41916d16527k36332n12369l03050L35422O66161K92385k37056k49299J26150L50219
$$ plain form
41983 11259 -143366 -400379 -476420 -27301 607919 794676 566606 621953 1314047 2126709
41973 2126709 2352470 1970632 1579297 1595349 1793364 1697368 1279555 1074761 1511669 2251521
41963 2251521 2426028 1596429 303409 -449057 -141861 905040 1955761 2463469 2356523
41954 2356523 1937666 1544466 1245261 875406 370041 -63741 -186015 -15125 254853
41945 254853 555026 1004756 1668859 2349205 2649866 2249046 1178349 -105548 -996319
41936 -996319 -1206229 -983764 -808535 -849498 -773485 -150026 952618 1864243 1910253 1092261
41926 1092261 55945 -600556 -805790 -796954 -715737 -594501 -506325 -481840 -439689 -416527
41916 -416527 -652859 -1165228 -1468278 -1132856 -466695 -174310 -411366 -660665 -534515 -184296
41906a84296L48966M05203N00284L69056R652l71887p12497r27376o94642N5618
41896a201919P28728P36761L24028J20481J69528J00929j0429K00738N22051L26323
41886B017219l89749r24377q75527n03707r7711K54723K80063k39118p85997n82183
41876a846364J46655L50384j94278m79240P8611O54698L75013k59952k04592M99277
41866h79788Q63937M37735j63743j65384M57549J002096P44089k77851j144672
41857H73968j026219k47180J28770k06854m49530o230O20486O70630J41127m97230
41847A738r42859r51446k54187Q49533J426563J022251K85398m6965j38718m02427
41837H48881n57143j77072L54352L44096j09080l48792k20216j13872j80358k37978
$$ plain form
41906 -184296 164670 569873 1070157 1439213 1448865 1076978 364481 -562895 -1257537 -1201919
41896 -1201919 -473191 263570 587598 708079 877607 978536 968107 1168845 1690896 2017219
41886 2017219 1627470 703093 -172434 -676141 -773852 -519129 -239066 -478184 -1264181 -1846364
41876 -1846364 -1699709 -1349325 -1543603 -2022843 -1944232 -1289534 -914521 -1174473 -1379065 -879788
41866 -879788 -15851 421884 258141 92757 550306 1552402 2296491 2018640 873968
41857 873968 -152251 -399431 -270661 -477515 -927045 -933275 -312789 357841 498968 1738
41847 1738 -941121 -1892567 -2146754 -1297221 129342 1151593 1436991 1390026 1251308 848881
41837 848881 291738 114666 469018 813114 704034 355242 135026 21154 -159204 -397182
41827c97182k84317m41274n61454m53680k65509j34356J78186P43731J013428
41818f02427N87777n959o8366J64971R537m58124n88996k68770P3780L17792O02599
41807b36186O63262J54162n32627o69067k37156K56137O72527R93523O35956p11363
41797I89168j891857j428633J89452R44949J80193n89305j91786N23509L66565
41788i07745k61768k65634L23706O14707L32246j7256r9539l3950P2426K59557
41778A6750M95887O51380N49866L3059o76179q57064j99258M07446j8660q39393
41768d36166n55008O82426J011290j90804j122974l54510Q83284O89194n71142
41759C5590j090103m44407K55971M67343O22524P17751K54412m25542l71842K72702
$$ plain form
41827 -397182 -681499 -1122773 -1684227 -2137907 -2403416 -2537772 -2359586 -1615855 -602427
41818 -602427 -14650 -20609 -88975 75996 85533 -372591 -961587 -1230357 -1156577 -838785 -236186
41807 -236186 427076 581238 48611 -620456 -857612 -601475 71052 1064575 1700531 989168
41797 989168 -902689 -2331322 -2141870 -1196921 -1016728 -1606033 -1797819 -1274310 -907745
41788 -907745 -1169513 -1435147 -1111441 -496734 -164488 -181744 -281283 -315233 -242807 16750
41778 16750 512637 1164017 1713883 1746942 1070763 213699 14441 421887 403227 -436166
41768 -436166 -991174 -308748 702542 511738 -611236 -965746 -82462 606732 35590
41759 35590 -1054513 -1498920 -1242949 -775606 -153082 564669 819081 393539 21697 294399
41749B94399L26132m25620p57488J0953R27755R42653L54983k1436j49258l67992
41739A135081m63259n1762N53317O67275J94674l38534n42111m69868l08795j66099
41729B09919j03681j13271j03707m2085M175K1586O5002R2209K0389l9824J07968
41718A18680L84439M90841L40486R5370k12370o57501r83842p17594R3492P34144
41708c13855O79947J91912k07811m09951n09488l59529J34101N42515L37687k85023
41698a99495n68895k41312J33803N5176j58209P1424N94930P09694K62888o4062
41688E95942J83950M65241N3189p59414r79793l43746L23287L28358l993l2689
41678a69668J98205J95615j15537l32758k23852K7619J54986O0855j71418k79442
$$ plain form
41749 294399 620531 194911 -562577 -551624 376131 1318784 1673767 1652331 1503073 1135081
41739 1135081 671822 620060 1173377 1840652 2035326 1696792 1154681 684813 376018 209919
41729 209919 106238 -7033 -110740 -152825 -148650 -127064 -62062 30147 50536 10712 118680
41718 118680 503119 993960 1334446 1429816 1217446 559945 -423897 -1141491 -1047999 -313855
41708 -313855 366092 558004 350193 -59758 -569246 -928775 -794674 -252159 85528 -199495
41698 -199495 -768390 -1009702 -875899 -820723 -978932 -907508 -312578 397116 660004 595942
41688 595942 779892 1245133 1298322 538908 -440885 -784631 -461344 -132986 -136979 -169668
41678 -169668 28537 224152 108615 -224143 -447995 -420376 -265390 -204535 -375953 -655395
41668f55395o601M87024O48244K42752k37536k14281K10370N07963M74171K91570
41658A748281P0374k07959m32195m53187l17315j11512K05866N40775N69700K46366
41648A859194j6531n9032l19017r35842j169054n08911K53449J04820n35687m75107
41638a801718K68529N60990J59052P6421O72409R10431J54743o55468n16288O7176
41628a03723M5960m83193o38689k19739K25332M12135M70124L51591o2416m49745
41618d52363l91286p8291L673o5592J92174P13452Q53446L79326j16266k5788
41608A012485M56322N90485l0q49051j110450n23568K23787L49222K2010K0165
41598A91377M06081L71807l30469p28011o4765Q53914O88019n11615j390775j117946
$$ plain form
41668 -655395 -661996 -174972 473272 716024 478488 264207 474577 982540 1456711 1748281
41658 1748281 1818655 1610696 1178501 725314 407999 296487 502353 1043128 1612828 1859194
41648 1859194 1842663 1783631 1464614 528772 -640282 -1149193 -895744 -790924 -1326611 -1801718
41638 -1801718 -1533189 -972199 -813147 -736726 -64317 846114 1000857 345389 -170899 -103723
41628 -103723 -57763 -540956 -1179645 -1399384 -1174052 -761917 -291793 59798 -2618 -452363
41618 -452363 -843649 -921940 -918267 -983859 -791685 -78233 775213 1154539 1038273 1012485
41608 1012485 1468807 2059292 2059262 1210211 99761 -423807 -200020 149202 171212 191377
41598 191377 597458 969265 638796 -89215 -153980 699934 1387953 876338 -514437 -1632383
41588a632383j99452N10378P56772O90491M30579Q6468k21389n03962p44701o67813
41578a495012j08247M86399M81560l8159l63293j78279J25816K38724L63965O24670
41568A38144O59769K28643k25052j00695M79394P39108J86305p62754j186397
41559A56465o68099J74554L78914j21077l76737J71994P40976L41283n54722n36870
41549b93319O04388J429890Q99016k05997n65576j43029J58344j4312l42818p69655
41539G56932j413892j721732q96108O51788J389205O62178l21070j68342P83996
41530b77045J096602K91568o75309q64540l62677K63280P05842Q02814L63535
41521A344070m09961q04156m37472Q6461o6663p31247q84579n7767R76401J199503
$$ plain form
41588 -1632383 -1831835 -1321457 -564685 125806 556385 642853 421464 -82498 -827199 -1495012
41578 -1495012 -1603259 -1116860 -635300 -673459 -1036752 -1215031 -1089215 -850491 -486526 138144
41568 138144 797913 1026556 801504 700809 1180203 1919311 2105616 1342862 156465
41559 156465 -511634 -337080 41834 -79243 -455980 -283986 456990 798273 243551 -293319
41549 -293319 311069 1740959 2639975 2433978 1868402 1725373 1883717 1869405 1526587 756932
41539 756932 -656960 -2378692 -3274800 -2623012 -1233807 -571629 -892699 -1061041 -277045
41530 -277045 819557 1111125 435816 -428724 -791401 -528121 177721 980535 1344070
41521 1344070 934109 129953 -307519 -221058 -287721 -1018968 -1903547 -1961314 -984913 214590
41511B14590O30285J90509M29039Q33474N95151k28029p38046m30449O1645j49001
41501A409168q87907j137779n34752J14356P2023k98803k51107J99642N07926
41492h07233N26995M77636L26070m9326l35766k09836l9587l23994o75353l47219
41482a457613L87576N25640j3365k64091R7881K84279k3209l2985N52132O89309
41472G45554k44473j075760n01280P99948J139831K93741m25901k34364L36909
41463H34205O20411N93387M15410J34911o9957q7006k27083p14946j056187o50316
41453b07171K37303Q58066R61301O25205k95450j504655j711028j86270J564828
41444C42129J377672m84451j608988q91108K10761L13890J8847K45939M51444
$$ plain form
41511 214590 844875 1035384 1464423 2297897 2893048 2665019 1926973 1496524 1558169 1409168
41501 1409168 521261 -616518 -1151270 -1036914 -964891 -1263694 -1514801 -1315159 -807233
41492 -807233 -280238 197398 523468 474142 138376 -71460 -111047 -435041 -1110394 -1457613
41482 -1457613 -1070037 -544397 -557762 -821853 -723972 -439693 -462902 -495887 56245 745554
41472 745554 501081 -574679 -1075959 -276011 863820 1157561 731660 497296 834205
41463 834205 1454616 2048003 2463413 2598324 2528367 2441361 2214278 1499332 443145 -207171
41453 -207171 30132 888198 1849499 2474704 2179254 674599 -1036429 -1222699 342129
41444 342129 1719801 1235350 -373638 -1264746 -1053985 -740095 -721248 -475309 -23865
41435b3865j25451p65472l45997P37313J147493N65970j60524m47368m44829l36746
41425a99476j18801N8226L5393l4134j3469p8930k34682o1923N12909Q16188M17501
41414A098802j32067k34338j79770l42987k65260M06701Q39474J75313q24906
41405E40962p80437O0850K00600o00658r21810n7698Q59273P51863J89690J99216
41395D41851O02415N74462Q8180k16137j31626K0747Q3478J04450o6023n38774
41385I63023r08989o43668J07483O11967M75971M6827j51092m7608J3965k29055
41375B38824n97896o11327n9864O01835O80673J13405l98370k77534K10484L85028
41365B85258M9882l60275m02880q7448K47959K81960m6997m50541m79622j204
$$ plain form
41435 -23865 -149316 -914788 -1260785 -523472 624021 1189991 1029467 582099 137270 -199476
41425 -199476 -318277 -260051 -224658 -258792 -272261 -351191 -585873 -647796 -134887 681301 1098802
41414 1098802 966735 732397 552627 209640 -55620 351081 1190555 1365868 540962
41405 540962 -239475 -178625 21975 -578683 -1500493 -1558191 -698918 52945 242635 441851
41395 441851 1044266 1618728 1706908 1490771 1359145 1379892 1463370 1567820 1501797 963023
41385 963023 54034 -589634 -482151 129816 605787 652614 501522 453914 467879 238824
41375 238824 -359072 -970399 -1030263 -428428 252245 365650 -32720 -310254 -99770 285258
41365 285258 335140 -25135 -428015 -515463 -267504 14456 -32541 -483082 -962704 -963908
41355i63908N41999N75768J19866j93257L9111L81993J14804p10301j201211p68964
41345b064100P1389M14407J72972J4293K22326L34506N1345k08546m9315K21317
41335h19406J90545R4311K91001M06163j37393r45280r59909o387Q69252Q67260
41325a49843M20255K87444L96804K26380j78547l25125j70387j65193m04001l82630
41315d44843J73164P12822M82061m54366j188548j002935j53386N41319O85231
41306f49481N55642M30956J57121l60090o61062k61893N10522Q05307L60607k54232
41296F33397n78843p59709q47080l72031P30521J397524O29863q26001j119921
41287a112280J86753J360652Q60104n16523q82714m206O03173J57059l58112o8953
$$ plain form
41355 -963908 -421909 153859 273725 80468 119579 501572 616376 -93925 -1295136 -2064100
41345 -2064100 -1992711 -1578304 -1405332 -1391039 -1168713 -834207 -782862 -991408 -1040723 -819406
41335 -819406 -628861 -534550 -243549 162614 25221 -920059 -1879968 -1886355 -1017103 -149843
41325 -149843 270412 557856 954660 1181040 1002493 677368 506981 341788 -62213 -444843
41315 -444843 -271679 441143 923204 468838 -719710 -1722645 -1876031 -1334712 -649481
41306 -649481 -93839 337117 494238 134148 -526914 -788807 -278285 527022 887629 633397
41296 633397 54554 -705155 -1552235 -1924266 -1193745 203779 833642 7641 -1112280
41287 -1112280 -925527 435125 1295229 778706 -104008 -108214 494959 652018 293906 224953
41277B24953L28270o0000o46176l61318M48278O12148J63913J62443O42061M78712
41267A993284m86317r52348l59638J21914l07602o24182J37260J019229P28300
41258A269900j25048j78129K29650k22390j251572j276785j40778O10571L35760
41249g48821J17011N30984O14344j60890p13976k26474L67051j6018p81284p27895
41239a745968N1500N92502N88889L54349l8601m99452m67923K23042O77258J74374
41229i0030n74183m92825K01834N92106O45958Q66357R18899J40208r15633j029280
41219B63411l02966j6740m53985m98072L08676R14894N55095n6944j14644j4735
41209E83990l13605n00364L4838O41938L02805n96822o71836L92343J319736J007398
$$ plain form
41277 224953 553223 493223 -152953 -514271 -65993 546155 710068 872511 1514572 1993284
41267 1993284 1506967 554619 194981 316895 9293 -614889 -477629 541600 1269900
41258 1269900 1144852 966723 1196373 973983 -277589 -1554374 -1695152 -1084581 -748821
41249 -748821 -631810 -100826 513518 352628 -361348 -587822 -220771 -236789 -1018073 -1745968
41239 -1745968 -1694468 -1101966 -513077 -158728 -197329 -696781 -1164704 -941662 -264404 -90030
41229 -90030 -664213 -1157038 -955204 -363098 282860 1149217 2068116 2208324 1292691 263411
41219 263411 -39555 -56295 -510280 -1008352 -699676 215218 770313 713369 598725 583990
41209 583990 270385 -229979 -195141 446797 749602 152780 -519056 -126713 1193023 2200421
41199B200421p2384o49302k70957L55899M07577j33462o76989q44578p69494o18240
41189a071509k54251L45784P24351M97885L6235k7727J86043K4350m97212o07307
41179f43358r6532K16399j98139o61537l66229L46673O13302L84266K15003J48524
41169d1628j58302m38056p3639O38908O37938k19071p14047o1014Q18815O32296
41159A022200l75069q36320k32518N63112O63433J87665k67336m24321k96242
41150D604L4325K53318n7415p36042r37382j84198Q49310J138341O06369L3192
41140A004422j31435j72859l53942m58872k95811r7879j32494k94484l21491j04935
41130a359780L38757Q37953R26119K35014p96876j165039n42779K51351L79758
$$ plain form
41199 2200421 2128037 1478735 1207778 1563677 1971254 1837792 1160803 316225 -453269 -1071509
41189 -1071509 -1325760 -979976 -255625 242260 278495 250768 436811 461161 -36051 -643358
41179 -643358 -739890 -523491 -721630 -1383167 -1749396 -1402723 -789421 -405155 -190152 -41628
41169 -41628 -199930 -637986 -711625 -72717 565221 346150 -367897 -428911 389904 1022200
41159 1022200 647131 -189189 -421707 141405 804838 992503 725167 300846 4604
41150 4604 38929 292247 234832 -501210 -1438592 -1622790 -773480 364861 971230 1004422
41140 1004422 872987 700128 346186 -112686 -408497 -506376 -638870 -933354 -1254845 -1359780
41130 -1359780 -1021023 -183070 743049 978063 181187 -983852 -1526631 -1275280 -895522
41121h95522J4882k07362j71383r3934J31001O18020Q73346L39242o07998r97037
41111i96745n34256J73321N88764P00591N60327J64096j55455n622K97208L1590
41101H23819p09130r57574l08938M44592N41329K96494L35293M79278J42682n95496
41091D92349j030508p46026L789O41592O67651Q282p32876p38208J0036O21705
41081h02214N14145J61573J94764M05155K92379P596n2142q7625m16071n68149
41071c50589M7668Q27530N55008o56905j264380m84931N66126N49674k62109o60006
41061a132914k92168J82142L31700L67364M08110K09603k01258k92392K37262
41052a82551Q96922R34854K40754n61675q52325o22279l13717k15025j77506N1685
$$ plain form
41121 -895522 -880640 -1088002 -1259385 -1353319 -1222318 -604298 269048 608290 292 -996745
41111 -996745 -1531001 -1357680 -768916 -68325 492002 656098 500643 495021 792229 823819
41101 823819 114689 -842885 -1151823 -707231 -165902 130592 465885 945163 1087845 492349
41091 492349 -538159 -1284185 -1280396 -638804 28847 37129 -695747 -1433955 -1423919 -802214
41081 -802214 -288069 -126496 68268 473423 765802 773398 721256 633631 217560 -350589
41071 -350589 -302921 524609 1079617 422712 -841668 -1326599 -760473 -210799 -472908 -1132914
41061 -1132914 -1425082 -1242940 -911240 -543876 -135766 73837 -127421 -419813 -182551
41052 -182551 714371 1649225 1889979 1328304 475979 -146300 -460017 -675042 -852548 -800863
41042h00863L81324M48264J10040l40184n23787l87089j64402n6074o0407m8059
41032a441237R1281L18590M09273J47613l62475o83496m62269J78506P44016Q24322
41022b35876M10676j55983m83223m52784l11509l47802m44839j59769N94588J178817
41012d07704R04918K4307m23118P1664P38303N21676m16936q01437O8873J316277
41002A596823J571624O76415k84827n17114l95992o13623j046255j008923l63802
40993c85674K44097L07018R7362J32562L55221K67737k23402n51460k45756L64105
40983C61810N20409m657o76265r40497q20710n99821k89890J98108O06136N70946
40973a074431K62782K48993O18997P67753L03872k95841l41846R2815L30509M7048
$$ plain form
41042 -800863 -419539 28725 138765 -201419 -725206 -1112295 -1276697 -1332771 -1393178 -1441237
41032 -1441237 -1349956 -1031366 -622093 -474480 -836955 -1520451 -1982720 -1804214 -1060198 -235876
41022 -235876 174800 18817 -464406 -917190 -1228699 -1576501 -2021340 -2181109 -1586521 -407704
41012 -407704 497214 521521 98403 170067 908370 1430046 1013110 211673 280546 1596823
41002 1596823 3168447 3844862 3560035 3042921 2646929 2033306 987051 -21872 -385674
40993 -385674 -141577 165441 262803 395365 750586 1018323 794921 243461 -2295 361810
40983 361810 882219 877562 201297 -739200 -1559910 -2159731 -2449621 -2251513 -1645377 -1074431
40973 -1074431 -811649 -562656 56341 824094 1127966 832125 490279 583094 913603 960651
40963I60651l96902n37158l17861L326J51282J5329k11426j21140L84556P38629
40953F69286K99802o77608j161579o34612J89643L12564k36819n57339j89211
40944a985873L41103M20923K37465L46978P02151P04007J80922k95356k85740
40935C66580j19384k19935k78373K01246Q05541N76792m57199j067646n33831
40926g26209K96917L12671k40308l50764N9070J44821l24552n88652k06079K81511
40916a341574L53217K94433M87332O58640M29729N0388j7243J88469L68482M90162
40906A962035N38046J87306o41644j287795j095026l44848K24692M70753O26522
40897F40041M22668m90202j402771j082830L62309J357993J006782K12035N8146
$$ plain form
40963 960651 563749 26591 -291270 -287944 -136662 -121333 -332759 -453899 -69343 669286
40953 669286 969088 291480 -870099 -1504711 -1315068 -1002504 -1239323 -1796662 -1985873
40944 -1985873 -1644770 -1223847 -986382 -639404 62747 766754 947676 652320 366580
40935 366580 247196 27261 -251112 -49866 755675 1332467 875268 -192378 -726209
40926 -726209 -429292 -116621 -356929 -707693 -648623 -503802 -828354 -1417006 -1623085 -1341574
40916 -1341574 -988357 -693924 -206592 452048 881777 932165 914922 1103391 1471873 1962035
40906 1962035 2500081 2687387 2045743 757948 -337078 -681926 -457234 13519 640041
40897 640041 1062709 572507 -830264 -1913094 -1550785 -192792 813990 1026025 1084171
40888A084171K19695r3065n98670n63545k49240l88919o53006r6351R96504J222748
40878H80322K28827o62192m75330Q0562K9281l04451j35425K99973K47807k05290
40868a5916m19849m01959n72348o66411q8776P58151P61021j60214p80111l56706
40858a943118M03706O47990O24651R30481J312293J071147K04580n96935q33536
40849A821259n34116J8542M29232L27823k05077n99119n10325k43642j67307j77822
40839A59448j25023k08988m39332k88448M48794J015648P26299J19038J04502
40830A511938M04286K9519r13800j242963o05852k8050j85490l89390Q4073P55107
40820e80622Q40942M96744K59857K183n66489r33846m35250M60446O27343n0802
$$ plain form
40888 1084171 1303866 1210801 612131 48586 -200654 -589573 -1242579 -1338930 -342426 880322
40878 880322 1109149 446957 -28373 52189 81470 -222981 -358406 -58433 189374 -15916
40868 -15916 -435765 -837724 -1410072 -2076483 -2165259 -1407108 -646087 -806301 -1586412 -1943118
40858 -1943118 -1539412 -891422 -266771 663710 1976003 3047150 3251730 2654795 1821259
40849 1821259 1287143 1305685 1734917 2062740 1857663 1258544 748219 504577 337270 159448
40839 159448 34425 -174563 -613895 -902343 -453549 562099 1288398 1407436 1511938
40830 1511938 1916224 1945743 1031943 -211020 -816872 -844922 -1030412 -1419802 -1335729 -580622
40820 -580622 260320 757064 1016921 1019104 452615 -481231 -916481 -456035 171308 120506
40810A20506n29941j90991M00023N47387L47262J58916p4239m25920m92540N6021
40800h3516P68146Q59704K16419n36359q43332o56601j90615K51164K42949m03974
40790c76015j128801j019417J626Q81915P41364M0996j32880L47015N59168J8856
40780f6173n71683l88840L57522Q54933Q12989N56601K87463q9783m83439n60844
40770G08746k71378J4567n054k58898n18077n96027l45307J74248N27397L23823
40760b45960j56590k23756K32243N17629J38603m44699m50345J65196P05561O29479
40750H67361P1552m69156o45305m33039m870M49014P89948Q74736N59703j08881
40740A951063p87594j097602r57737n28979K6673N14424O33690K99765r1297j12008
$$ plain form
40810 120506 -409435 -600426 -200403 346984 694246 853162 778923 353003 -139537 -83516
40800 -83516 684630 1544334 1760753 1224394 381062 -275539 -466154 -214990 27959 -376015
40790 -376015 -1504816 -2524233 -2522607 -1640692 -899328 -858332 -991212 -644197 -85029 -66173
40780 -66173 -637856 -1026696 -669174 185759 998748 1555349 1842812 1753029 1269590 708746
40770 708746 437368 451935 446881 187983 -330094 -926121 -1271428 -1097180 -569783 -245960
40760 -245960 -402550 -626306 -394063 123566 262169 -182530 -632875 -467679 237882 867361
40750 867361 938913 469757 -175548 -608587 -613457 -164443 625505 1500241 2059944 1951063
40740 1951063 1163469 65867 -891870 -1420849 -1394176 -879752 -246062 53703 -37594 -149602
40730a49602J13944K20160L00062O73525J061732P98154l4676n12111j92910K58499
40720B536777J78936j46849k06374k02055n34068r00023p51498k98950k22274
40711e46378n49393o05154o6314N91684P89148M88656M4693k43372l34104l68129
40701g98663l86929j58791M29269Q60334M76835l90421n93943J49526O70280J07340
40691C64837o92757n44772J66610K84690n4596K13954R40205P82972m32464j140023
40681a11344m32550N12895L31008m93738o38773m3608K93299P4399p291L98149
40671a17554P17691L56262m90772j093661q98211K0239R44723J067616K99221
40662H05554o13633r32341o27128q9211M34587Q15453Q45665M78126J8682k30235
$$ plain form
40730 -149602 -35658 184502 484564 1158089 2219821 3017975 2983299 2471188 2278278 2536777
40720 2536777 2715713 2568864 2362490 2160435 1626367 726344 -25154 -324104 -546378
40711 -546378 -1095771 -1700925 -1767239 -1175555 -386407 102249 146942 -96430 -430534 -798663
40701 -798663 -1185592 -1344383 -915114 -54780 422055 31634 -562309 -412783 257497 364837
40691 364837 -327920 -872692 -706082 -421392 -475988 -262034 678171 1461143 1028679 -111344
40681 -111344 -543894 -30999 300009 -193729 -832502 -876110 -582811 -508412 -515703 -117554
40671 -117554 600137 956399 465627 -628034 -1526245 -1506006 -561283 506333 805554
40662 805554 191921 -740420 -1367548 -1456759 -1022172 -206719 638946 1117072 1135754 905519
40652I05519k82500k28282m2188J51952P3249j82841j07355L83632O35948K35158
40642A542292k86424l01839q0926k05678m99894m20971j57367l45260q45522q10310
40632b411899k6850P27805Q59392O45764M78767K10029l04115o39137l46737L01778
40622e05203O11816L31019j24612k08745J97075O80282O74979O3136o25049q11945
40612B82753n86757m95047o88068p35515l37688K44327O29023P73122P91296O82102
40602E59548M54726K21782k6157m33919q94103r89606n60255k4403J14454j72486
40592a750419n63427p62245n53875J32701R25636J159110O87848J79479J70105
40583c75087K57417j48910o58478l68974O09942J103698N67348j22661q0264K44083
$$ plain form
40652 905519 623019 394737 352549 504501 577750 394909 287554 671186 1307134 1542292
40642 1542292 1255868 954029 873103 667425 167531 -253440 -410807 -756067 -1601589 -2411899
40632 -2411899 -2438749 -1710944 -851552 -205788 272979 483008 178893 -460244 -806981 -505203
40622 -505203 106613 437632 313020 104275 301350 981632 1656611 1719747 1094698 282753
40612 282753 -304004 -799051 -1487119 -2222634 -2560322 -2315995 -1686972 -913850 -122554 559548
40602 559548 1014274 1236056 1209899 775980 -118123 -1107729 -1667984 -1692387 -1577933 -1750419
40592 -1750419 -2313846 -3076091 -3629966 -3497265 -2571629 -1412519 -724671 -545192 -375087
40583 -375087 -117670 -266580 -925058 -1294032 -684090 419608 986956 864295 784031 1028114
40573A028114n3297p32208p85037j62816P2345m95487q64319j97143P46494P04610
40563g38744j20129l29929N32578J260195P55822l78510p19122L9762Q24553P21063
40553A847539L9402l63831l12728l95329r25637j298210p20502N67514J344160
40544b17622R22478J23337J53214Q38752Q65342k02935j165043r17528n6280Q6589
40534D30304n80612r08822k68691O70175J001588O18801j3915m64199m54938N3490
40524H3181O14417N83295o9833o26069n33044o2102J99173J10375p9198j93540
40514B6655j65004J20924O26501R77396Q24850K91613k07388m67457n63386n46261
40504I18443l64660m7978K58522M29399L98494J48273k02476m14357l82366k51933
$$ plain form
40573 1028114 974817 242609 -542428 -705244 -632899 -1128386 -1992705 -2189848 -1443354 -738744
40563 -738744 -858873 -1188802 -656224 603971 1359793 981283 262161 301923 1126476 1847539
40553 1847539 1886941 1523110 1210382 815053 -110584 -1408794 -2129296 -1561782 -217622
40544 -217622 704856 828193 981407 1820159 2685501 2482566 1317523 399995 343715 430304
40534 430304 -150308 -1059130 -1327821 -657646 343942 962743 948828 484629 29691 83181
40524 83181 697598 1280893 1211060 584991 51947 -10155 189018 299393 220195 26655
40514 26655 -138349 -17425 609076 1586472 2411322 2702935 2495547 2028090 1464704 918443
40504 918443 553783 505805 764327 1193726 1592220 1740493 1538017 1123660 741294 489361
40494D89361j38534P5845M34591N88711J55376o50198j110046q19397j26432L66703
40484g34020M88406M75521M50675K46975k04446n78166m77600L946K90420q20
40474c9109n59630p52730l94458J14911M15047O13608R05046J050640O31166k34320
40464A750171q34250o93545j50458J62516J62440K19921L59662J72715l30828
40455H18344m56493J14942N88348J39531o68143n78997L69495P77679N7737o07985
40445E54458j74520N85542M16284l26108l30594M45950P70413K28944j99830J00321
40435B070860M45705J62895l39713m35111k51205j47890n4543N9648j58483o94815
40425F57348q26666j90189N17150N60320J96829K3800L7797O1366L04792O73597
$$ plain form
40494 489361 350827 426672 861263 1449974 1605350 955152 -154894 -974291 -1100723 -734020
40484 -734020 -245614 229907 680582 927557 723111 144945 -332655 -328709 -38289 -39109
40474 -39109 -598739 -1351469 -1745927 -1631016 -1215969 -602361 302685 1353325 1984491 1750171
40464 1750171 915921 222376 71918 234434 396874 616795 976457 1149172 818344
40455 818344 361851 476793 1065141 1204672 536529 -42468 327027 1104706 1162443 554458
40445 554458 379938 965480 1381764 1055656 725062 1171012 1941425 2170369 1970539 2070860
40435 2070860 2516565 2679460 2339747 1904636 1653431 1505541 1450998 1510646 1352163 657348
40425 657348 -169318 -359507 157643 717963 914792 938592 976389 1037755 1342547 2016144
40415B016144L76540p56424j433182o46787N18728L74520o75515p49643M45400
40406e30219J177220N59561j33511K29779P91616L36020n76961n25761N22034
40397A849778J223750P66371l17902j079782j092183n63235p8567r7202l67480
40388B43548j88576M66362O99319K7166p29895o08596P5325L32850J6530k53446
40378H0587k92823l90247l51276L14135J203899J185490N5682r67430q70485j11182
40368a43650K85275J49939R733N5685L5106j07769j67447j47987k50229m26579
40358g07923m01172j30319J39135K76573L87636N14306N53654N19192N41481N15260
40348B207823J08751o61017j174592q78298m8633M82111L31213o7671j64383K1674
$$ plain form
40415 2016144 2392684 1636260 203078 -443709 75019 449539 -225976 -975619 -530219
40406 -530219 647001 1206562 1073051 1302830 2094446 2430466 1853505 1327744 1849778
40397 1849778 3073528 3839899 3521997 2442215 1350032 786797 708230 611028 243548
40388 243548 54972 521334 1220653 1247819 517924 -90672 -15347 317503 334033 80587
40378 80587 -212236 -602483 -953759 -639624 564275 1749765 1805447 838017 -32468 -143650
40368 -143650 141625 291564 301297 356982 392088 284319 116872 -31115 -281344 -707923
40358 -707923 -1109095 -1239414 -1100279 -823706 -436070 78236 631890 1151082 1692563 2207823
40348 2207823 2316574 1655557 480965 -397333 -445966 36145 367358 299687 135304 156978
40338A56978J30296N8385k2324p1225k08614l81015l67914j62480p933K2994J45775
40327g07077M27866N68197L24107j15748m14633m95373m22779j48094K90842N23238
40317a69454K26548l02456l62846K81829J033573J081746K43738q75181j448593
40308b91096j136058l31712K54928K80055j3141k10762j69319M531J65969J84537
40298a262068J913k23720k58604j77587k63977l91620k6194Q17557J207867N12126
40288f4307m93278n66586K28730O62373J82298m16713l69491K2918J86033K16617
40278d11406L78998L47148k58604r96665j033099k50434O75504J138292J010554
40269F00288L92613m46493r51057o71687J46329P34242N88335j32104q39202q99387
$$ plain form
40338 156978 287274 345659 323335 252110 43496 -337519 -705433 -867913 -875846 -852852 -707077
40327 -707077 -279211 288986 613093 497345 82712 -412661 -835440 -983534 -692692 -169454
40317 -169454 57094 -245362 -608208 -326379 707194 1788940 2032678 1157497 -291096
40308 -291096 -1427154 -1758866 -1503938 -1223883 -1237024 -1447786 -1617105 -1612574 -1446605 -1262068
40298 -1262068 -1260155 -1483875 -1742479 -1920066 -2184043 -2575663 -2601857 -1784300 -576433 -64307
40288 -64307 -557585 -1124171 -895441 -233068 -50770 -467483 -836974 -814056 -628023 -411406
40278 -411406 -32408 314740 56136 -940529 -1973628 -2224062 -1548558 -410266 600288
40269 600288 992901 546408 -404649 -1076336 -930007 -195765 392570 260466 -578736 -1478123
40259a478123q8541R46249J047414o7753j140482q42550L71644Q60960J46885
40250b44297n14735j62888N06023M83243O9885J01789L16461j99489j240068j496252
40240b380328m88563O58896Q02350K32376m2207K23499M75753M17672L36113M24703
40230F60264L80024j32430q85225j167957n09360O41677J124937L10976r29145
40221e06239j079604M8638R53616N18313l67195j91095P94412R37195j98665j105040
40211a95664o36548L67026O16825L40205M92690Q64409M66991n64202r70374l18929
40201D62429M01527M18826J84173K67705L55122L2512l15774j77451J77885K04950
40191B011904m5892k62298n40135r70425j059585m17937L61099M25365J772N1456
$$ plain form
40259 -1478123 -1566664 -620415 426999 359246 -781236 -1623786 -1252142 -391182 -244297
40250 -244297 -759032 -921920 -415897 67346 137231 239020 555481 355992 -884076 -2380328
40240 -2380328 -2868891 -2209995 -1407645 -1175269 -1217476 -993977 -518224 -100552 235561 660264
40230 660264 1040288 907858 22633 -1145324 -1654684 -1013007 111930 422906 -506239
40221 -506239 -1585843 -1537205 -583589 -65276 -432471 -623566 170846 1108041 909376 -195664
40211 -195664 -832212 -465186 151639 491844 984534 1848943 2315934 1751732 781358 462429
40201 462429 863956 1282782 1466955 1734660 2089782 2122294 1806520 1629069 1806954 2011904
40191 2011904 1966012 1703714 1163579 193154 -866431 -1284368 -923269 -497904 -496132 -444676
40181d44676P07028J034096M43257n18183r82550o84933P1148P35729P18032p0816
40171A008132q29052p26962j54492k12117q86687q87745K86007J318723R38269
40162a45924j86552n10649J06371M41889o5290n86933l11757M28029P68946L85574
40152C23704l56901q56875o81323R8951Q39466R08521L99545m9531j09227l9401
40142D76929j43487l84314n86812o24483l73885J30486N10301M44906K17962L37685
40132E288O38472M41582k67585o01454q1875N31231L25988l90584n59491Q5665
40122A27237P14875N98884n9649o04890p04452m49052o7973K21690L09056K79779
40112C65505K50716J07895l07759p25499n70019K21001Q85699P32359Q9793j35475
$$ plain form
40181 -444676 262352 1296448 1739705 1221522 238972 -445961 -374813 360916 1078948 1008132
40171 1008132 179080 -547882 -702374 -914491 -1801178 -2688923 -2402916 -1084193 -145924
40162 -145924 -332476 -843125 -736754 -294865 -360155 -947088 -1258845 -830816 -61870 323704
40152 323704 -33197 -890072 -1571395 -1472444 -632978 275543 675088 625557 516330 476929
40142 476929 333442 -50872 -637684 -1262167 -1636052 -1505566 -995265 -550359 -332397 5288
40132 5288 643760 1085342 817757 216303 134428 665659 991647 601063 41572 127237
40122 127237 842112 1440996 1381347 776457 72005 -377047 -445020 -223330 85726 365505
40112 365505 616221 724116 416357 -309142 -879161 -658160 227539 959898 1049691 914216
40102I14216K46847M59212m6824p28914p34724j38624K36777P8594o0598K13483
40092D39445M71769K36624j44402l6110M02624M20519j10270m39273r9394L40333
40082A481865J15049o07844j002884p55881l49258j68175P8528P22296J322611
40073H36307J049537j36210j191347j142495k06405O00758P32229M87864K37733
40064A267971o1073m04122m58694j60557n3398m74836q29046l52430O65816J171573
40054C11204P51060K9201l36097l55865l06650k74852k74804k80133l8012N83178
40044a91770J029063N64755n27856j075921o13657p154o0336l59944j43526M39146
40034i47200P16787N70585L16670j1908m52796n78264j0203Q04403J099268Q05593
$$ plain form
40102 914216 1161063 1620275 1573451 844537 109813 -28811 207966 286560 225962 439445
40092 439445 911214 1147838 1003436 967326 1369950 1790469 1680199 1240926 1141532 1481865
40082 1481865 1596914 989070 -13814 -769695 -1118953 -1287128 -1208600 -486304 836307
40073 836307 1885844 1749634 558287 -584208 -790613 -189855 542374 1030238 1267971
40064 1267971 1206898 802776 344082 183525 130127 -344709 -1173755 -1526185 -860369 311204
40054 311204 1062264 1091465 755368 399503 92853 -181999 -456803 -736936 -774948 -191770
40044 -191770 837293 1402048 874192 -201729 -815386 -822540 -882876 -1242820 -1386346 -947200
40034 -947200 -230413 340172 656842 644934 192138 -386126 -396329 408074 1507342 2312935
40024B312935L54954j52127p35784q93617k24613N47467L42277n49251p28273
40015B73968J97739J017179P83691Q1367j58127l6082j20206l47490l36039j81497
40005A174503j61513j34408N7991M3034n12782j168506j236150p24675j25267
39996b787773L93548Q92711J095311O83414k9043m38664n13790o22019o77811
39987b004116k64992M40322O95637K56997k98246m63509l53042j97606K9815K36596
39977a922144J07257k87060l51542J73236P20534O85397K56925N017J9517k3398
39967f16261j97648k38812R381M49666R00621J093577P18313j30112p45713n30722
39957G12290J62158L70754k79952j112033j181191k51554J003643J542207Q29735
$$ plain form
40024 2312935 2667889 2515762 1779978 886361 661748 1209215 1551492 1002241 273968
40015 273968 471707 1488886 2272577 2353944 2195817 2159735 2039529 1692039 1356000 1174503
40005 1174503 1012990 878582 936573 979607 466825 -701681 -1937831 -2662506 -2787773
39996 -2787773 -2394225 -1501514 -406203 277211 248168 -190496 -704286 -1326305 -2004116
39987 -2004116 -2269108 -1828786 -1133149 -876152 -1174398 -1637907 -1990949 -2188555 -2158740 -1922144
39977 -1922144 -1814887 -2101947 -2453489 -2280253 -1559719 -874322 -617397 -612380 -592863 -616261
39967 -616261 -813909 -1052721 -1043340 -593674 306947 1400524 2118837 1988725 1243012 712290
39957 712290 874448 1245202 965250 -146783 -1327974 -1579528 -575885 966322 1796057
39948A796057n10457j122186m15310N99362N66532l65129q24307k87559K56929
39939c06068L3236l32433j00896J81051k64412p83408j62926J186360J517767
39930I68271L25373q92432r00201l34342k57529l72062J51288R51562R68029K34425
39920H42382j51879K10043M92949O2322n96067p61734m90919k43638q7188J60838
39910e62891L39914P1633n69060r15815m13205O49089J282897Q33010j99981o66574
39900a50983j58873N28959N62556J70958P8893K87786K02112k30643l95284j21895
39890G73586r4171p77140j546298j397446k34096R83812J312479Q00063L36521
39881A57310N63562J057685Q71321j24370r69146r34070m75285l50950m39059
$$ plain form
39948 1796057 1285600 163414 -251896 347466 913998 548869 -275438 -562997 -306068
39939 -306068 -272832 -605265 -706161 -525110 -789522 -1572930 -1735856 -549496 968271
39930 968271 1293644 401212 -498989 -833331 -1090860 -1462922 -1311634 -360072 607957 842382
39920 842382 690503 900546 1393495 1455817 859750 98016 -392903 -636541 -723729 -562891
39910 -562891 -222977 -151344 -720404 -1636219 -2049424 -1400335 -117438 715572 515591 -150983
39900 -150983 -309856 219103 781659 952617 1031510 1319296 1521408 1290765 895481 773586
39890 773586 679415 -97725 -1644023 -3041469 -3275565 -2291753 -979274 -179211 157310
39881 157310 720872 1778557 2649878 2525508 1556362 622292 147007 -203943 -643002
39872f43002k27604Q6801K979k18163m4640J21929m12114j006808l30098J268245
39862a402475J784312M76020r47025q82288J699K79787L0061J63601N77489N15225
39852E96406P1983p6799N4021J2943m9097K12741L86236l3514n26051l44282P7204
39841C81791j15858n02987k3489R92581J131909K09759m38484j93681K484m83735
39831I60290q54760l99397K01201M5314n03762m88579J53285O59020O02766K89348
39821F64726J83997L76779N15659J90067m30595n60797J46155Q53265N91426k76728
39811B253954o20633l07068k07565n50678o15042j72069J41013J30217L33505
39802C85634O79193L36405o27618r88463l93673m1895n14816o38289L34918J085201
$$ plain form
39872 -643002 -870606 -783805 -780826 -998989 -1043629 -921700 -1333814 -2340622 -2670720 -1402475
39862 -1402475 381837 857857 -89168 -971456 -969757 -689970 -659909 -496308 81181 596406
39852 596406 668389 591590 645611 658554 609457 822198 1208434 1174920 648869 304587 381791
39841 381791 265933 -237054 -260543 732038 1863947 2073706 1635222 1441541 1444025 960290
39831 960290 105530 -293867 -92666 -47352 -551114 -1039693 -886408 -227388 375378 664726
39821 664726 848723 1225502 1741161 1931228 1500633 939836 1085991 1939256 2530682 2253954
39811 2253954 1633321 1326253 1118688 568010 -47032 -219101 -78088 52129 385634
39802 385634 1064827 1401232 773614 -214849 -608522 -650417 -1165233 -1803522 -1468604 -383403
39792c83403L28217q75632p45977L89317Q52641L88463J24987K83153L6300n11990
39782a13924k85922O52461Q76691p1158q38647m00034M60331N87973J13046k23434
39772G57383l70577o34905p79710l79991L62795Q87451J030202R57267O62251
39763B492166O6919n80149q46905n83780l5063L72077K59013m14365j156203j288623
39753a714913o19807L91684J126990J238981P18633q3371n49861l32589J85067
39744C60814L21186l6522l76232l19579j082K79676L46023J08379l20898n19828
39734a58063k24973J60708N2642l81987l93161K10830P31171N49622j23924o61955
39724b39090o87913j82141N71289R63129N04206m47604q62039k49438O51305P09909
$$ plain form
39792 -383403 -55186 -930818 -1676795 -1287478 -434837 -46374 78613 361766 398066 -113924
39782 -113924 -399846 252615 1129306 1058148 219501 -180533 279798 867771 980817 757383
39772 757383 386806 -248099 -1027809 -1407800 -1045005 -157554 872648 1829915 2492166
39763 2492166 2559085 1978936 1132031 548251 513188 885265 1144278 729913 -426290 -1714913
39753 -1714913 -2334720 -1943036 -816046 422935 1141568 1058197 508336 175747 360814
39744 360814 682000 645478 269246 -50333 -51415 228261 574284 682663 361765 -158063
39734 -158063 -383036 -222328 -169686 -551673 -944834 -734004 -2833 546789 422865 -239090
39724 -239090 -927003 -1109144 -537855 425274 929480 481876 -380163 -629601 21704 731613
39714G31613k88002j398506j467388k62815J203923J572196N62144o62916q65562
39705h75313j72359L60473K97850J44535K27537K11948o3997j51471J86742M30938
39695E96883J12025l80219l71188Q9238L51160Q7002l94607o62701o02873l44767
39685a520047k7287K76773M91628M80609J65553k56846m06174j75271J03686J31830
39675g35546J8114n1879j63259l33805k30248K80164O69417M36352p6957k03816
39665c91463L4096J33753o53j43532l62811o85697n54601L45515J106080O83383
39655A64070l32437m68474K85287N26451j09875l77305K90037P48031J84148m89908
39645D20025l06136J66431K9435m26585n65307n77201o46227j42284J066697J660623
$$ plain form
39714 731613 443611 -954895 -2422283 -2685098 -1481175 91021 653165 -9751 -875313
39705 -875313 -1047672 -687199 -389349 -244814 -17277 194671 130674 -20797 165945 596883
39695 596883 708908 328689 -42499 46739 397899 484901 90294 -572407 -1175280 -1520047
39685 -1520047 -1547334 -1270561 -778933 -298324 -132771 -389617 -795791 -971062 -867376 -735546
39675 -735546 -717432 -769311 -932570 -1266375 -1496623 -1216459 -547042 -110690 -187647 -391463
39665 -391463 -357367 -223614 -224267 -367799 -730610 -1416307 -1970908 -1625393 -519313 164070
39655 164070 -168367 -636841 -351554 174897 65022 -312283 -22246 725785 909933 420025
39645 420025 113889 280320 309755 -116830 -682137 -1259338 -1905565 -2047849 -981152 679471
39635F79471O89877o79461q16763r9590k1635o12595o59198k8344J94273k39707
39625a593672l82825J03695M41059K66691J99006N63296Q57628P84672O36363
39616A875913M27419j93486r71103j139598o73723k94067j16625M08952J057312
39607C80994Q01667l70719j092265o64654o2194j43875k67994L05614Q93649N24185
39597C04408l56085o20728k29947J7148q140K13811O05680N13260p2921m02259
39587c5773j61468J42796J39176O8325P4736j65691p11005r22374l38144M52666
39577a456756M63090l11686q01245k77561O75307J003275O25239L88824O48906
39568I57393O93264l4451q46396p10524J51864M97241j65555r55387r87879n09545
$$ plain form
39635 679471 1369348 689887 -126876 -226466 -248101 -860696 -1519894 -1548238 -1353965 -1593672
39625 -1593672 -1976497 -1872802 -1431743 -1165052 -966046 -402750 454878 1239550 1875913
39616 1875913 2303332 2109846 1138743 -855 -674578 -968645 -1085270 -676318 380994
39607 380994 1182661 811942 -280323 -944977 -1007171 -1151046 -1419040 -1113426 -219777 304408
39597 304408 -51677 -672405 -902352 -885204 -893344 -679533 -73853 439407 366486 -35773
39587 -35773 -197241 -54445 84731 153056 227792 62101 -648904 -1571278 -1909422 -1456756
39577 -1456756 -993666 -1305352 -2106597 -2384158 -1708851 -705576 -80337 308487 957393
39568 957393 1650657 1616206 769810 59286 211150 708391 542836 -412551 -1400430 -1909975
39558a909975k00527m9435L79664R64778J089524O33420K37685L84995O78087
39549B208216L99666m30157r99146p55049j05434K01803O4858o2654j8022m1263
39539D62818j06084Q6593L30554M728p40565q38159Q9273R27387O79206l0974
39529H64777j00564K38992O3476m39287l43531J97683J49559m66713m95820K90780
39519d0648O68445m1822r07476r40149m19532L5178N15396J129504J300845O48002
39509A947743k43634p08499r07613j137363j015945j79653Q27238J147338O62299
39500C91911j10082o89797p67260k42792M46024O30251L48625K68346M66461K79963
39490A021650l24650m50564J18045L09217m37831j060271n77122L07695M93395
$$ plain form
39558 -1909975 -2110502 -2159937 -1780273 -815495 274029 907449 1145134 1530129 2208216
39549 2208216 2607882 2177725 1178579 423530 318096 519899 584757 522103 504081 462818
39539 462818 356734 443327 773881 778609 38044 -800115 -710842 216545 895751 864777
39529 864777 764213 1003205 1066681 627394 283863 481546 631105 164392 -331428 -40648
39519 -40648 627797 585975 -321501 -1261650 -1681182 -1646004 -1130608 -1104 1299741 1947743
39509 1947743 1704109 995610 87997 -1049366 -2065311 -2244964 -1417726 -270388 391911
39500 391911 281829 -407968 -1175228 -1418020 -971996 -341745 6880 275226 741687 1021650
39490 1021650 697000 246436 364481 673698 235867 -824404 -1401526 -1093831 -600436
39481f00436K40422L02649L56223j74027o15228o6136P62325N15080m44605m98162
39471b21895N60967J171144M91375m37094m73620P0179K69788n1443l96732l70217
39461F12452L385L21157J42411l34061k85673M65798P99920j66318j489651j561207
39451a491787l96752N97681Q08551Q48524R67390O44676j12724n64855n50106
39442G50598o28160p60021l00323M94973N17694k78068n78874J78628R35349Q24811
39432A156607L35975R086m66944j064722r10390O4610N04886k14607p33905P3387
39422a246017J101678Q35852j17523j70534N65876P27255J62310o3890K05623
39413B000630O1607n56640o44896j5138L07169r2536l62032k4090J78430k87996
$$ plain form
39481 -600436 -360014 -57365 298858 124831 -490397 -556533 205792 720872 276267 -221895
39471 -221895 339072 1510216 2001591 1564497 1090877 1161056 1430844 1379401 982669 612452
39461 612452 615837 936994 1079405 745344 459671 925469 1725389 1559071 69420 -1491787
39451 -1491787 -1888539 -1290858 -482307 366217 1333607 1978283 1865559 1300704 750598
39442 750598 122438 -637583 -937906 -442933 74761 -203307 -782181 -603553 331796 1156607
39432 1156607 1492582 1501668 1034724 -29998 -940388 -875778 -370892 -585499 -1319404 -1246017
39422 -1246017 -144339 691513 573990 403456 969332 1696587 1858897 1795007 2000630
39413 2000630 2062237 1505597 860701 845563 1152732 1060196 698164 674074 852504 564508
39403E64508p56467n45046m2093J76855L47956P76242R33263K77699o12176p09269
39393D11472J1895O67908P59620N43053K57947j80905o79380q63560o36477k91954
39383c81K4583M18943P16873M93214r8843k12653M76884J044610N22212o10989
39373B774453j058563n95489k31548m16431l17009N71802J232789N44404q70345
39364A634063j404437o88245J41098K51074N347o0960l0658l4737J41696M43008
39354C97249L57836j74696m27619J7849N37096M29587P899K9587N16859Q61274
39344B552921P70666M18337j11331q29012j393871j314238o62703j02724q1313
39335g53268l42058l67697n2770K47267K57106J82425L98298P75456O94450j3053
$$ plain form
39403 564508 -191959 -737005 -779098 -602243 -254287 521955 1455218 1732917 1120741 411472
39393 411472 423367 1091275 1850895 2393948 2651895 2470990 1791610 928050 291573 -381
39383 -381 24202 443145 1160018 1653232 1554389 1341736 1818620 2863230 3385442 2774453
39373 2774453 1715890 1120401 888853 472422 155413 727215 1960004 2504408 1634063
39364 1634063 229626 -458619 -317521 -66447 -61100 -122060 -152718 -187455 -45759 397249
39354 397249 755085 580389 152770 170619 707715 1137302 1145201 1174788 1691647 2552921
39344 2552921 3323587 3741924 3630593 2801581 1407710 93472 -569231 -671955 -753268
39335 -753268 -1095326 -1463023 -1515793 -1268526 -1011420 -828995 -430697 344759 1039209 1026156
39325A026156n53702j68233O49025P03579k08198j032302r88316m52184j5105
39316a039280M01006R35489J107350N01402l85215p10254l76575L0032J05646
39307E69601q4586l24738l95523j24254L54638O21875N05425K81524J78079J21933
39297A703974J32267L63306N41618J07130p31813r16343n3198Q03089N93404k58976
39287B284458o29447l11589P3651K74070N18306P55631P13858N17589M53407L36770
39277D986704j34344o45227o65266l62788l36191o24923p82592p73330r50951
39268b88908j190482q81797O1313Q48377P16629j83923r45595p65913K79183J216456
39258a134660J165051L99672k4780K30800L95052p0826o16634n80969j62916K08319
$$ plain form
39325 1026156 472454 304221 953246 1656825 1448627 416325 -571991 -1024175 -1039280
39316 -1039280 -638274 297215 1404565 1905967 1520752 810498 433923 463955 569601
39307 569601 485015 160277 -235246 -359500 -4862 617013 1122438 1403962 1582041 1703974
39297 1703974 1836241 2199547 2741165 2848295 2116482 1200139 1146941 1950030 2543434 2284458
39287 2284458 1655011 1343422 1417073 1691143 2209449 2965080 3678938 4196527 4649934 4986704
39277 4986704 4852360 4207133 3541867 3179079 2842888 2217965 1435373 662043 -288908
39268 -288908 -1479390 -2361187 -2299874 -1451497 -734868 -918791 -1864386 -2630299 -2351116 -1134660
39258 -1134660 30391 430063 405283 636083 1031135 960309 343675 -237294 -400210 -191891
39248a91891O24466J091686J025747K08820n30539m83155j43283k28006m34271
39239I39574j75190K56931L32619K87328L98728J51371o84505j095595l12239
39230I9022O87246O51220Q3920J47312M97760J33724m31639J7641J007318R98754
39220C892278L5900m09672K380K18443o2997o5953L38982N49075O66434J092935
39210F257805J109742l9875j190527o87517Q28420J551181J628378K308062K897711
39201A4663380J956604O86537J309859K851977K851851K420305M460422P606585
39193C8807520Q159916P666763J1054675J7142788K0641418K5030163M0310960
39186A68814203O1223513O1501724K4136786l0486296o2949703n8747363l8737258
$$ plain form
39248 -191891 432575 1524261 2550008 2758828 2228289 1745134 1601851 1373845 939574
39239 939574 764384 1021315 1353934 1641262 2039990 2191361 1506856 411261 99022
39230 99022 786268 1437488 1521408 1668720 2166480 2300204 1868565 1886206 2893524 3892278
39220 3892278 3928178 3518506 3520886 3739329 3676332 3610379 3949361 4498436 5164870 6257805
39210 6257805 7367547 7327672 6137145 5449628 6278048 7829229 9457607 11765669 14663380
39201 14663380 16619984 17306521 18616380 21468357 24320208 26740513 31200935 38807520
39193 38807520 46967436 54634199 65688874 82831662 103473080 128503243 168814203
39186 168814203 230037716 291539440 315676226 285189930 222240227 163492864 124755606
39179A24755606k6511466k2776836j7297641r861042p285049q984896q273946
39172B3764730m201948j869224k690748k861608r75336P2185r03944j519117p37163
39163H077827n38194j651238j994598o00498O16548L19067k06047J98296N31190
39154D752353j71422r03741m85144M48587O43902J08676l85187o44073q85476
39145B478475r99502q00374m96239l63638l40897k16368J18191O18817R36723
39136I35188N48908m63985j136884p60463J02205M62558K92931K07321K63153
39127D50932J27779L2200L99582P88571L96173n21309q95065m70948p1878k08498
39117B7539n01109n73362n07317k85330K61728Q04443P22213J24424j81665R9930
$$ plain form
39179 124755606 98244140 75467304 58169663 48308621 41023572 32038676 23764730
39172 23764730 19562782 17693558 15002810 12141202 11165866 11238051 10334107 8814990 8077827
39163 8077827 7539633 5888395 3893797 3293299 3909847 4228914 4022867 4221163 4752353
39154 4752353 4580931 3677190 3192046 3640633 4284535 4393211 4008024 3363951 2478475
39145 2478475 1478973 678599 182360 -181278 -522175 -738543 -620352 -1535 935188
39136 935188 1484096 1020111 -116773 -877236 -775031 -312473 -19542 187779 450932
39127 450932 578711 610911 1010493 1799064 2195237 1673928 778863 307915 236037 27539
39117 27539 -473570 -1046932 -1554249 -1839579 -1577851 -773408 -51195 73229 -108436 -8506
39107h506L79641J71335k91478n64839m55610N3900O73591O93095k12011j179122
39097g40004j063274m9842O35631N62597M72319P30626O99652N0404m90049l06592
39087E01468J65842K94560J87753J78022J71117J25240M02912R84220J073780
39078D084914K23265q27937j192489j054850j003782q08082L6826R73154Q71616
39069A302635j82705q16200l57290J95545k04411r38573n88301Q61067J742174
39060A013941Q64377q36606j431211m12105P95825P85764j46854p19743m57847
39051e44459M448J47700J83558L28505K87784j22942m41697j81422L85744N92296
39041F39515K99679l0215n5542J25387L37303N56672O91432N17964L3636l90720
$$ plain form
39107 -8506 371135 542470 250992 -313847 -769457 -715557 -41966 651129 439118 -740004
39097 -740004 -1803278 -1853120 -1217489 -654892 -182573 548053 1247705 1298109 808060 501468
39087 501468 667310 961870 1149623 1327645 1498762 1624002 2026914 3011134 4084914
39078 4084914 4308179 3480242 2287753 1232903 229121 -578961 -542135 431019 1302635
39069 1302635 1119930 303730 -53560 141985 -62426 -1000999 -1589300 -728233 1013941
39060 1013941 1878318 1041712 -389499 -801604 -5779 779985 633131 -86612 -544459
39051 -544459 -540011 -392311 -208753 119752 407536 284594 -157103 -338525 47219 639515
39041 639515 939194 908979 853437 978824 1316127 1872799 2564231 3082195 3115831 2725111
39031B725111m45724l01672l19524m30623j72975N28781R75146M65892o86039
39022B338373j389551j075518k88097K03829L67143N74540P76157O51632L59215
39013B517723L80129N91531K52752p94427j567147j127455O0221N99055j04239
39004H08143j168232j441741q68656k58124r194L05007R89258J477661J041130
38995H75252n6326p46404m87570J91916O04041P27743Q06378P00717J90511m37428
38985B368830o81550n22462l28676k19213l0505J68072O2261l43802n99170m03214
38975e29429m0764l2095m53655p41265k72802P84369J423199R50636J2095j68372
38965I31917M69937P30406L0732o94092n62710j51545l38159o62042j70853P19187
$$ plain form
39031 2725111 2279387 1977715 1658191 1227568 1054593 1583374 2558520 3024412 2338373
39022 2338373 948822 -126696 -414793 -210964 156179 730719 1506876 2158508 2517723
39013 2517723 2897852 3489383 3742135 2947708 1380561 253106 313327 912382 808143
39004 808143 -360089 -1801830 -2670486 -2928610 -2937804 -2632797 -1643539 -165878 875252
38995 875252 818926 72522 -415048 -223132 380909 1108652 1915030 2615747 2806258 2368830
38985 2368830 1687280 1164818 836142 616929 586424 754496 816757 472955 -126215 -529429
38975 -529429 -570193 -602288 -1055943 -1797208 -2070010 -1285641 137558 1088194 1100289 931917
38965 931917 1401854 2132260 2162992 1468900 906190 754645 416486 -245556 -416409 302778
38955C02778P39120j16493n44241n1237L75135K3128m86854m12985M488K32448
38945F5287K50297J13600l67922r64588r17149o6090P20693P80024M84098L25072
38935D23322J02063l30043m40264M1026M01411M1781m59566k98297K37034L77729
38925I6196J75287J44531J61570j65431m69936j38189M69570M82897m166j03937
38915F48392L28850N36757K62846J14666L40288L82604j8500l25633k20730j52605
38905A896935l68994l21601L14925Q29887M78558k90839m79886n6800N7677n48686
38895A511176j133710q41420J42235Q32459O26623p4374m38719j90171J66983
38886F01082R0410k87524l92657o120M68882N36997J56792l06850m95748l40979
$$ plain form
38955 302778 1041898 925405 381164 329927 705062 728190 241336 -171649 -167161 65287
38945 65287 315584 429184 61262 -903326 -1820475 -1886565 -1165872 -385848 98250 423322
38935 423322 525385 195342 -244922 -203896 197515 239296 -220270 -518567 -281533 96196
38925 96196 271483 416014 577584 412153 -57783 -195972 273598 756495 752329 648392
38915 648392 977242 1513999 1776845 1891511 2231799 2614403 2595903 2270270 2049540 1896935
38905 1896935 1527941 1206340 1521265 2351152 2829710 2538871 2058985 2002185 2059862 1511176
38895 1511176 377466 -463954 -321719 510740 1137363 1062989 624270 434099 601082
38886 601082 691492 403968 11311 5191 474073 1011070 1167862 861012 365264 24285
38876B4285k8548K55469N24938Q59429J106351R66774M62557J2360j46095k81554
38866C755966o34998r07559p09923k53573p7574k46720l58986k63335j99353k12404
38856a08459j9041L86170N05446J769p55196j083747p28820k7335M84437M85596
38846h59180N7286l88869m37723j4688N88023R73075Q97676M17022j24985l83895
38836G23742l81718m03248m76049k91633J99950N33770L67068j5643j88375j74989
38826a07125j49437Q28K82988K35652l56310p84849k79380P29199J095628N67660
38816A234854j459j0862K28272K71892J34126m5205j88193o9009L53046M58894
38806B366356k71832j116451q64871K34214O25822j64962p70478k15239N72172
$$ plain form
38876 24285 -4263 251206 776144 1635573 2741924 3708698 4171255 4183615 4037520 3755966
38866 3755966 3120968 2213409 1503486 1249913 1172339 925619 566633 303298 103945 -108459
38856 -108459 -127500 258670 764116 765885 10689 -1073058 -1801878 -1829213 -1344776 -859180
38846 -859180 -801894 -1190763 -1628486 -1643174 -1055151 -82076 815600 1232622 1107637 723742
38836 723742 342024 -61224 -537273 -828906 -628956 -95186 271882 256239 67864 -107125
38826 -107125 -256562 -255734 27254 262906 -93404 -878253 -1157633 -428434 667194 1234854
38816 1234854 1233395 1222533 1450805 1722697 1856823 1811618 1623425 1554416 1907462 2366356
38806 2366356 2094524 978073 113202 347416 973238 808276 37798 -177441 394731
38797C94731M47816j10576j34464J6668m92385j147315q19753J59762M10184j90743
38787a466075l49622L48244P07253K4504o07937j8914J169240J475698O48538
38778A930929k57222n01748l63774l05159k68191K617M50913P59419O74202J71346
38768B293332n18798r81280q75911k66535L49708M67431R0134k51823j09659L29906
38758E26505M97611J96958k13884m26375n33174n91022l25769L25393P92573N40967
38748G89783j14387m37607l08161k00765k72941j91555J13558K36641k235k68849
38738f56518l31977l78532m74688l12297J78550N33622M84719M56451Q22781J139863
38728A461974P68824n7086n13223l94140k97198n37718o19407j17535M85670L99993
$$ plain form
38797 394731 842547 731971 597507 614175 121790 -1025525 -1845278 -1685516 -1275332 -1466075
38787 -1466075 -1815697 -1467453 -760200 -735696 -1343633 -1362547 -193307 1282391 1930929
38778 1930929 1673707 1171959 808185 503026 234835 237452 688365 1447784 2121986 2293332
38768 2293332 1774534 793254 -82657 -349192 516 467947 558081 306258 196599 526505
38758 526505 1024116 1221074 1007190 580815 47641 -543381 -869150 -543757 248816 789783
38748 789783 675396 237789 -70372 -271137 -544078 -735633 -622075 -385434 -387669 -656518
38738 -656518 -988495 -1367027 -1841715 -2154012 -1975462 -1441840 -957121 -500670 322111 1461974
38728 1461974 2230798 2173712 1660489 1266349 969151 431433 -187974 -305509 180161 580154
38718E80154k96341o55630q6292Q56499J148592N37761k01430k29362M09783R25315
38708B989049P07200p4829p68719r58304p86910o22202n46889l33627P2912L00654
38698b1665K6228m45360m80439p724L48876J83374j39358j62009p4717k59847
38688a032641m96014l03001J51235K66923P1177K14358P64451Q69773M1516r54601
38678d06824j093813m67466J0164n0116j62602J22962N80747O91252K81225l21950
38668h16421n64023j23826O93639J133777Q12032K12130N6518L48333M76495J86645
38658B415299r8278l3965Q8118j58852o37316q29660n55667j56746M392m0605
38648c280R29K93791O72862P54741K63897o47038j396757j417942o80193K68115
$$ plain form
38718 580154 283813 -371817 -458109 398390 1546982 2084743 1883313 1653951 2063734 2989049
38708 2989049 3696249 3621420 2852701 1894397 1107487 485285 -61604 -395231 -322319 -21665
38698 -21665 4563 -440797 -921236 -928960 -580084 -396710 -536068 -698077 -772794 -1032641
38688 -1032641 -1528655 -1831656 -1680421 -1413498 -1342321 -1127963 -363512 506261 547777 -406824
38678 -406824 -1500637 -1968103 -1957939 -2008055 -2170657 -2047695 -1466948 -775696 -494471 -816421
38668 -816421 -1380444 -1504270 -810631 323146 1135178 1347308 1403826 1752159 2228654 2415299
38658 2415299 2317021 2283056 2371174 2212322 1575006 745346 189679 32933 37325 -3280
38648 -3280 -2351 291440 964302 1719043 1982940 1335902 -60855 -1478797 -2158990 -1890875
38638a890875Q18716Q18304N44666K92527J33324L0580l2759j04450k28521k50339
38628A31173Q9150O45752P49476K1250q66787q57738J5761N09959j48152j098401
38618h08557r97070R7053Q25052M32338k93389k55159M89082J009243Q04419K13054
38608A516066k81210n39097n31309j73869L56612N50626J78909k65298j65941
38599F45489K91010L12524k98869p07512j90598P20342Q60960O452q79871j013363
38589b53436o76553m58429k97895J45992O43013O20107N2547m98341o60000n08731
38579a891726j37510M14459P80296M76003l12572p23732k79147N11854Q76291
38570b85784O75596L02817J01720J90443M69453N24510k7175p95416q11136O3792
$$ plain form
38638 -1890875 -1072159 -253855 290811 583338 716662 747242 714483 610033 381512 131173
38628 131173 220323 866075 1615551 1636801 770014 -87724 -71963 437996 289844 -808557
38618 -808557 -1805627 -1708574 -883522 -451184 -744573 -999732 -510650 498593 1303012 1516066
38608 1516066 1234856 695759 164450 -9419 347193 897819 1076728 811430 645489
38599 645489 936499 1249023 950154 242642 52044 772386 1633346 1639798 759927 -253436
38589 -253436 -929989 -1388418 -1686313 -1540321 -897308 -277201 -224654 -722995 -1382995 -1891726
38579 -1891726 -2029236 -1614777 -834481 -358478 -671050 -1394782 -1673929 -1162075 -285784
38570 -285784 389812 692629 794349 984792 1454245 1978755 1951580 1156164 345028 408820
38560D08820N84941k39310j520153j565837k91605P11848N73780K34060O23945
38551d79511J065320N33195m28556m66931L15376M03416o53266j295473k69100
38542a275530J256469J160187n72347j716424q55374P81606J203687L37905k83215
38533C6964O1786N19587L01296j99323l64071l67786n41961n50614m5610M82421
38523f67311M21092J05286J92292M10332P5550m62322k50256M67892L98075o04530
38513H6100j064323k32606O40488L69192k58541P005O54678M07928l92727l56559
38503a39365L87667K61941r77711j539881l48051J229169J420235M71878j77153
38494E88729j21073l1231j05928J23390O06513O05311j31133r03266j024312o18154
$$ plain form
38560 408820 993761 754451 -765702 -2331539 -2623144 -1911296 -1337516 -1103456 -479511
38551 -479511 585809 1119004 690448 223517 538893 942309 289043 -1006430 -1275530
38542 -1275530 -19061 1141126 568779 -1147645 -2003019 -1221413 -17726 320179 36964
38533 36964 98750 618337 919633 720310 356239 -11547 -553508 -1104122 -1149732 -667311
38523 -667311 -246219 -140933 51359 461691 537241 74919 -175337 292555 690630 86100
38513 86100 -978223 -1210829 -570341 -201149 -459690 -452685 201993 609921 217194 -139365
38503 -139365 248302 510243 -467468 -2007349 -2355400 -1126231 294004 765882 588729
38494 588729 467656 436425 330497 453887 1060400 1665711 1534578 631312 -393000 -1011154
38484a011154k07987Q805J87818M27233N88969M59498J8123m25565m47588K0597
38474c81251N26777N45409L7030n42650p36323n08633k08376j30402j36253J31849
38464a402823O07871P22422K47400j90298J9707M48945K61431l65998m55264J46282
38454C9675M82002R9471k12129J53939N57990K73989k28189j31802L34804L88616
38444A758366M405k86917m25033o03299m61522L78298J275593J221243L48629
38435C209763l11907m36263n89854q67359o22158K48277R06031Q04498L47397
38426B688425R200k83387n83401o27858m38879l98055m62193j71669L34708L11527
38416C78418k65982m44182J60461O35824K41894m15143m66027j28235q0293k53072
$$ plain form
38484 -1011154 -1219141 -1210336 -1022518 -595285 -6316 453182 471305 45740 -401848 -381251
38474 -381251 145526 690935 727965 185315 -551008 -1059641 -1268017 -1398419 -1534672 -1402823
38464 -1402823 -794952 -72530 174870 -15428 4279 453224 714655 348657 -106607 39675
38454 39675 521677 621148 409019 562958 1120948 1394937 1166748 1034946 1369750 1758366
38444 1758366 1762771 1475854 1050821 447522 -14000 364298 1639891 2861134 3209763
38435 3209763 2897856 2461593 1871739 1004380 382222 630499 1536530 2341028 2688425
38426 2688425 2697625 2414238 1830837 1202979 764100 366045 -96148 -267817 66891 378418
38416 378418 112436 -331746 -171285 464539 706433 291290 -174737 -302972 -383265 -636337
38406f36337j90594k413k2422k0569L44007P07425N09012l2523k59628q7302O1804
38395C70460J8752j21749l96303p06517n73959J39490P37858O66069M23915O26419
38385A184435P72797R6524q68043r44510k71060j08794o88752p88616J90637J154976
38375b70406R86556J28026l11939j65614n6685k19076k77393M8354N63100P98664
38365A223587M02917m09886q03614k22813O70536O86030k05514p75459l68565
38356A97219J99097Q2227k82721j21075K85927J81787k78032l22767P1855J92106
38346B05623j45085l18480K2025M41238M58522J34218k57330n64618o07501k20034
38336h51422L72695O74823N65126L95527L49238K01321j21155k78320r9958N7860
$$ plain form
38406 -636337 -826931 -829344 -851766 -872335 -528328 179097 688109 655586 395958 308656 370460
38395 370460 389212 267463 -128840 -835357 -1409316 -1269826 -531968 134101 558016 1184435
38385 1184435 1957232 2053756 1185713 241203 -29857 -138651 -827403 -1616019 -1425382 -270406
38375 -270406 716150 844176 532237 366623 309938 90862 -186531 -138177 424923 1223587
38365 1223587 1626504 1216618 413004 190191 860727 1546757 1341243 565784 197219
38356 197219 396316 478543 195822 74747 360674 542461 264429 -58338 13517 205623
38346 205623 60538 -257942 -235917 205321 663843 798061 540731 -23887 -631388 -851422
38336 -851422 -478727 196096 761222 1156749 1505987 1707308 1586153 1307833 1207875 1265735
38326A265735q9573k25880L3508M13573L56683m4531j28572K64379M19390k24652
38316B040060j101606j099971k1583J036307R28619k25030j246121j237415l88852
38307a315592N02696R20997Q67746N30748P9333k75390l36248j28631J04994J68680
38297A119333N6446j47982l38097l66161k02759j38326m86917r53116p23946M24120
38287a757405J473085J248583J9389p39277k90307M71306M67784k8974r3234K28352
38277I99302R0412n41033o55794J66319R58500P70403J1834l54688k87563l90638
38267G67054n85689j75193P60033J082174J49592j091717j217897j61254P44662
38258B71765N14663l26134o35830k55740o8897n08602p98206j52563Q72086J064701
$$ plain form
38326 1265735 1176162 950282 983790 1397363 1754046 1709515 1580943 1845322 2264712 2040060
38316 2040060 938454 -161517 -183100 853207 1781826 1556796 310675 -926740 -1315592
38307 -1315592 -812896 108101 975847 1506595 1585928 1310538 974290 845659 950653 1119333
38297 1119333 1175779 1027797 689700 323539 120780 -17546 -504463 -1457579 -2181525 -1757405
38287 -1757405 -284320 964263 983652 244375 -45932 425374 893158 864184 770950 999302
38277 999302 1089714 548681 -107113 59206 1017706 1788109 1799943 1445255 1157692 767054
38267 767054 181365 6172 766205 1848379 1997971 906254 -311643 -472897 271765
38258 271765 786428 460294 -175536 -431276 -500173 -1008775 -1806981 -1959544 -1087458 -22757
38248b2757L11062l26088k78605j58822m80574p56943m67482o274R2193R2785
38238b001505L95557O46081M20512J27922K29093K30917l73997q27103j93763
38229a346286P86135O24950l96314n26179N50321J097728J53886r54788q50216
38220h60763j40619l722j98863N6067L80766n030o25183m35456L57550O59317
38210h15936L16560J48789L60498L30719l7857r5080K86370M23827O4984j67886
38200H14988Q4557L06876O1351k79535k44728m2411j10749l73862m28231j75264
38190c87008R9820J21742r4122k48763m8484L67064M47232n7973o46902o99286
38180a146680k84839J22117L97815O20515N15010j28467p12465m70336K42948
$$ plain form
38248 -22757 288305 -37783 -316388 -475210 -955784 -1712727 -2180209 -2186483 -2094290 -2001505
38238 -2001505 -1605948 -959867 -539355 -411433 -182340 48577 -325420 -1152523 -1346286
38229 -1346286 -560151 64799 -331515 -857694 -307373 790355 944241 -10547 -860763
38220 -860763 -1001382 -1005104 -1203967 -1147900 -767134 -772164 -1397347 -1832803 -1475253 -815936
38210 -815936 -499376 -350587 9911 340630 302773 207693 494063 917890 982874 814988
38200 814988 899545 1206421 1267772 988237 743509 701098 590349 216487 -211744 -387008
38190 -387008 -287188 -165446 -259568 -508331 -556815 -189751 257481 199508 -447394 -1146680
38180 -1146680 -1431519 -1309402 -911587 -291072 223938 95471 -616994 -1087330 -844382
38171h44382L49571k11587l17300M74522J111836P14821n7573j99900o531l94484
38161F18993j177695j281012m86362K22377J87007p1460J18226N20956N21533
38152h27437J59865j681K00917L44488J41810j35973j14462J59872L86993M52242
38142G66634M04970J92971j91612m05585r2182M30305L82045l50156q76889n23809
38132b63308J45458J57250m10231n90929j1495O15070N72401J5150m50008m88507
38122g09149j14384M62845Q24107N94820n4823n14553m95626l13967k89021l01058
38112i10809j32739J72312M93155P65061P61524K35135m82543n72098J78740Q54981
38102A362719N25808m64005r20738l72264L77297L26554n32027j286765j137304
$$ plain form
38171 -844382 -494811 -706398 -1023698 -549176 562660 1277481 1219908 1020008 1013477 618993
38161 618993 -558702 -1839714 -2326076 -2103699 -1916692 -1988152 -1869926 -1348970 -827437
38152 -827437 -667572 -669253 -468336 -123848 17962 -118011 -232473 -72601 314392 766634
38142 766634 1171604 1364575 1172963 767378 675196 1105501 1487546 1137390 260501 -263308
38132 -263308 -117850 39400 -370831 -961760 -973255 -358185 214216 229366 -220642 -709149
38122 -709149 -823533 -360688 463419 1058239 1003416 488863 -6763 -320730 -609751 -910809
38112 -910809 -1043548 -871236 -378081 386980 1148504 1383639 901096 328998 507738 1362719
38102 1362719 1888527 1424522 503784 131520 508817 835371 303344 -983421 -2120725
38093b120725j67842Q27293J138270O98529n9256o75964q91475o52442j82610
38084b086222R4740K003j42370J799K79557L83081M53892P75823J054627P22535
38074A539465p3497n56691m83357m22501o60492o67065r0586M47474J74690o77264
38064a469824j124299n99055N13933J319141J194628L82525j74242N7789M12537
38055E13133j0930p99761o94970L62347R69653M42625j46863J28599N02214J8844
38045A284891o22031k30302P28394P95831j68862r48311r54845o96063l90407
38036a201705K88585J003225Q45930n1260m32219J27184N26768k7274p64636o75619
38026c61021k4279L11775J73725l9018j90521k97136j57809K05182K58287k23875
$$ plain form
38093 -2120725 -2288567 -1461274 -323004 375525 316269 -359695 -1251170 -1903612 -2086222
38084 -2086222 -1991482 -1989479 -2131849 -2130050 -1850493 -1467412 -1013520 -237697 816930 1539465
38074 1539465 1465968 909277 425920 3419 -657073 -1324138 -1414724 -967250 -792560 -1469824
38064 -1469824 -2594123 -3193178 -2679245 -1360104 -165476 217049 42807 100596 513133
38055 513133 502203 -297558 -992528 -630181 339472 782097 635234 763833 1266047 1284891
38045 1284891 662860 432558 1160952 1956783 1787921 839610 -115235 -811298 -1201705
38036 -1201705 -913120 90105 936035 884775 452556 579740 1106508 1079234 314598 -361021
38026 -361021 -385300 -73525 100200 61182 -129339 -426475 -584284 -379102 -120815 -344690
38016c44690n60180q6013P62413J008989M50122k80866o78180o89976k82845N54371
38006a46855J331316J237335R2332j195560j412400k94536J075747J282673J04670
37997B074722j178887j289478m72998J7474k87700o41833m34190j339J95147K68797
37987a750285L28140P4620m33652m52304K98685R25125O20851p6660k25836J704
37977f89612j42235m85083k78390K77210K55430k87396k42137O64182J240213
37968C12182O25051m00282n91549J10415Q04871Q44261J93565q21583j503126
37959d26195j091231K23460J089325N42268o28042q70723L2548P65648L60140
37950b802n83640q44790j30408P55210R74584M85178j42186m59359n32032n95660
$$ plain form
38016 -344690 -904870 -990883 -228470 780519 1230641 949775 271595 -418381 -701226 -146855
38006 -146855 1184461 2421796 2514128 1318568 -93832 -388368 687379 1970052 2074722
37997 2074722 895835 -393643 -866641 -849167 -1136867 -1778700 -2212890 -2214229 -2019082 -1750285
37987 -1750285 -1422145 -1347525 -1781177 -2233481 -1934796 -1009671 -388820 -465480 -691316 -689612
37977 -689612 -831847 -1316930 -1595320 -1318110 -1062680 -1350076 -1592213 -928031 312182
37968 312182 937233 536951 -54598 55817 860688 1704949 1898514 1076931 -426195
37959 -426195 -1517426 -1293966 -204641 337627 -290415 -1161138 -1128590 -362942 -2802
37950 -2802 -586442 -1431232 -1561640 -806430 168154 653332 511146 51787 -480245 -1075905
37940a075905n48087j32814M04673L88156k84799p38997k52816O23250Q04220
37931h13119K72538L6627M67805O78732j8919q92877p77691K20650Q60000M59279
37921D93025l02867m11469K34333Q74770Q65827K91771l08789n91013o44706o14630
37911a13748l39344L18121R13384P49216j05252p19336n50715j72257k40373m05695
37901f65999p2354L32207n770o82623m65221O63304J253637N68421l68717n60423
37891c538n09115q96246j042473j09360J063640R85369r4798n07365K59762R66585
37881A12461P66647L31467L37035K83224l83951j121054j162706o97273l18085
37872a852235j3269M56647P75649N33615M2343r5912R8324J85570Q4273l0738
$$ plain form
37940 -1075905 -1623992 -1756806 -1352133 -963977 -1248776 -1987773 -2240589 -1617339 -813119
37931 -813119 -540581 -503954 -36149 642583 623664 -269213 -1046904 -826254 33746 493025
37921 493025 190158 -221311 13022 887792 1753619 2045390 1736601 1145588 500882 -113748
37911 -113748 -453092 -134971 778413 1527629 1422377 703041 152326 -19931 -260304 -665999
37901 -665999 -738353 -406146 -411916 -1094539 -1559760 -896456 357181 925602 556885 -3538
37891 -3538 -512653 -1408899 -2451372 -2560732 -1497092 -511723 -606521 -1113886 -854124 112461
37881 112461 879108 1210575 1547610 1830834 1446883 325829 -836877 -1534150 -1852235
37872 -1852235 -1865504 -1408857 -633208 -99593 -57250 -153162 -54838 130732 215005 184267
37862A84267k78450q12744j259958j100066m36760K16568P16742J236956J619966
37853H6521J448400P03292j79962q22380j022197o08243K56343Q45574N93838
37844A301186q9849l47712o0473J46615n6862l78010n41654n48968l35403J26809
37834g84321M33981J90781k26362j52430K16043J33046k63562l9432P93906R64685
37824A266335l8827r16232m65080N35253N57660l37116p72138k40574L78475M25915
37814C93671K89229L85523M04029Q351n00132o89854n91104l81515J2182N78795
37804i0825Q99980O19849p58l78937l10351p0521P2239J42500K44702K89128Q0104
37793A497110l40413n92286l86239J139M999l95321n44798o7988N12139N59551
$$ plain form
37862 184267 -94183 -906927 -2166885 -3266951 -3703711 -3487143 -2770401 -1533445 86521
37853 86521 1534921 2238213 2058251 1235871 213674 -394569 -138226 707348 1301186
37844 1301186 1211337 863625 803152 949767 892905 514895 -26759 -575727 -911130 -784321
37834 -784321 -350340 -159559 -385921 -538351 -322308 -189262 -452824 -492256 301650 1266335
37824 1266335 1227508 311276 -153804 381449 939109 601993 -170145 -410719 -32244 393671
37814 393671 682900 1068423 1472452 1480803 980671 290817 -300287 -681802 -669620 -90825
37804 -90825 809155 1429004 1428246 1049309 738958 668437 740676 883176 1127878 1417006 1497110
37793 1497110 1156697 564411 178172 179311 184310 -211011 -755809 -823797 -311658 247893
37783B47893K67518J61059P9564m20025r00537m73462N38757P00295k95688q21100
37773i15726K92634J702758J321598n62742j610491p43393N44508N91061k11888
37764D08319m85998o7463O0471m65291q58399m36424M40022R08615N73914k73187
37754a95421j047175j266380p91821Q6981Q25776J010050O53632J59081n4820
37745f20097N1345J68544J18572J05149K79913L24063q0780n29720k90606N38099
37735F4482R83136N47651j13442k72654j61707l02955m52609p0741N55906O03727
37725A380794k4162n98293p03277o45864o43177m16188J59548O66878P22796M48478
37715C47533J34503j17207k46349j76234n3961j28152l04089k68175n8681M1108
$$ plain form
37783 247893 515411 676470 756034 336009 -564528 -1037990 -499233 201062 -94626 -915726
37773 -915726 -623092 1079666 2401264 1838522 228031 -515362 29146 620207 408319
37764 408319 -77679 -145142 -84671 -549962 -1408361 -1844785 -1404763 -496148 77766 -195421
37754 -195421 -1242596 -2508976 -3300797 -3213816 -2388040 -1377990 -724358 -565277 -620097
37745 -620097 -568752 -400208 -281636 -176487 103426 427489 346709 -183011 -473617 64482
37735 64482 1047618 1595269 1481827 1209173 1047466 744511 291902 221161 777067 1380794
37725 1380794 1356632 758339 55062 -590802 -1233979 -1650167 -1490619 -823741 -100945 347533
37715 347533 482036 364829 118480 -57754 -111715 -239867 -543956 -812131 -870812 -829704
37705h29704J42785N53579R09650M44682o16161r46801L4828J132286R73084r2107
37695A706121o42492k40188K05072n2794o56280q17128k81473N41393J050310
37686H12541R85657O47925M52398K41921m82872j503291j796094r72170l7224
37677a651209Q401l74098j53814N12569O03966Q17l43118K1486M79417N35786
37667c59797M74279N46834N00755K87064L25569O18748M59468m24239j185205
37658A243476r63474q6663M88725M58610K26504M8156j64285l53012k80048J1690
37648F29679J95091J77089K30310N01301P08196N29376R7769j74389k34329m96733
37638B163360j086149j316718n00995Q30078J302520N19537l22186j54290M38054
$$ plain form
37705 -829704 -686919 -133340 776310 1220992 604831 -341970 -307142 825144 1798228 1706121
37695 1706121 1063629 823441 1028513 975719 319439 -497689 -779162 -237769 812541
37686 812541 1798198 2446123 2898521 3140442 2657570 1154279 -641815 -1613985 -1651209
37677 -1651209 -1642808 -2016906 -2170720 -1658151 -1054185 -1053368 -1396486 -1375000 -895583 -359797
37667 -359797 114482 661316 1162071 1449135 1774704 2393452 2852920 2428681 1243476
37658 1243476 280002 193339 682064 1140674 1367178 1415334 1251049 898037 617989 629679
37648 629679 824770 1001859 1232169 1733470 2441666 2971042 3068811 2894422 2660093 2163360
37638 2163360 1077211 -239507 -740502 89576 1392096 1911633 1589447 1435157 1873211
37629A873211K57495n91301r50771m53545N9265m7158m11296m52092r2861M26070
37619c82983P61439N16431k10795n16891J89593J029958P42897k94988n35689
37610A298972K91835Q01465K60102m03939m28569l76733o82973o57868L8685M30790
37600E71767r0067n21722o999N25049J386p57648m12737N04910N22798j95521
37590A41216k40394N10791P87411K17570k03394k1553P5471k15049l07710l0959
37580G13400O0103o2688K17254P69555O75498j22417o12391m92914o11580j185222
37570f51402j209406k98503M66917L46993Q5116L16792L44918l51416q07195j59098
37560a916284O67174L96292m53700n11739J18143K16653l21806m04833K24040
$$ plain form
37629 1873211 2130706 1539405 588634 135089 194354 147196 -264100 -716192 -809053 -382983
37619 -382983 378456 894887 684092 167201 356794 1386752 2129649 1834661 1298972
37610 1298972 1590807 2392272 2652374 2248435 1819866 1443133 760160 102292 140977 571767
37600 571767 481700 -40022 -47021 478028 479414 -278234 -690971 -186061 336737 141216
37590 141216 -99178 411613 1199024 1416594 1213200 1191647 1267118 1052069 744359 713400
37580 713400 773503 710815 928069 1697624 2373122 2250705 1638314 1145400 533820 -651402
37570 -651402 -1860808 -2159311 -1692394 -1345401 -1260285 -943493 -598575 -949991 -1757186 -1916284
37560 -1916284 -1249110 -852818 -1306518 -1818257 -1700114 -1483461 -1805267 -2210100 -1986060
37551a986060N70517K28056J05004P92995J441047J004671j85092q61333m48346
37542F61459L20895L33312o17211j525935j263904J5112R39941O15746k75704
37533g96289n31614k7850M43112M69934K70166o1386n70390q23761k70817P15768
37523a183127J092817N97192O9253J17533L30080J41455l10310n95902n90458
37514c31467k94687K92752P98943O66728O0494j76520J62608K84516j38603k25927
37504A098837N10706R20095p7006j363098r64683Q31892J642382M64022r21306
37495B141841p60012J76243J37777q62758j388232q87933j51723J81294K21166
37486a192337J05214j40387j38853L59865P36010L60381j09470L05226R07634
$$ plain form
37551 -1986060 -1415543 -1187487 -1082483 -289488 1151559 2156230 1971138 1109805 661459
37542 661459 982354 1315666 698455 -827480 -2091384 -2076272 -1136331 -520585 -796289
37533 -796289 -1327903 -1355753 -912641 -442707 -172541 -233927 -804317 -1628078 -1898895 -1183127
37523 -1183127 -90310 506882 576135 693668 1023748 1165203 854893 258991 -331467
37514 -331467 -626154 -333402 465541 1132269 1192763 1016243 1178851 1463367 1324764 1098837
37504 1098837 1609543 2529638 2452632 1089534 124851 956743 2599125 3063147 2141841
37495 2141841 1381829 1558072 1695849 833091 -555141 -1443074 -1594797 -1413503 -1192337
37486 -1192337 -1087123 -1227510 -1366363 -1006498 -270488 89893 -19577 285649 1193283
37477A193283J19786j619949j879250J23161J979591J488916k42817q05959p8649
37468B78113K57744k48374n22456j94615J3272l6590K19492N43309J48062n38940
37458h0983k84539O65407P25451l02960p57745M8075O51940R878q03730o46052
37448g75258j55659j60383j2812Q61701J369504N44929m56836j68099N97779J61202
37438A806068r82136r59835K09644O64042j21643o54753j76065K18834k01382
37429a97226n51724j56637J80331k32316o24162j33723O83581Q53280N30609M56875
37419H08888O05811M11735j45497n54712n43213k18656K14418M40540J64372l87541
37409G96145n99628l87129l41043o46233o53707k0972N28687K71609l54648m19047
$$ plain form
37477 1193283 1313069 -306880 -2186130 -2062969 -83378 1405538 1162721 356762 278113
37468 278113 535857 287483 -234973 -429588 -416316 -452906 -233414 309895 457957 -80983
37458 -80983 -365522 299885 1025336 722376 -35369 12706 664646 674524 -129206 -775258
37448 -775258 -930917 -1091300 -1104112 -242411 1127093 1672022 1215186 1047087 1644866 1806068
37438 1806068 823932 -135903 73741 737783 616140 -38613 -214678 4156 -197226
37429 -197226 -748950 -905587 -725256 -957572 -1581734 -1715457 -1031876 -178596 352013 808888
37419 808888 1414699 1826434 1680937 1126225 583012 364356 578774 1019314 1183686 796145
37409 796145 196517 -190612 -531655 -1177888 -1831595 -1852567 -1323880 -1052271 -1406919 -1825966
37399a825966J61350O82636O97703L43464q3857l11425j12935L63798N66151K39770
37389G20689j83272k84898k96249n42463p15853l35543L92995Q23940P76062O02949
37379I58357M95183K76905j16932m19066l77996r1896N8109k27108p68890r46677
37369a160011l95218M29572P80955N86962L25677R4241l82635q55682o80418j0219
37359a266776K33279j07062j17520M83315O71902p7586o82670k37492L80296O8923
37349f51391m99194j25437O17331L05002p16151p54215L75915J056865N80429
37340A89154P7316K60472K30547o20704j258581o81098M05614P44201L11108j13169
37330d55140k49079j94487J77410P25222P03060j39887q56558o35557o7456m1674
$$ plain form
37399 -1825966 -1664616 -981980 -284277 59187 -24670 -336095 -449030 -85232 480919 720689
37389 720689 537417 252519 -43730 -586193 -1302046 -1637589 -1244594 -420654 355408 958357
37379 958357 1453540 1730445 1613513 1194447 816451 724555 782664 555556 -213334 -1160011
37369 -1160011 -1555229 -1125657 -344702 242260 567937 662178 279543 -576139 -1256557 -1266776
37359 -1266776 -1033497 -1140559 -1258079 -774764 -102862 -180448 -863118 -1100610 -720314 -651391
37349 -651391 -1150585 -1276022 -658691 -353689 -1069840 -1824055 -1448140 -391275 189154
37340 189154 266470 526942 757489 136785 -1121796 -1802894 -1397280 -653079 -341971 -455140
37330 -455140 -704219 -898706 -721296 3926 706986 567099 -289459 -925016 -992472 -1034146
37320a034146j70696L89459J147822Q23717n05319j261483n53038O95862J146093
37311F78271O31262n9825k77111J7265M04397L71630j66122o64121n99716j97930
37301A38000l9325j33868k9102K74725K82330p8932k60989M236K94561K35429
37291F87065K3586p7162j92447m49749o24777n29566l45847k48669q1271K68571
37281a570266N19130L70210l1755k91760k11692J51831N98423P80180M19482k59061
37271D74722o43123m85483j86369j15065q7105J57668L81499K07805k29915m46035
37261i71401k45970J24940L18357J43583k61889l58730K78712J154424J160085
37252A342111J01547p88329n33212J16900r4360q48824p74632K08258O74882N5308
$$ plain form
37320 -1034146 -1204842 -815383 332439 1156156 650837 -610646 -1163684 -467822 678271
37311 678271 1309533 1249708 972597 989862 1394259 1765889 1599767 935646 335930 138000
37301 138000 98675 -35193 -64295 210430 492760 413828 152839 157075 451636 687065
37291 687065 710651 633489 441042 -8707 -633484 -1163050 -1508897 -1757566 -1838837 -1570266
37281 -1570266 -1051136 -680926 -712681 -1004441 -1216133 -1064302 -465879 314301 733783 474722
37271 474722 -168401 -653884 -840253 -955318 -1042423 -884755 -503256 -295451 -525366 -971401
37261 -971401 -1217371 -1092431 -774074 -630491 -892380 -1251110 -972398 182026 1342111
37252 1342111 1443658 655329 122117 239017 144657 -704167 -1478799 -1270541 -595659 -540351
37242e40351m15875J86163Q81127M29479n86506p50113r6206J80727j01306N8402
37232g54459Q03158R28207k8590p40192j14715Q38006M73214r28341j569779q25091
37222a918582L3317J8697j25014N55317J383150R76533m96867j322305n77243
37213a472997O70236R57259L12326k05039k29739l49174p96857r12553k25225
37204b251763O64673Q29593K47690k35891j4265O35033R61625N22220m03582j008964
37194e3631p11992J33165N22481J8322o60639o32556n2888K82874K50239M54285
37184d50340R72911R93695R5138r02454r88975l07843K43300L34538L38511L94570
37174G23051K18361j49796k46092k5267l5634m33112n65838n2930L98958j761
$$ plain form
37242 -540351 -956226 -770063 111064 540543 -45963 -796076 -892282 -711555 -812861 -754459
37232 -754459 48699 976906 948316 208124 93409 931415 1404629 476288 -1093491 -1918582
37222 -1918582 -1885265 -1866568 -1991582 -1436265 -53115 923418 426551 -895754 -1472997
37213 -1472997 -802761 154498 466824 261785 32046 -317128 -1113985 -2026538 -2251763
37204 -2251763 -1587090 -757497 -509807 -745698 -759963 -124930 836695 1358915 955333 -53631
37194 -53631 -765623 -632458 -109977 -91655 -752294 -1384850 -1437738 -1154864 -904625 -450340
37184 -450340 522571 1516266 1611404 708950 -280025 -587868 -344568 -10030 328481 723051
37174 723051 941412 791616 545524 520257 484623 51511 -514327 -567257 -168299 -170060
37164a70060q03992q97021j73895L83319K81474J31389L97101N60596J50121k70299
37154d11267k839N34482M57548j24081l90798k84623m68450q54932n29884N54167
37144a520677J144199N63379k00600j34391K10483r7843n72258j59012P20538
37135d6182O18334o02734j440302r46536J23119P12263P76125O84228M01746q6420
37125A93641l81190l02646k24185l24376k58140K2756J7027k60183J8074R93162
37115e06060J380056K74306j173243j176378J62404J101940P36186j26899n00806
37106A71506l49399r405L75769N23073P2423o52095p86827k04928J71438k09040
37096h97485n95851q7425R10974J216210N57913j06939j7304L78169K08933m62843
$$ plain form
37164 -170060 -974052 -1871073 -2044968 -1661649 -1380175 -1248786 -851685 -291089 -140968 -411267
37154 -411267 -414106 120376 577924 453843 63045 -221578 -690028 -1544960 -2074844 -1520677
37144 -1520677 -376478 186901 -13699 -148090 62393 -35450 -607708 -766720 -46182
37135 -46182 572152 -30582 -1470884 -2417420 -2294301 -1582038 -805913 -121685 280061 193641
37125 193641 -187549 -490195 -714380 -1038756 -1296896 -1274140 -1257113 -1517296 -1499222 -506060
37115 -506060 873996 1148302 -24941 -1201319 -1038915 63025 799211 672312 171506
37106 171506 -177893 -187298 188471 711544 783967 131872 -654955 -859883 -688445 -897485
37096 -897485 -1493336 -1580761 -669787 546423 1104336 997397 980093 1358262 1567195 1104352
37086A104352p01832r8878N54138M13212j25345r5723L33858k3032j336940k085086
37076b061276j130694N74356J379497J154129Q82802P62281K19715n52661p00354
37067E27795k88284k26038n27233k46298N83205O49898m17377j193753o88465
37058a826550J17572P2187k51018J45239P13421L73348l81917k11694P19841R35379
37048D05808P0285o17381l53211J05800j2359k82030o7953L04124J41745n09041
37038h14213j002225r02545k30404O80461J242678R80114J48907m16750l27241
37029f41218m6580l7583o0635K58634O52786N74672P3597k38246k3956L97296
37019I08767N31485K77128n9560j60943m6790m6034l85333q33163q94666l87403
$$ plain form
37086 1104352 402520 303642 857780 1270992 1145647 1049924 1383782 1360750 23810 -2061276
37076 -2061276 -3191970 -2617614 -1238117 -83988 798814 1561095 1780810 1228149 527795
37067 527795 239511 13473 -513760 -760058 -176853 473045 55668 -1138085 -1826550
37058 -1826550 -1708978 -1636791 -1887809 -1742570 -1029149 -655801 -1037718 -1249412 -529571 405808
37048 405808 476093 -141288 -494499 -388699 -401058 -683088 -751041 -446917 -305172 -814213
37038 -814213 -1816438 -2718983 -2949387 -2268926 -1026248 -46134 102773 -313977 -641218
37029 -641218 -687798 -725381 -786016 -527382 125404 700076 773673 535427 511471 908767
37019 908767 1440252 1717380 1657820 1496877 1450087 1404053 1018720 185557 -709109 -1096512
37009a096512L23788P11648N71321Q9479m00321o33783n07905j08471L16374M54419
36999b79963J22635m96368q67499o00921K1456K96940k4601m45142m53776j68438
36989b895677L1843J18395K57248L81844L83788M37521O37645O06795N4346n27709
36979e13961m20976K13908N23309K03169j99753k65808j97169j75756J442L46821
36969d84774M19300J0757m51694n27927k90476N1047M88914Q47595O66458r3636
36959F35564p26101o39715j19587K09833K26968J38294o0846l55430l46149K08199
36949h28970P69869O32722l4391m25994k47854O1658J96791L41649N68773N62425
36939A596678J90703j72830j82641J8768J16518M8452j18019m01489p22143p64290
$$ plain form
37009 -1096512 -772724 -61076 510245 599724 199403 -434380 -942285 -1050756 -734382 -279963
36999 -279963 -157328 -653696 -1521195 -2122116 -2100660 -1803720 -1828321 -2273463 -2727239 -2895677
36989 -2895677 -2863834 -2745439 -2488191 -2106347 -1722559 -1285038 -647393 -40598 13748 -513961
36979 -513961 -934937 -721029 -197720 5449 -194304 -460112 -657281 -833037 -831595 -484774
36969 -484774 -65474 -54717 -506411 -1034338 -1324814 -1273767 -784853 62742 729200 635564
36959 635564 -90537 -730252 -849839 -640006 -413038 -274744 -335590 -691020 -1037169 -828970
36949 -828970 -59101 573621 539230 113236 -134618 -72960 123831 465480 1034253 1596678
36939 1596678 1787381 1614551 1431910 1450678 1567196 1615648 1497629 1096140 373997 -390293
36929c90293l30025L09863O56521M88630j5012n18522p36418n46395j00310K56271
36919i25690L38854L10152L56974L31731J484m23796m15734J02021M98360K50706
36909D25062k84342l60373P7894L78624K46037J43587L81322M80703k702n58301
36899I27511l88654K98492N25997J5480m48736k78866J11095J11240j61776k30122
36889D81661l7010J32116J56197Q4885o4455j77222l3861K60638K28719k51826
36879G79842o08663l98241k8579j12003m75292m61743L1229M84557N98992N74326
36869C84425N84895N38056L79663J88675k4472k28835j86041K10932N35065K68336
36859B650699m11412p84757n14288L5286L58129K48042k40850p93345q67728k37709
$$ plain form
36929 -390293 -720318 -410455 246066 734696 719684 201162 -535256 -1081651 -1181961 -925690
36919 -925690 -586836 -276684 80290 412021 413505 -10291 -426025 -324004 174356 425062
36909 425062 140720 -219653 -141759 236865 482902 626489 1007811 1488514 1485812 927511
36899 927511 538857 837349 1363346 1378826 930090 651224 762319 873559 711783 481661
36889 481661 444651 576767 732964 817849 753394 576172 542311 802949 1031668 779842
36879 779842 171179 -227062 -255641 -367644 -842936 -1304679 -1273450 -788893 -189901 384425
36869 384425 969320 1507376 1887039 2075714 2051242 1822407 1636366 1847298 2382363 2650699
36859 2650699 2239287 1454530 940242 975528 1333657 1581699 1340849 547504 -320224 -557933
36849e57933N50532P46937L32203j13762k99127l46285k05532K68677P04704N21194
36839A601608q8766l28429o6236k1205m56750o58484j33154N64006P32466M71630
36829A616686J67637k07599o54757o99906r0486O21330Q20092O01978K62737k79358
36819B158354q83700q20352Q8665P04851N3269j053686j136095l11769J5026m84068
36809a669505o02919K95736J207843J070559K20252m10786o00119o13623m40089
36800a542651o565L63830L70791K32941K48709K45736l1808l26410j71029M04106
36790b12350Q61668P41670N8189p04500r03456l32055M41450O77238L88455J88224
36780A204533K64739J88106j85620l96961k07802l32o3984k06563l24941n41522
$$ plain form
36849 -557933 -7401 739536 1071739 957977 658850 312565 107033 375710 1080414 1601608
36839 1601608 1512842 1184413 1118177 1096972 640222 -18262 -151416 412590 1145056 1616686
36829 1616686 1784323 1576724 921967 222061 131575 752905 1572997 2174975 2437712 2158354
36819 2158354 1274654 454302 542967 1247818 1301087 247401 -888694 -1200463 -1185437 -1669505
36809 -1669505 -2272424 -1976688 -768845 301714 521966 111180 -488939 -1102562 -1542651
36800 -1542651 -1549216 -1185386 -814595 -581654 -332945 -87209 -119017 -445427 -616456 -212350
36790 -212350 649318 1390988 1449177 744677 -158779 -490834 -49384 627854 1016309 1204533
36780 1204533 1469272 1657378 1471758 1074797 866995 866663 802679 596116 271175 -270347
36770b70347n36737K13438J167764R61005m22335j121531j09794R73780K31309
36761A086552j458873j765387m48772O13455N57999L64624N09529J76309o45850
36752a010414n49455Q16051J671051P97008m54167l63274M60975L71863n13044
36743A226594p87080k91439j40538n04244l11808P02968J361626Q65402r0679
36734B030802n33233m63764l75758l69606k70915o8549J10298Q9487l03895q32433
36724i87566p47229K00531R81726N31372m92149m84908O19742J184831M83507
36715A289857j85604K37049P75909J42198r95003j039642j2520N81571J06850
36706I00665n42882o40623n45192o17722m60376J91986P41537N61893l7283k98112
$$ plain form
36770 -270347 -807084 -593646 574118 1535123 1112788 -8743 -118537 855243 1086552
36761 1086552 -372321 -2137708 -2586480 -1973025 -1415026 -1050402 -540873 -364564 -1010414
36752 -1010414 -1559869 -743818 927233 1724241 1270074 906800 1367775 1739638 1226594
36743 1226594 439514 148075 7537 -496707 -808515 -105547 1256079 2121481 2030802
36734 2030802 1497569 1033805 658047 288441 17526 -51023 59275 148762 -155133 -987566
36724 -987566 -1734795 -1534264 -552538 -21166 -513315 -998223 -378481 806350 1289857
36715 1289857 1104253 1341302 2117211 2259409 1264406 224764 212244 793815 900665
36706 900665 357783 -282840 -828032 -1445754 -1906130 -1714144 -972607 -410714 -447997 -746109
36696g46109o5665K07317K50948K41237L32275L49633P3090l76655o00092l80396
36686g14417J7029J54969J8113K9913L51021M96902R182p17955p82500N3136R84376
36675a00231J106297M04711l87945o86176n44899l44472k36003m1677L38254O20164
36665A28023M32121j52900o34722o54472k81479K73653Q44768J109757O98639
36656A763388j95967p57792n18699k8188o7981n20446o11056p8419N30808O83912
36646A99560M10633J6413k52631k29735L8418J68555j21252m91504l79350J24279
36636e16614L55202P1984k16668o9492K81847L79264J65956p1915r8988P1356
36626C51932J54751j76869p61980q73110j64913N93394M79657j34683j19189N21592
$$ plain form
36696 -746109 -811774 -604457 -353509 -112272 220003 569636 642726 266071 -334021 -714417
36686 -714417 -697388 -542419 -524306 -494393 -143372 353530 362712 -355243 -1137743 -1084607 -100231
36675 -100231 1006066 1410777 1022832 336656 -208243 -552715 -788718 -830395 -492141 128023
36665 128023 560144 407244 -227478 -881950 -1163429 -889776 -45008 1064749 1763388
36656 1763388 1567421 809629 290930 262742 194761 -325685 -936741 -1015160 -484352 199560
36646 199560 610193 626606 373975 144240 182658 351213 229961 -261543 -640893 -516614
36636 -516614 -161412 -89428 -306096 -375588 -93741 285523 451479 379564 280576 351932
36626 351932 506683 329814 -432166 -1305276 -1470189 -876795 -397138 -531821 -651010 -129418
36616a29418N86773k30346o37496J39541Q97585K93948r27844j043701j1026O18545
36606d43439K10083j90062J94201O69792M36879n2125L2277M53708K98119n48399
36596A061034j147569p51867K25419O72774O7548q38108p98823L53993J280454
36587A24855P39213o60487j111303k2236J156807R21754l16778r76648m49564
36578e94387L87707N83475J55335l56492o50933o91076m65304p9300J90395K15568
36568a305012J93598K85126K85854n6551n47943p16284m44986r1305R3622K96705
36558b007176O75372Q81024M56774m17662j022285r75516o19760m07594k85383
36549c722206O9041O74461J185552J240999P18739j19041o17890k67813N10235
$$ plain form
36616 -129418 457355 227009 -410487 -270946 626639 920587 -7257 -1050958 -1061984 -443439
36606 -443439 -233356 -423418 -229217 440575 877454 825329 857606 1311314 1609433 1061034
36596 1061034 -86535 -838402 -612983 59791 127339 -710769 -1509592 -1155599 124855
36587 124855 864068 203581 -907722 -929958 226849 1148603 831825 -144823 -594387
36578 -594387 -206680 376795 532130 175638 -475295 -1166371 -1631675 -1710975 -1520580 -1305012
36568 -1305012 -1111414 -826288 -540434 -596985 -1144928 -1861212 -2306198 -2397503 -2303881 -2007176
36558 -2007176 -1331804 -450780 5994 -411668 -1433953 -2409469 -3029229 -3436823 -3722206
36549 -3722206 -3653165 -2978704 -1793152 -552153 166586 47545 -570345 -838158 -327923
36540c27923O13253k77149j025521n45772N18277O65898j42704l92558N13313
36531d00886J130065J88570j248258j223470J77787R40142J09675r11654n79320
36522a817349O10872J110862N96634O6904P9853J17307k38181n54837l76908k8066
36512d32909m5003l01186k61028J66242N31565M76767P8947l33193m18804m5323
36502e83925M48625M47202j49096o27292m11217M6905j7133l81121j71168O01183
36492g97037R18370L77596j77257j19001l3981m74983p23992N7732J137695J021965
36482A187107l04358j238413p19072N68450J328335J059244J20332p48264p62784
36473D90577K08715J078911N53699j026161j828923r34174M29984P06003Q6970
$$ plain form
36540 -327923 285330 8181 -1017340 -1563112 -1044835 -378937 -521641 -914199 -400886
36531 -400886 729179 917749 -330509 -1553979 -1376192 -436050 -326375 -1238029 -1817349
36522 -1817349 -1206477 -95615 501019 567923 647776 765083 526902 -27935 -404843 -432909
36512 -432909 -477912 -779098 -1040126 -873884 -342319 134448 213395 -119798 -538602 -583925
36502 -583925 -135300 311902 162806 -464486 -875703 -828798 -845931 -1227052 -1398220 -797037
36492 -797037 121333 498929 321672 202671 168690 -306293 -1030285 -972553 165142 1187107
36482 1187107 882749 -355664 -1074736 -506286 822049 1881293 2001625 1253361 490577
36473 490577 699292 1778203 2331902 1305741 -523182 -1457356 -1027372 -321369 -234399
36464b34399j69862K46536N49802L44710R4480J06100L4910l72675p63978p12251
36454h76627l05619L8397O1915j52908k85326m9610M43534O90954L88968j21397
36444a67719k77664j6197K36694J57928j93543n54104o20797k11944M29154O90963
36434e27229K93661k74483l67163K0622M36780O34198N69319R2595p13032j148140
36424i82872n96849N15128J181685J120862Q50307N81710k254p86152j046100
36415H35465n63895m7210m1561k18039j69959j21093l10490m05249j24320J97254
36405i69097K44922K68838M04130J97423m52926o72628J03875R21692N57454n34656
36395F9027q53657j24591M82069L40473J01648K14609J56006l48966o07259j51685
$$ plain form
36464 -234399 -404261 -157725 392077 736787 831267 937367 972277 599602 -164376 -876627
36454 -876627 -1182246 -1143849 -1081934 -1234842 -1520168 -1569778 -1126244 -435290 -46322 -167719
36444 -167719 -445383 -461580 -224886 -66958 -260501 -814605 -1435402 -1647346 -1218192 -527229
36434 -527229 -233568 -508051 -875214 -854592 -417812 216386 785705 878300 165268 -982872
36424 -982872 -1579721 -1064593 117092 1237954 2088261 2669971 2667717 1881565 835465
36415 835465 271570 224360 182799 -35240 -205199 -326292 -636782 -1042031 -1166351 -969097
36405 -969097 -724175 -455337 -51207 146216 -306710 -979338 -875463 46229 603683 69027
36395 69027 -784630 -909221 -427152 -86679 14969 229578 385584 36618 -570641 -722326
36385g22326M09904M67187L65889N27072N35549j0438n66472n05774j68547p6766
36375B55278J17207P64736J082585K88263p39784n71898L85998M46916n18468
36366A510833q39268L1644M95104m16071j269794o52468L90223J76689o82371
36357a255479l76908Q77183J096488j46834r96629l22824O34335M86820j95523
36348a99371j85860L37975L86000q9440l55356k50556j83434j56871J11588L56203
36338b29122Q9180l88654l02813L03144N54023J16670l24064k08786Q4405l7393
36328c43410m64117o38505l44821J21031L34019R8988l40551l92312K55587J062866
$$ plain form
36385 -722326 -312422 154765 520654 1047726 1583275 1572837 1006365 500591 332044 255278
36375 255278 372485 1137221 2219806 2508069 1768285 1196387 1582385 2029301 1510833
36366 1510833 671565 703209 1198313 782242 -487552 -1140020 -749797 -573108 -1255479
36357 -1255479 -1632387 -755204 341284 194450 -802179 -1125003 -490668 -3848 -199371
36348 -199371 -385231 -47256 338744 249304 -106052 -356608 -540042 -696913 -585325 -229122
36338 -229122 -139942 -528596 -831409 -528265 25758 142428 -181636 -390422 -306017 -343410
36328 -343410 -807527 -1446032 -1790853 -1669822 -1335803 -1236815 -1577366 -1969678 -1714091 -651225
$$ [...]
##END NTUPLES=NMR SPECTRUM
##END=
