##TITLE=31Pdec_LR-579-H1-CR2
 D2O, 24 sc
 25.6.2019
##JCAMPDX= 6.0         $$ Bruker NMR JCAMP-DX V2.0
##DATA TYPE= NMR SPECTRUM
##DATA CLASS= NTUPLES
##ORIGIN= UXNMR, Bruker Analytische Messtechnik GmbH
##OWNER= root
$$ XWIN-NMR		Version 3.5
$$ Tue Jun 25 13:52:10 2019 Russian Standard Time (UT+4h)  she@DPX200
##.OBSERVE FREQUENCY= 81.013821
##.OBSERVE NUCLEUS= ^31P
##.ACQUISITION MODE= SIMULTANEOUS
##.ACQUISITION SCHEME= undefined
##.AVERAGES= 24
##.DIGITISER RES= 17
##SPECTROMETER/DATA SYSTEM= spect
##.PULSE SEQUENCE= zgpg30
##.SOLVENT NAME= D2O
##.SHIFT REFERENCE= (INTERNAL, D2O, 0, 182.463)
##AUDIT TRAIL= $$ (NUMBER, WHEN, WHO, WHERE, WHAT)
$$ ##TITLE= Audit trail, XWIN-NMR		Version 3.5
$$ ##JCAMPDX= 5.01
$$ ##ORIGIN= Bruker BioSpin GmbH
$$ ##OWNER= she
$$ F:/spectra/data/she/nmr/P31/1/pdata/1/auditp.txt
$$ ##AUDIT TRAIL=  $$ (NUMBER, WHEN, WHO, WHERE, WHAT)
(   1,<2019-06-25 13:50:13.73 +0400>,<she>,<DPX200>,
      <created by zg, POWCHK disabled, PULCHK disabled
       configuration hash MD5:
       00 E9 B6 7A A2 85 ED C7 34 08 36 98 17 FE 4E 26
       data hash MD5: 32K
       73 98 D0 7C 8F 60 77 B7 9E 9B 37 C5 9E 7C BE 0F>)
(   2,<2019-06-25 13:50:24.90 +0400>,<she>,<DPX200>,
      <Start of raw data processing
       efp BC_mod = 2 LB = 1 FT_mod = 6 PKNL = 1 PHC0 = -2718.051 PHC1 = 478.399 SI = 64K 
       data hash MD5: 64K
       C8 21 7A C3 73 26 DE 71 6A 1A DB 54 AC 89 E7 66>)
(   3,<2019-06-25 13:51:05.87 +0400>,<she>,<DPX200>,
      <pk PHC0 = -108.4904 PHC1 = 289.2005 
       data hash MD5: 64K
       F3 6F B7 9E 26 7D F7 A0 BF E1 3F B5 26 77 18 06>)
(   4,<2019-06-25 13:51:24.32 +0400>,<she>,<DPX200>,
      <pk PHC0 = 330.994 PHC1 = -869.1999 
       data hash MD5: 64K
       83 DD 60 E8 A9 1D F7 1C 0E 16 DD 58 C2 1A 55 AB>)
(   5,<2019-06-25 13:51:43.42 +0400>,<she>,<DPX200>,
      <abs ABSG = 5 
       data hash MD5: 64K
       29 00 A7 5D FE ED 2F D5 A4 47 B5 D8 D8 E0 49 AF>)
$$ ##END=
$$ 
$$ hash MD5
$$ 3A 5A 29 25 B4 31 1B 45 7C 17 D1 E5 84 1C 7A 3B
##$RELAX= 
##$RELAX= 
##$RELAX= 
##$RELAX= 
##$RELAX= 
##$RELAX= 
##$RELAX= 
##$RELAX= 
$$ Bruker specific parameters
$$ --------------------------
##$DU= <F:/spectra>
##$EXPNO= 1
##$NAME= <P31>
##$PROCNO= 1
##$TYPE= <nmr>
##$USER= <she>
##$AMP= (0..31)
100 100 100 100 100 100 100 100 100 100 100 100 100 100 100 100 100 100 
100 100 100 100 100 100 100 100 100 100 100 100 100 100 
##$AQSEQ= 0
##$AQ_mod= 1
##$AUNM= <au_zg>
##$AUTOPOS= <>
##$BF1= 81.014009
##$BF2= 200.13
##$BF3= 200.13
##$BF4= 200.13
##$BF5= 200.13
##$BF6= 200.13
##$BF7= 200.13
##$BF8= 200.13
##$BYTORDA= 1
##$CFDGTYP= 0
##$CFRGTYP= 5
##$CHEMSTR= <none>
##$CNST= (0..31)
1 1 145 1 1 1 1 1 1 1 1 1 1 1 1 1 1 1 1 1 1 1 1 1 1 1 1 1 1 1 1 1 
##$CPDPRG= <waltz16>
##$CPDPRG1= <>
##$CPDPRG2= <waltz16>
##$CPDPRG3= <>
##$CPDPRG4= <mlev>
##$CPDPRG5= <mlev>
##$CPDPRG6= <mlev>
##$CPDPRG7= <mlev>
##$CPDPRG8= <mlev>
##$CPDPRGB= <>
##$CPDPRGT= <>
##$D= (0..31)
$$ [...]
##$SUBNAM3= <"">
##$SUBNAM4= <"">
##$SUBNAM5= <"">
##$SUBNAM6= <"">
##$SUBNAM7= <"">
##$SUBNAM8= <"">
##$SUBNAM9= <"">
##$SW= 369.568048894756
##$SWIBOX= (0..15)
0 1 3 0 0 0 0 0 0 0 0 0 0 0 0 0 
##$SW_h= 29940.119760479
##$TD= 32768
##$TD0= 1
##$TE= 0
##$TE2= 300
##$TE3= 300
##$TEG= 300
##$TL= (0..7)
0 120 53 12 22 120 120 120 
##$TP= (0..7)
150 150 150 150 150 150 150 150 
##$TP07= 0
##$TPNAME0= <>
##$TPNAME1= <>
##$TPNAME2= <>
##$TPNAME3= <>
##$TPNAME4= <>
##$TPNAME5= <>
##$TPNAME6= <>
##$TPNAME7= <>
##$TPOAL= (0..7)
0.5 0.5 0.5 0.5 0.5 0.5 0.5 0.5 
##$TPOFFS= (0..7)
0 0 0 0 0 0 0 0 
##$TUNHIN= 0
##$TUNHOUT= 0
##$TUNXOUT= 0
##$USERA1= <user>
##$USERA2= <user>
##$USERA3= <user>
##$USERA4= <user>
##$USERA5= <user>
##$V9= 5
##$VALIST= <valist>
##$VCLIST= <CCCCCCCCCCCCCCC>
##$VD= 0
##$VDLIST= <DDDDDDDDDDDDDDD>
##$VPLIST= <PPPPPPPPPPPPPPP>
##$VTLIST= <TTTTTTTTTTTTTTT>
##$WBST= 1024
##$WBSW= 4
##$XGAIN= (0..3)
0 0 0 0 
##$XL= 0
##$YL= 0
##$YMAX_a= 9788
##$YMIN_a= -16714
##$ZGOPTNS= <>
##$ZL1= 120
##$ZL2= 120
##$ZL3= 120
##$ZL4= 120
##$ABSF1= 182.463
##$ABSF2= -187.1042
##$ABSG= 5
##$ABSL= 3
##$ALPHA= 0
##$AQORDER= 0
##$ASSFAC= 0
##$ASSFACI= 0
##$ASSFACX= 0
##$ASSWID= 0
##$AUNMP= <proc_1d>
##$AZFE= 0.1
##$AZFW= 0.5
##$BCFW= 0
##$BC_mod= 2
##$BYTORDP= 0
##$COROFFS= 0
##$CY= -3
##$DATMOD= 1
##$DC= 0
##$DFILT= <>
##$DTYPP= 0
##$F1P= 0
##$F2P= 0
##$FCOR= 1
##$FTSIZE= 65536
##$FT_mod= 6
##$GAMMA= 0
##$GB= 0
##$INTBC= 1
##$INTSCL= 5.30512e-09
##$ISEN= 30
##$LB= 1
##$LEV0= 0
##$LPBIN= 0
##$MAXI= 10000
##$MC2= 0
##$MEAN= 0
##$ME_mod= 0
##$MI= 50
##$NCOEF= 0
##$NC_proc= -9
##$NLEV= 6
##$NOISF1= 182.463
##$NOISF2= 159.3651
##$NSP= 0
##$NTH_PI= 0
##$NZP= 0
##$OFFSET= 182.463
##$PC= 4
##$PHC0= -2495.548
##$PHC1= -101.6004
##$PH_mod= 1
##$PKNL= yes
##$PPARMOD= 0
##$PSCAL= 0
##$PSIGN= 0
##$REVERSE= no
##$SF= 81.0140089999434
##$SI= 65536
##$SIGF1= 159.3651
##$SIGF2= -187.1042
##$SINO= 113.3802
##$SIOLD= 16384
##$SREGLST= <1H.CDCl3>
##$SSB= 0
##$STSI= 65536
##$STSR= 0
##$SW_p= 29940.119760479
##$SYMM= 0
##$S_DEV= 0
##$TDeff= 32768
##$TDoff= 0
##$TI= <>
##$TILT= no
##$TM1= 0
##$TM2= 0
##$TOPLEV= 0
##$USERP1= <user>
##$USERP2= <user>
##$USERP3= <user>
##$USERP4= <user>
##$USERP5= <user>
##$WDW= 1
##$XDIM= 65536
##$YMAX_p= 338127531
##$YMIN_p= -474017736
$$ End of Bruker specific parameters
$$ ---------------------------------
##NTUPLES= NMR SPECTRUM
##VAR_NAME=  FREQUENCY,     SPECTRUM/REAL,   SPECTRUM/IMAG
##SYMBOL=    X,             R,               I
##VAR_TYPE=  INDEPENDENT,   DEPENDENT,       DEPENDENT
##VAR_FORM=  AFFN,          ASDF,            ASDF
##VAR_DIM=   65536,         65536,           65536
##UNITS=     HZ,            ARBITRARY UNITS, ARBITRARY UNITS
##FACTOR=    0.456856943014862, 1,           1
##FIRST=     14782.0589164792, 0,            0
##LAST=      -15158.0608439998, 0,           0
##MIN=       -15158.0608439998, -474017736,  0
##MAX=       14782.0589164792, 338127531,    0
$$ Real data points
##PAGE= N=1
##DATA TABLE= (X++(R..R)), XYDATA
$$ [...]
$$ plain form
4089 14098094 18836475 20843021 13589873 -4318323 -22665719 -26134075 -12519264 2513494
4081 2513494 5754303 3434527 7788111 14840641 10957595 -2349935 -7750733 2376836
4073 2376836 16067929 21699618 22413898 23875581 22326193 15065212 10787694 17089937
4065 17089937 26184150 25417474 15784441 8050592 5404595 2063650 -4048987 -8820820
4057 -8820820 -10394738 -10030981 -6659001 -305989 2242942 -3438577 -7763358 1722755
4049 1722755 19128665 26108277 20243689 19736986 33830947 46477267 41279996 27904637
4041 27904637 27285825 39932950 47191163 40344620 30409057 27222069 24879866 14737396
4033 14737396 1236359 -4645003 -1526446 1613021 -1558608 -7976679 -11281712 -9507148
$$ packed form
4089A4098094M738381K006546p253148j7908196j8347396l468356J3614811J5032758
4081B513494L240809k319776M353584P052530l883046j3307530n400798J0127569
4073B376836J3691093N631689P14280J461683j549388p260981m277518O302243
4065A7089937R094213p66676r633033p733849k645997l340945o112637m771833
4057h820820j573918L63757L371980O353012K548931n681519m324781R486113
4049A722755J7405910O979612n864588n06703J4093961J2646320n197271j3375359
4041B7904637o18812J2647125P258213o846543r935563l186988k342203j0142470
4033A4737396j3501037n881362L118557L139467l171629o418071l305033J774564
$$ plain form
4025 -9507148 -5545525 -3230738 -4311911 -7132948 -6897159 961110 15365814 28075679
4017 28075679 30164803 21141824 10132262 6927324 13168959 23058939 30069048 30666094
4009 30666094 24344989 14528217 8330424 10438885 16714661 18115184 11742587 3869819
4001 3869819 1079431 2898125 4910144 4814829 2951147 323656 -1732965 -3035924 -6772610
3992 -6772610 -15906337 -26222306 -28736900 -21417934 -12177467 -6945265 -2361255 4159362
3984 4159362 5351082 -5467227 -20568171 -25771738 -19745530 -14020960 -14191753 -12867942
3976 -12867942 -3896171 7276008 12863224 14190696 17359703 22726488 24755371 19532711
3968 19532711 8490078 -2895929 -8156506 -5565144 -2632581 -9504057 -25101060 -35886961
$$ packed form
4025i507148L961623K314787j081173k821037K35789P858269J4404704J2709865
4017B8075679K089124r022979j1009562l204938O241635R889980P010109N97046
4009C0666094o321105r816772o197793K108461O275776J400523o372597p872768
4001C869819k790388J818694K012019r5315j863682k627491k056621j302959l736686
3992f772610r133727j0315969k514594P318966R240467N232202M584010O520617
3984D159362J191720j0818309j5100944n203567O026208N724570j70793J323811
3976a2867942Q971771J1172179N587216J327472L169007N366785K028883n222660
3968A9532711j1042633j1386007n260577K591362K932563o871476j5597003j0785901
$$ plain form
3960 -35886961 -32406383 -20660436 -11714383 -7034408 -2417264 -510565 -7606355 -19594968
3952 -19594968 -23194753 -13527923 -366429 7034210 11802954 19669455 25340273 18573457
3944 18573457 686081 -14655229 -17771320 -12649120 -8263664 -6736245 -4538203 -1497266
3936 -1497266 -2654506 -10732388 -20388811 -22374285 -13296360 -173829 6028258 2082676
3928 2082676 -3600309 -772601 9913596 17553905 14873754 6847033 2594572 3268101
3920 3268101 3749067 3402138 6660628 12347349 11897662 3309937 -1199143 9412741 26377506
3911 26377506 29095920 11997099 -7408721 -11252410 -2483522 3851095 2738405 1580608
3903 1580608 3589014 1523721 -8719828 -18216904 -15811658 -3406920 6991546 9021670
$$ packed form
3960c5886961L480578J1745947Q946053M679975M617144J906699p095790j1988613
3952a9594968l599785R666830J3161494P400639M768744P866501N670818o766816
3944A8573457j7887376j5341310l116091N122200M385456J527419K198042L040937
3936a497266j157240q077882r656423j985474R077925J3122531O202087l945582
3928B082676n682985K827708J0686197P640309k680151q026721m252461O73529
3920C268101M80966l46929L258490N686721m49687q587725m509080J0611884J6964765
3911B6377506K718414j7098821j9405820l843689Q768888O334617j112690j157797
3903A580608K008406k065293j0243549r497076K405246J2404738J0398466K030124
$$ plain form
3895 9021670 7544043 8812103 12175934 14129210 15240808 18527262 23343823 25138544
3887 25138544 20809938 11306956 -863059 -13699853 -24584367 -29844233 -27807210 -21822529
3879 -21822529 -18535773 -22271300 -31127991 -38876292 -40820945 -37501553 -32403863 -27024836
3871 -27024836 -19876364 -10276184 -916708 4474936 4561085 474805 -5877164 -12278915
3863 -12278915 -16526761 -17712055 -15894952 -10006362 1047101 14009457 22271022 24259843
3855 24259843 26452017 33570658 40340008 39205084 31885427 25058126 18439712 7811192
3847 7811192 -2851665 -5964281 -6894874 -19314701 -39450611 -43013144 -18724287 11128325
3839 11128325 19403009 10597633 9199910 20561659 26552077 17555843 4982707 -1422010
$$ packed form
3895I021670j477627J268060L363831J953276J111598L286454M816561J794721
3887B5138544m328606r502982j2170015j2836794j0884514n259866K037023N984681
3879b1822529L286756l735527q856691p748301j944653L319392N097690N379027
3871b7024836P148472R600180R359476N391644Q6149m086280o351969o401751
3863a2278915m247846j185294J817103N888590J1053463J2962356Q261565J988821
3855B4259843K192174P118641O769350j134924p319657o827301o618414j0628520
3847G811192j0662857l112616r30593j2419827k0135910l562533K4288857K9852612
3839A1128325Q274684q805376j397723J1361749N990418q996234j2573136o404717
$$ plain form
3831 -1422010 -6336033 -11028011 -3476267 20407724 41671993 40582301 23791159 13883276
3823 13883276 18750120 26226406 25109375 17369480 10294399 7926896 10801957 15912661
3815 15912661 17592447 15154913 16546476 26224629 33289956 22648816 -3466530 -26309027
3807 -26309027 -33354199 -29675460 -25232843 -21698167 -16048747 -8397247 -574055 7611290
3799 7611290 16296297 23375724 26648444 24904416 16884341 3782908 -8229471 -14362484
3791 -14362484 -18950865 -28685691 -38829380 -36774399 -21065645 -5579973 -766452 -2033712
3783 -2033712 -2617944 -5891840 -14887930 -19467193 -7372709 16357030 32895440 30725505
3775 30725505 14102461 -6580960 -22607449 -27054135 -18673147 -7212803 -5602251 -14527259
$$ packed form
3831a422010m914023m691978P551744K3883991K1264269j089692j6791142r907883
3823A3883276M866844P476286j117031p739895p075081k367503K875061N110704
3815A5912661J679786k437534J391563R678153P065327j0641140k6115346k2842497
3807b6309027p045172L678739M442617L534676N649420P651500P823192Q185345
3799G611290Q685007P079427L272720j744028q020075j3101433j2012379o133013
3791a4362484m588381r734826j0143689K054981J5708754J5485672M813521j267260
3783b033712n84232l273896q996090m579263J2094484K3729739J6538410k169935
3775C0725505j6623044k0683421j6026489m446686Q380988J1460344J610552q925008
$$ plain form
3767 -14527259 -22201676 -20849346 -15405246 -13591587 -15493509 -17052424 -17164052 -16196969
3759 -16196969 -12051031 -2412826 11772179 27597086 41328821 46349613 35698864 11622636
3751 11622636 -11084470 -17082786 -5361878 10772107 17129975 9615000 -5705468 -19137617
3743 -19137617 -23945968 -19443913 -9268909 2534302 12729903 18015166 17242194 14851427
3735 14851427 17105732 23130525 24973761 19436286 13751469 14352510 15903100 9546680
3727 9546680 -1866394 -6850261 -2599655 1549331 105416 8689 7162010 13339211
3719 13339211 6266893 -11453537 -23163758 -17174035 2589481 24511615 39809623
3712 39809623 43925720 36017026 21997505 12571413 12741220 16423792 15635413 11090676
$$ packed form
3767a4527259p674417J352330N444100J813659j901922j558915j11628R67083
3759a6196969M145938R638205J4185005J5824907J3731735N020792j0650749k4076228
3751A1622636k2707106n998316J1720908J6133985O357868p514975j5320468j3432149
3743a9137617m808351M502055J0175004J1803211J0195601N285263p72972k390767
3735A4851427K254305O024793J843236n537475n684817O01041J550590o356420
3727I546680j1413074m983867M250606M148986j443915r6727P153321O177201
3719A3339211p072318j7720430j1710221N989723J9763516K1922134J5298008
3712C9809623M116097p908694j4019521r426092J69807L682572p88379m544737
$$ plain form
3704 11090676 8165744 6043944 -841404 -11052844 -14705518 -7034218 3688738 7410263
3696 7410263 6664828 12332502 26568248 37791106 35302135 23252755 14745459 14194235
3688 14194235 11887909 -1755447 -21345253 -31605195 -26457103 -16750754 -16141819 -24242202
3680 -24242202 -29044893 -23105675 -10651278 805617 8860897 14190794 15921877 12746644
3672 12746644 5618132 -2918029 -9534016 -10023448 -3114249 5015072 6484407 3703248
3664 3703248 7428551 18880081 23380080 9999892 -10480839 -18399992 -10875971 -2397907
3656 -2397907 -2427836 -5345598 -2978842 4900716 14498669 21634343 19713039 5598563
3648 5598563 -9666652 -8443646 10000680 25260251 21479706 5864274 -5883999 -10157221
$$ packed form
3704A1090676k924932k121800o885348j0211440l652674P671300J0722956L721525
3696G410263p45435N667674J4235746J1222858k488971j2049380q507296n51224
3688A4194235k306326j3643356j9589806j0259942N148092R706349O08935q100383
3680b4242202m802691N939218J2454397J1456895Q055280N329897J731083l175233
3672A2746644p128512q536161o615987m89432O909199Q129321J469335k781159
3664C703248L725303J1451530M499999j3380188k0480731p919153P524021Q478064
3656b397907k9929k917762K366756P879558R597953P135674j921304j4114476
3648E598563j5265215J223006J8444326J5259571l780545j5615432j1748273m273222
$$ plain form
3640 -10157221 -10849767 -6206233 4705497 10532887 -492483 -20902777 -31903676 -29003816
3632 -29003816 -24182416 -23251320 -18573970 -7845738 -2924311 -11408998 -22895923 -24252792
3624 -24252792 -18572656 -17241965 -20117946 -16421658 -3033696 9440082 10317712 864592
3616 864592 -9660800 -14927861 -15845982 -16478385 -17932361 -16695353 -9460339 1061798
3608 1061798 7620319 6289727 382412 -4055330 -3778801 931829 6915207 8106798
3600 8106798 -520803 -16039850 -28027992 -28943213 -21439679 -13411746 -9549038 -10621886
3592 -10621886 -16821628 -26681333 -34459743 -33337775 -21911252 -6050299 5227171 5992322
3584 5992322 -1533195 -7610549 -4310250 5146857 10892644 10571449 11763823 17639723
$$ packed form
3640a0157221o92546M643534J0911730N827390j1025370k0410294j1000899K899860
3632b9003816M821400R31096M677350J0728232M921427q484687j1486925j356869
3624b4252792N680136J330691k875981L696288J3387962J2473778Q77630r453120
3616H64592j0525392n267061r18121o32403j453976J237008P235014J0522137
3608A061798O558521j330592n907315m437742K76529M710630N983378J191591
3600H106798q627601j5519047j1988142r15221P503534Q027933L862708j072848
3592a0621886o199742r859705p778410J121968J1426523J5860953J1277470P65151
3584E992322p525517o077354L300299R457107N745787l21195J192374N875900
$$ plain form
3576 17639723 19069186 8052498 -7871693 -14173618 -8739376 -3344624 -7320333 -18690222
3568 -18690222 -31167965 -40721635 -43362163 -34951539 -17803996 -2333118 2295961 -3077593
3560 -3077593 -9898315 -10154826 -1500628 11957533 21812845 21155437 10800637 -1112897
3552 -1112897 -6626448 -4637152 -969152 -3078911 -13158354 -24566247 -26946516 -17098742
3544 -17098742 -2481970 8049961 12678387 12181290 3244271 -15659024 -35319094 -42689135
3536 -42689135 -36504957 -27399024 -22387162 -18393604 -12252698 -7129749 -5466748 -4277215
3528 -4277215 -1969505 -2381886 -7456941 -12768889 -14826824 -16053986 -17946347 -16381699
3520 -16381699 -9055313 -818352 3841244 6694972 8697781 5335827 -3728169 -9114734
$$ packed form
3576A7639723J429463j1016688j5924191o301925N434242N394752l975709j1369889
3568a8690222j2477743r553670k640528Q410624J7147543J5470878M629079n373554
3560c077593o820722k56511Q654198J3458161R855312o57408j0354800j1913534
3552a112897n513551J989296L668000k109759j0079443j1407893k380269R847774
3544a7098742J4616772J0531931M628426m97097q937019j8903295j9660070p370041
3536d2689135O184178R105933N011862L993558O140906N122949J663001J189533
3528d277215K307710m12381n075055n311948k057935j227162j892361J564648
3520a6381699P326386Q236961M659596K853728K002809l361954r063996n386565
$$ plain form
3512 -9114734 -5357654 -1898620 -8924299 -19691074 -21097209 -16044375 -18306396 -27793364
3504 -27793364 -30025771 -22111663 -19554848 -30042929 -38591339 -30796812 -16254780 -13460358
3496 -13460358 -21650406 -24949364 -18945747 -14963587 -18072779 -17962183 -6846125 6953534
3488 6953534 11441385 7838119 6034122 8843415 10248509 7361509 5373602 8876579
3480 8876579 14328939 14716345 8744481 1935170 -405623 1776597 5667411 10168389
3472 10168389 15723711 20638418 20705913 13872671 3843463 -2484361 -1225364 4718358
3464 4718358 7548740 1598948 -9124211 -11804559 1900657 22963958 31736254 20790041
3456 20790041 4427297 -313097 4919061 7331030 6476957 14666123 32683960 41789569
$$ packed form
3512i114734L757080L459034p025679j0766775j406135N052834k262021r486968
3504b7793364k232407P914108K556815j0488081q548410P794527J4542032K794422
3496a3460358q190048l298958O003617L982160l109192J10596J1116058J3799659
3488F953534M487851l603266j803997K809293J405094k887000j987907L502977
3480H876579N452360L87406n971864o809311k340793K182220L890814M500978
3472A0168389N555322M914707O7495o833242j0029208o327824J258997N943722
3464D718358K830382n949792j0723159k680348J3705216K1063301Q772296j0946213
3456B0790041j6362744m740394N232158K411969q54073Q189166J8017837R105609
$$ plain form
3448 41789569 28701445 5720246 -6424264 -6556027 -9246836 -18849280 -24100877 -17922411
3440 -17922411 -6598594 3429171 13140546 20570065 17344577 3477856 -6953899 -4677313
3432 -4677313 988836 -2199883 -10276362 -12380219 -10113006 -12076483 -15334000 -9434960
3424 -9434960 3781416 11218486 8740453 3897049 -1737971 -14543223 -29674743 -29161578
3416 -29161578 -7802374 15077126 20008109 9903378 -1738371 -10783208 -18018840 -18326189
3408 -18326189 -10185773 -5590024 -13618247 -22501666 -16014075 -1149566 485977 -14149356
3400 -14149356 -25416877 -20881494 -10081804 -5681221 -7143171 -8837355 -9411614 -6963675
3392 -6963675 1713619 11320848 10541891 -213078 -7290239 -5646189 -6314513 -13742512
$$ packed form
3448D1789569j3088124k2981199j2144510j31763k690809r602444n251597O178466
3440a7922411J1323817J0027765R711375P429519l225488j3866721j0431755K276586
3432d677313N666149l188719q076479k103857K267213j963477l257517N899040
3424i434960J3216376P437070k478033m843404n635020j2805252j5131520N13165
3416b9161578K1359204K2879500M930983j0104731j1641749r044837p235632l07349
3408a8326189Q140416M595749q028223q883419O487591J4864509J635543j4635333
3400a4149356j1267521M535383J0799690M400583j461950j694184n74259K447939
3392f963675Q677294R607229p78957j0754969p077161J644050o68324p427999
$$ plain form
3384 -13742512 -13121150 6053481 28929715 34982277 26941890 20934296 17048740 2438902
3376 2438902 -19805286 -28731066 -16215993 453358 3992027 -1364554 -3008220 -804228
3368 -804228 -2946368 -10316140 -17196194 -22319172 -28125619 -31545618 -25603297 -10775975
3360 -10775975 2641656 5575836 -645354 -7415886 -8055082 -2739108 3516041 6107551
3352 6107551 4369751 912937 -980906 1498492 9751487 20610062 25527794 18143728
3344 18143728 3598328 -4744441 -345044 8994512 11566190 5163517 -4453913 -14143495
3336 -14143495 -24728711 -32584406 -28577446 -9886263 12122050 21967895 16933599 8877902
3328 8877902 8807566 14609709 16908903 13183105 10627433 15401954 24060462 27821053 22497964
$$ packed form
3384a3742512O21362J9174631K2876234O052562q040387o007594l885556j4609838
3376B438902k2244188q925780J2515073J6669351L538669n356581j643666K203992
3368h04228k142140p369772o880054n122978n806447l419999N942321J4827322
3360a0775975J3417631K934180o221190o770532o39196N315974O255149K591510
3352F107551j737800l456814j893843K479398Q252995J0858575M917732p384066
3344A8143728j4545400q342769M399397R339556K571678o402673r617430r689582
3336a4143495j0585216p855695M006960J8691183K2008313R845845n034296q055697
3328H877902p0336N802143K299194l725798k555672M774521Q658508L760591n323089
$$ plain form
3319 22497964 11960646 3461677 1298384 3842741 5749410 4321209 3440791 8053470
3311 8053470 14621616 12449817 -2545010 -20327573 -27694775 -22952557 -14470461 -8295397
3303 -8295397 -4030923 -737863 735291 884728 226434 -4556194 -15819859 -26948281
3295 -26948281 -28111233 -20807126 -16526253 -18351960 -15419909 -1678502 11317304 10650003
3287 10650003 2553611 3987220 18292371 32047750 34550677 28450431 20946788 15942279
3279 15942279 16338601 22578053 25720866 13437395 -11498768 -28933410 -24944980 -9123819
3271 -9123819 139226 -284136 417790 7409862 14808687 18244115 20310305 21352630 15211481
3262 15211481 -1175625 -20710025 -33017919 -34298449 -28469577 -23177935 -25449596 -35116823
$$ packed form
3319B2497964j0537318q498969k163293K544357J906669j428201q80418M612679
3311H053470O568146k171799j4994827j7782563p367202M742218Q482096O175064
3303h295397M264474L293060J473154J49437o58294m782628j1263665j1128422
3295b6948281j162952P304107M280873j825707K932051J3741407J2995806o67301
3287A0650003q096392J433609J4305151J3755379K502927o100246p503643n004509
3279A5942279L96322O239452L142813j2283471k4936163j7434642L988430J5821161
3271i123819R263045m23362P01926O992072P398825L435428K066190J042325o141149
3262A5211481j6387106j9534400j2307894j280530N828872N291642k271661r667227
$$ plain form
3254 -35116823 -41333083 -32925502 -14301712 -2630518 -5846281 -13477298 -15330506 -17652676
3246 -17652676 -29001290 -39402127 -30746072 -5397503 12977293 10045858 -3028333
3239 -3028333 -9922919 -11342260 -16562721 -23624019 -21837812 -9906494 760234 870717
3231 870717 -7245751 -15400408 -17688941 -11988684 408455 14305618 23169726 23604730
3223 23604730 16033569 2789873 -11553892 -20459171 -20577425 -15357854 -9854797 -4579919
3215 -4579919 675139 707414 -9008911 -21282871 -21925804 -7712554 8823083 16168684
3207 16168684 17314004 20727273 25134425 22417582 12422080 4802614 4445210 2933051
3199 2933051 -10288168 -32013001 -46639823 -43871302 -30422013 -21093308 -21203769 -23126661
$$ packed form
3254c5116823o216260Q407581J8623790J1671194l215763p631017j853208k322170
3246a7652676j1348614j0400837Q656055K5348569J8374796k931435j3074191
3239c028333o894586j419341n220461p061298J786207J1931318J0666728J10483
3231H70717q116468q154657k288533N700257J2397139J3897163Q864108M35004
3223B3604730p571161j3243696j4343765q905279j18254N219571N503057N274878
3215d579919N255058L2275r716325j2273960o42933J4213250J6535637P345601
3207A6168684J145320L413269M407152k716843r995502p619466l57404j512159
3199B933051j3221219k1724833j4626822K768521J3449289R328705j10461j922892
$$ plain form
3191 -23126661 -19671098 -13761995 -11290144 -10917936 -8372744 -6918517 -13688197 -25527402
3183 -25527402 -28513151 -15637387 2685996 11532996 9483348 7267861 11939342 19655050
3175 19655050 23737145 23557759 23002167 23455739 21669692 14951425 6801864 4729207 11088250
3166 11088250 18666425 18788057 11884414 5192467 1430200 -3281019 -9723056 -11957990
3158 -11957990 -6744282 745635 5469137 9952067 16697179 19366580 10760085 -3351482
3150 -3351482 -8008385 2592883 17614685 22079046 12002046 -3865185 -13069936 -9196979
3142 -9196979 3966097 16806109 23769770 27719604 33005484 37789022 37137567 30405934
3134 30405934 20502146 8931071 -2454082 -7899315 -3687848 4023901 5420598 306622
$$ packed form
3191b3126661L455563N909103K471851L72208K545192J454227o769680j1839205
3183b5527402k985749J2875764J8323383Q847000k049648k215487M671481P715708
3175A9655050M082095j79386n55592M53572j786047o718267q149561k072657O359043
3166A1088250P578175J21632o903643o691947l762267m711219o442037k234934
3158a1957990N213708P489917M723502M482930O745112K669401q606495j4111567
3150c351482m656903J0601268J5021802M464361j0077000j5867231r204751L872957
3142i196979J3163076J2840012O963661L949834N285880M783538o51455o731633
3134C0405934r903788j1571075j1385153n445233M211467P711749J396697n113976
$$ plain form
3126 306622 -3206783 -2740593 -4430113 -10407378 -14229014 -12631885 -11838905 -16599572 -22097851
3117 -22097851 -23562856 -25158195 -30503052 -32137444 -22020485 -7924033 -6509644 -20396110
3109 -20396110 -33561285 -32085927 -20329169 -12581695 -15704731 -24780552 -31126196 -29726098
3101 -29726098 -21223250 -10444189 -2278500 2569178 6733958 10923898 12008775 7491145
3093 7491145 -172653 -5073909 -2807568 5826145 14407452 15010249 5635602 -6568885
3085 -6568885 -12419960 -10852162 -8709069 -10960250 -16015217 -21383774 -27781950 -34309252
3077 -34309252 -35205984 -27270368 -17197758 -14882481 -20449511 -24270814 -20147252 -12035406
3069 -12035406 -5782270 -886611 4655357 6484653 -1473155 -15896068 -25395997 -24571467
$$ packed form
3126C06622l513405M66190j689520n977265l821636J597129P92980m760667n498279
3117b2097851j465005j595339n344857j634392J0116959J4096452J414389j3886466
3109b0396110j3165175J475358J1756758P747474l123036r075821o345644J400098
3101b9726098Q502848J0779061Q165689M847678M164780M189940J084877m517630
3093G491145p663798m901256K266341Q633713Q581307O02797r374647j2204487
3085f568885n851075J567798K143093k251181n054967n368557o398176o527302
3077c4309252q96732P935616J0072610K315277n567030l821303M123562Q111846
3069a2035406O253136M895659N541968J829296p957808j4422913r499929Q24530
$$ plain form
3061 -24571467 -19799655 -17538789 -14061211 -4235093 4779446 528413 -13298918 -14886692
3053 -14886692 8852499 41926786 56280312 45002338 27144465 20280522 20962619 16837410
3045 16837410 6910956 186418 245211 1960377 2095951 3318478 5716631 2660335 -9512131
3036 -9512131 -22254483 -21913660 -6217467 10886107 13536329 1454053 -10125186 -8517513
3028 -8517513 2228191 8648078 5966953 1587901 697949 -1841440 -10130203 -16565863
3020 -16565863 -12061195 -1402484 3098063 687466 2072942 9874300 13228135 6661470
3012 6661470 1253510 8315607 22120962 29115285 26407668 20206988 12866101 4449091
3004 4449091 2354226 14379023 32969599 40786278 34049775 27119379 29863134 33146482
$$ packed form
3061b4571467M771812K260866L477578R826118R014539m251033j3827331j587774
3053a4886692K3739191L3074287J4353526j1277974j7857873o863943O82097m125209
3045A6837410r926454o724538N8793J715166J35574J222527K398153l056296j2172466
3036i512131j2742352L40823J5696193J7103574K650222j2082276j1579239J607673
3028h517513J0745704O419887k681125m379052q89952k539389q288763o435660
3020a6565863M504668J0658711M500547k410597J385476P801358L353835o566665
3012F661470n407960P062097J3805355O994323k707617o200680p340887q417010
3004D449091k094865J2024797J8590576P816679o736503o930396K743755L283348
$$ plain form
2996 33146482 23863714 4535810 -10422244 -11778876 -2302453 8231388 9727322 -1077791
2988 -1077791 -15657517 -21495081 -17959740 -16469116 -21165056 -20514074 -5859777 12663511
2980 12663511 20126198 17795806 16943566 19032183 17420371 13853082 16139609 20908640
2972 20908640 15879188 764052 -10296813 -10124485 -6607861 -5724938 -3382904 -384377
2964 -384377 -7523700 -24975645 -32926619 -17331057 7784169 19461852 16440626 13375590
2956 13375590 13547350 7703737 -4294091 -11534705 -11866253 -14604720 -21173859 -21151346 -11866509
2947 -11866509 -4397717 -3669629 382004 12921717 21839710 17416338 10262221 14769601
2939 14769601 25527690 26645205 17205087 10611627 12642298 16195897 16101476 14168703
$$ packed form
2996C3146482r282768j9327904j4958054j356632R476423J0533841J495934j0805113
2988a077791j4579726n837564L535341J490624m695940O50982J4654297J8523288
2980A2663511P462687k330392q52240K088617j611812l567289K286527M769031
2972B0908640n029452j5115136j1060865J72328L516624Q82923K342034K998527
2964c84377p139323j7451945p950974J5595562K5115226J1677683l021226l065036
2956A3375590J71760n843613j1997828p240614l31548k738467o569139K2513R284837
2947a1866509P468792P28088M051633J2539713Q917993m423372p154117M507380
2939A4769601J0758089J117515r440118o593460K030671L553599r4421j932773
$$ plain form
2931 14168703 10114796 2018539 -3994611 521556 9540671 7426305 -5700425 -10069649
2923 -10069649 5006652 24274437 29143236 23590388 24032984 33798350 42677459 44873597
2915 44873597 42419657 35408826 23570220 14565113 15959808 20556916 15021877 3245278
2907 3245278 4719715 26010732 49378576 56359433 48888635 38634732 28316515 15464893
2899 15464893 5163180 4956213 11190316 12672199 6846439 2550106 6410989 14306401
2891 14306401 17663524 13033678 4324614 -1633798 -2097413 -2226961 -9134505 -21086262
2883 -21086262 -27984721 -24815665 -17210173 -9348867 4342092 26764945 45463149 44734249
2875 44734249 26799013 9278547 3579553 6769028 12875346 19333318 21503708 13768234
$$ packed form
2931A4168703m053907q096257o013150M516167R019115k114366j3126730m369224
2923a0069649J5076301J9267785M868799n552848M42596R765366Q879109K196138
2915D4873597k453940p010831j1838606r005107J394695M597108n535039j1776599
2907C245278J474437K1291017K3367844O980857p470798j0253903j0318217j2851622
2899A5464893j0301713k06967O234103J481883n825760m296333L860883P895412
2891A4306401L357123m629846q709064n958412m63615j29548o907544j1951757
2883b1086262o898459L169056P605492P861306J3690959K2422853J8698204p28900
2875D4734249j7935236j7520466n698994L189475O106318O457972K170390p735474
$$ plain form
2867 13768234 -163557 -8748080 -8704207 -10098270 -20651444 -33766966 -37734079 -29587801
2859 -29587801 -14790443 -288492 6726275 249978 -17271122 -33529464 -37887265 -30869880
2851 -30869880 -18799272 -4888154 9144874 18418269 19176278 14836003 11690042 10510391
2843 10510391 7300547 622048 -6106278 -8406040 -3983324 6086456 17257390 24503718
2835 24503718 26398833 23810050 15910532 3519546 -4421581 2404483 19169906 26073095
2827 26073095 11771544 -10966694 -20330557 -9652673 10776824 28946992 38342350
2820 38342350 35099542 19586597 244568 -12597695 -16676867 -15869838 -11113884 -896722
2812 -896722 10956986 16298004 12256385 4481790 956289 6152720 18420756 28394884
$$ packed form
2867A3768234j3931791q584523M3873j394063j0553174j3115522l967113Q146278
2859b9587801J4797358J4501951P014767o476297j7521100j6258342m357801P017385
2851c0869880J2070608J3911118J4033028R273395P58009m340275l145961j179651
2843A0510391l209844o678499o728326k299762M422716J0069780J1170934P246328
2835B4503718J895115k588783p899518j2390986p941127O826064J6765423O903189
2827B6073095j4301551k2738238r363863J0677884K0429497J8170168R395358
2820C8342350l242808j5512945j9342029j2842263m079172Q07029M755954J0217162
2812h96722J1853708N341018m041619p774595l525501N196431J2268036R974128
$$ plain form
2804 28394884 24078958 4105293 -17591000 -27187841 -26990749 -28085602 -31762514 -29426573
2796 -29426573 -18990091 -9368069 -7376826 -10066925 -11998899 -11650360 -8926983 -4226501
2788 -4226501 -1521879 -5079274 -12250313 -16687211 -18225791 -20788331 -21203651 -11719178
2780 -11719178 4395580 12038194 4290353 -7270182 -9065821 -3689950 -3893586 -14773667
2772 -14773667 -29459683 -38314859 -36390464 -25288096 -12630798 -6678390 -7855868 -8779775
2764 -8779775 -4649616 1277178 4407882 4447557 1511434 -5683299 -13162272 -11230198 2418567
2755 2418567 15735298 16615554 9208762 7332866 15264591 24412447 27407844 25886234
2747 25886234 23269683 18454144 10395775 3156396 1664423 5117852 8318069 8349987
$$ packed form
2804B8394884m315926j9973665k1696293r596841J97092j094853l676912K335941
2796b9426573J0436482R622022J991243k690099j931974L48539K723377M700482
2788d226501K704622l557395p171039m436898j538580k562540m15320R484473
2780a1719178J6114758P642614p747841j1560535j795639N375871k03636j0880081
2772a4773667j4686016q855176J924395J1102368J2657298N952408j177478r23907
2764h779775M130159N926794L130704L9675k936123p194733p478973J932074J3648765
2755B418567J3316731Q80256p406792j875896P931725R147856K995397j521610
2747B5886234k616551m815539q058369p239379j491973L453429L200217L1918
$$ plain form
2739 8349987 6853806 5838361 4214975 33074 -5809272 -10664735 -13814820 -15601534
2731 -15601534 -13601672 -4991784 6240550 11016537 7455662 4581724 8313048 10976031
2723 10976031 3398164 -8337168 -9488641 2409915 14255324 14812082 5885969 -3998213
2715 -3998213 -8281335 -4808478 2293217 4147799 -1804676 -5701820 425630 7912418
2707 7912418 4434651 -4028125 -2275638 6536045 4410327 -9724734 -16045109 -7279143
2699 -7279143 -1501973 -10980390 -21555835 -17763544 -7834256 -6417948 -10105024 -8358817
2691 -8358817 -3256646 55164 7856968 23730814 34172515 28446394 18845347 19506158
2683 19506158 19507461 2721792 -18165117 -17439092 1473693 10807438 2524988 -3270697
$$ packed form
2739H349987j496181j015445j623386m181901n842346m855463l150085j786714
2731a5601534J999862Q609888J1232334M775987l560875k873938L731324K662983
2723A0976031p577867j1735332j151473J1898556J1845409N56758q926113r884182
2715c998213m283122L472857P101695J854582n952475l897144O127450P486788
2707G912418l477767q462776J752487Q811683k125718j4135061o320375Q765966
2699g279143N777170r478417j0575445L792291R929288J416308l687076J746207
2691h358817N102171L311810P801804J5873846J0441701n726121r601047O60811
2683A9506158J303j6785669k0886909P26025J8912785R333745q282450n795685
$$ plain form
2675 -3270697 4979171 15151766 17834037 20110269 25464431 24712251 15438101 8308885
2667 8308885 6688205 2047279 -3764591 3777587 22873342 29808605 15396853 2227927
2659 2227927 8921226 20318084 13871171 -4073593 -12048144 -8524205 -8296749 -13608195
2651 -13608195 -13299484 -5891347 -1291933 -849879 4743772 16293679 21250531 11559949
2643 11559949 -5493012 -17496808 -19666927 -15793504 -12800459 -14771929 -18120582 -14471857
2635 -14471857 -1725470 11778299 17589843 15940386 10571868 2604607 -5187366 -6730969
2627 -6730969 -2394582 -2020594 -10445134 -18532068 -17364687 -12497363 -13554591 -17711173
2619 -17711173 -15611523 -7606826 -1884073 -901566 -1041040 -1817146 -4595226 -5856587 -2352090
$$ packed form
2675c270697Q249868J0172595K682271K276232N354162p52180r274150p129216
2667H308885j620680m640926n811870P542178J9095755O935263j4411752j3168926
2659B227927O693299J1396858o446913j7944764p974551L523939K27456n311446
2651a3608195L08711P408137M599414M42054N593651J1549907M956852r690582
2643A1559949j7052961j2003796k170119L873423K993045j971470l348653L648725
2635a4471857J2746387J3503769N811544j649457n368518p967261p791973j543603
2627f730969M336387L73988q424540q086934J167381M867324j057228m156582
2619a7711173K099650Q004697N722753R82507j39474p76106k778080j261361L504497
$$ plain form
2610 -2352090 490458 -4297635 -12978394 -16277854 -13664284 -12053211 -12908113 -11116540
2602 -11116540 -5144755 1172895 5667847 8407194 7328555 1326791 -4715383 -5620739
2594 -5620739 -3665365 -3241657 -1702442 6265482 18590726 27863456 29958473 24402728
2586 24402728 11933110 -1357713 -4822653 3355441 11325395 10707558 8622654 11919605
2578 11919605 11372525 -3140763 -22469726 -31707374 -35173258 -46893938 -62174784 -61872561
2570 -61872561 -43389074 -24906456 -17545471 -14444960 -9966773 -8623953 -10067866 -5127742
2562 -5127742 6418988 12005252 7485401 5615768 15406357 28165166 32556972 30052209
2554 30052209 27013625 23393519 17285174 10527680 3525909 -5803653 -13460922 -10328140
$$ packed form
2610b352090K842548m788093q680759l299460K613570J611073q54902J791573
2602a1116540N971785O317650M494952K739347j078639o001764o042174r05356
2594e620739J955374M23708J539215P967924J2325244R272730K095017n555745
2586B4402728j2469618j3290823l464940Q178094P969954o17837k084904L296951
2578A1919605n47080j4513288j9328963r237648l465884j1720680j5280846L02223
2570f1872561J8483487J8482618P360985L100511M478187J342820j443913M940124
2562e127742J1546730N586264m519851j869633R790589J2758809M391806k504763
2554C0052209l038584l620106o108345o757494p001771r329562p657269L132782
$$ plain form
2546 -10328140 3932890 17808662 21566740 14381649 -1524591 -20640970 -28853223 -15110150
2538 -15110150 9509944 20817749 12252920 625000 -95329 7400370 17714262 30650720
2530 30650720 42190652 46611066 48590619 53427611 49555532 27870410 11909508 30560020
2522 30560020 64134685 67582845 50629024 68812578 112044696 78600349 -82786778
2515 -82786778 -266387737 -323627754 -246728663 -155302187 -122792881 -110441035 -75360677
2508 -75360677 -46516192 -57370201 -78414194 -67096823 -34711829 -16682535 -14408364
2501 -14408364 -10300792 -9070098 -20858398 -28330230 -12968173 4968340 -6153468 -36241408
2493 -36241408 -47903528 -34579607 -24902513 -32615207 -39595708 -31747405 -19457303 -15371565
$$ packed form
2546a0328140J4261030J3875772L758078p185091j5906240j9116379q212253J3743073
2538a5110150K4620094J1307805q564829j1627920p20329P495699J0313892J2936458
2530C0650720J1539932M420414J979553M836992l872079k1685122j5960902J8650512
2522C0560020L3574665L448160j6953821J8183554M3232118l3444347j61387127
2515h2786778j83600959n7240017P6899091R1426476L2509306J2351846L5080358
2508g5360677K8844485j0854009k1043993J1317371L2384994J8029294K274171
2501a4408364M107572J230694j1788300p471832J5362057J7936513j1121808l0087940
2493c6241408j1662120J3323921R677094p712694o980501P848303J2290102M085738
$$ plain form
2485 -15371565 -17576548 -21718538 -28309321 -32591544 -26998986 -18428916 -23911218 -44148557
2477 -44148557 -59880198 -59796824 -53309834 -48818928 -38554244 -16028559 7446952 17097783
2469 17097783 14493783 10759329 8568180 2769654 -6886559 -14499694 -16497568 -13598256
2461 -13598256 -7209017 46833 3699465 3054725 3931675 10333848 17107955 16764498 10109802
2452 10109802 3479310 -1770612 -9132167 -17212076 -18858386 -12702661 -8278595 -13864785
2444 -13864785 -23557639 -24099985 -14019638 -7707206 -16597557 -33189717 -41403273 -38557331
2436 -38557331 -36347413 -40265151 -40675656 -29702502 -15711405 -11218210 -14322685 -13882081
2428 -13882081 -7952901 -4109329 -4232397 -3336424 -3632462 -14127362 -31713963 -37633432
$$ packed form
2485a5371565k204983m141990o590783m282223N592558Q570070n482302k0237339
2477d4148557j5731641Q3374O486990M490906J0264684K2525685K3475511R650831
2469A7097783k604000l734454k191149n798526r656213p613135j997874K899312
2461a3598256O389239P255850L652632o44740Q76950O402173O774107l43457o654696
2452A0109802o630492n249922p361555q079909j646310O155725M424066n586190
2444a3864785r692854n42346J0080347O312432q890351j6592160q213556K845942
2436c8557331K209918l917738m10505J0973154J3991097M493195l104475M40604
2428a3882081N929180L843572j23068Q95973k96038j0494900j7586601n919469
$$ plain form
2420 -37633432 -21801616 1134400 10926326 7296401 3731693 3680139 -802475 -9704779
2412 -9704779 -12010492 -5077927 -1576804 -9886845 -20195541 -20127265 -14386039 -16103112
2404 -16103112 -24632844 -26647730 -18477042 -12787943 -18460351 -25487796 -18191479 3503058
2396 3503058 24458097 32097161 26373741 14984794 6559694 7297450 16180235 22643879
2388 22643879 16353549 1448555 -5774042 3082197 17032263 19736812 10224439 2182051
2380 2182051 4453111 10698258 10974725 6830904 8455858 18912477 28255793 25988710
2372 25988710 14733909 6412386 6500685 7937157 1658473 -12173446 -25989091 -32872437
2364 -32872437 -29171824 -14389881 5225768 16554409 10832603 -5891698 -20076307
$$ packed form
2420c7633432J5831816K2936016R791926l629925l564708n1554m482614q902304
2412i704779k305713O932565L501123q310041j0308696O8276N741226j717073
2404a6103112q529732k014886Q170688N689099n672408p027445P296317K1694537
2396C503058K0955039P639064n723420j1388947q425100P37756Q882785O463644
2388B2643879o290330j4904994p222597Q856239J3950066K704549r512373q042388
2380B182051K271060O245147K76467m143821J624954J0456619R343316k267083
2372B5988710j1254801q321523Q8299J436472o278684j3831919j3815645o883346
2364c2872437L700613J4781943J9615649J1328641n721806j6724301j4184609
$$ plain form
2357 -20076307 -27013981 -31843037 -35010806 -27699466 -6123022 18308453 29976723 25367892
2349 25367892 13160091 2813516 -1195047 1928422 9045322 12844748 7823067 -3060247
2341 -3060247 -11038689 -10570316 -3707731 2864668 2890878 -5204837 -16386568 -22924802 -22190740
2332 -22190740 -18596887 -16720001 -16071054 -14555152 -12782331 -11729063 -9779533 -5482153
2324 -5482153 -289968 3760962 5432434 2011395 -8257325 -18966875 -18647961 -6043827
2316 -6043827 5564942 5667971 -309450 -3418035 -7021067 -17283532 -25737089 -18714464
2308 -18714464 -1238699 7105414 1611185 -1094480 8029975 13641965 413534 -20051343
2300 -20051343 -23367201 -6265539 10090195 9098168 -3106073 -10646111 -7987690 -2199876
$$ packed form
2357b0076307o937674m829056l167769P311340K1576444K4431475J1668270m608831
2349B5367892j2207801j0346575m008563L123469P116900L799426n021681j0883314
2341c060247p978442M68373O862585O572399K6210q095715j1181731o538234P34062
2332b2190740L593853J876886O48947J515902J772821J053268J949530M297380
2324e482153N192185M050930J671472l421039j0268720j0709550L18914J2604134
2316f043827J1608769J03029n977421l108585l603032j0262465q453557P022625
2308a8714464J7475765Q344113n494229k705665R124455N611990j3228431k0464877
2300b0051343l315858J7101662J6355734r92027j2204241p540038K658421N787814
$$ plain form
2292 -2199876 -1813354 -7908010 -12961807 -6826897 12230118 31257166 32702797 14114509
2284 14114509 -6515990 -9624525 4695779 19492856 22369498 16291979 8755725 255668
2276 255668 -10009436 -14755374 -6177415 9410453 16053678 8693312 -1385418 -4731836
2268 -4731836 -6120323 -12516493 -19282974 -18190325 -11593303 -7963358 -8692618 -9604093 -10501655
2259 -10501655 -12220162 -9010650 3502219 16298046 16603371 7495392 3578221 8297820
2251 8297820 11436511 9865888 13279568 25038234 34251562 33847161 31113960 32332563
2243 32332563 32061823 27279756 27208662 36869875 44069800 36559792 21092356 11373042
2235 11373042 7277932 924590 -6192097 -8770132 -12574046 -25883773 -41317102 -43864239
$$ packed form
2292b199876L86522o094656n053797O134910J9057015J9027048J445631j8588288
2284A4114509k0630499l108535J4320304J4797077K876642o077519p536254q500057
2276B55668j0265104m745938Q577959J5587868O643225p360366j0078730l346418
2268d731836j388487o396170o766481J092649O597022L629945p29260r11475q97562
2259a0501655j718507L209512J2512869J2795827L05325r107979l917171M719599
2251H297820L138691j570623L413680J1758666R213328m04401k733201J218603
2243C2332563k70740m782067p1094R661213P199925p510008j5467436r719314
2235A1373042m095110o353342p116687k578035l803914j3309727j5433329k547137
$$ plain form
2227 -43864239 -33622127 -23460666 -16912067 -6140955 9344200 19828425 21742431
2220 21742431 20314320 15804576 4483925 -6246992 -3052335 10208334 14112033 3035453
2212 3035453 -6914453 -5325671 -1608270 -2496574 2712458 20383920 35512636 33718804
2204 33718804 24167370 22448553 25211204 21571597 16296467 18758634 19388420 2915628
2196 2915628 -20694531 -25334080 -8254434 5098669 -827136 -12805108 -14943536 -11425430
2188 -11425430 -12299680 -15106111 -13941193 -12984555 -17786679 -23206396 -21678769 -15514163
2180 -15514163 -11321396 -9693409 -8649550 -9181861 -9365290 -1837219 14023931 26247140
2172 26247140 25992111 20181330 18394584 17084411 9385819 883201 -462563 -2647549
$$ packed form
2227d3864239J0242112J0161461O548599J0771112J5485155J0484225J914006
2220B1742431j428111m509744j1320651j0730917L194657J3260669L903699j1076580
2212C035453r949906J588782L717401q88304N209032J7671462J5128716j793832
2204C3718804r551434j718817K762651l639607n275130K462167O29786j6472792
2196B915628k3610159m639549J7079646J3353103n925805j1977972k138428L518106
2188a1425430q74250k806431J164918R56638m802124n419717J527627O164606
2180a5514163M192767J627987J043859n32311j83429P528071J5861150J2223209
2172B6247140k55029n810781j786746j310173p698592q502618j345764k184986
$$ plain form
2164 -2647549 -18862207 -41618364 -47666245 -30533078 -9898936 -3772975 -7870055 -9859416
2156 -9859416 -9102502 -11665192 -16607120 -18709000 -18481830 -20209296 -24444477 -29050328 -32797580
2147 -32797580 -32519374 -23013602 -6082278 6777942 7949532 4055888 5211745 10065025
2139 10065025 10643218 6720650 4495227 4230944 813703 -4212151 -2596159 6811721
2131 6811721 13911559 10328244 -816460 -11078030 -16286132 -17226791 -16479286 -17222769
2123 -17222769 -20123992 -19532436 -8575831 9494380 21213087 18115842 7087017 1092112
2115 1092112 3339110 5142935 -2738317 -20004890 -36147541 -37979125 -21239415 2362001
2107 2362001 12808080 413632 -24129140 -40076823 -35411770 -15074457 5282450
$$ packed form
2164b647549j6214658k2756157o047881J7133167K0634142O125961m097080j989361
2156i859416P56914k562690m941928k101880K27170j727466m235181m605851l747252
2147c2797580K78206R505772J6931324J2860220J171590l893644J155857M853280
2139A0065025N78193l922568k225423k64283l417241n025854J615992R407880
2131F811721P099838l583315j1144704j0261570n208102r40659P47505p43483
2123a7222769k901223N91556J0956605J8070211J1718707l097245j1028825n994905
2115A092112K246998J803825p881252j7266573j6142651j831584J6739710K3601416
2107B362001J0446079j2394448k4542772j5947683M665053K0337313K0356907
$$ plain form
2100 5282450 11603796 1862261 -12003453 -15056409 -4775183 7375848 11187464 9002681
2092 9002681 8264222 9285617 7472330 3297561 1488440 2081338 521928 -3817224 -7153265
2083 -7153265 -9343469 -13677951 -17096391 -10210864 8260190 25348879 28796102 21822151
2075 21822151 15572874 12548957 7272470 -37026 -2329145 977456 967511 -6210199 -11566439
2066 -11566439 -6940166 1465486 2292674 -3733261 -6484565 -3600483 -3123413 -8370670
2058 -8370670 -12138065 -10110444 -9183381 -15288991 -21857447 -19891035 -13146312 -12120088
2050 -12120088 -16119512 -13192872 1344612 16603099 19699411 10178655 -3012933 -13319467
2042 -13319467 -20882407 -28091172 -34476047 -35864508 -28675461 -15792743 -5538292 -2218994
$$ packed form
2100E282450O321346r741535j3865714l052956J0281226J2151031L811616k184783
2092I002681p38459J021395j813287m174769j809121N92898j559410m339152l336041
2083g153265k190204m334482l418440O885527J8471054J7088689L447223o973951
2075B1822151o249277l023917n276487p309496k292119L306601r945p177710n356240
2066a1566439M626273Q405652Q27188o025935k751304K884082M77070n247257
2058h370670l767395K027621R27063o105610o568456J966412O744723J026224
2050a2120088l999424K926640J4537484J5258487L096312r520756j3191588j0306534
2042a3319467p562940p208765o384875j388461P189047J2882718J0254451L319298
$$ plain form
2034 -2218994 -1493822 795401 675466 -5926948 -12937195 -12603070 -9862039 -14597724 -21784262
2025 -21784262 -16028818 2312432 13439147 6665349 -4428325 -4672890 1218800 2325380
2017 2325380 1426452 5053583 6120663 -4399156 -16918470 -14664859 -1375642 2108765
2009 2108765 -12124369 -30240849 -37831930 -32802787 -16662718 8775840 32542014 39574244
2001 39574244 30404353 21272057 20021599 17543893 8892440 5286957 14593922 25191316
1993 25191316 22901117 12571831 8649652 12891142 15891377 14879219 15508543 18385328
1985 18385328 16611222 7122481 -4751675 -12281938 -11967304 -2496654 13528927 27278872
1977 27278872 29735038 20840888 8779779 1101278 -88693 3431369 7820938 8983778
$$ packed form
2034b218994P25172K289223j19935o602414p010247L34125K741031m735685p186538
2025b1784262N755444J8341250J1126715o773798j1093674k44565N891690J106580
2017B325380q98928L627131J067080j0519819j2519314K253611J3289217L484407
2009B108765j4233134j8116480p591081N029143J6140069K5438558K3766174P032230
2001C9574244r169891r132296j250458k477706q651453l605483R306965J0597394
1993B5191316k290199j0329286l922179M241490L000235j012158O29324K876785
1985A8385328j774106r488741j1874156p530263L14634R470650J6025581J3749945
1977B7278872K456166q894150j2061109p678501j189971L520062M389569J162840
$$ plain form
1969 8983778 6399605 4082308 5473630 9260278 11348039 7888448 -3514714 -19993539
1961 -19993539 -30838585 -27114646 -15554515 -12841012 -22442112 -28581781 -19513051 -4683289
1953 -4683289 807737 -2306709 -3458988 -57069 4158379 9932355 16554036 12979438
1945 12979438 -7014469 -26088366 -20335862 5954437 23428935 18241330 8471283 12824665
1937 12824665 22948968 20095536 4788271 -5713092 -1485303 12134758 25957291
1930 25957291 34701561 35967930 31133300 26526755 27063429 29877447 29209001 25085238
1922 25085238 21742265 19698503 15294136 7535117 660244 -826245 2597695 5460068
1914 5460068 2228374 -6634927 -14261852 -15383043 -12940084 -12272132 -11033031 -2728280
$$ packed form
1969H983778k584173k317297J391322L786648K087761l459591j1403162j6478825
1961a9993539j0845046L723939J1560131K713503r601100o139669R068730J4829762
1953d683289N491026l114446j152279L401919M215448N773976O621681l574598
1945A2979438j9993907j9073897N752504K6290299J7474498n187605r770047M353382
1937A2824665J0124303k853432j5307265j0501363M227789J3620061J3822533
1930B5957291Q744270J266369m834630m606545N36674K814018o68446m123763
1922B5085238l342973k043762m404367p759019o874873j486489L423940K862373
1914E460068l231694q863301p626925j121191K442959O67952J239101Q304751
$$ plain form
1906 -2728280 9809252 14133919 4823366 -8081120 -12373192 -8343374 -4647455 -6111267
1898 -6111267 -11908684 -19902912 -25638166 -22026746 -7997997 6003862 8947954 3096235
1890 3096235 -796389 -202159 -3773064 -16531864 -29967808 -30993221 -17042002 1143401
1882 1143401 10579291 8125682 1613032 -301897 2330095 3116865 -1009466 -7470080
1874 -7470080 -14816834 -24819870 -35537903 -39413832 -32959933 -22637712 -15807359 -11109414
1866 -11109414 -4133991 2048784 -94492 -11224481 -23784331 -30847440 -30585567 -23479136
1858 -23479136 -11289876 1422241 9702226 12252442 10389712 5197261 -1118380 -4709882
1850 -4709882 -5302803 -7767926 -13396930 -15031877 -8277157 -1989649 -7017192 -17942069
$$ packed form
1906b728280J2537532M324667r310553j2904486m292072M029818L695919j463812
1898f111267n797417p994228n735254L611420J4028749J4001859K944092n851719
1890C096235l892624N94230l570905j2758800j3435944j025413J3951219J8185403
1882A143401R435890k453609o512650j914929K631992P86770m126331o460614
1874g470080p346754j0003036j0718033l875929O453899J0322221O830353M697945
1866a1109414O975423O182775k143276j1129989j2559850p063109K61873P106431
1858b3479136J2189260J2712117Q279985K550216j862730n192451o315641l591502
1850d709882n92921k465123n629004j634947O754720O287508n027543j0924877
$$ plain form
1842 -17942069 -18737806 -6584864 3086350 -671725 -7668409 180453 25354744 50821773
1834 50821773 56579789 37014572 5114320 -18386315 -22606051 -13750496 -3362364 5791243
1826 5791243 15874179 22438449 19595339 14283503 19717758 32853578 35001737 20390232
1818 20390232 7078731 9784538 18203290 16310876 8761155 9785813 16419835 14013173
1810 14013173 2987817 -1504453 4624061 9835470 9654609 12795446 19622138 15657220
1802 15657220 -3361499 -18535498 -13672910 742492 4961541 -708259 -1689007 4097054
1794 4097054 4677116 -3675132 -10796286 -10468179 -8381853 -9170985 -9061256 -6106286 -5933964
1785 -5933964 -11130594 -14427793 -9361238 -669197 2351162 -2589829 -11365035 -20424456
$$ packed form
1842a7942069p95737J2152942R671214l758075o996684P848862K5174291K5467029
1834E0821773N758016j9565217l1900252k3500635m219736Q855555J0388132R153607
1826E791243J0082936O564270k843110n311836N434255J3135820K148159j4611505
1818B0390232j3311501K705807Q418752j892414p549721J024658O634022k406662
1810A4013173j1025356m492270O128514N211409j80861L140837O826692l964918
1802A5657220j9018719j5173999M862588J4415402M219049n669800r80748N786061
1794D097054N80062q352248p121154L28107K086326p89132J09729K954970J72322
1785e933964n196630l297199N066555Q692041L020359m940991q775206r059421
$$ plain form
1777 -20424456 -27185697 -27324216 -18294478 -4769094 3875361 2417153 -4668589 -6434436
1769 -6434436 3984804 19761507 24513003 11016446 -7696098 -13561031 -6558815 -1791718
1761 -1791718 -5228734 -6553820 1592725 12620412 20462877 30039477 43350003 48566049
1753 48566049 36050217 14976156 395423 -7527916 -17222424 -26729526 -27087401 -19262988
1745 -19262988 -11733050 -5023371 5761017 16346294 17249857 9796242 2268684 -6809458
1737 -6809458 -23604135 -39540364 -37620911 -19171857 -3680685 576070 4247712 11142191
1729 11142191 8623820 -7004755 -18156355 -12183129 -369708 3768398 6863541 19363168
1721 19363168 32540424 31117746 17978153 8310454 7044073 7661818 6403405 3923381
$$ packed form
1777b0424456o761241j38519R029738J3525384Q644455j458208p085742j765847
1769f434436J0419240J5776703M751496j3496557j8712544n864933P002216M767097
1761a791718l437016j325086Q146545J1027687P842465R576600J3310526N216046
1753D8566049j2515832k1074061j4580733p923339r694508r507102l57875P824413
1745a9262988P529938O709679J0784388J0585277R03563p453615p527558r078142
1737f809458j6794677j5936229J919453J8449054J5491172M256755L671642O894479
1729A1142191k518371j5628575j1151600N973226J1813421M138106L095143J2499627
1721A9363168J3177256j422678j3139593r667699j266381O17745j258413k480024
$$ plain form
1713 3923381 -373202 -4028832 230943 11293797 14856768 3214119 -10900255 -11493082
1705 -11493082 1487851 20429607 41855521 57273169 50604778 21845760 -4084219
1698 -4084219 -9967739 -8826577 -15191909 -18009498 -7395918 -2168140 -17239236 -28241748
1690 -28241748 -8533943 21712286 29379312 27404988 42941150 49256636 4855118 -50200680
1682 -50200680 -32163235 34800041 6844699 -184008216 -405424086 -474017736 -372583116
1675 -372583116 -234993907 -156094170 -113619331 -66203863 -29043071 -26001624 -37677128
1668 -37677128 -35116191 -22420205 -16093734 -13692119 -6859345 -115236 2729715 9569971
1660 9569971 22384882 28344314 20883359 11096706 8134360 7006861 4889007 10096506
$$ packed form
1713C923381m296583l655630M259775J1062854L562971j1642649j4114374n92827
1705a1493082J2980933J8941756K1425914J5417648o668391k8759018k5929979
1698d084219n883520J141162o365332k817589J0613580N227778j5071096j1002512
1690b8241748J9707805L0246229P667026j974324J5536162O315486m4401518n5055798
1682e0200680J8037445O6963276k7955342j90852915k21415870o8593650J01434620
1675c72583116J37589209P8899737M2474839M7415468L7160792L041447j1675504
1668c7677128K560937J2695986O326471K401615O832774O744109K844951O840256
1660I569971J2814911N959432p460955r786653k962346j127499k117854N207499
$$ plain form
1652 10096506 24625319 35306723 32164453 20410373 7496275 -5416701 -13610037
1645 -13610037 -8755872 4714714 11185346 7775894 7730917 14435460 14104913 2770036
1637 2770036 -2729306 6937846 15954980 9541353 -1762413 -1233781 7058131 8594465
1629 8594465 2636451 -1494195 -2142558 -3449700 -4242689 -2524294 -3161267 -9312062 -14236966
1620 -14236966 -11674209 -5460661 -400306 5385867 10777690 7704741 -3620277 -9909983
1612 -9909983 -5560494 -2409245 -7340937 -8340686 2222591 9363977 -268127 -13363173
1604 -13363173 -11563047 -2706740 -5185623 -13624962 -8190955 9562461 18146677 9863379
1596 9863379 -2742440 -11830118 -20214935 -22976115 -8792260 17073490 33370464 30378154
$$ packed form
1652A0096506J4528813J0681404l142270j1754080j2914098j2912976q193336
1645a3610037M854165J3470586O470632l409452m4977O704543l30547j1334877
1637B770036n499342R667152R017134o413627j1303766N28632Q291912J536334
1629H594465n958014m130646o48363j307142p92989J718395o36973o150795m924904
1620a4236966K562757O213548N060355N786173N391823l072949j1325018o289706
1612i909983M349489L151249m931692r99749J0563277P141386r632104j3095046
1604a3363173J800126Q856307k478883q439339N434007J7753416Q584216q283298
1596I863379j2605819r087678q384817k761180J4183855K5865750J6296974k992310
$$ plain form
1588 30378154 18049113 5823589 -5438162 -10995849 -4309981 5722553 2098507 -11854698
1580 -11854698 -14013093 1748601 15879960 15009403 9028852 6641595 -1468437 -20925981
1572 -20925981 -37274078 -38190642 -33478341 -35472979 -36455393 -24680411 -8535707 -4195092
1564 -4195092 -9863343 -12351330 -11007376 -15053224 -22521624 -21439963 -10102413 894853
1556 894853 6486015 11905502 18914380 21057893 15678273 10130922 12186410 20755096
1548 20755096 28544786 30058232 26393523 23705334 24816459 22753864 9444140 -8648309
1540 -8648309 -14851420 -6590750 -2359535 -15786463 -35044191 -39812573 -28260166 -14133197
1532 -14133197 -6578774 -7147825 -17575207 -33608447 -38319068 -20239273 6155378 16484889
$$ packed form
1588C0378154j2329041j2225524j1261751n557687O685868J0032534l624046j3953205
1580a1854698k158395J5761694J4131359q70557n980551k387257q110032j9457544
1572b0925981j6348097r16564M712301j994638r82414J1774982J6144704M340615
1564d195092n668251k487987J343954m045848p468400J081661J1337550J0997266
1556H94853N591162N419487P008878K143513n379620n547351K055488Q568686
1548B0755096P789690J513446l664709k688189J111125k062595j3309724j8092449
1540h648309o203111Q260670M231215j3426928j9257728m768382J1552407J4126969
1532a4133197P554423n69051j0427382j6033240m710621J8079795K6394651J0329511
$$ plain form
1524 16484889 9507340 4519931 8199600 7210639 -3144425 -6546733 8221993 27594207
1516 27594207 32186151 21772403 9410590 1875305 -1980766 -1867723 3174418 9704932
1508 9704932 14169246 17573886 19811891 15941661 4828679 -5264691 -6943710 -3356029
1500 -3356029 -887092 945563 4805015 7789586 7213780 7986050 14691702 21630407 20892254
1491 20892254 15851633 15564453 18850935 15697662 3470814 -9499785 -16815849 -19948159
1483 -19948159 -20397076 -16634475 -11094323 -9682983 -10770305 -5079963 8263356 15939577
1475 15939577 8622039 -3711755 -4800287 5704344 14506008 15565611 15924740 20208024
1467 20208024 21653109 13234006 -1333645 -13253009 -18339765 -15910688 -5370887 8979400
$$ packed form
1524A6484889o977549m987409L679669r88961j0355064l402308J4768726J9372214
1516B7594207M591944j0413748j2361813p535285l856071J13043N042141O530514
1508I704932M464314L404640K238005l870230j1112982j0093370j679019L587681
1500c356029K468937J832655L859452K984571n75806P72270O705652O938705p38153
1491B0892254n040621k87180L286482l153273j2226848j2970599p316064l132310
1483a9948159m48917L762601N540152J411340j087322N690342J3343319P676221
1475A5939577p317538j2333794j088532J0504631Q801664J059603L59129M283284
1467B0208024J445085q419103j4567651j1919364n086756K429077J0539801J4350287
$$ plain form
1459 8979400 16150040 10448231 786795 -1256753 1817436 262353 -3117835 3847958
1451 3847958 18687330 21926264 6536333 -7492903 -1771135 11250478 6466642 -14856528
1443 -14856528 -26036183 -13877766 4055419 5770969 -8660322 -24379771 -31686533
1436 -31686533 -30066673 -23331188 -19472893 -26318038 -39352313 -42622818 -29639214 -14017967
1428 -14017967 -10081351 -12539218 -7561616 4050353 9556665 5638074 1862657 3945941
1420 3945941 7695218 10510329 15490046 21193268 19688964 9744572 1697044 3609007
1412 3609007 11208589 17074063 21418004 26983670 30512201 27535936 20952837 16914671
1404 16914671 15242041 11372376 5932051 4799697 9248520 12184339 6375025 -6844885
$$ packed form
1459H979400P170640n701809r661436k043548L074189j555083l380188O965793
1451C847958J4839372L238934j5389931j4029236N721768J3021613m783836k1323170
1443a4856528j1179655J2158417J7933185J715550j4431291j5719449p306762
1436c1686533J619860O735485L858295o845145j3034275l270505J2983604J5621247
1428a4017967L936616k457867M977602J1611969N506312l918591l775417K083284
1420C945941L749277K815111M979717N703222j504304r944392q047528J911963
1412C609007P599582N865474M343941N565666L528531k976265o583099m038166
1404A6914671j672630l869665n440325j132354M448823K935819n809314j3219910
$$ plain form
1396 -6844885 -18569996 -20289763 -10741976 3300521 12890462 14687205 12463278 10340504
1388 10340504 6948083 -842147 -9919827 -11384290 -975826 13601201 19106700 10539279
1380 10539279 -4040737 -13365141 -14679962 -12605164 -9054215 -913765 11359944 20204685
1372 20204685 20367093 15697921 10624217 1104838 -16793608 -33905478 -35693472 -22416977
1364 -22416977 -9862731 -8715059 -14949280 -22735484 -32678886 -41299297 -37115645 -18484698
1356 -18484698 -3642385 -8854157 -24556615 -28046451 -14344131 876413 5227552 8507
1348 8507 -11430300 -27360750 -37586884 -28478192 -5381279 6036962 -9025443 -34833346
1340 -34833346 -47300189 -43728706 -37171280 -31571378 -20047859 -3805257 4553694 -1544030
$$ packed form
1396f844885j1725111j719767R547787J4042497R589941J796743k223927k122774
1388A0340504l392421p790230r077680j464463J0408464J4577027N505499q567421
1380A0539279j4580016r324404j314821K074798L550949Q140450J2273709Q844741
1372B0204685J62408m669172n073704r519379j7898446j7111870j787994J3276495
1364b2416977J2554246J147672o234221p786204r943402q620411M183652J8630947
1356a8484698J4842313n211772j5702458l489836J3702320J5220544M351139n219045
1348H507j1438807j5930450j0226134R108692K3096913J1418241j5062405k5807903
1340c4833346j2466843L571483O557426N599902J1523519J6242602Q358951o097724
$$ plain form
1332 -1544030 -14564042 -24777732 -29763986 -29351096 -21359320 -7476759 4133962 7693515
1324 7693515 6759555 8607264 15674276 25197819 32919439 34664665 29111844 21900556
1316 21900556 21701638 28125969 28716681 13891679 -8711504 -21760075 -18630926 -9153525
1308 -9153525 -4253110 -2074648 6159259 20786111 30778020 26871212 13283575 3496057
1300 3496057 6045701 17305366 27607589 30757973 26128379 15149443 201697 -13641949
1292 -13641949 -20172137 -17532958 -10579143 -6216447 -6986716 -10007906 -11600799 -11775631
1284 -11775631 -13282405 -16220784 -15552544 -6727561 6857415 16329313 18454264 19088232
1276 19088232 22138238 20940294 8001953 -10032905 -16945506 -7483654 5343866 7027486
$$ packed form
1332a544030j3020012j0213690m986254M12890P991776J3882561J1610721L559553
1324G693515r33960J847709P067012R523543P721620J745226n552821p211288
1316B1900556j98918O424331N90712j4825002k2603183j3048571L129149R477401
1308i153525M900415K178462Q233907J4626852R991909l906808j3587637r787518
1300C496057K549644J1259665J0302223L150384m629594j0978936j4947746j3843646
1292a3641949o530188K639179O953815M362696p70269l021190j592893j74832
1284a1775631j506774k938379O68240Q824983J3584976R471898K124951O33968
1276A9088232L050006j197944j2938341j8034858o912601R461852J2827520J683620
$$ plain form
1268 7027486 -1444925 -8364172 -7732198 -4662433 -6859000 -16133581 -27693050 -33969432
1260 -33969432 -29336838 -14011892 5697818 21192887 25513702 15824290 -3702915 -21557537
1252 -21557537 -26587568 -18001726 -4397437 6944339 14148270 14667848 5031288 -9327024
1244 -9327024 -13920761 -2642473 12467109 17703014 16443761 20217782 27678150 27435824
1236 27435824 19078187 14716053 17799876 16859568 6420052 -986693 5832284 16999355
1228 16999355 14593571 -1060536 -11541088 -4727133 12165474 23979241 22727797 10327794
1220 10327794 -5380423 -14654907 -12223482 -3038746 1999508 -2143013 -10495703 -16470901
1212 -16470901 -19566138 -22322039 -24036604 -21957368 -16970993 -13787658 -14865639 -17017742
$$ packed form
1268G027486q472411o919247O31974L069765k196567r274581j1559469o276382
1260c3969432M632594J5324946J9709710J5495069M320815r689412j9527205j7854622
1252b1557537n030031Q585842J3604289J1341776P203931N19578r636560j4358312
1244i327024m593737J1278288J5109582N235905j259253L774021P460368k42326
1236B7435824q357637m362134L083823r40308j0439516p406745O818977J1167071
1228A6999355k405784j5654107j0480552O813955J6892607J1813767j251444j2400003
1220A0327794j5708217r274484K431425R184736N038254m142521q352690n975198
1212a6470901l095237k755901j714565K079236M986375L183335j077981k152103
$$ plain form
1204 -17017742 -15871827 -12288727 -11523798 -15369301 -18269065 -14530361 -7446211 -5859314
1196 -5859314 -11403841 -15731588 -13371735 -10231778 -12511612 -12831884 1524188 26876038
1188 26876038 41022179 27969946 -2642602 -26871002 -31758017 -22783315 -10937311
1181 -10937311 -1900081 2481790 1422403 -2123905 -1766851 4744725 11425109 11147522
1173 11147522 4211160 -3478002 -7918290 -8528793 -4682837 3662264 12582768 17001160
1165 17001160 17344250 18262577 20113462 17704164 9295519 337946 -5134625 -10210200
1157 -10210200 -17154868 -20389357 -14847909 -5939086 -1912643 -341756 6660077 16015646
1149 16015646 15945718 5980917 299612 5310092 7525941 -5853039 -24958611 -29533328
$$ packed form
1204a7017742J145915L583100P64929l845503k899764L738704P084150J586897
1196e859314n544527m327747K359853L139957k279834l20272J4356072K5351850
1188B6876038J4146141j3052233l0612548k4228400m887015Q974702J1846004
1181a0937311R037230M381871j059387l546308L57054O511576O680384k77587
1173A1147522o936362p689162m440288o10503L845956Q345101Q920504M418392
1165A7001160L43090R18327J850885k409298q408645q957573n472571n075575
1157a0210200o944668l234489N541448Q908823M026443J570887P001833R355569
1149A6015646o9928r964801n681305N010480K215849j3378980j9105572m574717
$$ plain form
1141 -29533328 -16975645 -3373978 1310249 3945449 11570135 17872302 14072052 4482643
1133 4482643 1728709 9748398 19106132 18841985 8047922 -4722098 -10258653 -6281435
1125 -6281435 1367167 3785573 -3753812 -18013905 -30188426 -32318306 -22862908 -7161515
1117 -7161515 7533959 17119173 20300936 15802172 4521129 -5956096 -5901831 4053901
1109 4053901 10888079 5021517 -6714217 -10566969 -4052306 3483134 5067386 880954
1101 880954 -9148806 -24978795 -37076448 -31056421 -8411667 8803779 4078118 -11071342
1093 -11071342 -12787004 2102210 12822118 4234019 -14291485 -24959261 -25537507 -27380309
1085 -27380309 -34724961 -37436920 -26374975 -7987066 2404098 -824086 -7665042 -5930195
$$ packed form
1141b9533328J2557683J3601667M684227K635200P624686O302167l800250r589409
1133D482643k753934Q019689R357734k64147j0794063j2770020n536555L977218
1125f281435P648602K418406p539385j4260093j2174521k129880R455398J5701393
1117g161515J4695474R585214L181763m498764j1281043j0477225N4265R955732
1109D053901O834178n866562j1735734l852752O514663P535440J584252m186432
1101H80954j0029760j5829989j2097653O020027K2644754J7215446m725661j5149460
1093a1071342j715662J4889214J0719908q588099j8525504j0667776n78246j842802
1085b7380309p344652k711959J1061945J8387909J0391164l228184o840956J734847
$$ plain form
1077 -5930195 4200922 12416336 12026496 6323360 1422418 -1775517 -5420200 -7886966
1069 -7886966 -4135423 6372690 15489067 13521922 942402 -10038692 -8749108 556772
1061 556772 3676024 -4819493 -15076951 -18012454 -19446623 -28769891 -39359890 -34361875
1053 -34361875 -12132772 8231196 11435732 3526095 -2329342 -5662640 -13038438 -21517896
1045 -21517896 -22136406 -16095399 -13526340 -16171635 -13693321 228905 18117345 28396500
1037 28396500 27008266 16777372 3291927 -5239307 -2134226 8630493 13800830 6582729
1029 6582729 -4533189 -7961671 -4433231 -3323021 -7776185 -11906413 -11805340 -11533892
1021 -11533892 -16170932 -23913877 -27751921 -22699216 -10090351 3654834 12026405 13641517
$$ packed form
1077e930195J0131117Q215414l89840n703136m900942l197935l644683k466766
1069g886966L751543J0508113R116377j967145j2579520j0981094J289584R305880
1061E56772L119252q495517j0257458k935503j434169r323268j0589999M998015
1053c4361875K2229103K0363968L204536p909637n855437l333298p375798q479458
1045b1517896o18510O041007K569059k645295K478314J3922226J7888440J0279155
1037B8396500j388234j0230894j3485445q531234L105081J0764719N170337p218101
1029F582729j1115918l428482L528440J110210m453164m130228J01073K71448
1021a1533892m637040p742945l838044N052705J2608865J3745185Q371571J615112
$$ plain form
1013 13641517 12627922 12771959 12216218 6103237 -5963250 -17880751 -23680884 -24773886
1005 -24773886 -28819257 -40683541 -54984030 -59597445 -48658775 -30915709 -21394567 -24330221
997 -24330221 -29001742 -24673003 -14190014 -7455400 -5964765 -2613357 4147855 6504929
989 6504929 1668150 688631 13862864 32320765 35716517 19257934 2683966 6494274
981 6494274 26087807 37999853 29345385 11936087 4967992 11158904 16315995 9429717
973 9429717 -4277424 -11926964 -8790274 -577895 7192498 14658592 20401953 16228951
965 16228951 -2564795 -23940774 -26569385 -4862613 20933204 26655613 11363856 -5672251
957 -5672251 -11725493 -13297446 -20897455 -32250815 -37197724 -32670463 -25215519 -21102379
$$ packed form
1013A3641517j013595J44037n55741o112981j2066487j1917501n800133j093002
1005b4773886m045371j1864284j4300489m613415J0938670J7743066R521142k935654
997b4330221m671521M328739J0482989O734614J490635L351408O761212K357074
989F504929m836779r79519J3174233J8457901L395752j6458583j6573968L810308
981F494274J9593533J1912046q654468j7409298o968095O190912N157091o886278
973I429717j3707141p649540L136690Q212379P770393P466094N743361m173002
965A6228951j8793746k1375979k628611K1706772K5795817N722409j5291757j7036107
957e672251o053242j571953p600009j1353360m946909M527261P454944M113140
$$ plain form
949 -21102379 -19490277 -14697748 -2570118 13821249 23956226 19429805 5101741 -5161234
941 -5161234 -6256747 -7594080 -16440270 -24821627 -21988538 -12148687 -7838824 -10905619
933 -10905619 -13479143 -14305504 -18460601 -21443408 -11266831 9168906 18659514 5487345
925 5487345 -15040104 -21173519 -11157976 1998554 10627761 13071250 3951310 -18216482
917 -18216482 -38082566 -36422104 -16462579 -1442194 -3950759 -12904241 -14677499 -11435279
909 -11435279 -10684033 -10298768 -5227069 388613 -262915 -4254502 -4626566 -4114521 -10779733
900 -10779733 -21230994 -20784185 -3562293 17215403 24563801 17266001 8309686 7633121
892 7633121 12880622 16575589 16102651 13204127 7314142 -4010583 -16490245 -17314783
$$ packed form
949b1102379J612102M792529J2127630J6391367J0134977m526421j4328064j0262975
941e161234j095513j337333q846190q381357K833089R839851M309863l066795
933a0905619k573524q26361m155097k982807J0176577K0435737R490608j3172169
925E487345k0527449o133415J0015543J3156530Q629207K443489r119940k2167792
917a8216482j9866084J660462J9959525J5020385k508565q953482j773258L242220
909a1435279P51246L85265N071699N615682o51528l991587l72064N12045o665212
900a0779733j0451261M46809J7221892K0777696P348398p297800q956315o76565
892G633121N247501L694967m72938k898524n889985j1324725j2479662q24538
$$ plain form
884 -17314783 1176745 28138875 42930071 38788389 29736911 29907595 34531799 29768103
876 29768103 15302878 5601235 9758849 20880852 27460612 26273440 20672252 14065063
868 14065063 9741523 10847296 15548502 17020607 12071225 4487605 -3333234 -14081489
860 -14081489 -24886752 -22075969 2143261 32947787 45791384 34904757 17197150
853 17197150 7993480 5907341 4186548 2900611 2570423 -2536153 -14418453 -22894046
845 -22894046 -18254558 -6831524 -2670067 -7359325 -10104799 -6635018 -5462645 -12530408
837 -12530408 -20190656 -17384639 -4482779 7732592 10690261 5572776 -178716 -1504084
829 -1504084 -893154 -3948494 -9063840 -6225399 8865903 24453416 26017829 17674010
$$ packed form
884a7314783J8491528K6962130J4791196m141682r051478J70684M624204m763696
876B9768103j4465225r701643M157614J1122003O579760j187172n601188o607189
868A4065063m323540J105773M701206J472105m949382p583620p820839j0748255
860a4081489j0805263K810783K4219230L0804526J2843597j0886627j7707607
853A7197150r203670k086139j720793j285937l30188n106576j1882300q475593
845b2894046M639488J1423034M161457m689258k745474L469781J172373p067763
837a2530408p660248K806017J2901860J2215371K957669n117485n751492j325368
829a504084O10930l055340n115346K838441J5091302J5587513J564413q343819
$$ plain form
821 17674010 18034063 32694967 43584899 32430617 4677272 -18753944 -25682337 -18827003
813 -18827003 -4384297 12936181 25395794 24694999 11347830 -5852413 -20893017 -34272486
805 -34272486 -45105810 -47601998 -38780775 -23932718 -10871215 -2821184 588127 -138867
797 -138867 -3377539 -5356382 -3784739 -735330 372163 -1217910 -4220154 -7343045 -8538333
788 -8538333 -4773677 4507282 15231051 22601085 25928358 27183199 26249432 21090469
780 21090469 12443384 4808105 1392945 513661 -1058437 -2794771 -958348 5847006
772 5847006 13834454 17249050 13088694 2583263 -10156655 -20574753 -26955051 -32015001
764 -32015001 -38638161 -43259883 -37933967 -22186375 -8320994 -8867812 -20944910 -29656131
$$ packed form
821A7674010L60053J4660904J0889932j1154282k7753345k3431216o928393O855334
813a8827003J4442706J7320478J2459613p00795j3347169j7200243j5040604j3379469
805c4272486j0833324k496188Q821223J4848057J3061503Q050031L409311p26994
797a38867l238672j978843J571643L049409J107493j590073l002244l122891j195288
788h538333L764656R280959J0723769P370034L327273J254841r33767n158963
780B1090469q647085p635279l415160q79284j572098j736334J836423O805354
772E847006P987448L414596m160356j0505431j2739918j0418098o380298n059950
764c2015001o623160m621722N325916J5747592J3865381n46818j2077098q711221
$$ plain form
756 -29656131 -26276969 -16417680 -10016286 -10368289 -14775545 -19514262 -21296039 -18544901
748 -18544901 -13036844 -6444941 3432552 16380748 22302994 11362654 -8644858 -19195918
740 -19195918 -17846664 -21470505 -36528054 -45510482 -35806497 -23126816 -26742313 -37259456
732 -37259456 -33886667 -22305395 -25700518 -42947241 -47878040 -32839282 -21014768 -25905303
724 -25905303 -29029766 -14453122 1086236 -5023301 -24173991 -30647984 -18994017 -3451382
716 -3451382 9295493 21939581 27876916 16494520 -3704714 -10425945 1289872 13099579
708 13099579 12049439 6318086 6541201 8982567 6269251 1132553 -389777 513511 215026
699 215026 -225317 -139419 -3974683 -13518733 -21392366 -19229119 -8087987 4376066 12906118
$$ packed form
756b9656131L379162R859289O401394l52003m407256m738717j781777K751138
748a8544901N508057O591903R877493J2948196N922246j0940340k0007512j0551060
740a9195918J349254l623841j5057549q982428R703985J2679681l615497j0517143
732c7259456L372789J1581272l395123j7246723m930799J5038758J1824514m890535
724b5905303l124463J4576644J5539358o109537j9150690o473993J1653967J5542635
716c451382J2746875J2644088N937335j1382396k0199234o721231J1715817J1809707
708A3099579j050140n731353K23115K441366k713316n136698j522330R03288k98485
699B15026m40343Q5898l835264r544050p873633K163247J1141132J2464053Q530052
$$ plain form
690 12906118 16788737 17530232 18008254 19818045 19464276 12677372 3774668 2575792 8849922
681 8849922 9185898 -4488036 -21485448 -25520565 -15184668 -2863498 2168676 975311
673 975311 -1540707 -1893539 1772903 7649444 9517063 3870984 -4098432 -7436933 -7488620
664 -7488620 -9917459 -13544877 -12450563 -8288105 -9943729 -18664203 -23429938 -16178917
656 -16178917 -3738013 1982135 -134969 -1863978 644318 2820246 846487 -2399888
648 -2399888 -2732090 -1256450 -2719723 -9498215 -18968888 -25368790 -23733089 -14363518 -4375436
639 -4375436 -2098636 -8024171 -13696256 -12184647 -7426242 -9115564 -19086449 -27649175
631 -27649175 -25168881 -13574856 -3390841 -1496590 -5127434 -7190058 -4325256 932712
$$ packed form
690A2906118L882619P41495M78022J809791l53769o786904q902704j198876O274130
681H849922L35976j3673934j6997412m035117J0335897J2321170N032174j193365
673I75311k516018l52832L666442N876541J867619n646079p969416l338501n1687
664g488620k428839l627418J094314M162458j655624q720474m765735P251021
656a6178917J2440904N720148k117104j729009K508296K175928j973759l246375
648b399888l32202J475640j463273o778492r470673o399902J635701R369571R988082
639d375436K276800n925535n672085J511609M758405j689322r970885q562726
631b7649175K480294J1594025J0184015J894251l630844k062624K864802N257968
$$ plain form
623 932712 3804806 1643932 -4539851 -11500936 -16005767 -16173529 -12271484 -7313924 -5454307
614 -5454307 -7628199 -9656985 -7244548 -2006063 952328 908842 2215367 6349713 8569889
605 8569889 4972615 -1535930 -5091770 -2747347 5586089 17747010 26900326 24975515
597 24975515 13496101 4654512 5254149 6211481 -3249594 -17032765 -19655038 -9282508
589 -9282508 -310954 -2537187 -9972744 -13101431 -11137591 -7462221 -2173605 5063998
581 5063998 11426604 14929425 16703920 16518121 12171401 5464643 1477967 -346278 -6023670
572 -6023670 -15216087 -19288631 -15227302 -10880787 -10466875 -6291275 6235352 16076549
564 16076549 11053780 -3022985 -10492262 -7312448 -1357214 4161783 13179462 24399611
$$ packed form
623I32712K872094k160874o183783o961085m504831j67762L902045M957560J859617
614e454307k173892k028786K412437N238485K958391m3486J306525M134346K220176
605H569889l597274o508545l555840K344423Q333436J2160921R153316j924811
597B4975515j1479414q841589N99637R57332r461075j3783171k622273J0372530
589i282508Q971554k226233p435557l128687J963840L675370N288616P237603
581E063998O362606L502821J774495j85799m346720o706758l986676j824245n677392
572f023670r192417m072544M061329M346515M13912M175600J2526627R841197
564A6076549n022769j4076765p469277L179814N955234N518997R017679J1220149
$$ plain form
556 24399611 30489786 30489950 30685969 31692395 26689717 15028111 5765858 3556815 2024542
547 2024542 -3357696 -6062005 427349 10587057 14323795 10606894 5367791 419475
539 419475 -6355023 -11978746 -9115559 2626117 13371801 14461820 8618121 4485104
531 4485104 3971210 829163 -7570630 -13036134 -6419175 7822413 14198572 4976613
523 4976613 -9980932 -16082627 -11307489 -4902433 -2884227 -2443414 194214 3313395
515 3313395 2575045 -3785552 -13504135 -21725131 -24972870 -25782123 -30151670 -37205085 -36760972
506 -36760972 -23715945 -9799054 -11253002 -27193813 -40803405 -41578732 -35248965 -30164201
498 -30164201 -25787729 -19737953 -16170121 -19533374 -25956315 -27308451 -20300254 -8019461
$$ packed form
556B4399611O090175J64J96019J006426n002678j1661606r262253k209043j532273
547B024542n382238k704309O489354J0159708L736738l716901n239103m948316
539D19475o774498n623723K863187J1741676J0745684J090019n843699m133017
531D485104n13894l142047q399793n465504O616959J4241588O376159r221959
523D976613j4957545o101695M775138O405056K018206M40813K637628L119181
515C313395p38350o360597r718583q220996l247739q09253m369547p053415M44113
506c6760972J3045027J3916891j453948j5940811j3609592p75327O329767N084764
498c0164201M376472O049776L567832l363253o422941j352136P008197J2280793
$$ plain form
490 -8019461 3293831 6906830 1086961 -5707045 -2414501 8710241 12238499 527115
482 527115 -14210469 -15810270 -4291431 8325476 15383572 18640074 18880286 14607242
474 14607242 8323873 4610985 2666055 -1309762 -5648473 -5336764 -1431144 257881
466 257881 -733220 89138 1401396 -4242114 -17330088 -27506458 -27488124 -23026545 -23125913
457 -23125913 -26659867 -25723659 -18208903 -9737719 -4612671 -1034637 4557816 12864250
449 12864250 21777976 27518113 25443380 13281358 -5131371 -21522017 -29570799 -28240149
441 -28240149 -19479962 -6685780 3161153 1097363 -14092832 -29485486 -28537269 -9946200
433 -9946200 9864951 16351004 13047548 12847095 18874993 23200897 21997805 20811946
$$ packed form
490h019461J1313292L612999n819869o794006L292544J1124742L528258j1711384
482E27115j4737584j599801J1518839J2616907P058096L256502K40212m273044
474A4607242o283369l712888j944930l975817m338711L11709L905620J689025
466B57881r91101Q22358J312258n643510j3087974j0176370J8334M461579r9368
457b3125913l533954R36208P514756Q471184N125048L578034N592453Q306434
449A2864250Q913726N740137k074733j2162022j8412729j6390646q048782J330650
441b8240149Q760187J2794182R846933k063790j5190195j5392654R48217J8591069
433i946200J9811151O486053l303456k00453O027898M325904j203092j185859
$$ plain form
425 20811946 22681902 21055034 9934755 -6100507 -18144216 -23940851 -26556444 -26638918
417 -26638918 -23012211 -18227456 -16411276 -16287478 -12253633 -2786498 6653921 9815415
409 9815415 5992729 319554 -327614 6974076 17427308 22164335 17739988 9599278
401 9599278 3952883 -152791 -7063564 -16528583 -24742990 -31160346 -38643023 -47193681
393 -47193681 -51901869 -47655262 -34010583 -16603214 -4880130 -4927963 -12131706 -15141438
385 -15141438 -10193054 -6213746 -11369398 -20811424 -24395698 -20548317 -13913768 -4868513
377 -4868513 7362957 14853178 7835360 -8338099 -16275859 -9767234 -2092176 -6053205
369 -6053205 -16500877 -20341507 -15562467 -10793280 -10359481 -9056786 -1519653 9574315
$$ packed form
425B0811946J869956j626868j1120279j6035262j2043709n796635k615593q2474
417b6638918L626707M784755J816180J23798M033845R467135R440419L161494
409I815415l822686n673175o47168P301690J0453232M737027m424347q140710
401I599278n646395m105674o910773r465019q214407o417356p482677q550658
393d7193681m708188M246607J3644679J7407369J1723084m7833p203743l009732
385a5141438M948384L979308n155652r442026l584274L847381O634549R045255
377d868513J2231470P490221p017818j6173459p937760O508625P675058l961029
369f053205j0447672l840630M779040M769187M33799J302695P537133J1093968
$$ plain form
361 9574315 16384092 14334863 6303369 -1502792 -7136193 -13733567 -21331517 -22563452
353 -22563452 -11926306 4242269 14537311 16865396 17090217 14888840 2914475 -17365027
345 -17365027 -30777582 -26070998 -10358256 678174 732575 -5012777 -9850429 -10908925
337 -10908925 -8503242 -5745431 -5936342 -7002944 -2874589 6591547 12804443 9418222
329 9418222 153795 -8352691 -14588286 -18148364 -15682354 -8131064 -4841626 -11569648
321 -11569648 -20058793 -19055007 -11023034 -7677728 -12307219 -17506414 -18968011 -20437722
313 -20437722 -24026475 -25323246 -20849047 -13242316 -6596490 -2061907 472011 1109914
305 1109914 1285506 2523880 4203328 5887169 9435894 14283402 14561171 7827402 2697854
$$ packed form
361I574315O809777k049229q031494p806161n633401o597374p597950j231935
353b2563452J0637146J6168575J0295042K328085K24821k201377j1974365k0279502
345a7365027j3412555M706584J5712742J1036430N4401n745352m837652j058496
337a0908925K405683K757811j90911j066602M128355R466136O212896l386221
329I418222r264427q506486o235595l560078K466010P551290L289438o728022
321a1569648q489145J003786Q031973L345306m629491n199195j461597j469711
313b0437722l588753j296771M474199P606731O645826M534583K533918O37903
305A109914J75592J238374J679448J683841L548725M847508K77769o733769n129548
$$ plain form
296 2697854 8370649 19061202 19951438 8236691 -3560469 -6934732 -7881335 -13886782
288 -13886782 -22060486 -26921346 -30094178 -34062246 -34507833 -28206194 -22037206 -23800968
280 -23800968 -28494191 -24752061 -13027445 -6276052 -11572081 -20882621 -23257306 -18103909
272 -18103909 -11899477 -8208484 -6579067 -6742353 -7683154 -5296434 2742193 11184924 12682021
263 12682021 8572231 6968480 9056040 6044956 -5805607 -15904122 -13454937 -3999716
255 -3999716 -464730 -2343759 1493451 10046825 7671014 -10243266 -25618994 -22399761
247 -22399761 -9299773 -4249940 -7418260 -6425413 -305163 1069841 -2229996 -12718
239 -12718 7133026 6520711 -3262769 -6928687 2044656 8369121 -1298552 -16476139 -18879040
$$ packed form
296B697854N672795J0690553Q90236j1714747j1797160l374263r46603o005447
288a3886782q173704m860860l172832l968068m45587O301639O168988j763762
280b3800968m693223L742130J1724616O751393n296029r310540k374685N153397
272a8103909O204432L690993J629417j63286r40801K386720Q038627Q442731J497097
263A2682021m109790j603751K087560l011084j1850563j0098515K449185R455221
255c999716L534986j879029L837210Q553374k375811j7914280j5375728L219233
247b2399761J3099988N049833l168320R92847O120250J375004l299837K217278
239a2718P145744o12315r783480l665918Q973343O324465r667673j5177587k402901
$$ plain form
230 -18879040 -9551528 -4931529 -12444792 -24150053 -31070787 -31428008 -26401469 -18191716
222 -18191716 -11448368 -8405259 -4237040 5460404 15382404 16458366 8189145 -2640644
214 -2640644 -11921393 -18350511 -17993023 -9604322 -2315921 -5643916 -13094518 -9032616 7355484
205 7355484 19062567 15728785 7072800 5222515 6775981 2951132 -2496831 1133560
197 1133560 12945277 20489724 17621919 11407019 9469703 9411804 4925124 -3364795 -8177488
188 -8177488 -4614757 4559540 12491269 15299733 14751092 13994447 12197590 6112499 -2981520
179 -2981520 -8064028 -4952686 1005674 1051762 -5834368 -12603001 -14513023 -14671868 -17767346
170 -17767346 -22861104 -25521723 -23989560 -19490142 -12563180 -3759695 2548081 522768
$$ packed form
230a8879040R327512M619999p513263j1705261o920734l57221N026539Q209753
222a8191716O743348L043109M168219R697444R922000J075962q269221j0829789
214b640644r280749o429118L57488Q388701P288401l327995p450602M061902J6388100
205G355484J1707083l333782q655985j850285J553466l824849n447963L630391
197A133560J1811717P544447k867805o214900j937316n7899m486680q289919m812693
188h177488L562731R174297P931729K808464n48641p56645j796857o085091r094019
179b981520n082508L111342N958360M6088o886130o768633j910022j58845l095478
170a7767346n093758k660619J532163M499418O926962Q803485O307776k025313
$$ plain form
162 522768 -8698148 -15272154 -11740267 -3664735 -3987311 -16657611 -30818074 -33275888
154 -33275888 -22852413 -9392602 -1737278 -874884 -3258204 -5852910 -7075592 -6352745
146 -6352745 -4566005 -3133076 -1625954 2036390 8007258 12557772 11100885 2929682
138 2929682 -7452567 -13579404 -12103788 -5538839 292101 2034861 1127338 -96878
130 -96878 -2033125 -4956457 -5127210 976574 8613539 7070745 -6861185 -22192198 -25290460
121 -25290460 -15731820 -5450143 -3010354 -4596309 -2273174 4045169 7273239 3401590
113 3401590 -3733982 -8142824 -8548718 -8207284 -10126080 -13980684 -16500085 -14094319 -6639722
104 -6639722 742062 2073552 -1937103 -3602403 1935277 9522910 10778837 5857937
$$ packed form
162E22768r220916o574006L531887Q075532l22576j2670300j4160463k457814
154c3275888J0423475J3459811P655324Q62394k383320k594706j222682P22847
146f352745J786740J432929J507122L662344N970868M550514j456887q171203
138B929682j0382249o126837J475616O564949N830940J742760r07523j224216
130i6878j936247k923332j70753O103784P636965j542794j3931930j5331013l098262
121b5290460R558640J0281677K439789j585955K323135O318343L228070l871649
113C401590p135572m408842m05894L41434j918796l854604k519401K405766P454597
104f639722P381784J331490m010655j665300N537680P587633J255927m920900
$$ plain form
96 5857937 2663946 4705948 6370032 2456566 -3540629 -5037511 -2381758 -2321758 -9008012
87 -9008012 -19245393 -25981646 -24308938 -15426699 -6520444 -4772757 -9843120 -14890408
79 -14890408 -16312421 -17848818 -22230529 -24849445 -21769288 -18737633 -23181643 -29836860
71 -29836860 -25024384 -6492100 10907775 13571488 5338665 -470434 654354 1524732
63 1524732 -3749183 -11117201 -12500048 -6432400 -58525 -847072 -7990240 -13931165 -14253643
54 -14253643 -12250804 -11393939 -8355736 128275 7139539 2048528 -12881655 -22716622
46 -22716622 -19694468 -12796741 -12109870 -13590613 -8308286 1073737 4808398 2834772 4537578
37 4537578 12270598 16815418 11779649 2757720 -2118127 -3050726 -4798797 -7678427 -8012316
$$ packed form
96E857937l193991K042002J664084l913466n997195j496882K655753O0000o686254
87i008012j0237381o736253J672708Q882239Q906255J747687n070363n047288
79a4890408j422013j536397m381711k618916L080157L031655m444010o655217
71b9836860M812476J8532284J7399875K663713q232823n809099J124788Q70378
63A524732n273915p368018j382847O067648O373875p88547p143168n940925l22478
54a4253643K002839Q56865L038203Q484011P011264n091011j4930183r834967
46b2716622L022154O897727O86871j480743N282327R382023L734661j973626J702806
37D537578P733020M544820n035769r021929m875847r32599j748071k879630l33889
$$ plain form
28 -8012316 -4515814 174254 2688988 1271620 -2779332 -4402686 1113983 11049615 15696244
19 15696244 8716645 -5809904 -19115506 -26978848 -30077335 -29052696 -24394198 -19262927
11 -19262927 -17179703 -17114793 -14836279 -9138949 -3480489 -1475758 -3557995 -7842350 -11687692
2 -11687692 -12834364 -11421013
0 -11421013
$$ packed form
28h012316L496502M690068K514734j417368m050952j623354N516669R935632M646629
19A5696244o979599j4526549j3305602p863342l098487J024639M658498N131271
11a9262927K083224O4910K278514N697330N658460K004731k082237m284355l845342
2a1687692j146672J413351
0a1421013
$$ Imaginary data points
##PAGE= N=2
##DATA TABLE= (X++(I..I)), XYDATA
$$ plain form
65535 6316453 6604796 5427075 3716881 6693744 15819067 24560057 26613505 24050001
65527 24050001 21664090 17676096 8191472 -1930923 -2890636 4966791 9894136 5276983
65519 5276983 -1992373 -4121509 -4283350 -8839735 -15029920 -15330653 -9678902 -4613457
65511 -4613457 -2920722 -2365191 -2800744 -6000483 -8974222 -5907209 2300994 7935793
65503 7935793 7290333 4470742 2738930 -238227 -5175625 -6526997 -442925 7874299
65495 7874299 10744506 8632574 8323322 12022897 13763478 7440202 -4932262 -14712440
65487 -14712440 -15668242 -10481304 -7120053 -8846041 -10883835 -8868842 -6031706 -6816307
65479 -6816307 -7671567 -2749044 3665095 1674152 -6500473 -6019345 8364585 21559867
$$ packed form
65535F316453K88343j177721j710194K976863R125323Q740990K053448k563504
65527B4050001k385911l987994r484624j0122395r59713P857427M927345m617153
65519E276983p269356k129136j61841m556385o190185l00733N651751N065445
65511d613457J692735N55531m35553l199739k973739L067013Q208203N634799
65503G935793o45460k819591j731812k977157m937398j351372O084072Q317224
65495G874299K870207k111932l09252L699575J740581o323276j2372464r780178
65487a4712440r55802N186938L361251j725988k037794K014993K837136p84601
65479f816307q55260M922523O414139j990943q174625M81128J4383930J3195282
$$ plain form
65471 21559867 18183041 3733478 -4774160 -1938827 4128051 7892064 11257026 14036728
65463 14036728 12102477 6398261 3671968 6023732 7936352 5493788 981128 -3168089
65455 -3168089 -7309749 -9654918 -6163690 1907263 7349608 6770099 4515231 4279763
65447 4279763 3877301 1682731 849124 2287959 322501 -8321712 -16517586 -14744428
65439 -14744428 -3611783 8151293 15347730 18975698 19045410 12760661 1276329 -8188256
65431 -8188256 -10467226 -8873753 -9795726 -12954405 -11237436 -608170 13219279 20291756
65423 20291756 16857895 7498288 -1983695 -9417800 -13349575 -10629134 -915230 9548133
65415 9548133 13328558 9945754 5448758 5185534 9577965 14988945 16150001 10614199
$$ packed form
65471B1559867l376826j4449563q507638K835333O066878L764013L364962K779702
65463A4036728j934251n704216k726293K351764J912620k442564m512660m149217
65455c168089m141660k345169L491228Q070953N442345n79509k254868k35468
65447D279763m02462k194570q33607J438835j965458q644213q195874J773158
65439a4744428J1132645J1763076P196437L627968O9712o284749j1484332r464585
65431h188256k278970J593473r21973l158679J716969J0629266J3827449P072477
65423B0291756l433861r359607r481983p434105l931775K720441R713904J0463363
65415I548133L780425l382804m496996k63224M392431N410980J161056n535802
$$ plain form
65407 10614199 3561430 3788478 10891069 12165354 -1056694 -19423194 -26883560 -21666789
65399 -21666789 -15086641 -12287697 -7340698 1827311 6825364 1409297 -9526116 -18047792
65391 -18047792 -21742370 -20669586 -14531368 -6659666 -2430188 -280229 7020156 19111451
65383 19111451 25917453 22479686 15393313 10121557 3522885 -5206458 -8492471 -3219440
65375 -3219440 1916667 501704 -1703811 -168142 -2038436 -11454677 -17325011 -10442098
65367 -10442098 -1018400 -2025448 -5648973 3312729 18429070 19176988 4313248 -5947191
65359 -5947191 -2446215 906917 -7053106 -17473812 -18647976 -13460073 -9716083 -6691970
65351 -6691970 -1393008 2588246 1741424 -365143 -103959 -1996 -2336606 -4671045 -6176962
$$ packed form
65407A0614199p052769K27048P102591J274285j3222048j8366500p460366N216771
65399b1666789O580148K798944M946999R168009M998053n416067j0935413q521676
65391a8047792l694578J072784O138218P871702M229478K149959P300385J2091295
65383A9111451O806002l437767p086373n271756o598672q729343l286013N273031
65375c219440N136107j414963k205515J535669j870294r416241n870334O882913
65367a0442098R423698j007048l623525Q961702J5116341P47918j4863740j0260439
65359e947191L500976L353132p960023j0420706j174164N187903L743990L024113
65351f691970N298962L981254q46822k106567K61184J01963k334610k334439j505917
$$ plain form
65342 -6176962 -9208594 -10819111 -3869963 8721074 13579682 7380704 4329425 14032731
65334 14032731 25291426 24139498 16034994 15021676 20012365 18768024 9789050 2823295
65326 2823295 -146948 -7212936 -18574698 -22259086 -12867417 -1877923 -2107657 -10835794
65318 -10835794 -15671266 -10974266 -1240561 7915994 14722084 17836921 14350340 4187295
65310 4187295 -6351876 -9783941 -6818739 -6597925 -14637092 -24239796 -25306979 -18673106
65302 -18673106 -13640614 -12746110 -9784795 -4594768 -7135306 -20367282 -30486711 -24443293
65294 -24443293 -8946066 -593177 -2968571 -5672552 -2412845 2454122 4268582 3434708
65286 3434708 82012 -6410948 -11702678 -9941100 -4233564 -4219741 -11127232 -14584963
$$ packed form
65342f176962l031632j610517O949148J2591037M858608o198978l051279R703306
65334A4032731J1258695j151928q104504j013318M990689j244341q978974o965755
65326B823295k970243p065988j1361762l684388R391669J0989494k29734q728137
65318a0835794m835472M697000R733705R156555O806090L114837l486581j0163045
65310D187295j0539171l432065K965202K20814q039167r602704j067183O633873
65302a8673106N032492Q94504K961315N190027k540538j3231976j0119429O043418
65294b4443293J5497227Q352889k375394k703981L259707M866967J814460q33874
65286C434708l352696o492960n291730J761578N707536J3823o907491l457731
$$ plain form
65278 -14584963 -7716938 3142744 8310309 6938891 3982302 1014800 -3411164 -7527854
65270 -7527854 -6694212 41064 7128817 7562551 748467 -5188241 -1562359 9214575
65262 9214575 14573320 7977259 -1417272 -2184470 1752368 -2079208 -12991699 -16127741
65254 -16127741 -5359258 6360351 5831320 -2598180 -6830956 -5544921 -6067001 -9433870
65246 -9433870 -9310916 -4377095 -1742616 -6553453 -15139781 -20600142 -20706706 -18489814
65238 -18489814 -17567842 -17876401 -15282540 -6628358 4416136 10071592 8781010 8054676
65230 8054676 13446551 19946895 20117493 16110261 15705180 19447702 21045107 19622705
65222 19622705 21352678 26999633 27847002 18915076 8084078 5403246 9253169 10402623
$$ packed form
65278a4584963O868025J0859682N167565j371418k956589k967502m425964m116690
65270g527854Q33642O735276P087753M33734o814084n936708L625882J0776934
65262I214575N358745o596061r394531p67198L936838l831576j0912491l136042
65254a6127741J0768483J1719609n29031q429500m232776J286035n22080l366869
65246i433870J22954M933821K634479m810837q586328n460361j06564K216892
65238a8489814R21972l08559K593861Q654182J1044494N655456j290582p26334
65230H054676N391875O500344J70598m007232m05081L742522J597405j422402
65222A9622705J729973N646955Q47369q931926j0830998k680832L849923J149454
$$ plain form
65214 10402623 5537262 -983893 -6075410 -10408520 -12790886 -10025685 -3333783 1951555
65206 1951555 4528784 8294054 13510665 14338433 9063040 5407339 9225807 13772078
65198 13772078 8739681 -3120754 -7619762 2572968 19017105 28484943 26691727 19114970
65190 19114970 13318531 12715429 14148160 10469079 -873812 -12185070 -13798671 -7646829
65182 -7646829 -5069291 -9781837 -11976735 -3688501 8445872 12681049 7829993 1398524
65174 1398524 -2977612 -7244319 -11004091 -11112091 -8561007 -7623700 -7721041 -3645700 4619349
65165 4619349 9085003 3732896 -7308698 -14428789 -12563216 -5014887 159265 -3415849
65157 -3415849 -15001050 -26539085 -29638234 -23593314 -15654129 -13636176 -18885041 -25318898
$$ packed form
65214A0402623m865361o521155n091517m333110k382366K765201O691902N285338
65206A951555K577229L765270N216611Q27768n275393l655701L818468M546271
65198A3772078n032397j1860435m499008J0192730J6444137R467838j793216p576757
65190A9114970n796439o03102J432731l679081j1342891j1311258j613601O151842
65182g646829K577538m712546k194898Q288234J2134373M235177m851056o431469
65174A398524m376136m266707l759772j08000K551084R37307r7341M075341Q265049
65165D619349M465654n352107j1041594p120091J865573P548329N174152l575114
65157c415849j1585201j1538035l099149O044920P939185K017953n248865o433857
$$ plain form
65149 -25318898 -24794378 -15346349 -4449295 -1082525 -4600634 -6562668 -4087704 -3606271
65141 -3606271 -8342057 -11289229 -7017139 -1569062 -1510173 -1225822 6967496 16368008 13870236
65132 13870236 1151892 -7172975 -5919106 -4428040 -7385383 -6282540 4011306 13517333
65124 13517333 10619600 -1796531 -11408225 -10992179 -2103758 9301290 15700096 12330718
65116 12330718 3083319 -2976698 -2907683 -1140885 684922 4669887 5835291 -6016278
65108 -6016278 -27911287 -40800056 -34135050 -21169980 -18569543 -22052684 -16667605 -2857892
65100 -2857892 4516114 -265830 -7076280 -7159047 -3676173 -2593708 -3896437 -5675703
65092 -5675703 -8937514 -14153069 -18001723 -16800665 -10842707 -4435555 -3001364 -8814352
$$ packed form
65149b5318898N24520R448029J0897054L366770l518109j962034K474964M81433
65141c606271m735786k947172M272090N448077N8889K84351Q193318R400512k497772
65132A3870236j2718344q324867J253869J491066k957343J102843J0293846R506027
65124A3517333k897733j2416131r611694M16046Q888421J1405048O398806l369378
65116A2330718r247399o060017O9015J766798J825807L984965J165404j1851569
65108f016278k1895009j2888769O665006J2965070K600437l483141N385079J3809713
65100b857892P374006m781944o810450q2767L482874J082465j302729j779266
65092e675703l261811n215555l848654J201058N957958O407152J434191n812988
$$ plain form
65084 -8814352 -18099835 -24788212 -27837038 -30005374 -28821005 -17670541 60486 8343689
65076 8343689 -1454034 -16444379 -18738071 -9149553 -2253247 -3199884 -3809349 -124472
65068 -124472 369287 -8345686 -21070581 -27761145 -23067614 -9043020 5490762 9796920
65060 9796920 2582587 -3760299 1926241 13771062 17522756 11220471 5034820 2845733
65052 2845733 -1586424 -9344589 -12008357 -6521849 -1437546 -2958967 -6092350 -5606414
65044 -5606414 -5374856 -9910835 -15472186 -16940361 -16515906 -18580867 -21333932 -19546172
65036 -19546172 -11579196 207360 11518248 16120982 9741431 -3186621 -12510156 -14214404
65028 -14214404 -12910318 -11568900 -7827683 -3046316 -4798632 -15320981 -26442233 -31145484
$$ packed form
65084h814352r285483o688377l048826k168336J184369J1150464J7731027Q283203
65076H343689r797723j4990345k293692R588518O896306r46637o09465L684877
65068a24472M93759q714973j2724895o690564M693531J4024594J4533782M306158
65060I796920p214333o342886N686540J1844821L751694o302285o185651k189087
65052B845733m432157p758165k663768N486508N084303j521421l133383M85936
65044e606414K31558m535979n561351j468175M24455k064961k753065J787760
65036a9546172P966976J1786556J1310888M602734o379551j2928052r323535j704248
65028a4214404J304086J341418L741217M781367j752316j0522349j1121252m703251
$$ plain form
65020 -31145484 -31167112 -27910867 -16458589 3343662 19542433 21932860 15922709 12582471
65012 12582471 11579665 5097160 -6400077 -14239394 -14974916 -13275858 -12910587 -14332192
65004 -14332192 -19751170 -30551577 -39493618 -35128523 -16345822 4484576 14815719
64997 14815719 12666416 3402038 -7159927 -13619762 -11026849 589991 13352622 17095216
64989 17095216 9148331 -1960352 -4051001 5804717 16975923 17177370 8137922 4057301
64981 4057301 13013646 25920883 27704789 14499771 -4779886 -19717639 -26037230 -25221716
64973 -25221716 -22000401 -20770511 -20855344 -17281074 -8947146 -2285580 -2580387 -5108648
64965 -5108648 -559238 12039433 22749443 21684381 10144550 -115745 401656 6127581
$$ packed form
65020c1145484k1628L256245J1452278J9802251J6198771K390427o010151l340238
65012A2582471j002806o482505j1497237p839317p35522J699058L65271j421605
65004a4332192n418978j0800407q942041M365095J8782701K0830398J0331143
64997A4815719k149303r264378j0561965o459835K592913J1616840J2762631L742594
64989A7095216p946885j1108683k090649R855718J1171206K01447r039448m080621
64981D057301Q956345J2907237J783906j3205018j9279657j4937753o319591Q15514
64973b5221716L221315J229890q4833L574270Q333928O661566k94807k528261
64965e108648M549410J2598671J0710010j065062j1539831j0260295N17401N725925
$$ plain form
64957 6127581 159386 -23977256 -48462220 -49318739 -27257464 -7441573 -6196340 -12785564
64949 -12785564 -11040434 -3621370 -1879410 -3570060 2382115 14677942 19588845 11160230
64941 11160230 -1321218 -6292172 -557537 12129324 24005137 26097000 16698149 5506459
64933 5506459 1781574 2055957 -1438353 -4986930 1755085 17583077 29177328 28679440
64925 28679440 20642034 11406212 2464076 -5120455 -10020458 -14879056 -21682972 -23730531
64917 -23730531 -13019790 4926885 15298957 13265511 7369771 3759751 34658 -4259296
64909 -4259296 -5023599 -4256499 -9571536 -19198450 -20897189 -10660685 536518 4043446
64901 4043446 4455056 6864545 6380534 -1372991 -10855209 -16210272 -19719155 -22645559
$$ packed form
64957F127581n968195k4136642k4484964q56519K2061275J9815891J245233o589224
64949a2785564J745130P419064J741960j690650N952175J2295827M910903q428615
64941A1160230j2481448m970954N734635J2686861J1875813K091863r398851j1191690
64933E506459l724885K74383l494310l548577O742015J5827992J1594251m97888
64925B8679440q037406r235822q942136p584531m900003m858598o803916k047559
64917b3730531J0710741J7946675J0372072k033446n895740l610020l725093m293954
64909d259296p64303P67100n315037r626914j698739J0236504J1197203L506928
64901D043446M11610K409489m84011p753525r482218n355063l508883k926404
$$ plain form
64893 -22645559 -18886441 -7242349 665878 -4091078 -12835384 -10937270 2443741 16263462
64885 16263462 22829248 21786123 15197594 7689192 5463473 7037918 1828680 -14214930
64877 -14214930 -30026700 -35303777 -35172048 -37916533 -38321210 -27801804 -13152749 -8919281
64869 -8919281 -16220398 -24960394 -32558904 -43421072 -52821070 -50027221 -37728802 -30090517
64861 -30090517 -29140609 -21506514 -3679143 8040496 2277442 -8753169 -8196112 -152164
64853 -152164 -1376770 -14450147 -24444876 -20771047 -9706951 -3142151 -3810352 -5448778
64845 -5448778 -2549115 3615971 6873765 2627703 -6451136 -11339314 -5398739 7174325
64837 7174325 13920857 7534420 -4166090 -5600195 7267741 19178842 12775609 -8685769
$$ packed form
64893b2645559L759118J1644092P908227m756956q744306J898114J3381011J3819721
64885A6263462O565786j043125o588529p508402k225719J574445n209238j6043610
64877a4214930j5811770n277077J31729k744485m04677J0519406J4649055M233468
64869h919281p301117q739996p598510j0862168r399998K793849J2298419P638285
64861c0090517R49908P634095J7827371J1719639n763054j1030611N57057Q043948
64853a52164j224606j3073377r994729L673829J1064096O564800o68201j638426
64845e448778K899663O165086L257794m246062r078839m888178N940575J2573064
64837G174325O746532o386437j1700510j434105J2867936J1911101o403233k1461378
$$ plain form
64829 -8685769 -24136705 -21288741 -11132058 -11213909 -23122858 -34479630 -36834060 -32030520
64821 -32030520 -24685978 -18003043 -15141158 -16034316 -14139257 -4245473 8336273 14707885
64813 14707885 16115297 20665044 27765379 27757497 18400434 9942651 9950268 13354851 12423922
64804 12423922 7369538 1370453 -6410257 -15644756 -19249331 -10887200 5335961 18366687
$$ packed form
64829h685769j5450936K847964J0156683q1851j1908949j1356772k354430M803540
64821c2030520P344542O682935K861885q93158J895059R893784J2581746O371612
64813A4707885J407412M549747P100335p882r357063q457783P617L404583r30929
64804A2423922n054384n999085p780710r234499l604575Q362131J6223161J3030726
$$ [...]
##END NTUPLES=NMR SPECTRUM
##END=
