##TITLE=31Pdec_LR-576-oC1A
 CDCl3, 24 sc
 24.6.2019
##JCAMPDX= 6.0         $$ Bruker NMR JCAMP-DX V2.0
##DATA TYPE= NMR SPECTRUM
##DATA CLASS= NTUPLES
##ORIGIN= UXNMR, Bruker Analytische Messtechnik GmbH
##OWNER= root
$$ XWIN-NMR		Version 3.5
$$ Mon Jun 24 15:54:46 2019 Russian Standard Time (UT+4h)  she@DPX200
##.OBSERVE FREQUENCY= 81.013821
##.OBSERVE NUCLEUS= ^31P
##.ACQUISITION MODE= SIMULTANEOUS
##.ACQUISITION SCHEME= undefined
##.AVERAGES= 24
##.DIGITISER RES= 17
##SPECTROMETER/DATA SYSTEM= spect
##.PULSE SEQUENCE= zgpg30
##.SOLVENT NAME= CDCl3
##.SHIFT REFERENCE= (INTERNAL, CDCl3, 0, 182.463)
##AUDIT TRAIL= $$ (NUMBER, WHEN, WHO, WHERE, WHAT)
$$ ##TITLE= Audit trail, XWIN-NMR		Version 3.5
$$ ##JCAMPDX= 5.01
$$ ##ORIGIN= Bruker BioSpin GmbH
$$ ##OWNER= she
$$ F:/spectra/data/she/nmr/P31/1/pdata/1/auditp.txt
$$ ##AUDIT TRAIL=  $$ (NUMBER, WHEN, WHO, WHERE, WHAT)
(   1,<2019-06-24 15:53:40.51 +0400>,<she>,<DPX200>,
      <created by zg, POWCHK disabled, PULCHK disabled
       configuration hash MD5:
       00 E9 B6 7A A2 85 ED C7 34 08 36 98 17 FE 4E 26
       data hash MD5: 32K
       43 C9 1B A1 46 10 ED 16 A1 ED AB 64 01 98 C8 29>)
(   2,<2019-06-24 15:53:42.73 +0400>,<she>,<DPX200>,
      <Start of raw data processing
       efp BC_mod = 2 LB = 1 FT_mod = 6 PKNL = 1 PHC0 = -2587.448 PHC1 = 151.799 SI = 64K 
       data hash MD5: 64K
       8E B4 32 00 E2 A5 50 C5 CB 28 A3 8E E9 D9 24 FA>)
(   3,<2019-06-24 15:53:56.93 +0400>,<she>,<DPX200>,
      <pk PHC0 = 18.88528 PHC1 = 0 
       data hash MD5: 64K
       4A 17 B3 66 25 15 C8 A6 5B 3C 03 9F F2 E2 45 81>)
(   4,<2019-06-24 15:54:00.17 +0400>,<she>,<DPX200>,
      <abs ABSG = 5 
       data hash MD5: 64K
       6F 00 9D B4 BD 55 DE 1E 01 C4 51 6B 32 2D F8 B5>)
(   5,<2019-06-24 15:54:14.73 +0400>,<she>,<DPX200>,
      <pk PHC0 = 1.21183 PHC1 = 0 
       data hash MD5: 64K
       E5 91 5E 94 9B 38 ED B6 DC 8E 12 51 E4 81 B0 FD>)
$$ ##END=
$$ 
$$ hash MD5
$$ A0 0B D5 92 21 00 ED 95 E1 36 30 E7 41 38 1F 02
##$RELAX= 
##$RELAX= 
##$RELAX= 
##$RELAX= 
##$RELAX= 
##$RELAX= 
##$RELAX= 
##$RELAX= 
$$ Bruker specific parameters
$$ --------------------------
##$DU= <F:/spectra>
##$EXPNO= 1
##$NAME= <P31>
##$PROCNO= 1
##$TYPE= <nmr>
##$USER= <she>
##$AMP= (0..31)
100 100 100 100 100 100 100 100 100 100 100 100 100 100 100 100 100 100 
100 100 100 100 100 100 100 100 100 100 100 100 100 100 
##$AQSEQ= 0
##$AQ_mod= 1
##$AUNM= <au_zg>
##$AUTOPOS= <>
##$BF1= 81.014009
##$BF2= 200.13
##$BF3= 200.13
##$BF4= 200.13
##$BF5= 200.13
##$BF6= 200.13
##$BF7= 200.13
##$BF8= 200.13
##$BYTORDA= 1
##$CFDGTYP= 0
##$CFRGTYP= 5
##$CHEMSTR= <none>
##$CNST= (0..31)
1 1 145 1 1 1 1 1 1 1 1 1 1 1 1 1 1 1 1 1 1 1 1 1 1 1 1 1 1 1 1 1 
##$CPDPRG= <waltz16>
##$CPDPRG1= <>
##$CPDPRG2= <waltz16>
##$CPDPRG3= <>
##$CPDPRG4= <mlev>
##$CPDPRG5= <mlev>
##$CPDPRG6= <mlev>
##$CPDPRG7= <mlev>
##$CPDPRG8= <mlev>
##$CPDPRGB= <>
##$CPDPRGT= <>
##$D= (0..31)
0 1 0 0 0 0 0 0 0 0 0 0.03 2e-05 3e-06 0 0 0 0 0 0 0 0 0 0 0 0 0 0 0 0 
0 0 
$$ [...]
##$SUBNAM3= <"">
##$SUBNAM4= <"">
##$SUBNAM5= <"">
##$SUBNAM6= <"">
##$SUBNAM7= <"">
##$SUBNAM8= <"">
##$SUBNAM9= <"">
##$SW= 369.568048894756
##$SWIBOX= (0..15)
0 1 3 0 0 0 0 0 0 0 0 0 0 0 0 0 
##$SW_h= 29940.119760479
##$TD= 32768
##$TD0= 1
##$TE= 0
##$TE2= 300
##$TE3= 300
##$TEG= 300
##$TL= (0..7)
0 120 53 12 22 120 120 120 
##$TP= (0..7)
150 150 150 150 150 150 150 150 
##$TP07= 0
##$TPNAME0= <>
##$TPNAME1= <>
##$TPNAME2= <>
##$TPNAME3= <>
##$TPNAME4= <>
##$TPNAME5= <>
##$TPNAME6= <>
##$TPNAME7= <>
##$TPOAL= (0..7)
0.5 0.5 0.5 0.5 0.5 0.5 0.5 0.5 
##$TPOFFS= (0..7)
0 0 0 0 0 0 0 0 
##$TUNHIN= 0
##$TUNHOUT= 0
##$TUNXOUT= 0
##$USERA1= <user>
##$USERA2= <user>
##$USERA3= <user>
##$USERA4= <user>
##$USERA5= <user>
##$V9= 5
##$VALIST= <valist>
##$VCLIST= <CCCCCCCCCCCCCCC>
##$VD= 0
##$VDLIST= <DDDDDDDDDDDDDDD>
##$VPLIST= <PPPPPPPPPPPPPPP>
##$VTLIST= <TTTTTTTTTTTTTTT>
##$WBST= 1024
##$WBSW= 4
##$XGAIN= (0..3)
0 0 0 0 
##$XL= 0
##$YL= 0
##$YMAX_a= 19292
##$YMIN_a= -22017
##$ZGOPTNS= <>
##$ZL1= 120
##$ZL2= 120
##$ZL3= 120
##$ZL4= 120
##$ABSF1= 182.463
##$ABSF2= -187.1042
##$ABSG= 5
##$ABSL= 3
##$ALPHA= 0
##$AQORDER= 0
##$ASSFAC= 0
##$ASSFACI= 0
##$ASSFACX= 0
##$ASSWID= 0
##$AUNMP= <proc_1d>
##$AZFE= 0.1
##$AZFW= 0.5
##$BCFW= 0
##$BC_mod= 2
##$BYTORDP= 0
##$COROFFS= 0
##$CY= -3
##$DATMOD= 1
##$DC= 0
##$DFILT= <>
##$DTYPP= 0
##$F1P= 0
##$F2P= 0
##$FCOR= 1
##$FTSIZE= 65536
##$FT_mod= 6
##$GAMMA= 0
##$GB= 0
##$INTBC= 1
##$INTSCL= 5.30512e-09
##$ISEN= 30
##$LB= 1
##$LEV0= 0
##$LPBIN= 0
##$MAXI= 10000
##$MC2= 0
##$MEAN= 0
##$ME_mod= 0
##$MI= 50
##$NCOEF= 0
##$NC_proc= -6
##$NLEV= 6
##$NOISF1= 182.463
##$NOISF2= 159.3651
##$NSP= 0
##$NTH_PI= 0
##$NZP= 0
##$OFFSET= 182.463
##$PC= 4
##$PHC0= -2567.351
##$PHC1= 151.799
##$PH_mod= 1
##$PKNL= yes
##$PPARMOD= 0
##$PSCAL= 0
##$PSIGN= 0
##$REVERSE= no
##$SF= 81.0140089999434
##$SI= 65536
##$SIGF1= 159.3651
##$SIGF2= -187.1042
##$SINO= 113.3802
##$SIOLD= 16384
##$SREGLST= <1H.CDCl3>
##$SSB= 0
##$STSI= 65536
##$STSR= 0
##$SW_p= 29940.119760479
##$SYMM= 0
##$S_DEV= 0
##$TDeff= 32768
##$TDoff= 0
##$TI= <>
##$TILT= no
##$TM1= 0
##$TM2= 0
##$TOPLEV= 0
##$USERP1= <user>
##$USERP2= <user>
##$USERP3= <user>
##$USERP4= <user>
##$USERP5= <user>
##$WDW= 1
##$XDIM= 65536
##$YMAX_p= 363980595
##$YMIN_p= -40246918
$$ End of Bruker specific parameters
$$ ---------------------------------
##NTUPLES= NMR SPECTRUM
##VAR_NAME=  FREQUENCY,     SPECTRUM/REAL,   SPECTRUM/IMAG
##SYMBOL=    X,             R,               I
##VAR_TYPE=  INDEPENDENT,   DEPENDENT,       DEPENDENT
##VAR_FORM=  AFFN,          ASDF,            ASDF
##VAR_DIM=   65536,         65536,           65536
##UNITS=     HZ,            ARBITRARY UNITS, ARBITRARY UNITS
##FACTOR=    0.456856943014862, 1,           1
##FIRST=     14782.0589164792, 0,            0
##LAST=      -15158.0608439998, 0,           0
##MIN=       -15158.0608439998, -40246918,   0
##MAX=       14782.0589164792, 363980595,    0
$$ Real data points
##PAGE= N=1
##DATA TABLE= (X++(R..R)), XYDATA
$$ [...]
45648A098628K780155J077711n21332q84435l76689l95318j241079j498388l04213
45639b64960Q92815K96241j267986j340420L10195J101962l62958j978327j370945
45630c984383M48031R23549J13948K22501J533904J866527M06896q36934m38786
45621B55253K41004j90232n65570N76461K019345J649404o2626r31298n78580
45612B413161m59609q13524l28218J050324J599947O84405j98994l7547J71952
45603D081897m69249j113227q84340m93018o99097p06334K98536J296634Q87976
45594B199778l68980q25230k27261L75354N94992P80105N76242o09798j804897
45585F90305j177902J069255K409771J364031m60363p90860J50400L39937r12877
$$ y = [1098628, 3878783, 4956494, 4435162, 3550727, 3174038, 2778720, 1537641, 39253, -264960, 627855, 924096, -343890, -1684310, -1374115, -272153, -635111, -2613438, -3984383, -3536352, -2612803, -2498855, -2276354, -742450, 1124077, 1530973, 694039, 255253, 496257, 306025, -259545, 316916, 2336261, 3985665, 3923039, 2991741, 2413161, 1953552, 1140028, 811810, 1862134, 3462081, 4146486, 3947492, 3909945, 4081897, 3612648, 2499421, 1615081, 1122063, 422966, -283368, 15168, 1311802, 2199778, 1830798, 1005568, 778307, 1153661, 1748653, 2528758, 3105000, 2495202, 690305, -487597, 581658, 2991429, 4355460, 3895097, 3104237, 3254637, 3594574, 2681697]
45576B681697k051362j523980J63709J136984M29330r29853j202429p8577R59305
45567d15176O38604l50622l94489O40593J253464O41777j63113r7714K45894j99064
45557A800154j040851j056357k63825Q8678m63773r59383n96750K24918Q10570
45548a456619J035847Q81949J82226o03161m48165O50469J216962L84192o45638
45539A198062m91920J02502m03477j490958j237942L74231J196073L41198m93372
45530i05603m5308N05434K7436k36044J019441K229272J034664j677363k671268
45521g19339j054666O79968N85143l77361o73206n26204o68279o80443o9424M34768
45511c069043J36201j87252M74641J571135J812287J097494L39764p7460m38847
$$ y = [2681697, 630335, -893645, -729936, 407048, 836378, -93475, -1295904, -1374481, -415176, 223428, -127194, -521683, 118910, 1372374, 2014151, 1851038, 1753324, 1999218, 1800154, 759303, -297054, -560879, -472201, -935974, -1895357, -2492107, -2267189, -1456619, -420772, 461177, 643403, 40242, -407923, 242546, 1459508, 1843700, 1198062, 706142, 808644, 405167, -1085791, -2323733, -1949502, -753429, -412231, -905603, -950911, -445477, -418041, -654085, 365356, 2594628, 3629292, 1951929, -719339, -1774005, -1094037, -508894, -886255, -1559461, -2085665, -2753944, -3434387, -3503811, -3069043, -2932842, -3120094, -2645453, -1074318, 737969, 1835463, 2175227, 2097767, 1658920]
45502A658920p12945n79857j87589N1609J60867L54330N02049N17594O83025Q54882
45492C302885J70455j439031k327502j150424Q25934J107619n52697j777845q91075
45483b731681R15415J394331J86877q62627J780K277973L447948J703508j586788
45474D746736l076522j531700N90716O44378o68596j051075m90534p03816j438115
45465b978528n76426J792867K686876P95810j178738n98450J142831J088930o66329
45456A508843j546460o30861M73887N63427K13748P8403j43303n70117n91139
45447f43572k9535L83650K07745n8528M8418K63271K82206K87900L52216J09910
45437A203681m62425o27503J39631J218541J489734O88100l77476q62038p33998
$$ y = [1658920, 945975, 366118, 178529, 230138, 391005, 745335, 1247384, 1764978, 2448003, 3302885, 3473340, 2034309, -293193, -1443617, -617683, 489936, -62761, -1840606, -2731681, -1816266, -421935, -235058, -1097685, -1095905, 1182068, 4630016, 6333524, 4746736, 1670214, 138514, 729230, 1373608, 705012, -346063, -836597, -1540413, -2978528, -3554954, -1762087, 924789, 1720599, 541861, -56589, 1086242, 2175172, 1508843, -37617, -668478, -194591, 368836, 582584, 660987, 517684, -52433, -643572, -673107, -289457, -81712, -140240, -91822, 171449, 453655, 741555, 1093771, 1203681, 741256, 113753, 253384, 1471925, 2961659, 3649759, 3272283, 2410245, 1676247]
45428A676247n21657m99792m07782m459L98732L14674j35171l40899j77834k35931
45418F6128p82994j125498n41199N94047J197916P26375m23740j428256j542225
45409c259446n57934P22509R92105O5571n65448L38238J819420J877249K97262
45400A729526j007899o43538N06702O67589n67025j943011j980394l24650J879605
45391a683095K783620J571100m45823j136909j22541Q30372L34372p40455p74893
45382F15748M5656M0231j275194k221228j264060P03474J451686M25263n69962
45373b048386j6821J137352J011447k29492n72798N99066J299457n5938j965192
45364h41305j843943J76150J451419O30987p35485p90489K02495Q58747O90225
$$ y = [1676247, 1154590, 654798, 247016, 242557, 641289, 955963, 820792, 479893, 302059, 66128, -716866, -1842364, -2383563, -1789516, -591600, 134775, -288965, -1717221, -3259446, -3817380, -3094871, -2102766, -2037195, -2602643, -2264405, -444985, 1432264, 1729526, 721627, 78089, 584791, 1252380, 685355, -1257656, -3238050, -3562700, -1683095, 1100525, 2671625, 2225802, 1088893, 966352, 1796724, 2131096, 1390641, 615748, 661404, 701635, -573559, -2794787, -4058847, -3355373, -1903687, -1478424, -2048386, -2065207, -927855, 83592, -145900, -718698, -119632, 1179825, 1123887, -841305, -2685248, -2509098, -1057679, -426692, -1162177, -1952666, -1750171, -891424, -201199]
45355b01199N7388q41191j753128j844375n64865J269276K178904J637869L65711
45346C04390o62881q79950k10204P52826R60160M5434r85680r18696P0481P75308
45336g48812P14928N89594R45886J326799J081961L13593m17264q37997r93368
45327A975320q74531m64776j4569J01298j51408l38914k2315O67744J048756O10829
45317B537434l71382j178926j483469j434208j012168k8807J032333J063496j37756
45308a013453j138604o07387P44691J065636r9345j397929j691608j123171l9946
45299e301116J570770K968823K582627K40686j776602j456347R4557L26162q36132
45290a586572r86883P84504K330627J791646L56601N2021M64725j10809j282052
$$ y = [-201199, -143811, -985002, -2738130, -4582505, -5147370, -3878094, -1699190, -61321, 304390, -358491, -1238441, -1448645, -695819, 264341, 309775, -675905, -1594601, -1524120, -748812, -33884, 555710, 1501596, 2828395, 3910356, 4223949, 3806685, 2968688, 1975320, 1100789, 636013, 621444, 722742, 571334, 232420, 210105, 877849, 1926605, 2537434, 2166052, 987126, -496343, -1930551, -2942719, -2971526, -1939193, -875697, -1013453, -2152057, -2759444, -2014753, -949117, -1048462, -2446391, -4137999, -5261170, -5301116, -3730346, -761523, 1821104, 2061790, 285188, -1171159, -1076602, -750440, -1586572, -2573455, -1788951, 541676, 2333322, 2689923, 2741944, 3206669, 3095860, 1813808]
45281A813808r56441R56818J839988J56855k187865k588860j212312j34333j71268
45272b483610l68486m3338M29975P42959J036777J076384L63206p34872j159991
45263a140996p21142l40034m38092k52948P23339J712875J775045J103605M61519
45254B883171L0645m31193q76575j129471j257602j160279l73907R96169J779457
45245D60415J117038j31663m25596K91629O48383O3172l88202J80388Q62501K35498
45235B913563j270105j522673M81197K850598K757147p9524k861038k983127r34119
45226f48081Q19653J046300N68806K59046j27529p89531j095912p68779o06655
45217a342682j034753j027887K86600J833644J866911N20145m24473j06008N42229
$$ y = [1813808, 857367, 1814185, 3654173, 3811028, 1623163, -965697, -2178009, -2312342, -2483610, -2852096, -2895434, -2465459, -1722500, -685723, 390661, 753867, 18995, -1140996, -1862138, -2202172, -2640264, -2893212, -2169873, -456998, 1318047, 2421652, 2883171, 2913816, 2482623, 1606048, 476577, -781025, -1941304, -2315211, -1319042, 460415, 1577453, 1445790, 1020194, 1311823, 1960206, 2023378, 1635176, 1815564, 2678065, 2913563, 1643458, 120785, 601982, 3452580, 6209727, 6130203, 3269165, 286038, -648081, 171572, 1217872, 1786678, 2045724, 1918195, 1128664, 32752, -736027, -1342682, -2377435, -3405322, -3118722, -1285078, 581833, 1101978, 677505, 571497, 1113726]
45208A113726N38392R4317j90860k07159J7913N61314J033048O36287o53230j672801
45198A270947j433229m04172J05025m65983j411577j668069r16418K05065Q84574
45189c833837J057629J307544J803961J886809J095153J6817n60657q11120j289960
45180F72339j641696j026348L41355J248429J106760M60808j26459n54855n21151
45171d0818L22290J304688J159516q9416r71684p82371n49369j099146j611372
45162b357682j124844j74997L10370O00515J237558J534049O51517n34700m52372
45153c10586O43449R83377Q8714n41484R0084R41069N91096q02368k014272k270865
45143b601786j492555J40866J965777K743436J743106k45398j627955j641977
$$ y = [1113726, 1652118, 1746435, 1555575, 1348416, 1366329, 1927643, 2960691, 3596978, 2943748, 1270947, -162282, -566454, -461429, -927412, -2338989, -4007058, -4923476, -4718411, -3833837, -2776208, -1468664, 335297, 2222106, 3317259, 3334076, 2773419, 1962299, 672339, -969357, -1995705, -1654350, -405921, 700839, 1161647, 1035188, 480333, -40818, 281472, 1586160, 2745676, 2656260, 1684576, 902205, 352836, -746310, -2357682, -3482526, -3657523, -3347153, -2746638, -1509080, 24969, 676486, 141786, -310586, 332863, 1316240, 1404954, 863470, 953554, 1894623, 2485719, 1683351, -330921, -2601786, -4094341, -3953475, -1987698, 755738, 2498844, 2253446, 625491, -1016486]
45135a016486q53052k25156j67783m00646l70148J64140P58107P06642L4620l71197
45125a740959n9162R3906q24606j882010j053344J769225L859451K839915j02499
45116B899917j641806n65724J048123J035928k08895j051991j067080r15256q13247
45107a280031n15731j91903o7330K27375P56137N30536p94683j365165N22510
45098b178285L011024K442568j129422l222080j080807K206957K072647j093071
45090A029531k849392j127729J371705J477586l57377j422228n89366O84592O81266
45081a101412l87319q01543L74613J923219J876378J20470j314207q77299N61989
45072C74889J089593K34101q11232q59027K29388J663871K148171P95205j591330
$$ y = [-1016486, -1869538, -2094694, -2262477, -2663123, -3033271, -2869131, -2111024, -1404382, -1369762, -1740959, -1800121, -1706215, -2530821, -4412831, -5466175, -3696950, 162501, 3002416, 2899917, 1258111, 692387, 1740510, 2776438, 2567543, 1515552, 448472, -466784, -1280031, -1795762, -1987665, -2054995, -1827620, -1071483, -540947, -1335630, -2700795, -2178285, 832739, 3275307, 2145885, -1076195, -2157002, 49955, 2122602, 1029531, -1819861, -2947590, -1575885, -98299, -455676, -1877904, -2467270, -1782678, -1101412, -1488731, -2290274, -1915661, 7558, 1883936, 2004406, 690199, -187100, 374889, 1464482, 1698583, 887351, 28324, 257712, 1921583, 4069754, 4864959, 3273629]
45063C273629k817430j743749K48964J108931N94081j60420o45639j118503j367204
45054b627340q71751Q1551P26400R76086J156272J042823L07044o08395j143439
45045i60749j406735j242511K37412K649438L401754J072024j622201j164329
45037I64103J410056J959987l70417k095684j132992L72630K32539m78362k34036
45028F27824N3732o80251j179569k18316Q27318L49401n18712J4489J054944O28530
45018I59390o86502p04802N78313R88412l32877j883394k189375j244828L05005
45009d210658J678277J888726P26208n46277q09125o39013q00456l78649J515749
45000a575218L227560K310759o84084k703589k323449j008836k52293J78568Q07039
$$ y = [3273629, 456199, -1287550, -1038586, 70345, 664426, 504006, -141633, -1260136, -2627340, -3499091, -3417540, -2691140, -1715054, -558782, 484041, 791085, 182690, -960749, -2367484, -3609995, -3372583, -723145, 2678609, 3750633, 2128432, 964103, 2374159, 4334146, 3963729, 1868045, 735053, 1107683, 1340222, 861860, 627824, 681556, 1305, -1178264, -1396580, -569262, -219861, -738573, -724084, 330860, 959390, 272888, -431914, 146399, 1134811, 801934, -1081460, -3270835, -4515663, -4210658, -2532381, -643655, 82553, -463724, -1272849, -1911862, -2712318, -3090967, -1575218, 1652342, 3963101, 3279017, 575428, -1748021, -2756857, -3009150, -2830582, -2023543]
44991b023543J321092J355468Q89083j70343j391556j351371L97420J648069K51440
44982I25759k134378j973146P23596K282993J042368m27939J09191J145916M20675
44973B115035j414540k204704j346727L33820J955192K392181O99177j844765
44965F84669k252809M6714J885755R34098q69455p29845O10740P86847L6558J19557
44955A252829N05941o39087k422058j962199P76924K413246J137584p59365n94468
44946b90653R02606J146050m54592j852894j122818J116442K231858O30940j910768
44937C96171k099847L50770J926804L40068j842120j102442J349908J426467j183029
44928d37250k381516j20371K506693K095947m63869k214149k298085j683040p52868
$$ y = [-2023543, -702451, 653017, 1542100, 1371757, -19799, -1371170, -973750, 674319, 925759, -1208619, -3181765, -2458169, -175176, 867192, 439253, 548444, 1694360, 2115035, 700495, -1504209, -2850936, -2517116, -561924, 1830257, 2529434, 684669, -1568140, -1521426, 364329, 1298427, 428972, -300873, 309867, 1096714, 1133272, 1252829, 1758770, 1119683, -1302375, -3264574, -2487650, -74404, 1063180, 303815, -290653, 611953, 1758003, 1303411, -549483, -1672301, -555859, 1675999, 2306939, 396171, -1703676, -1352906, 573898, 913966, -928154, -2030596, -680688, 745779, -437250, -2818766, -2939137, -432444, 1663503, 1199634, -1014515, -3312600, -4995640, -5748508]
44919e748508N28613J438172J462277J383718J842519J988982J048204n3951k07381
44910C682645j6340n34527j301220j368258j131528j312941j255974k37772O22752
44901b853163N3186p33545K59552K063466J685526j114241k994644j793854N45040
44892d882677J155785J83159k04809P49467J783847J715578O79738m28405p73297
44883b1614q0689J032767J481084Q28448l48286j309859j752764j524406o38399
44874b333718K43203L20341r6460J12839J060105J545886R76158K29459R251k13802
44864A853262p54960p21321L23670J084410M13407o92694o17289L32826O63630
44855A884941J56731k68736m90295r92913j252890m30904O31934L48770q04653
$$ y = [-5748508, -5219895, -3781723, -2319446, -935728, 906791, 2895773, 3943977, 3890026, 3682645, 3666305, 3131778, 1830558, 462300, -669228, -1982169, -3238143, -3475915, -2853163, -2799977, -3533522, -3273970, -1210504, 475022, -639219, -3633863, -5427717, -4882677, -3726892, -3543733, -3748542, -2999075, -1215228, 500350, 1180088, 751683, -21614, -102303, 930464, 2411548, 3239996, 2891710, 1581851, -170913, -1695319, -2333718, -2090515, -1770174, -1866634, -1753795, -693690, 852196, 1828354, 2057813, 2067064, 1853262, 1098302, 376981, 700651, 1785061, 2198468, 1505774, 888485, 1221311, 1884941, 2041672, 1772936, 1282641, 289728, -963162, -1394066, -762132, -413362, -1218015]
44846a218015q16342L99732O82617o64229j536874n30840P65759N97626o6971
44837b387537N19765J813071K029891R97808j38790j026445j881221k040507q15679
44828b929644Q06678J232304N24419j18339m49901q82835q86904J68430J214610
44819a321182Q57472P24N10155J673694J013071j332803k339415q95363M38061
44810a395586k22566j117721j72423J439912J469603K04282o17832q49789j346852
44801b608972j642335p83986M22536M62051k47227o3435J045483J621991J273225
44792e20669Q73701M91612n86812j785420j499265K31789J385660Q34142k53604
44783h28866m78362l2743K47891K48294K36287K37811L13129N68479O20248r623
$$ y = [-1218015, -2034357, -1634625, -952008, -1616237, -3153111, -3683951, -2918192, -2320566, -2387537, -1867772, -54701, 1975190, 2972998, 2834208, 1807763, -73458, -2113965, -2929644, -2122966, -890662, -366243, -484582, -934483, -1817318, -2704222, -2535792, -1321182, -463710, -462986, 47169, 1720863, 2733934, 1401131, -938284, -1833647, -1395586, -1618152, -2735873, -2908296, -1468384, 1219, 205501, -412331, -1262120, -2608972, -4251307, -5035293, -4612757, -4150706, -4397933, -4461368, -3415885, -1793894, -520669, 353032, 844644, 257832, -1527588, -3026853, -2795064, -1409404, -575262, -828866, -1307228, -1339971, -1092080, -843786, -607499, -369688, -56559, 511920, 1132168, 1122545]
44773A122545q68495j014614n02628k22419k59848K03817J252386J922596J719086
44764C352426J060695J29277j182220k090764j488882L9005O56202R6562m9636
44755E22665N87648K59021j596873k642614j058861J433417K168937J425528J172975
44746B271843J242555k33311k905335l709818j053944K588994L451790P68328
44738B421102k613642l395293j042967J943105K699417Q52994j431921k003674
44730b570879o44773J405383K710224K233729M7076k007982j730526O21998K307007
44721B371257J673024J18225n68664q36659j620493j895392m57666J237576Q62079
44712H83287r35202j384241j1121P77668k01784j110051k96901J137891J333131
$$ y = [1122545, 254050, -760564, -1263192, -1485611, -1745459, -1541642, -289256, 1633340, 3352426, 4413121, 4542398, 3360178, 1269414, -219468, -180463, 475739, 572301, 522665, 1110313, 1369334, -227539, -2870153, -3929014, -2495597, -326660, 1098868, 2271843, 3514398, 3281087, 375752, -3334066, -4388010, -1799016, 1652774, 2421102, -192540, -3587833, -4630800, -2687695, 11722, 864716, -567205, -2570879, -3215652, -1810269, 899955, 3133684, 3180760, 1172778, -557748, 64250, 2371257, 4044281, 4162506, 3593842, 2757183, 1136690, -758702, -1216368, 21208, 883287, -51915, -1436156, -1447277, -669609, -871393, -1981444, -2278345, -1140454, 192677]
44703A92677L90582l09407k54784L4239J83440K48666K37898R373n20516j185660
44693i73492j404540o17069O74784J092576L86474J57836J331233K204157R12413
44684C764372j356726k069988j316074j126378j445679k63454K177126L011498
44676A374697J374626j97526k06959m41071k011378k672754o19998K023507K392128
44667A015272J128187N26685N81724j2641o98060j08551J036619J134475O02485
44658E206195O34824L37672j630484l630477k850309L1118J602750R37601M00165
44649A039055J052054R79886r07164k753023k761302j615795o03631K89461J156960
44640d123499J232223M57601J30170Q71350J631407J547395J054164M94891m55131
$$ y = [192677, 583259, 273852, 19068, 53307, 236747, 485413, 723311, 732684, 212168, -973492, -2378032, -2995101, -2320317, -1227741, -841267, -683431, 647802, 2851959, 3764372, 2407646, 337658, -978416, -2104794, -3550473, -3813927, -1636801, 1374697, 2749323, 2551797, 2344838, 1903767, -107611, -2780365, -3400363, -1376856, 1015272, 2143459, 2670144, 3251868, 3239227, 2541167, 2432616, 3469235, 4603710, 5206195, 5841019, 6178691, 4548207, 917730, -1932579, -1901461, -298711, 638890, 1039055, 2091109, 3070995, 2163831, -589192, -3350494, -4966289, -5569920, -5280459, -4123499, -2891276, -2433675, -2303505, -1432155, 199252, 1746647, 2800811, 3295702, 2840571]
44631B840571j358781j092487J1844L09796k97897j90129O61195K73973j376791
44622b18706j470368P70302J951606l3875j945555k67711K647297K091591j361432
44613B163149k853827j039164L67275p66780j767142j94233K017815J880958j31567
44604c23516j398500r69160J64658J146059J642569J251732J70418m24728Q287
44595A267819L28701m74950j472088j233388j79347J78938j92312J98618J826997
44586B48988L089919K337101N7147j628156j372991q2489J62649j373094k989551
44577a550477k475619R1114K335434K486050J254941L16990l9113o87038j675431
44568E6851j773570k02134K015689K923278J634615p74789k365132k234282j208289
$$ y = [2840571, 1481790, 389303, 401147, 710943, 413046, 222917, 884112, 1158085, -218706, -1689074, -918772, 1032834, 998959, -946596, -1214307, 1432990, 3524581, 2163149, -690678, -1729842, -1362567, -2129347, -3896489, -4090722, -2072907, -191949, -323516, -1722016, -2691176, -2526518, -1380459, 262110, 1513842, 1684260, 1259532, 1267819, 1596520, 1121570, -350518, -1583906, -1763253, -1584315, -1776627, -1578009, 248988, 3338907, 5676008, 5733155, 4104999, 2732008, 2649519, 2812168, 1439074, -1550477, -4026096, -3934982, -1599548, 886502, 2141443, 2458433, 2419320, 1732282, 56851, -1716719, -1918853, 96836, 3020114, 4654729, 3879940, 1514808, -719474, -1927763]
44559a927763o11840o95539o67602K038R77369J705092J965229J676073Q34183
44550C257240j58088p31505r01272j143841j385300r24169L18880J311235J193599
44541H36779L75123j98949k61571j50132q8983j35371l70595o28068m87745M5586
44531a063926M32717N56205J006443J868810K144581J209011m9683o22286j055338
44522D426534k303945l516996k775372o6519K188726K117094N71748l86003j38634
44513A16633K48786j80187j112191j449630n18959J122220K028878J336999j62688
44504A429861r53015p19752n26925r40810j052113K263J438455J742602P29466
44495A150032l30603m97282j20532Q9177Q3135J80383L73777M45301M05813L20344
$$ y = [-1927763, -2539603, -3235142, -3902744, -3900706, -2923337, -1218245, 746984, 2423057, 3257240, 3099152, 2367647, 1466375, 322534, -1062766, -1986935, -1668055, -356820, 836779, 1211902, 1012953, 751382, 601250, 512267, 376896, 6301, -621767, -1109512, -1063926, -631209, -75004, 931439, 2800249, 4944830, 6153841, 6104158, 5481872, 4426534, 2122589, -1394407, -4169779, -4236298, -2047572, 69522, 641270, 255267, 116633, 365419, 185232, -926959, -2376589, -2895548, -1773328, 255550, 1592549, 1429861, 476846, -242906, -769831, -1710641, -2762754, -2760491, -1322036, 420566, 1150032, 819429, 322147, 201615, 290792, 373927, 554310, 928087, 1373388, 1779201, 2099545]
44485B099545l2986p39849j126486l33419J261778J948406O45341j496286k257961
44476c1917r56428R35399J756704J335294M71996k88441p90272r09072p70655
44467G52608q23207j082495q44414K03732J200585J254564P69881O29949O18543
44458B679746o1654j040675j066543q8184M55104j77182r11161n74346M21616
44449c63279Q94171M96043k34152o94429m92844L25236Q10618j27219j842683
44440a228538k095516j42450J626526Q17626j251149j254194J118956K536830
44432A28091J003815j170656r92052P34823J002716n11926j142845K02243J193729
44423D47938k590j515121o75865J586660K107859M78401n02215M03321R50276
$$ y = [2099545, 2066559, 1326710, 200224, -133195, 1128583, 3076989, 3722330, 2226044, -31917, -988345, -52946, 1703758, 3039052, 3511048, 3222607, 2432335, 1523263, 752608, -70599, -1153094, -1997508, -1793776, -593191, 661373, 1431254, 2061203, 2679746, 2618092, 1577417, 510874, 422690, 877794, 700612, -210549, -784895, -363279, 530892, 1026935, 792783, 98354, -394490, -69254, 741364, 614145, -1228538, -3324054, -3466504, -1839978, -1022352, -2273501, -3527695, -2408739, 128091, 1131906, -38750, -1030802, -295979, 706737, 194811, -948034, -745791, 447938, 445348, -1069773, -1745638, -158978, 1948881, 2427282, 1925067, 2328388, 3278664]
44414C278664m02333j506713k11186J472311L47212k321578k231844J126699L284613
44405B835845J439018j595893k086989o93504k48289p93893k89878J219541J687920
44396A473878P66582K15421O39464P13124m2548m11896M144m5057r36522j173986
44386A202604r902J102598R80641N87078Q67871O59481j198791l190161k953793
44377a952374r06384L64826o2965n54900P3111Q86487P89175K86341K92202N12613
44367b71868J20014q02914j453288j381239o45959N50899J694571J966543J210452
44358I87211M56208O45903J190683P69116o14236j498465j064303k41335j84471
44349D46311o23605n96697j08028N7251j90287j62770K19390J48041o54745j289111
$$ y = [3278664, 2876331, 1369618, 1158432, 2630743, 2977955, 656377, -1575467, -448768, 2835845, 4274863, 2678970, 591981, -101523, -349812, -1143705, -1433583, -214042, 1473878, 2240460, 2455881, 3095345, 3808469, 3765921, 3354025, 3358169, 3313112, 2376590, 1202604, 1192702, 2295300, 3275941, 3863019, 4730890, 5390371, 4191580, 1001419, -1952374, -2858758, -2493932, -2556897, -3111797, -3038686, -2152199, -1363024, -1076683, -784481, -271868, -151854, -954768, -2408056, -3789295, -4435254, -3884355, -2189784, -223241, 987211, 1443419, 2089322, 3280005, 4049121, 3434885, 1936420, 872117, 630782, 446311, -177294, -773991, -882019, -824768, -1015055, -1177825, -958435, -810394, -1465139, -2754250]
44339b754250r69347r2924N58761Q68434R71456O29664j21027m29644K41326J034700
44329f2851Q48302M7813k19546L119l03431j083604j013674L35310J629954J642772
44319A824164P37829j42118p99970j321710j340261p13653j74808l69679p80600
44310c080806m27515P45864J840197K027829J165640k13386j193050j249899r24957
44301a310083j051842j279063m74273J171109J918679J033229j0783N0347K39819
44292B87139o73933j593543o83421J316794J829252L09271j002132n57955M37753
44283c30775K93889o42070r16490j98571O48669R89894Q65031M46907j00594m00844
44273F55046p6995Q07303J679401J768461O92879q96248j582805p59123L54368
$$ y = [-2754250, -3723597, -3816521, -3257760, -2389326, -1417870, -788206, -909233, -1338877, -1097551, -62851, 785451, 833264, 613718, 616837, 313406, -770198, -1783872, -1448562, 181392, 1824164, 2561993, 2419875, 1619905, 298195, -1042066, -1755719, -1930527, -2300206, -3080806, -3508321, -2762457, -922260, 1105569, 2271209, 2057823, 864773, -385126, -1310083, -2361925, -3640988, -4115261, -2944152, -1025473, 7756, -3027, 47320, 287139, -386794, -1980337, -2663758, -1346964, 482288, 791559, -210573, -768528, -330775, -36886, -678956, -1595446, -1794017, -1145348, -155454, 709577, 1156484, 1055890, 655046, 578051, 1385354, 3064755, 4833216, 5526095, 4629847, 3047042, 2287919, 2642287]
44264B642287J47689j115738j577842l59165J333296J958053J365233L04549p26949
44255C971413j461551j530935r46062l89748m23528q03443r86500q41348m93563
44246c905265K0982N59913P82258N99147L70884M84637J064203J979071K590715
44237D546545J823487m98320k588102k347168k09040J167155M48907p46097n38691
44228A058676N54939R07139L45200j35284k83437o05384j023782r82986n35889
44219g00808j01786M37468J200842J376521K11210j411589j810930p66582M01124
44210a164530Q57382R46064R04262M06806l58765n57119n4848L08230K01768L41300
44200A830550J006211J215866J99715j214978j594027p30630K76558M45900j64077
$$ y = [2642287, 2789976, 1674238, 96396, -262769, 1070527, 3028580, 4393813, 4698362, 3971413, 2509862, 978927, 32865, -356883, -780411, -1583854, -2570354, -3411702, -3905265, -3884283, -3324370, -2542112, -1942965, -1572081, -1087444, -23241, 1955830, 4546545, 6370032, 5871712, 3283610, 936442, 727402, 1894557, 2343464, 1597367, 1058676, 1613615, 2520754, 2865954, 2730670, 2447233, 1841849, 818067, -164919, -700808, -802594, -365126, 835716, 2212237, 2423447, 1011858, -799072, -1565654, -1164530, -307148, 638916, 1543178, 1949984, 1591219, 1034100, 979252, 1287482, 1489250, 1830550, 2836761, 4052627, 4252342, 3037364, 1443337, 712707, 989265, 1435165, 1271088]
44191A271088p40721n61898K77494Q75833N39146k85189n67434o4235N45588P86221
44181B075893P75882N14145j64268p75475n27716J51305k41324j880258k681697
44172b753513r88941J816503K890803J558371j91039o56826k97718l28458p88636
44163B60546p69647J69694J469384K069637J146367j125488l219421l298238j180081
44154d477247J169885J723437O39284k24932K34287J278884J691854J251741M59374
44145C746567l50725r37652q40433k1867N87450J68860o22015m95785L71023M49374
44135B054797o72401j462136q70029j33320q21917k148763j937151J94356K283358
44126c513206K635719J561020L40743k90125l24791j12197n4649k6284O84787
$$ y = [1271088, 530367, -31531, 245963, 1121796, 1660942, 1375753, 808319, 744084, 1289672, 2075893, 2851775, 3365920, 3201652, 2426177, 1898461, 2049766, 1808442, -71816, -2753513, -3742454, -1925951, 964852, 2523223, 2332184, 1675358, 1377640, 1049182, 260546, -509101, -339407, 1129977, 3199614, 4345981, 3220493, 1072, -3297166, -4477247, -3307362, -1583925, -944641, -1169573, -935286, 343598, 2035452, 3287193, 3746567, 3395842, 2458190, 1617757, 1595890, 2183340, 2352200, 1730185, 1234400, 1605423, 2054797, 1382396, -79740, -949769, -1083089, -1905006, -4053769, -5990920, -5796564, -3513206, -877487, 683533, 1024276, 734151, 409360, 297163, 242514, 216230, 901017]
44117I01017K013205K316311M24260j999929k178456k04309J063460M31315n4522
44108B712352R56027J519729j58089k171831j695669M21867J105320L3922l54393
44099B369235M97632L47583j520239k574532j112547R18116J147103L68844N30373
44090I71568J091900K28025j481014j531885N45319K323066J936501K92808p89533
44081C586755q71798m96602P1385O99101R18666M77092k61339r62417j620376
44072A540467j818550p81854J066947J718159K3319k194585k060311M83343K341028
44063C17963J256625j242834j926153m8558J918882J713931J12432m67896N74877
44054B209269J328401K99256j294528j245134M05246J414751N76524p58249r56825
$$ y = [901017, 2914222, 5230533, 5654793, 3654864, 1476408, 1272099, 2335559, 2766874, 2712352, 3668379, 5188108, 5030019, 2858188, 1162519, 1584386, 2689706, 2723628, 2369235, 2866867, 3214450, 1694211, -880321, -1992868, -1074752, 72351, 441195, 971568, 2063468, 2291493, 810479, -721406, -176087, 2146979, 4083480, 4376288, 3586755, 2714957, 2218355, 2289740, 2988841, 3907507, 4384599, 4123260, 3160843, 1540467, -278083, -1059937, 7010, 1725169, 1748488, -446097, -2506408, -2023065, 317963, 1574588, 331754, -1594399, -1642957, 275925, 1989856, 2102288, 1634392, 2209269, 3537670, 3836926, 2542398, 1297264, 1702510, 3117261, 3693785, 2935536, 1978711]
44045A978711l45567q1740j03844K67650O45231K87435j22543N77360J584891
44036D687584Q90668j318844k392409j118639M19713K19499n54431K27184K037205
44027C097530K582897J291781l83588j499555k188326k079848n61314J290530
44019A550107J328849n91723k124578j639502j17512Q52064J131135J102626M07478
44010A898944j011668j898861j188922L35075J161949J089717R41423R42254O91787
44001B961698L03169K80461M51704J57111n44242q42343m25327N4905p1097o81287
43991A644752j154093j028226k58854Q23790J643819J663334P65743n21964j280295
43982B298006j032926m34482n68384j272367j037151O88635K128424J466538l73466
$$ y = [1978711, 1633144, 1551404, 1447560, 1715210, 2360441, 2647876, 2525333, 3102693, 4687584, 5578252, 4259408, 1866999, 748360, 1168073, 1387572, 833141, 1060325, 3097530, 5680427, 6972208, 6588620, 5089065, 2900739, 820891, 259577, 1550107, 2878956, 2287233, 162655, -1476847, -1594359, -742295, 388840, 1491466, 1898944, 887276, -1011585, -2200507, -1865432, -703483, 386234, 1327657, 2269911, 2961698, 3264867, 3545328, 3997032, 4154143, 3609901, 2767558, 2342231, 2397136, 2326039, 1644752, 490659, -537567, -796421, 27369, 1671188, 3334522, 4100265, 3578301, 2298006, 1265080, 830598, 262214, -1010153, -2047304, -1358669, 769755, 2236293, 1862827]
43973A862827j092656n23912m38270j103707q60470M71194Q15775m06986q09647
43964b085852Q79264K172299P82472j313571r15467J228746J820169L36674p13481
43955B191253k87335P9539l35063l79469J77213k3871j030395r72757N97104J527024
43945A543243N63342m87404K46488J658453J501435k69778j811234k005133j229931
43936b90519k60012L76933M51541K22988J07005p5392o68613j021901j14436J539085
43926B66679K212362J447716M61318j72535j106841k016308j338233P30129J543382
43917B027669j03567j799008j178482M84432P20510r8629K68P97401M45795r44282
43907C52107j325845j36717R99635J104247R56115J081607Q36547Q593n49845
$$ y = [1862827, 770171, 246259, -192011, -1295718, -2156188, -1684994, -869219, -1276205, -2085852, -1206588, 965711, 1748183, 434612, -480855, 747891, 2568060, 2904734, 2191253, 1903918, 1983457, 1648394, 1268925, 1446138, 1422267, 391872, -580885, 16219, 1543243, 2106585, 1619181, 1865669, 3524122, 5025557, 4755779, 2944545, 939412, -290519, -550531, -173598, 277943, 500931, 607936, 532544, -136069, -1157970, -1272406, 266679, 2479041, 3926757, 4388075, 4215540, 3108699, 1092391, -245842, 484287, 2027669, 1924102, 125094, -1053388, -568956, 151554, 52925, 53193, 850594, 1296389, 352107, -973738, -1110455, -110820, 993427, 1949542, 3031149, 3867696, 3876289, 3326444]
43898C326444m71146m64735q50539r55523m73613p8124j48192j17246L30880N20688
43888F18894p1921p61839m54847Q98564K099040J837845N1101j752756j912338
43879E51743o07772K75639k37409p47539L67082K283788K710094J046494r42510
43870D699610j521175p61887J18570J93658m69445r06999k82986P88114P30038
43861B587498o15628j361789l60623Q69389N92453k42134K81395J602055J547912
43852D900528n0488j294854j413751j340946j258883l42423R23221R48007r7795
43843I72616l57476L66349K53113r11546r08618R55122K192099J147866k08561
43834C500964L39537J600346J214192m24465j187593q11533q53165j781731k363382
$$ y = [3326444, 2855298, 2390563, 1540024, 584501, 110888, 32764, -115428, -232674, 98206, 618894, 546973, -214866, -669713, 228851, 2327891, 4165736, 4216837, 2464081, 551743, -56029, 219610, -17799, -765338, -398256, 1885532, 4595626, 5642120, 4699610, 3178435, 2416548, 2535118, 2728776, 2259331, 1352332, 1069346, 1857460, 2587498, 1971870, 610081, 249458, 1118847, 1711300, 1469166, 1750561, 3352616, 4900528, 4850040, 3555186, 2141435, 800489, -458394, -800817, 122404, 1070411, 972616, 615140, 981489, 1234602, 323056, -585562, 369560, 2561659, 3709525, 3500964, 3840501, 5440847, 6655039, 6230574, 5042981, 4231448, 3378283, 1596552, -766830]
43825g66830j662532n9165J456916K002865J414502P82355J297935K097739J023296
43816G587081j732936l080567j506149M22797O8624j221644p89475P37275Q35008
43807A320014m01937o89812K94237O62490n6112k93123M66115R17531N14009J24333
43797B857745r1287q39698j542398p57891R00611J053384o88157k006491j611271
43788b725453q79184q70412o30213K44170K49818j033815j287007R92747L542423
43779b396926L460533J482314M46527Q43353P54054m91553j424931j171580o37657
43770H64134n56691l13973O15665J529044J549391Q37078J12750l30656n78053
43761C728689n13224J24986J107781J478686L69953j723349k941461k047122j58417
$$ y = [-766830, -2429362, -2488527, -1031611, 971254, 2385756, 3168111, 4466046, 6563785, 7587081, 5854145, 2773578, 1267429, 1690226, 1758850, 537206, -252269, 485006, 1320014, 918077, 228265, 522502, 1184992, 1128880, 835757, 1301872, 2219403, 2733412, 2857745, 2766458, 1926760, 384362, -373529, 527082, 1580466, 892309, -1114182, -2725453, -3604637, -4475049, -5105262, -4861092, -4611274, -5645089, -6932096, -5939349, -2396926, 1063607, 2545921, 2992448, 3835801, 4589855, 4098302, 2673371, 1501791, 864134, 307443, -6530, 609135, 2138179, 3687570, 4524648, 4637398, 4306742, 3728689, 3215465, 3340451, 4448232, 5926918, 6296871, 4573522, 1632061, -415061, -573478]
43752e73478N20414l47859q56984K44158J726368J790280N76158l77245l33672
43743B368140J36296K97157r9860q87721j442593j059622J9032O28867L14508
43734B74204o535K63112K62903o15349j106982J66187K165937K559325R70177
43725D932979p17791j166718r21462q39554q55619o84614m03022K8172O90068
43716F2439J015083L71851o02049o08681K76662O83259K18624n3427K28228J8459
43706A610448r35991j207271j94507M24052n69003j476050j83861K141008K442042
43697B050867K87023j611855j394922j07815O72933R46692J157432R85349M10268
43688C395972K80492O45678J81730j385589k041817m85614J267028O83467j141695
$$ y = [-573478, -53064, -400923, -1257907, -1013749, 712619, 2502899, 3079057, 2701812, 2368140, 2504436, 2801593, 2701733, 1814012, 371419, -688203, -669171, -40304, 274204, 267669, 530781, 793684, 178335, -928647, -762460, 1403477, 3962802, 4932979, 4215188, 3048470, 2127008, 1287454, 431835, -252779, -655801, -627629, 62439, 1077522, 1449373, 847324, 238643, 515305, 1198564, 1417188, 1363761, 1591989, 1610448, 674457, -532814, -727321, -303269, -872272, -2348322, -2532183, -391175, 2050867, 2337890, 726035, -668887, -776702, -103769, 842923, 2000355, 2985704, 3395972, 3676464, 4322142, 4503872, 3118283, 1076466, 590852, 1857880, 2541347, 1399652]
43679A399652j121300O75131R85345j164266k538247p72668J811549J931757M05258
43670A612211L59837J936053K267459K98506j685065j728514n95273L05165R24791
43661C695170J429381J166437J00410m66591M2520K74552p51559j638643o72242
43652C179435J268024J807870M06800j274221j950825j882708j562614r05421
43644i13660q644N58469N80901M52515M69971N72803P01363P52481M75478Q8537
43634C730214L95885J372891J473347k58629k184607k057519m73188l3345j150301
43625H14748j345633O13999K538598K195562O08234K8900L71466J42j027912j032700
43615C765404K58785J001200j03160k062923l021857k297717o12872Q56636J363358
$$ y = [1399652, 278352, 953483, 1938828, 774562, -1763685, -2536353, -724804, 1206953, 1612211, 1972048, 3908101, 6175560, 6474066, 4789001, 3060487, 2465214, 2770379, 3695170, 5124551, 6290988, 6391398, 5924807, 5967327, 6241879, 5490320, 3851677, 3179435, 4447459, 6255329, 6662129, 5387908, 3437083, 1554375, -8239, -913660, -922304, -363835, 217066, 669581, 1139552, 1712355, 2413718, 3166199, 3641677, 3730214, 4126099, 5498990, 6972337, 6713708, 4529101, 2471582, 1998394, 1965049, 814748, -530885, 83114, 2621712, 4817274, 5425508, 5454408, 5825874, 5826016, 4798104, 3765404, 4024189, 5025389, 4922229, 2859306, -162551, -2460268, -3073140, -2216504, -853146]
43606h53146J079546P62721O23686N2922r54750j052054N56914K305122K085786
43597D606747L71984n30589j47036l04071j538082j733040L02339K278454J570177
43588D876883p58919j556491k41654P36097j29327j421187j252745K34938J570542
43579B058137J751697O95793r49752j890114j135393O10425J485399Q05354j83428
43570C248118k81786J55187K90120J38204m018l50018r13954j025787n05885k98892
43560D51289r19868j379333q58158k61851n73128q15819L64622J978942J885571
43551a27733K63235n87730J10595P36269M31593N00298J646821K267157J047080
43542F287585o81574r39147L4012O27753L48244k20367q39793j316058p91157
$$ y = [-853146, 226400, 989121, 1612807, 1665729, 710979, -341075, 215839, 2520961, 4606747, 4978731, 4448142, 4301106, 3997035, 2458953, 725913, 1028252, 3306706, 4876883, 4117964, 2561473, 2319819, 3055916, 2926589, 1505402, 252657, 487595, 2058137, 3809834, 4505627, 3555875, 1665761, 530368, 1140793, 2626192, 3431546, 3248118, 2966332, 3121519, 3411639, 3549843, 3545825, 3195807, 2281853, 1256066, 750181, 451289, -468579, -1847912, -2706070, -2967921, -3541049, -4356868, -3992246, -2013304, -127733, 135502, -452228, -341633, 394636, 826229, 1326527, 2973348, 5240505, 6287585, 5606011, 4666864, 4700876, 5328629, 5676873, 5456506, 4616713, 3300655, 2509498]
43533B509498Q90459K019667J123314n49578o87662N44773Q99265k90985j250412
43524E208339q13276m7803j41855o34392o80306m45060k46311K90054J178777
43515C668167J404841M06319p77590r36622m22976l54050p89490q83180m15145
43506I00274j8962j6794r001K84600N27739L79109J49898M70592J338441J810428
43496E816324J039937m00219r14955K861Q75473L06858q56096q08389L10874O43347
43486F016015k78529o98006M47012J660994J131209n91167j522927r09889L13026
43477E567738J044209Q93048N2664q03564r36334m48628j77552k99003l2292P85954
43467E646240J142431O26994L38924R60578J378788N37589p42100j252393j240567
$$ y = [2509498, 3399957, 5419624, 6542938, 5993360, 5305698, 5850471, 6749736, 6458751, 5208339, 4395063, 4347260, 4205405, 3571013, 2890707, 2445647, 2199336, 2489390, 3668167, 5073008, 5479327, 4701737, 3765115, 3342139, 2988089, 2198599, 1315419, 900274, 881312, 864518, 855517, 1140117, 1667856, 2046965, 2196863, 2667455, 4005896, 5816324, 6856261, 6456042, 5541087, 5543948, 6419421, 6726279, 5870183, 5061794, 5372668, 6016015, 5737486, 5039480, 5486492, 7147486, 8278695, 7687528, 6164601, 5254712, 5567738, 6611947, 7504995, 7557659, 6754095, 5817761, 5369133, 5191581, 4892578, 4860286, 5646240, 6788671, 7415665, 7754589, 8715167, 10093955, 10631544, 9889444, 8637051, 7396484]
43458G396484j121497l1455K167079L095055Q98733k151402k321677J02605J476906
43449I510831N61224k19010M67293Q94853J53038M2902J321169J684111j51964
43440A4264447j644580n24116J199870N94423j278632j462234k37876j93002j372760
43431I345540j456358k41198P8038q54276r38318K33938L86314j214056k046419
43422C293205m46610J610904J701079L28567p87989j431439j828024j083282R78388
43413B334799K251561J101506q13488r47655K32480L98690o75240j194593p50463
43404A937597o50831r85801l31991J230240J601563M1909j361094p84475P88203
43395A485320J440978J049067O73048N56353K53737j10153p8370J62076P2516
$$ y = [7396484, 6274987, 6243532, 8410611, 11505666, 12404399, 10252997, 7931320, 8033925, 9510831, 10072055, 9853045, 10320338, 11215191, 11368229, 11411131, 12732300, 14416411, 14264447, 12619867, 12095751, 13295621, 13890044, 12611412, 11149178, 10911302, 10718300, 9345540, 7889182, 7647984, 7726022, 6871746, 5933428, 6167366, 6553680, 5339624, 3293205, 2846595, 4457499, 6158578, 6487145, 5699156, 4267717, 2439693, 1356411, 2334799, 4586360, 5687866, 4874378, 3926723, 4159203, 4557893, 3882653, 2688060, 1937597, 1286766, 300965, -31026, 1199214, 2800777, 2842686, 1481592, 697117, 1485320, 2926298, 3975365, 4648413, 5204766, 5458503, 5348350, 5269980, 5432056, 5504572]
43386E504572l90544r36091j403441j495196p81997L89341Q09047k2041j025412
43377F48238j059131m79254k30614j55351N80299J817210K366565J554536o2513
43368D979985j430400j773100q55570Q21971K172968K352793J370598j91176j529284
43359E918785j652776j30989J748298J794375k87823k100093j605698K09030J043791
43350D936900M73957k47482n83958r25789j049192m29511K63868j6223o85068
43341A737502l93618M10191J46379q08979m14986J361589K086189R06337R2573
43332E123177J089199J887629M79707j502129j288093O19157J417353L30314q49459
43323G306855j002132p86349n85074J89859J378380J705747P14305n10747j019368
$$ y = [5504572, 5114028, 4177937, 2774496, 1279300, 497303, 886644, 1695691, 1673650, 648238, -410893, -890147, -1120761, -1276112, -695813, 1121397, 3487962, 5042498, 4979985, 3549585, 1776485, 920915, 1742886, 3915854, 6268647, 7639245, 7448069, 5918785, 4266009, 4135020, 5883318, 7677693, 7389870, 5289777, 3684079, 3893109, 4936900, 5410857, 5163375, 4579417, 3653628, 2604436, 2174925, 2438793, 2422570, 1737502, 1343884, 1754075, 1900454, 1091475, 676489, 2038078, 4124267, 5030604, 5123177, 6212376, 8100005, 8579712, 7077583, 5789490, 6408647, 7826000, 8156314, 7306855, 6304723, 5518374, 4933300, 5123159, 6501539, 8207286, 8921591, 8410844, 7391476]
43314G391476j020615q44358k70045N45330O95941j57011r58461n20740Q39718
43305E701235J519921L99083j805180l011607j873410N43768J746213O74295j214733
43296B679585k039484j535656l83594J079719K305493K087893L21599r73729k84158
43287C257668Q50209J86187j334394r41286J194849J889339K6196j606863p61043
43278B760862R48458R45016m55647j161590n27302N39841J365166J611352P77375
43269F803531p59756j355328l37483N90954j26532j313215j024430J19510K2822
43260B620073j252487j639059o33841j6375o27187r20368L32096J899012J920700
43251A682564N17568o63574o53133J09142P21270P37972L84455J83632J97897
$$ y = [7391476, 6370861, 5526503, 5256458, 5801788, 6497729, 6340718, 5382257, 4861517, 5701235, 7221156, 7620239, 5815059, 2803452, 930042, 1473810, 3220023, 3894318, 2679585, 640101, -895555, -1279149, -199430, 2106063, 4193956, 4515555, 3541826, 3257668, 4107877, 4294064, 2959670, 2018384, 3213233, 5102572, 5128768, 3521905, 2760862, 3709320, 4654336, 4198689, 3037099, 2509797, 3049638, 4414804, 6026156, 6803531, 6043775, 4688447, 4350964, 4941918, 4815386, 3502171, 2477741, 2597251, 2620073, 1367586, -271473, -905314, -921689, -1548876, -2469244, -2137148, -238136, 1682564, 2200132, 1536558, 883425, 992567, 1713837, 2451809, 2836264, 3019896, 3217793]
43242C217793j43538r34927j023256N09009K393594K283653M556j929768j654852
43233B722264k63749J93446l68922n46603J02869O91728P19478O60062P40226
43224D650799L71805p41076j749471j543830j92001R98634R18034q9195o76417
43215A947282k16798L98548J02975o98297p30602J18916O10467J90776j55947
43206A567320K56475N18587j91321q32589l3782J390243J368058k38366j329417
43197B475208o55664O55309J196902J098761Q26520j28270j938288l113933k202591
43188a786046q7610J026202M76076n19332j006988j136110r58755j20869R60507
43179c152925J158137L75809j09341M07992J056419R67131N90605O18549P59689
$$ y = [3217793, 3074255, 2139328, 1116072, 1625081, 4018675, 6302328, 6306884, 4377116, 2722264, 2458515, 2651961, 2283039, 1736436, 1839305, 2531033, 3250511, 3910573, 4650799, 5022604, 4281528, 2532057, 988227, 796226, 1794860, 2712894, 2623699, 1947282, 1730484, 2129032, 2232007, 1533710, 803108, 922024, 1532491, 1723267, 1567320, 1823795, 2342382, 2151061, 1318472, 1284690, 2674933, 4042991, 3804625, 2475208, 1819544, 2474853, 3671755, 4770516, 5597036, 5468766, 3530478, 416545, -1786046, -1873656, -847454, -371378, -890710, -1897698, -3033808, -3992563, -4113432, -3152925, -1994788, -1618979, -1728320, -1320328, -263909, 703222, 1293827, 1912376, 2672065]
43170B672065N61161M26347P47704R04703K47338o51767q24747l37611J35840
43161C881033M57704O78152L60514n03728p62862K18615R85487o0661j783204
43152C471050j611675M58331J590050K76035j497231j259204O06100J821553J252723
43143E107732k35526j147535o98223N90365J178472J50294j311574j259177J33191
43134B508019O80338m06825j222382k66901J127699J059504J13408J53893J127790
43125D874543J228927j20119j352745r86753N47170J619689J250051R0833k79022
43116F872574O61061J331325N3931k091186k281717j76167J250967K07750j135423
43107D693115l27105J293056R98330o61093r22635M92059J192047K96186n08056
$$ y = [2672065, 3233226, 3659573, 4407277, 5311980, 5559318, 4907551, 4082804, 3745193, 3881033, 4338737, 5016889, 5377403, 4873675, 4110813, 4329428, 5314915, 5254254, 3471050, 1859375, 2317706, 3907756, 4183791, 2686560, 1427356, 2033456, 3855009, 5107732, 4872206, 3724671, 3026448, 3616813, 4795285, 4945579, 3634005, 2374828, 2508019, 3188357, 2781532, 1559150, 1292249, 2419948, 3479452, 3592860, 3746753, 4874543, 6103470, 5983351, 4630606, 3643853, 4191023, 5810712, 7060763, 7151596, 6872574, 7533635, 8864960, 8918891, 6827705, 4545988, 4369821, 5620788, 5828538, 4693115, 4366010, 5659066, 6657396, 5996303, 5073668, 5565727, 6757774, 7053960, 6545904]
43098F545904k79184j57777q19034j252859q13067k02115J86815P69834J223881
43089E202398P16577J6075Q21686K505673K351495j12497j979888j433629l52156
43080G735734o82048j127134J05304J697486J251586p65085j936037j544313o57335
43071D078158M03522J951234K957756J917086m73398j860099j466128o74535l80263
43062F453333J01269J166129J909129J616151Q21803K97822Q9529l9988j31354
43053A2283823k47024m21441l99201j16628j26084o86065r45448j59916Q42401
43044A0024417Q25468K76705O36064J636753J421124m24798j900880j386183K03793
43035A1312463R76576M98084l19837p70506p89671n12943k29101l01258n66182
$$ y = [6545904, 6266720, 6108943, 5289909, 4037050, 3223983, 3021868, 3208683, 3978517, 5202398, 5918975, 5935050, 6756736, 9262409, 11613904, 11501407, 9521519, 8087890, 7735734, 7053686, 5926552, 6031856, 7729342, 8980928, 8215843, 6279806, 4735493, 4078158, 4481680, 6432914, 9390670, 11307756, 10834358, 8974259, 7508131, 6833596, 6453333, 6554602, 7720731, 9629860, 11246011, 12067814, 12365636, 12455165, 12415177, 12283823, 12036799, 11615358, 11216157, 11099529, 10973445, 10287380, 9341932, 9182016, 10024417, 10849885, 11126590, 11762654, 13399407, 14820531, 14395733, 12494853, 11108670, 11312463, 12289039, 12787123, 12467286, 11696780, 10907109, 10394166, 10165065, 9863807, 9297625]
43026I297625l35103N34841J176283Q54644L1634k79871J94564Q58988J084563
43017A3418168P48131J68243j79667m3422L77223P39447R81567J098934P51043
43008A8059667k60704j265598j280051l23504O05591R08000Q81883Q11428O20556
42999A8757268O27306J406521K427109K153628L65144q92398M9404J901406K140358
42990B8935746P22160J25330J617405L404154L268122J537023K56126M11284J264459
42981D1541809J859251J911494J494262J017464J333984K670781L642248K816858
42973E8288151J290996J821333M806221P187505O653791M953103M956285O078410
42965I6035795N479835K931057J187760J514792K175114K126457K936211N507247
$$ y = [9297625, 8962522, 9497363, 10673646, 11528290, 11559924, 11280053, 11474617, 12333605, 13418168, 14166299, 14334542, 14154875, 14111453, 14488676, 15228123, 16209690, 17308624, 18059667, 17798963, 16533365, 15253314, 14929810, 15535401, 16443401, 17325284, 18136712, 18757268, 19384574, 20791095, 23218204, 25371832, 25736976, 24844578, 24893982, 26795388, 28935746, 29657906, 29783236, 31400641, 34804795, 38072917, 39609940, 39866066, 40277350, 41541809, 43401060, 45312554, 46806816, 47824280, 49158264, 51829045, 55471293, 58288151, 59579147, 61400480, 66206701, 73394206, 80047997, 85001100, 89957385, 96035795, 101515630, 104446687, 105634447, 107149239, 109324353, 111450810, 114387021, 119894268]
42957A19894268P919650Q694082R603051J2599760J6140760J7668701J8103592
42950B10623864K0366682K4334684K6801083K6147714K3542011J9317125J1826043
42943C62959206J021389r929090j8191959k4006591k8389176l0508532k9348859
42936B23606388k6153963k3061609k0493172j7743359j5071143j3278430j1972399
42929I5832313j0128519p982928o723933o543483o456041n902927n195272m439060
42921D2460150l310248j989672j189724j073165j113391j180644j770020k832765
42913B8000521l330857k563260j296919q70228j480774k025716j572161l88235
42905A4472371O08532Q79311M33891m87053j308695j147282J36786J120110K56722
$$ y = [119894268, 127813918, 136508000, 146111051, 158710811, 174851571, 192520272, 210623864, 230990546, 255325230, 282126313, 308274027, 331816038, 351133163, 362959206, 363980595, 354051505, 335859546, 311852955, 283463779, 252955247, 223606388, 197452425, 174390816, 153897644, 136154285, 121083142, 107804712, 95832313, 85703794, 77720866, 70996933, 64453450, 57997409, 52094482, 46899210, 42460150, 39149902, 37160230, 35970506, 34897341, 33783950, 32603306, 30833286, 28000521, 24669664, 22106404, 20809485, 19939257, 18458483, 16432767, 14860606, 14472371, 15080903, 15960214, 16394105, 15907052, 14598357, 13451075, 13587861, 14707971, 14964693]
42896A4964693j730242k293542m35771J829140K311913J431414P79841L85587
42888A7243033n95349j531926j045305M03647R75543K90128m32804q51427j635691
42879A2819849k158463q60485J644926K689446J580747O66704J280674J630324
42871A9293722L84593n98553N07784K028672J320915j017302k229700j369406
42863A8320725L48308J955832L029005K725836J055606O6482J219367K632834
42855C1353995J692596o24239j193843J88197O90429p14164j866323j396983p01513
42846B7428152r21010j012029j98666L45583j51462l81089O72388J730291J372973
42837B8885131M00125K00853L64200j09125n62558J82387J381214J286112Q1312
$$ y = [14964693, 13234451, 10940909, 10505138, 12334278, 14646191, 16077605, 16857446, 17243033, 16647684, 15115758, 14070453, 14474100, 15449643, 15739771, 15306967, 14455540, 12819849, 10661386, 9800901, 11445827, 14135273, 15716020, 16382724, 17663398, 19293722, 19678315, 19079762, 19587546, 21616218, 22937133, 21919831, 19690131, 18320725, 18669033, 20624865, 23653870, 26379706, 27435312, 27501794, 28721161, 31353995, 33046591, 32422352, 31228509, 31416706, 32107135, 31392971, 29526648, 28129665, 27428152, 26507142, 25495113, 25296447, 25642030, 25490568, 25109479, 25781867, 27512158, 28885131, 29285256, 29486109, 29850309, 29741184, 29178626, 29361013, 30742227, 32028339, 32109651]
42828C2109651k11299J190579K672224K568906J259579K92265M30395J294499
42820D1606799K306710L175543L607168L275344K413825K041734K995560M745804
42812F6168487N818887N591815M920411M586129M078886K780668J433557J097003
42804I6475843J243054M22452j475405l216102m332728n523201o821310p179236
42796F9593367o358094n574545n577702n565769m768992l707687l046233k540502
42788C2453843k046179k270334l432077m315114l828061k579435j783290j449313
42780A0750040p92359K78529J157694J423352Q44034p22877k504870k793169r66842
42771F673532J186468J488213J58543p58616l41686L13653Q3365o81179r63141
$$ y = [32109651, 31898352, 33088931, 35761155, 38330061, 39589640, 39881905, 40312300, 41606799, 43913509, 47089052, 50696220, 53971564, 56385389, 58427123, 61422683, 66168487, 71987374, 77579189, 82499600, 87085729, 91164615, 93945283, 95378840, 96475843, 97718897, 98141349, 96665944, 93449842, 89117114, 83593913, 76772603, 69593367, 63235273, 57660728, 52083026, 46517257, 41748265, 38040578, 34994345, 32453843, 30407664, 28137330, 24705253, 20390139, 16562078, 13982643, 12199353, 10750040, 9957681, 10236210, 11393904, 12817256, 13661290, 12938413, 10433543, 7640374, 6673532, 7860000, 9348213, 9506756, 8748140, 8406454, 8720107, 8803472, 8122293, 7159152]
42762G159152m47628K86485M17089l72386j404494j471723k90364Q68057P25750
42753E469938j58115r0020J274286K279279J514753k31586j100782p17708m72373
42744G767672j119663j348612K08523K344726K429877K28533j492458j033469
42736G985129k72313j314150k640014j453118J409261K440391J000015J02479
42728G257680J147769J732713J73344j416666q14655O35121O94835m8701m1515
42719I319925L41j066790j736901j84419J863798J368258r71604j812845o74596
42710F105167k56326j346184j631955k52546M96970o55248j646883o99098Q22516
42701I36413J099980P39844Q93617Q64589j67127j007067l90357M80554k89346
$$ y = [7159152, 6711524, 6998009, 7415098, 7042712, 5638218, 4166495, 3876131, 4744188, 5469938, 5311823, 5221803, 6496089, 8775368, 10290121, 10058535, 8957753, 8240045, 7767672, 6648009, 5299397, 5507920, 7852646, 10282523, 10511056, 9018598, 7985129, 7712816, 6398666, 3758652, 2305534, 3714795, 6155186, 7155201, 7257680, 8405449, 10138162, 10311506, 8894840, 8080185, 8715306, 9410141, 9361440, 9319925, 9320266, 8253476, 6516575, 6332156, 8195954, 9564212, 8592608, 6779763, 6105167, 5848841, 4502657, 2870702, 2618156, 3115126, 2459878, 812995, 113897, 936413, 2036393, 2776237, 3669854, 4534443, 4367316, 3360249, 2969892, 3450446, 3161100]
42692C161100k067867k514504r75023R17664J688937J438634R87636Q74057J120084
42683D630718J213444N84735m76877j037538r47039r86190j209308o03360Q96312
42674B064897J700630R68610J05984N09879J371559J327688Q04553Q12377P41165
42665A0407342m23064j706389j385113J2870L81397n89567j128011m80600N3130
42656E141995m59082j258836j528344j422769q97809N74133K319881K352602J03555
42647D925326k220944k295509n59435P85949P16968K6122l21773j64253K67690
42638A160141O62231N64789k10311j067429j103919j93387P66072Q13455J3337
42629A404979n23869J32071J465900J918666Q56791m81294o96092k22177m48742
$$ y = [3161100, 1093233, -1421271, -2396294, -1478630, 210307, 1648941, 2636577, 3510634, 4630718, 5844162, 6428897, 5952020, 4914482, 3967443, 2981253, 1771945, 1168585, 2064897, 3765527, 4734137, 4840121, 5350000, 6721559, 8049247, 8853800, 9666177, 10407342, 9984278, 8277889, 6892776, 6905646, 7287043, 6697476, 5569465, 5088865, 5141995, 4682913, 3424077, 1895733, 472964, -424845, 149288, 2469169, 4821771, 4925326, 2704382, 408873, -150562, 635387, 1352355, 1378477, 1056704, 892451, 1160141, 1822372, 2387161, 2176850, 1109421, 5502, -187885, 578187, 1391642, 1404979, 881110, 1013181, 2479081, 4397747, 5254538, 4773244, 4077152, 3854975, 3406233]
42620C406233j310568j360388k67106N02471J6078p48261p08348l43861m13837
42611a227587l81153M21376J163109P55551o9209K26099J337805J440533Q8078
42602C754602j154080j285372j182886j619396j709887n20291J083617J606650
42594a027043J116980Q67547J193774J149413J56035j133118j799744j683494
42586a159650j231890q75678o85755l28175N29470J495544J591612O53941j319
42577a1900P45490J974669J857373L84682o32032m51811m77997j654767k530505
42568g96798j389157R26948K125881J691486J091973J023227M77199j033078k135198
42559A982483j493572J49912R61315L62748o08153r04489n42778j57917j34101
$$ y = [3406233, 2095665, 735277, 468171, 970642, 986720, 238459, -469889, -813750, -1227587, -1608740, -1187364, -24255, 731296, 662087, 888186, 2225991, 3666524, 3754602, 2600522, 1315150, 132264, -1487132, -3197019, -3717310, -2633693, -1027043, 89937, 957484, 2151258, 3300671, 3456706, 2323588, 523844, -1159650, -2391540, -3267218, -3952973, -4281148, -3751678, -2256134, -664522, -10581, -11900, 733590, 2708259, 4565632, 4950314, 4318282, 3866471, 3388474, 1733707, -796798, -2185955, -1259007, 866874, 2558360, 3650333, 4673560, 5150759, 4117681, 1982483, 488911, 638823, 1600138, 1962886, 1354733, 450244, -92534, -250451, -384552]
42550c84552k74470o9432O75991J417485J332651L08464q61367j364508j058900
42541b78638k16971Q10886J429545R64931m75571j751785j840427r48560n0416
42532b357006L53820N17417P38608R15543P76848K52758l23035l13627N59658
42523A120984J506388J189051o12055k358687k376588p79132Q23443J246055P10999
42514D70458J14301K9662M47965R05583P70354j50431j205204j468447p73438
42505h59197J29204M61863J82922j63402j15780K66705N80511O87377R49867J506805
42495C626875J556015K20117j743713k241701n72616J171181O47432j474658k342174
42486a153242q28626J045031J025524m93578j442055r25679J06186O45062Q53242
$$ y = [-384552, -659022, -728454, -52463, 1365022, 2697673, 3006137, 2144770, 780262, -278638, -495609, 315277, 1744822, 2709753, 2234182, 482397, -1358030, -2306590, -2357006, -2003186, -1485769, -747161, 168382, 945230, 1197988, 874953, 561326, 1120984, 2627372, 3816423, 3204368, 845681, -1530907, -2310039, -1486596, -240541, 470458, 584759, 614421, 1062386, 1967969, 2738323, 2587892, 1382688, -85759, -859197, -729993, -268130, -85208, -248610, -364390, -97685, 482826, 1170203, 2120070, 3626875, 5182890, 5403007, 3659294, 1417593, 844977, 2016158, 2663590, 1188932, -1153242, -1981868, -936837, 88687, -404891, -1846946, -2772625, -2666439, -2021377, -1168135]
42477a168135J271279J659427J295075J52737r06506j291765j417753j765142
42469b170783j746557n27834J185620J546330J56693j117676p86568J66587J61511
42460c132677k67838L85265J564271J240018n23915j224713J32264J209472p6803
42451f94656k168427k092662K28045K106401J923861P38819J43902L71161Q57027
42442A413471J208939J097624K99772o85932r85622o64000p38235j483702j770687
42433b308372p58514O80726J150604O63548L30238N29461N59860P8270k52146
42424F73675J01712O50753O77431K92423Q1242J26734L5225l06297o13626p26808
42414I92464p13643n46196j65482K58248O11945J111787J633432J192679p66468
$$ y = [-1168135, 103144, 1762571, 3057646, 3210383, 2303877, 1012112, -405641, -2170783, -3917340, -4445174, -3259554, -1713224, -1556531, -2674207, -3460775, -3294188, -3132677, -3400515, -3015250, -1450979, -210961, -734876, -1959589, -1827325, -617853, -694656, -2863083, -4955745, -4727700, -2621299, -697438, 41381, 185283, 556444, 1413471, 2622410, 3720034, 4019806, 3333874, 2348252, 1684252, 946017, -537685, -2308372, -3066886, -2386160, -1235556, -572008, -241770, 287691, 847551, 925821, 673675, 775387, 1426140, 2103571, 2395994, 2477236, 2603970, 2639195, 2332898, 1719272, 992464, 278821, -267375, -432857, -174609, 437336, 1549123, 3182555, 4375234, 3608766]
42405C608766k753583k458399L5122J875431J141282o25601q82856L29019J083646
42396A352827Q07100N84507O93862K22376p22382p25234M04184R16141j19058
42387C414323j234318r59961q8187o3023n69654m56580Q1797J19164m7810M63274
42377F59025J082784M98780p82272p95378O66634J385865J29505j253791o12841
42368I78311J113425J222116p33178k308758j707881j49982J51849q92501j490480
42359c817079p68916J43198K5876o88710p92538o2861P87015J365969J744305
42350b063741J643010P00306m44545n76698L06067Q28657L07087k79250j06348
42341C14545L825q99580j930560j476649K65231J464936J252091O45838P07695
$$ y = [3608766, 855183, -1603216, -1568094, 307337, 1448619, 823018, -59838, 269181, 1352827, 2159927, 2744434, 3438296, 3660672, 2938290, 2213056, 2617240, 3533381, 3414323, 2180005, 1220044, 1131857, 1068834, 499180, 42600, 124397, 243561, 195751, 659025, 1741809, 2240589, 1458317, 662939, 1329573, 2715438, 2844943, 1591152, 978311, 2091736, 3313852, 2580674, 271916, -1435965, -1585947, -1434098, -2326599, -3817079, -4585995, -4442797, -4416921, -5105631, -5898169, -5961030, -5174015, -3808046, -2063741, -420731, 279575, -164970, -741668, -435601, 393056, 700143, 420893, 314545, 318370, -581210, -2511770, -3988419, -3723188, -2258252, -1006161, -360323, 347372]
42332C47372J107096J017430M00544k29884o17398p47309n07267J03648O82725
42323A556957P27498J56730n96375r24901n35251K40961P27914O37124K89041
42314B279698k377k90429n08726l15050J04174j02767j008169j215588J89761
42305h69473J762968J371448o65453j908003j203528J44522Q56276J244887J569942
42296B303586R25608q41306j867639p71190Q69695O28223j000580j273261N51778
42287d75086K022728J122297r63820j843691j147030k74165Q9873M73422R16809
42278g8663N05017r02976j789001q42449R67661J389102j23833j573327j027978
42269c476447Q61079J865008J190966K92501N55973J319602R55549o87084j924506
$$ y = [347372, 1454468, 2471898, 2872442, 2642558, 2025160, 1277851, 770584, 874232, 1556957, 2284455, 2441185, 1844810, 919909, 384658, 625619, 1353533, 1990657, 2279698, 2277321, 1986892, 1478166, 1163116, 1267290, 1164523, 156354, -1059234, -869473, 893495, 2264943, 1599490, -308513, -1512041, -1367519, -511243, 733644, 2303586, 3229194, 2387888, 520249, -250941, 618754, 1246977, 246397, -1026864, -475086, 1547642, 2669939, 1706119, -137572, -1284602, -1558767, -1468894, -995472, -78663, 426354, -476622, -2265623, -3108072, -2140411, -751309, -875142, -2448469, -3476447, -2615368, -750360, 440606, 733107, 1289080, 2608682, 3564231, 2877147, 952641]
42260I52641j394658J62318P73323l46274j791938j642724J87944J823732J693094
42251D17458L10124o20907l87912J45159l5352q30494j347337r60241J70173J332022
42241a807307J869281J709673J261144P29800o7767r47657j072033j47496O66703
42232B194341J47764j025532j037177L55365J360713P75814l96560o86633j84969
42223A503126K05337M13602P74381P62660l10968j679481j711417k40802R88484
42214G04922O27187n63796r65142l39221J00790l43412q05603k51576P31141N87768
42204e16942p53545j364541l6331J618915J273635n98309j302051K8426J204077
42195d46666N27095n98593r2082J437532J705900J89708j392187j640385q57477
$$ y = [952641, -442017, -279699, 493624, 147350, -1644588, -3287312, -3099368, -1275636, 417458, 727582, 106675, -281237, -136078, -171430, -1001924, -2349261, -3309502, -3139329, -1807307, 61974, 1771647, 3032791, 3762591, 3694824, 2747167, 1675134, 1527638, 2194341, 2342105, 1316573, 279396, 634761, 1995474, 2771288, 2374728, 1688095, 1503126, 1708463, 2122065, 2896446, 3659106, 3348138, 1668657, -42760, -283562, 704922, 1332109, 768313, -196829, -536050, -435260, -778672, -1584275, -1835851, -1104710, -516942, -1270487, -2635028, -2671359, -1052444, 221191, -377118, -1679169, -1650743, -446666, 80429, -518164, -610246, 827286, 2533186, 2722894, 1330707, -309678, -1167155]
42186a167155O36L90257K25345j04604O8322O43453M34892j089468k478854k058213
42176e135389l62136P63691R23690J178516J637352J178609k71690j225356q96374
42167b209087j96001J02732M80658J246523J602119R76815q2812j065342k073991
42158a218386k550529j174346J779176L586377K193039r00971k441597j328178
42150b055415P02923J633936R85377m56526j405759q35872R28949K120753J423031
42141C041397l85238j498929j312997o80244m41855o75770j024236r12590J05716
42132c784746J444326J602564J22547j367265j222686n3769N22195N46288J177978
42123a012568J971147J087807j421375k814742j235162J551984K372234N91271
$$ y = [-1167155, -1166519, -776262, -550917, -655521, -587199, 56254, 491146, -598322, -3077176, -5135389, -5497525, -4733834, -3810144, -2631628, -994276, 184333, -87357, -1312713, -2209087, -2405088, -2302356, -1821698, -575175, 1026944, 2003759, 1920947, 855605, -1218386, -3768915, -4943261, -3164085, 422292, 2615331, 1714360, -727237, -2055415, -1352492, 281444, 1266821, 810295, -595464, -1431336, -502387, 1618366, 3041397, 2656159, 1157230, -155767, -836011, -1277866, -1953636, -2977872, -3890462, -3784746, -2340420, -737856, -615309, -1982574, -3205260, -3259029, -2736834, -2190546, -1012568, 958579, 2046386, 625011, -2189731, -3424893, -1872909, 499325, 1090596]
42115A090596j488249j677737j80160J119668Q19123p53745k081168j994659o31875
42106e778206J006463K035003K024439R36527o73847j736319j580805n55765O64866
42097c657644J787607K330624J349310j016845k573335j451084R31094J353239
42089i47034o54497j972049l57680K318310K739252N61555j563556j641675l93249
42080a910623K37878m93374j456531j037011P99169K033598Q81689j591039k394690
42071d930934m57647J912596K200572R03474L03972J107687J919205J577303M74760
42062E010988m44188q26196q36485p07023n99802n98907p76865j193733j469691
42053b441902o61804J439111L064153K123663n86707j785331j85909J531606P41263
$$ y = [1090596, -397653, -2075390, -2255550, -1135882, -316759, -1070504, -3151672, -5146331, -5778206, -4771743, -2736740, -712301, 224226, -449621, -2185940, -3766745, -4322510, -3657644, -1870037, 460587, 1809897, 793052, -1780283, -3231367, -2300273, -947034, -1601531, -3573580, -3931260, -1612950, 1126302, 1687857, 124301, -1517374, -1910623, -1672745, -2166119, -3622650, -4659661, -3860492, -1826894, -945205, -2536244, -4930934, -5388581, -3475985, -1275413, -371939, -67967, 1039720, 2958925, 4536228, 5010988, 4566800, 3740604, 2904119, 2197096, 1597294, 998387, 221522, -972211, -2441902, -3103706, -1664595, 1399558, 3523221, 2936514, 1151183, 965274, 2496880, 3238143]
42044C238143j257890j650326n62122j60691n27623J21459J507733J202296j059859
42035H51120k363472j025822R66044J397793R56464J054187J022123j33939j127587
42026A596911k64215J336964J147571p86807j895688r83495L49097N23274Q0629
42017A104241J49779M39798j00713j474691k462400k021672m09235J031202J184687
42008b559004L79284m261O41680J293588P91130m57745j121147q09502k83055
41999b129032o5656R4296M16342O75372O96491N62567L03415n5092k60772j91094
41989D6837j36511j47085L66388J536961K171096J188637m98970r70474K6739
41980C583618Q58138M56477n46633j323507j870540k074029j345756M7392O72597
$$ y = [3238143, 1980253, 329927, -232195, -392886, -920509, -799050, 708683, 1910979, 851120, -1512352, -2538174, -1572130, -174337, 782127, 1836314, 2858437, 2724498, 1596911, 1332696, 2669660, 3817231, 3030424, 1134736, 151241, 500338, 1023612, 1104241, 1254020, 1693818, 1593105, 118414, -2343986, -4365658, -4774893, -3743691, -2559004, -2179720, -2183981, -1542301, -248713, 542417, 84672, -1036475, -1845977, -2129032, -2194688, -2100392, -1684050, -1008678, -312187, 250380, 553795, 498703, 237931, 46837, -89674, -236759, 129629, 1666590, 3837686, 5026323, 4527353, 3556879, 3583618, 4441756, 4898233, 4351600, 3028093, 1157553, -916476, -2262232, -2214840, -1542243]
41971a542243j36113j183717j146582l15362L34303P54626J393589J997790J986963
41962B143254J394730M72697r40923k657547l489373k539184n91877Q62263J413268
41953c932692J459723R12227l76669j422272j007059L84290J067988N70789M3668
41944b300007K41425O74965R78722J455214J789828R15249j000830j961437p14546
41935G8583J248838J586048J62595j122041j041058k29075J86189k4708l63106
41926D82265m17449k41879j93191l86970l01055O20964J846242K012790P38734
41917D160451o96448j146719j125160j535953j838239r75104M88981R91296N79216
41908a097679R04177K224714K454301L10575k257931k465313n16451P84684j02544
$$ y = [-1542243, -1678356, -2862073, -4008655, -4324017, -3989714, -3235088, -1841499, 156291, 2143254, 3537984, 4010681, 3069758, 412211, -3077162, -5616346, -6208223, -5345960, -3932692, -2472969, -1560742, -1937411, -3359683, -4366742, -3982452, -2914464, -2343675, -2300007, -2058582, -1383617, -404895, 1050319, 2840147, 3755396, 2754566, 793129, 78583, 1327421, 2913469, 3076064, 1954023, 912965, 683890, 870079, 845371, 482265, 64816, -177063, -370254, -757224, -1058279, -437315, 1408927, 3421717, 4160451, 3464003, 2317284, 1192124, -343829, -2182068, -3157172, -2668191, -1676895, -1097679, -193502, 2031212, 4485513, 4796088, 2538157, 72844, -443607, 341077, 238533]
41899B38533j732988k013601p92616N00676P82012J35773o68889q29576p6033
41890d456709R01774R69974r435o96014P7392J517218J707464K47867j027856
41881g68325m63939J217302K023929J379163M98439K78622J87099l71913q62737
41872C117640o68709l79628q30570j427610q30222Q12355J724063R40640l31741
41863B126218m28447O48051J561208J363200J09211j606596k842645k551124o72136
41854b293060J217033J315487l35813j963925k163767j090083L38268J393953
41846c581907J535789N20769r30427j361797j38457J686162K551192K003358P12879
41837B997561n86683j548212j944918j638492q06653J37716P97022Q87563M64348
$$ y = [238533, -1494455, -3508056, -4300672, -3799996, -3017984, -2882211, -3551100, -4380676, -4456709, -3554935, -2584961, -2594396, -3290410, -3213018, -1695800, 11664, 259531, -768325, -1232264, -14962, 2008967, 3388130, 3886569, 4165191, 4352290, 3980377, 3117640, 2448931, 2069303, 1238733, -188877, -1019099, -206744, 1517319, 2457959, 2126218, 1697771, 2345822, 3907030, 5270230, 5379441, 3772845, 930200, -1620924, -2293060, -1076027, 239460, -96353, -2060278, -4224045, -5314128, -4975860, -3581907, -2046118, -1525349, -2455776, -3817573, -3956030, -2269868, 281324, 2284682, 2997561, 2410878, 862666, -1082252, -2720744, -3527397, -3389681, -2592659, -1705096, -1240748]
41828a240748J67540O28430J334224Q89358r69888k465095j918325j69985N17990
41819c226499k97295p08625N41057K094248J917925R8677j462966j540947o15925
41810c200350L19857Q80273J075445Q48694K25412n03949j035949j254998j095878
41801c741443n28514J84991N47964L85283J08021J49206L32219J94946j39006
41792b506333J7804P80270J152315K78811j098711j395328m31893K05704m39313
41783c436674j141807m47671Q10639O83702o27425p87947J000215K460695J578216
41774I1943k73206l90402J160921J718262K5912k067495k341031q89144O90424
41765b273816J401815J174433J86457r81137j250859k62906Q02614P09645L8820
$$ y = [-1240748, -1073208, -444778, 889446, 1778804, 808916, -1656179, -3574504, -3744489, -3226499, -3523794, -4232419, -3691362, -1597114, 320811, 419488, -1043478, -2584425, -3200350, -2880493, -2000220, -924775, -76081, 149331, -354618, -1390567, -2645565, -3741443, -4269957, -4084966, -3537002, -3151719, -3043698, -2894492, -2562273, -2367327, -2506333, -2488529, -1708259, -555944, -277133, -1375844, -2771172, -3203065, -2997361, -3436674, -4578481, -5026152, -4215513, -3531811, -4159236, -4947183, -3946968, -1486273, 91943, -181263, -571665, 589256, 2307518, 2333430, 265935, -2075096, -2964240, -2273816, -872001, 302432, 488889, -492248, -1743107, -2006013, -1203399, -493754, -454934]
41756d54934L13362J495525J868885O45705q33648j196024r20374r90759q94124
41747i66386L27013J745329J401530m73848j271046K06615J765248J034445r96734
41738B772166j606462l91029O04888L28251j28928K9859L1287n96966q98500k58630
41728a14064L68752J01241m97579p62011j096360j599736j199158L06748J046295
41719c445872j30759j294125k94572J488521J274612l22417k44711J626795K073234
41710G30706J20182j083004M18257K005054R47976j035872r63371K48439l10315
41701A078052k086770j771046R72466K569697R70702j457959j755292k86534P93573
41692i73111Q49341O82827N61853J16465n11198p62328n49827k53451j96531n16727
$$ y = [-454934, -141572, 1353953, 3222838, 3868543, 3034895, 1838871, 918497, -72262, -966386, -639373, 1105956, 2507486, 2033638, 762592, 969207, 2734455, 3768900, 2772166, 1165704, 774675, 1379563, 1707814, 1578886, 1608745, 1640032, 1043066, 144566, -114064, 254688, 355929, -141650, -903661, -2000021, -3599757, -4798915, -4492167, -3445872, -3576631, -4870756, -5165328, -3676807, -2402195, -2724612, -2969323, -1342528, 730706, 850888, -232116, 186141, 2191195, 3139171, 2103299, 1139928, 1388367, 1078052, -1008718, -2779764, -1807298, 762399, 1733101, 275142, -1480150, -1766684, -973111, -123770, 559057, 1120910, 1237375, 726177, -36151, -585978, -839429, -1035960, -1552687]
41682a552687r81376p83560N69147K042446K000584O30994o1373P45975J391172
41673D001322M36451r96607j089468j25882L51625R8152q3545l50417j420297
41664H21334k557107k157446l83703Q39935P07573M14145P29509P55777n2415
41655h82398n56941J40974J037225Q78175J49214p8799j19961p93436j467026
41646a692973q43520P78216J799852J616136R33170M7091j297405k303979j476308
41637b439720Q56676K294311J571091K90849K85224Q75021L98864q13331j037136
41628B281849q3876M44855k07738r26071p03968r6701m4153m31058n62771k37681
41618e67313K99043Q08134R48242L68496n86601r02079j63779P86617J027717
$$ y = [-1552687, -2534063, -3317623, -2748476, -706030, 1294554, 1925548, 1864175, 2610150, 4001322, 4437773, 3441166, 2351698, 2225816, 2577441, 2675593, 2592048, 2241631, 821334, -1735773, -3893219, -4276922, -3436987, -2729414, -2315269, -1585760, -829983, -882398, -1439339, -1298365, -261140, 617035, 766249, 687450, 567489, -225947, -1692973, -2536493, -1758277, 41575, 1657711, 2590881, 2637972, 1340567, -963412, -2439720, -1583044, 711267, 2282358, 2573207, 2858431, 3733452, 4132316, 3318985, 2281849, 2197973, 2642828, 2435090, 1509019, 805051, 708350, 664197, 233139, -329632, -567313, -268270, 539864, 1488106, 1856602, 1270001, 367922, 204143, 990760, 2018477]
41609B018477P79619P46440P78870J38676j075091j692863r21911N17815J079777
41600B369809R8379j406715j804554p64478K93469Q1512p04869m30248P88617
41591a479078R80282n91749j895081r68914J029383J466352J24046p43545q7292
41582b165596N45239r8168q27418m9524J610827K312027J614735N36760l10553
41573C168329j021128j235325l98772P99904Q79971j88706p08744J45024R23967
41564B364520J94769j026068p59933O93931R70786p72257k371591j682645L62212
41555b026276J204428L43827k41981O70185J703361J066704p38505j700302j131685
41546h50244l19420l90650q07476m66158N70064J167713O18793n39868j170970
$$ y = [2018477, 2798096, 3544536, 4323406, 4462082, 3386991, 1694128, 772217, 1290032, 2369809, 2468188, 1061473, -743081, -1507559, -1214090, -1132578, -1837447, -2267695, -1479078, -498796, -1090545, -2985626, -3954540, -2925157, -1458805, -1334759, -2078304, -2165596, -1620357, -1718525, -2545943, -2595467, -984640, 1327387, 2942122, 3478882, 3168329, 2147201, 911876, 513104, 1313008, 2192979, 2004273, 1295529, 1440553, 2364520, 2559289, 1533221, 773288, 1467219, 2438005, 1665748, -705843, -2388488, -2026276, -821848, -478021, -720002, -49817, 1653544, 2720248, 1981743, 281441, -850244, -1169664, -1560314, -2367790, -2833948, -2263884, -1096171, -477378, -1017246, -2188216]
41537b188216p02963L57489R66312N98031k92408r20318r98873n91468M63244
41528c309170K157304L423014K755523K46779j924418j885671l07644P23120N19694
41519B398531J85951M06221M35639k49903p54306k36935M45623r2705j498989
41510A039127k002419r26221M48053P78277K32549l29545o62334q43388n41253
41501b807154M21603J295657J215661N07122K16459N03890N15017j38702q00876
41492I28677q84908o02128k15375M88652J388039J514807K18125j624776k405270
41483a194157j609285j90079P33045R01899O76472L88720J45583p1559l21280
41474e40641n99697p53055n53153R0041R12189J279708O93248m29160q69982q3505
$$ y = [-2188216, -2891179, -2533690, -1567378, -969347, -1261755, -2182073, -3180946, -3772414, -3309170, -1151866, 2271148, 5026671, 5273450, 3349032, 1463361, 1155717, 1878837, 2398531, 2584482, 2990703, 3426342, 3176439, 2422133, 2185198, 2630821, 2538116, 1039127, -963292, -1889513, -1441460, -663183, -430634, -760179, -1422513, -2265901, -2807154, -2385551, -1089894, 125767, 632889, 849348, 1353238, 1868255, 1729553, 928677, 43769, -558359, -773734, -285082, 1102957, 2617764, 2835889, 1211113, -1194157, -2803442, -2993521, -2260476, -1358577, -682105, -293385, -147802, -219361, -540641, -1140338, -1893393, -2446546, -2356505, -1444316, -164608, 528640, 99480, -770502, -854007]
41464h54007Q37326N54726m63274n81623L43546O30077l91779j062515j34887
41455a122410Q63458q1587j988486k036028K09219K092691J675635J48590l16463
41446e55381N40007J366724J262697M63101m20036j010923j260200j279664r34523
41437a828198J75820J777665K423746J052035j173843j952912q29589L72270L32258
41428C49252j96688k24271k50902r76365j563190p08410J171227K207205J422126
41419A229984j61304q60472k32512N73401L07454o87079q33301L27734J137925
41410H01830J93259j338398j490645o97994q16974j465807m31621K031318K771766
41401d43266P45812r93806k12739R23640j29830j713315r13784J216739J447248
$$ y = [-854007, -16681, 538045, 74771, -506852, -163306, 466771, 74992, -987523, -1122410, -258952, -340539, -2329025, -4365053, -4155834, -2063143, -387508, -238918, -555381, -15374, 1351350, 2614047, 3077148, 2657112, 1646189, 385989, -893675, -1828198, -1652378, 125287, 2549033, 3601068, 2427225, 474313, -355276, 16994, 349252, 152564, -71707, -322609, -1298974, -2862164, -3570574, -2399347, -192142, 1229984, 1068680, 208208, -24304, 549097, 856551, 169472, -663829, -336095, 801830, 995089, -343309, -1833954, -2531948, -3348922, -4814729, -5246350, -3215032, -443266, 302546, -691260, -903999, 19641, -110189, -1823504, -2737288, -1520549, -73301]
41392g3301q0148l29316J201507J703696q7877k017801k165472j150093l4598
41383c033403J091511J649708O00189j151337j184072O15746J511607L19570o91134
41374b71615J17057Q56980l86642j866497r16270J508413K176318M52985j097331
41365E73398o52562P94553J422242P45478n04214j368642j308668o43095k64566
41356a206076m64669n66769j27981M13453P83406J295345J528423K18814k306474
41347d32528l299378j054538K134682K679046M75204j315221p97691O95322J220763
41338C05661O41269r6710m38023k93485K44743P67662Q83870P97490Q23872N44020
41328D180369n66982j859130k012748q63022L00271L65534m82082j271973j159966
$$ y = [-73301, -153449, -482765, 718742, 2422438, 2334561, 316760, -1848712, -2998805, -3033403, -1941892, -292184, 308005, -843332, -2027404, -1411658, 99949, 419519, -271615, -154558, 702422, 315780, -1550717, -2466987, -958574, 1217744, 1670729, 573398, -79164, 715389, 2137631, 2883109, 2378895, 1010253, -298415, -941510, -1206076, -1670745, -2237514, -2365495, -1952042, -1168636, 126709, 1655132, 1873946, -432528, -3731906, -4786444, -2651762, 27284, 502488, -812733, -1610424, -915102, 305661, 946930, 850220, 412197, 118712, 363455, 1131117, 2014987, 2812477, 3636349, 4180369, 3613387, 1754257, -258491, -1121513, -821242, -455708, -937790, -2209763, -3369729]
41319c369729K4734J436332J671278K86331j480115k169905j728056r07046J32291
41310f103885J486299K481578K321218J318705L49792l47529p34355k52994J021859
41301A540688J517109K41047j198023p34338Q46095J158763P7132m83775k27205
41292B737493o71699j556102n81839K311214L801711J946562q67824j704089j172964
41283D242463j428273k304893k161220j025771k21836J69240J039816K095078
41275D04604K128241J061833r0254q88905j494383j542461o35095M34775M67777
41266a53868m13495j047285p98271K21645J731346K914862K483695N17992q49809
41257D606812k38522O98218j75261j834214j610230M20061J514676N72435n96249
$$ y = [-3369729, -3344995, -1908663, -237385, 48946, -1431169, -3601074, -5329130, -6236176, -6103885, -4617586, -2136008, 185210, 1503915, 1853707, 1506178, 771823, 518829, 1540688, 3057797, 3298844, 2100821, 1366483, 2212578, 3371341, 3448473, 2964698, 2737493, 2065794, 509692, -72147, 2239067, 6040778, 7987340, 7119516, 5415427, 4242463, 2814190, 509297, -1651923, -2677694, -2899530, -2730290, -1690474, 404604, 2532845, 3594678, 3504424, 2615519, 1121136, -421325, -1056420, -621645, -153868, -567363, -1614648, -2412919, -2191274, -459928, 2454934, 4938629, 5456621, 4606812, 4368290, 5066508, 4891247, 3057033, 1446803, 1866864, 3381540, 3953975, 3357726]
41248C357726o29577l96958o71635o66232p365J44661p56355j399221q64893k43216
41238b133065n28359o42541O96125K493569K696927J018423j006684k068832j870969
41229a345406o19497R38880J558340P47455n08008j113496j167127j078072n32378
41220c119309N04684R49440K30540l49694M19872J385255P57639p22972p64803
41211g09348P11662J370032K02638j027843p68780J60906M13414J56158K2647
41202E31486l17229j123280j455278n42364P40816J134400Q30834P25142P05570
41193A230097J62423n01375m39642J6641j37321p36765o53423K56115R27931Q89281
41183A013962Q02464R76413P72961o1556p77998q91491q81283j028862p48608
$$ y = [3357726, 2728149, 2331191, 1659556, 993324, 985959, 1130620, 374265, -1024956, -1889849, -2133065, -2661424, -3303965, -2607840, -114271, 2582656, 3601079, 2594395, 525563, -1345406, -1964903, -1026023, 532317, 1279772, 771764, -341732, -1508859, -2586931, -3119309, -2614625, -1665185, -1434645, -1784339, -1364467, 20788, 778427, 55455, -709348, 2314, 1372346, 1574984, 547141, -221639, -60733, 352681, 508839, 531486, 214257, -909023, -2364301, -2906665, -2165849, -1031449, -200615, 524527, 1230097, 1392520, 891145, 451503, 468144, 330823, -405942, -1059365, -803250, 124681, 1013962, 1816426, 2792839, 3565800, 3504244, 2726246, 1834755, 953472, -75390, -823998]
41174h23998J51213O72249R5955o79388m25849M72386O07798k99308j055057p27690
41164b011689K98158J109037J300573J045387O96383N00048M00871J49966k15622
41155C273112l06959n5188M6384k10140k68078K09549N42553R1488m89170j71771
41145B661780O69948O45315o30853k043528k446668j599080J50755J906251K189845
41136A503765L75717j852831k085151l73110Q78779M84212p1761N57915J432448
41127H49983J235688M72875J72240m1560q38835j503994j204837p25462r76053
41118b559955r53406N58119K263037J933631O2045q66657m29393n26456j453889
41109a972924j093949J000410K027193L22329j478048k38941K717756L408357
$$ y = [-823998, -672785, -536, 95419, -583969, -1009818, -537432, 70366, -228942, -1283999, -2011689, -1713531, -604494, 696079, 1741466, 2437849, 2937897, 3338768, 3488734, 3273112, 2966153, 2910965, 2957349, 2747209, 2479131, 2688680, 3231233, 3322721, 2833551, 2661780, 3331728, 3977043, 3346190, 1302662, -1144006, -2743086, -2592331, -686080, 1503765, 1879482, 26651, -2058500, -2431610, -1552831, -1068619, -1140380, -582465, 849983, 2085671, 2558546, 2730786, 2689226, 1850391, 346397, -858440, -1583902, -2559955, -3513361, -2955242, -692205, 1241426, 1303471, 436814, 7421, -519035, -1972924, -3066873, -2066463, -39270, 283059, -1194989, -1433930, 1283826, 4692183]
41101D692183Q74868j818786k047935n46579N14850L52218l12437o04957j52126
41092I51299Q47646J627120J415164L61024m70883k85179M86451N95992o23584
41083D905050k247209k420880m90320J819525K233164Q00206l19138p2271J70572
41074D378699p58035j712853j225802r3603o862o30239k78661J036806J553786
41065B263236O75912k83857n42272q78524j627040j664559l91118R58492J125347
41056c64383N73708K86445Q0856n58562j003914l37626R16036J314357N00414
41047A407331m61151o34922j36903M62471Q06207O90095j2444j053604j710479
41038f43399j297287L4567J060253N50043j087829j889145p83539Q09591J040013
$$ y = [4692183, 5567051, 3748265, 1700330, 1153751, 1668601, 2020819, 1708382, 1103425, 951299, 1798945, 3426065, 4841229, 5202253, 4731370, 4446191, 4932642, 5528634, 4905050, 2657841, 236961, -253359, 1566166, 3799330, 4599536, 4280398, 4208127, 4378699, 3620664, 1907811, 682009, 588406, 581544, -48695, -327356, 709450, 2263236, 2939148, 2655291, 2113019, 1234495, -392545, -2057104, -2448222, -1489730, -364383, 209325, 495770, 576626, 18064, -985850, -1323476, -407440, 906917, 1407331, 946180, 311258, 174355, 636826, 1443033, 2133128, 2120684, 1067080, -643399, -1940686, -1906119, -845866, -295823, -1383652, -3272797, -4056336, -3246745, -2206732]
41029b206732M40686P47024J473367M30577k065966k690678j78482K136596J147214
41020g66394j268693j348663O90322J526914L44108l62597N54078J195605K84607
41011H49287p32634m19290M88148Q74299Q81650O19488m83653j841692j550669
41002a315066M99355J637924K71596j445039q85186J018291J461894O7404j073308
40993B37865p62080K76282J156895J494695P69346r74217k182362j434112L27728
40984a089960R76927J76730o41378p78622p47715n94657J73064J094784J140682
40975b90145M89311J00828j43299q35827j082892L02898J938914J216919j281328
40966D15379j984554K22144K070446R47221j243625j424415N7910P75783K18381
$$ y = [-2206732, -1766046, -1019022, 454345, 884922, -1181044, -3871722, -4050204, -1913608, -766394, -2035087, -3383750, -2693428, -1166514, -822406, -1185003, -630925, 564680, 849287, 116653, -302637, 185511, 1059810, 1941460, 2560948, 2077295, 235603, -1315066, -815711, 822213, 1093809, -351230, -1236416, -218125, 1243769, 1311173, 237865, -524215, -247933, 908962, 2403657, 3173003, 2198786, 16424, -1417688, -1089960, -113033, 63697, -577681, -1356303, -2104018, -2698675, -2525611, -1430827, -290145, 199166, 299994, 156695, -679132, -1762024, -1459126, 479788, 1696707, 415379, -1569175, -1347031, 723415, 1670636, 427011, -997404, -939494, -163711, 54670]
40957E4670k78093l07189n47211r34151q42190m88220l99220j93043N51890J143770
40947b238987J044809J127078J946435K120851N26867j222031r97758K61852K9272
40938B598388j556652k009999p05016M47416N78751Q65854J511409J019124n72663
40929B176612r50871N28819J190036o86684k635313j613222J210367K171159M11697
40920A802600j368368j022681O57226J783876J657474P73829j38840o15867o49120
40911B880129n29725k77104K99900P19716K1055j513481k060240p85168N60473
40902f84445J28475j029951n29296J416442K087218M36969j260089q92366M14905
40893H7862L14109j062104j452336p0132J182747O08153p65096p42779Q13752
$$ y = [54670, -223423, -530612, -1077823, -2011974, -2854164, -3342384, -3741604, -3934647, -3382757, -2238987, -1194178, -67100, 1879335, 4000186, 4527053, 3305022, 2307264, 2569116, 2598388, 1041736, -968263, -1673279, -1225863, -647112, 218742, 1730151, 2749275, 2176612, 1225741, 1754560, 2944596, 2257912, -377401, -1990623, -780256, 1390903, 1802600, 434232, -588449, 68777, 1852653, 3510127, 4283956, 4145116, 3529249, 2880129, 2350404, 2073300, 2373200, 3092916, 3113971, 1600490, -459750, -1244918, -684445, -555970, -1585921, -2115217, -698775, 1388443, 1825412, 565323, -327043, 87862, 401971, -660133, -2112469, -2182601, -999854, -391701, -1156797, -1899576, -1085824]
40884a085824J860518J172986q7997m08241j07754k75327n83043R4502J379148
40875A958968J656845O59274j93026l79582j100132k653163l123535j197996J440641
40866b931706K351116J594298Q26425L93988l50074p47213M37574K233374K139255
40857E947037o2187j709294j251423m12919j072608k146094j517303M08512J340340
40848d75939O30687j1249O09394J465828J096795k83854j394080j682663j434958
40839a480039o46468Q46496K102547J438476j147707l095235k163254N13238J861730
40830a770216R90408j04494n6987k9542j140863k189176j629730j47747O86288
40821e392059R83132J641499K050630J121575j78699M2715J321637J364182k00856
$$ y = [-1085824, 774694, 1947680, 1859683, 1451442, 1343688, 1068361, 485318, 579820, 1958968, 3615813, 4275087, 4082061, 3702479, 2602347, -50816, -3174351, -4372347, -2931706, -580590, 1013708, 1840133, 2234121, 1884047, 1136834, 1574408, 3807782, 5947037, 5884850, 4175556, 2924133, 2511214, 1438606, -707488, -2224791, -1816279, -475939, 154748, 143499, 752893, 2218721, 3315516, 3031662, 1637582, -45081, -1480039, -2126507, -1280011, 822536, 2261012, 1113305, -1981930, -4145184, -3631946, -1770216, -779808, -884302, -941289, -970831, -2111694, -4300870, -5930600, -6078347, -5392059, -4408927, -2767428, -716798, 404777, 226078, 268793, 1590430, 2954612, 2753756]
40812B753756j324418j046540p16379j067435q55637M75018J328593O08723l88364
40803b32683k92458J44702j70063n56397k6001P60958Q20339O67452J039367J196632
40793C351848K92480r14238j458777j802771k252869j515784Q91888K581382J468004
40784F41163n39256l06968J321003R39195j463294k283911l37663J254719M57590
40775c17422m78828O78991K151398J255457j118098k175206j531483q72711n90112
40766b998014K62064J315548J038057m72675j212737j53898J412341J839347J023129
40757B053162n5969n79282l52495J51510P7839q15964j580270j210933q8571N86085
40747a814888N07933M08593O53108P69604M17638j18521n27338p93152q51920
$$ y = [2753756, 1429338, 382798, -333581, -1401016, -2256653, -1781635, -453042, 155681, -232683, -525141, -380439, -550502, -1106899, -1132900, -371942, 448397, 1115849, 2155216, 3351848, 3644328, 2730090, 1271313, -531458, -2784327, -4300111, -3408223, -826841, 641163, 101907, -205061, 1115942, 2055137, 591843, -1692068, -2029731, -775012, -317422, -796250, -117259, 2034139, 3289596, 2171498, -3708, -1535191, -2407902, -2998014, -2735950, -1420402, -382345, -855020, -2067757, -2221655, -809314, 1030033, 2053162, 1997193, 1417911, 1065416, 1216926, 1294765, 478801, -1101469, -2312402, -2400973, -1814888, -1306955, -898362, -245254, 524350, 941988, 823467, 296129, -497023, -1348943]
40738a348943n92116j91003J43438N97948J270190J556930Q63589l19790r74382
40729A005861r77850r75177j017382n10730M64048R94295P18807K94775K47784
40720B44431L84793N41578P89267O85030l69805j641537j433442L13107J323893
40711H37315J13065j553104j008142J386168K659366J353078p54722j448197q62753
40702G22074m95776o65714l81827O57663J314888O35520o36697r20335Q1201R01502
40692A212499K25349j292543j754400l92789J449328J858814L91969j637570k548025
40683b487368j754543j17548R77853R83143N61006M91798O45646N39814L78117
40674B17918N68120N76206l94233j636111j443845K46682J396942Q25878l1934
$$ y = [-1348943, -1941059, -2132062, -1988624, -1390676, -120486, 1436444, 2300033, 1980243, 1005861, 28011, -947166, -1964548, -2475278, -2011230, -1016935, -298128, -3353, 244431, 629224, 1170802, 1960069, 2645099, 2275294, 633757, -799685, -486578, 837315, 950380, -602724, -1610866, -224698, 2434668, 3787746, 3033024, 1584827, 722074, 226298, -439416, -821243, -163580, 1151308, 1786828, 1150131, 229796, 310997, 1212499, 1437848, 145305, -1609095, -2001884, -552556, 1306258, 1698227, 60657, -2487368, -4241911, -4359459, -3381606, -2398463, -1837457, -1345659, -700013, -160199, 217918, 786038, 1362244, 968011, -668100, -2111945, -1865263, -468321, 357557, 325623]
40665C25623M47005J398332Q90905j057012k679115k941127k089603m07561J673595
40656d438958K727569J707155j0605r6682J149012R74612j548098l686947k644021
40647e866963P14364L074191K550347K47329j323507o48239J380938K199274M53909
40638B781643k044111k529048j082307k04696o45128l64046J560189K848565J529909
40629A850970q72101j754614j079481l91978M8696P29371R45206k5402r58156
40620a507489m21505N78343K79804n62219K1295J479055J491506K8284o17789
40611G69285J99946P32504K81967J42608N94366K07144j064886j310717k17477
40602C34740J4150j382248k098296p21277Q09511P27976L57329J116385J569885
$$ y = [325623, 772628, 2170960, 3061865, 2004853, -674262, -3615389, -5704992, -6112553, -4438958, -1711389, -4234, -14839, -111521, 1037491, 2012103, 464005, -3222942, -5866963, -5152599, -2078408, 471939, 719268, -604239, -1252478, 128460, 2327734, 2781643, 737532, -1791516, -2873823, -3078519, -3723647, -4087693, -2527504, 321061, 1850970, 978869, -775745, -1855226, -2247204, -2198508, -1469137, -523931, -549333, -1507489, -1928994, -1350651, -1070847, -1633066, -1611771, -132716, 1358790, 1387074, 769285, 969231, 1701735, 1983702, 2126310, 2720676, 2927820, 1862934, 552217, 334740, 348890, -1033358, -3131654, -3852931, -3043420, -2315444, -1958115, -841730, 728155]
40593G28155L34945p61949K41936J534134M40910j580171j059690J447361J896230
40584C221861p55448k858855j738470O48962J251690K13509k82040M96672J353451
40575A551332J156572J8183r99668q34406L88695J163894L98885r72044j297686
40566E73757n95527j27752j26262K00311P33885N82079K221M7519L43821m48090
40556A185962j830702j691924J93971J489704R24827M4552K52262O23427Q3095
40547A275174n79342n19867n33574j183880j265093n1762Q46609K3437j086068
40538c074366m45670J231700J848148J282988P61048Q2235j541686k743548j406605
40529d005756J382578K100024n4981j861272q95851J162973J538634L32851m06766
$$ y = [728155, 1063100, 301151, 543087, 2077221, 2518131, 937960, -121730, 1325631, 3221861, 2466413, -392442, -2130912, -1481950, -230260, -16751, -298791, 197881, 1551332, 2707904, 2726087, 1726419, 892013, 1280708, 2444602, 2843487, 1871443, 573757, -21770, -149522, -275784, -75473, 658412, 1240491, 1242712, 1290231, 1634052, 1185962, -644740, -2336664, -2142693, -652989, 271838, 316390, 568652, 1192079, 1275174, 695832, 175965, -357609, -1541489, -2806582, -2858344, -2011735, -1988298, -3074366, -3520036, -2288336, -440188, 842800, 1603848, 1686083, 144397, -2599151, -4005756, -2623178, -523154, -578135, -2439407, -3335258, -2172285, -633651, -300800, -707566]
40520g07566P499N25650M48665J93134K56038N68557P52928L91491o25844j592301
40510B18251j404163M040J273347J248205L84290j05560P1858K45403N218l74043
40500A566846o11122p72738q41996m95395L79564J206363J153462J59375p50716
40491I93643n59370M15106Q56842K41164m53536k40075M68184O77238L12856q4456
40481B627596n28880j217556j471542n36623P55895P43428n49293j272460m75885
40472a925320O60653R18627P55263J019676J376986J129152M72340j30487p70663
40463C506227j278638p92603O47779J323796J68619j263379r37619N45091J037885
40454B957158K61581k65519k57585q97995j965463j638776O8451N62101j191602
$$ y = [-707566, -700067, -174417, 274248, 467382, 723420, 1291977, 2044905, 2436396, 1810552, 218251, -1185912, -1181872, 91475, 1339680, 1723970, 1618410, 1690268, 1935671, 1940889, 1566846, 955724, 182986, -659010, -1154405, -774841, 431522, 1584984, 1744359, 993643, 434273, 849379, 1706221, 1947385, 1493849, 1253774, 1721958, 2399196, 2712052, 2627596, 2098716, 881160, -590382, -1127005, -371110, 372318, -176975, -1449435, -1925320, -1264667, -346040, 409223, 1428899, 2805885, 3935037, 4407377, 4276890, 3506227, 2227589, 1434986, 2082765, 3406561, 3575180, 2311801, 1374182, 1919273, 2957158, 3218739, 2953220, 2695635, 1797640, -167823, -1806599, -1738148, -1176047, -2367649]
40445b367649k444346p40185J986222K155095q2323j339706k54254R55638M83416
40436a648092m52404q3132J122116J641492J258820P04881R0397p98961j404242
40427D30875r98417J8318N66461L36124j21839l83488l34388K44777J287313J892538
40417B938274J164057m65367j559815j294215j32771Q85401R40111q4408j203828
40408A187439r91188M78031J104528m74903k372544j665594J199463K653644J085478
40399B204354q65240l77324J425743J475875o09097k297288j922841m46866N59500
40390h53184P93976P01417N38252M96213P38399R07851M21025n20432j037437
40381B186080q49343n36685l52179J64731R63123R70224l63158j800985j665853
$$ y = [-2367649, -4811995, -5552180, -3565958, -1410863, -1493186, -2832892, -3087146, -2131508, -1648092, -2100496, -2183628, -1061512, 579980, 1838800, 2543681, 2634078, 1835117, 430875, -567542, -549224, 17237, 353361, 231522, -151966, -486354, -241577, 1045736, 2938274, 4102331, 3636964, 2077149, 782934, 650163, 1535564, 2475675, 2391267, 1187439, 196251, 674282, 1778810, 1303907, -1068637, -2734231, -1534768, 1118876, 2204354, 1339114, 961790, 2387533, 3863408, 3254311, 957023, -965818, -1412684, -853184, -59208, 642209, 1180461, 1676674, 2415073, 3322924, 3743949, 3223517, 2186080, 1336737, 800052, 447873, 612604, 1575727, 2545951, 2182793, 381808, -1284045]
40372a284045r6393J074673P15057k72916l93186M05191R06809N68470K82858
40363A906518Q22783J348598M41390j631882k821415j797545L28924J382504O14507
40354E94382q37913j563835j224507m04294L02071Q63528J528083K002817J368518
40345B628850n79506k334915k206145p36264p7696p26389p80015P49966J997760
40336b064354J198374l19265l28642N79404J89777j343488j703832l63178O83062
40327c472142M25115J91878P77634R64637L9436p10352m05291k29731j111016
40318c529832j805708j044419K86569R53418J534787K664430K871918P99023j710239
40309A019947j652950O33548J883705O66431j030094j273628o21323k69423m7951
$$ y = [-1284045, -1380438, -305765, 409292, 136376, -256810, 148381, 1055190, 1623660, 1906518, 2729301, 4077899, 4519289, 2887407, 65992, -1731553, -1402629, -20125, 594382, -243531, -1807366, -3031873, -3436167, -3134096, -2270568, -742485, 1260332, 2628850, 2049344, -285571, -2491716, -3227980, -3305676, -4032065, -4812080, -4062114, -2064354, -865980, -1185245, -1513887, -934483, -744706, -2088194, -3792026, -4155204, -3472142, -3047027, -2855149, -2077515, -1112878, -1073442, -1783794, -2189085, -2418816, -3529832, -5335540, -6379959, -6093390, -5139972, -3605185, -940755, 1931163, 2730186, 1019947, -633003, 545, 1884250, 2550681, 1520587, 246959, -374364, -643787, -691738]
40300f91738M94977P07580p4501j136825j302654n58430J73824L86109L47804
40291a653854M32688O22477N65401p856p58443q53594m1873P57001O18582p1234
40281c90705l71983l24312m65867l19346Q85744K154404J501267q33141k121045
40272b84984r95059N65229M59269l67797J4454R79622M94699j111581j433434
40263a679582O170Q24192m20153j900530j337602O59300J701227R34861l56467
40254a568584q26268l31366N23718R49580L54782q62298j295823k96263Q05439
$$ y = [-691738, -196761, 510819, 436318, -700507, -2003161, -2561591, -2387767, -2001658, -1653854, -1221166, -598689, -33288, -41144, -799587, -1653181, -1695054, -938053, -319471, -390705, -762688, -1087000, -1552867, -1872213, -986469, 1167935, 2669202, 1836061, -284984, -1280043, -714814, -255545, -623342, -608888, 370734, 865433, -246148, -1679582, -1673412, -849220, -1269373, -3169903, -4507505, -3848205, -2146978, -1212117, -1568584, -2394852, -2726218, -2202500, -1252920, -898138, -1760436, -3056259, -3352522, -2547083]
$$ [...]
##END NTUPLES=NMR SPECTRUM
##END=
