##TITLE=31Pdec_LR-562-C3-C
 CDCl3
  64 sc
 20.12.2023
##JCAMPDX= 6.0         $$ Bruker NMR JCAMP-DX V2.0
##DATA TYPE= NMR SPECTRUM
##DATA CLASS= NTUPLES
##ORIGIN= UXNMR, Bruker Analytische Messtechnik GmbH
##OWNER= root
$$ XWIN-NMR		Version 3.5
$$ Wed Dec 20 16:39:36 2023 Russian Standard Time (UT+4h)  she@DPX200
##.OBSERVE FREQUENCY= 81.013821
##.OBSERVE NUCLEUS= ^31P
##.ACQUISITION MODE= SIMULTANEOUS
##.ACQUISITION SCHEME= undefined
##.AVERAGES= 64
##.DIGITISER RES= 16
##SPECTROMETER/DATA SYSTEM= spect
##.PULSE SEQUENCE= zgpg30
##.SOLVENT NAME= CD2Cl2
##.SHIFT REFERENCE= (INTERNAL, CD2Cl2, 0, 248.564)
##AUDIT TRAIL= $$ (NUMBER, WHEN, WHO, WHERE, WHAT)
$$ ##TITLE= Audit trail, XWIN-NMR		Version 3.5
$$ ##JCAMPDX= 5.01
$$ ##ORIGIN= Bruker BioSpin GmbH
$$ ##OWNER= she
$$ F:/spectra/data/she/nmr/P31/1/pdata/1/auditp.txt
$$ ##AUDIT TRAIL=  $$ (NUMBER, WHEN, WHO, WHERE, WHAT)
(   1,<2023-12-20 16:38:21.95 +0400>,<she>,<DPX200>,
      <continue with go, POWCHK disabled, PULCHK disabled
       configuration hash MD5:
       00 E9 B6 7A A2 85 ED C7 34 08 36 98 17 FE 4E 26
       data hash MD5: 32K
       08 68 44 54 3F C5 87 6A 37 99 70 F4 82 46 3B 65>)
(   2,<2023-12-20 16:38:24.82 +0400>,<she>,<DPX200>,
      <Start of raw data processing
       efp BC_mod = 2 LB = 10 FT_mod = 6 PKNL = 1 PHC0 = -12577.28 PHC1 = 1005.094 SI = 64K 
       data hash MD5: 64K
       0F 83 2F 16 23 3E D4 B8 1F 49 14 BA 4D FF 13 37>)
(   3,<2023-12-20 16:38:55.32 +0400>,<she>,<DPX200>,
      <pk PHC0 = -5.936419 PHC1 = 166.3999 
       data hash MD5: 64K
       79 85 B0 F7 CC DC 1B 84 2C 1C 9B 70 22 07 9D BB>)
(   4,<2023-12-20 16:39:08.37 +0400>,<she>,<DPX200>,
      <abs ABSG = 5 
       data hash MD5: 64K
       59 04 0C A8 74 26 F1 C4 6C 63 EC 8E 05 58 15 F3>)
$$ ##END=
$$ 
$$ hash MD5
$$ EC B5 1B 7A D0 5E 94 6C BE 06 6E 0E F4 36 84 D7
##$RELAX= 
##$RELAX= 
##$RELAX= 
##$RELAX= 
##$RELAX= 
##$RELAX= 
##$RELAX= 
##$RELAX= 
##$RELAX= 
$$ Bruker specific parameters
$$ --------------------------
##$DU= <F:/spectra>
##$EXPNO= 1
##$NAME= <P31>
##$PROCNO= 1
##$TYPE= <nmr>
##$USER= <she>
##$AMP= (0..31)
100 100 100 100 100 100 100 100 100 100 100 100 100 100 100 100 100 100 
100 100 100 100 100 100 100 100 100 100 100 100 100 100 
##$AQSEQ= 0
##$AQ_mod= 1
##$AUNM= <au_zg>
##$AUTOPOS= <>
##$BF1= 81.014009
##$BF2= 200.13
##$BF3= 200.13
##$BF4= 200.13
##$BF5= 200.13
##$BF6= 200.13
##$BF7= 200.13
##$BF8= 200.13
##$BYTORDA= 1
##$CFDGTYP= 0
##$CFRGTYP= 5
##$CHEMSTR= <none>
##$CNST= (0..31)
1 1 145 1 1 1 1 1 1 1 1 1 1 1 1 1 1 1 1 1 1 1 1 1 1 1 1 1 1 1 1 1 
##$CPDPRG= <waltz16>
##$CPDPRG1= <>
##$CPDPRG2= <waltz16>
##$CPDPRG3= <>
##$CPDPRG4= <mlev>
##$CPDPRG5= <mlev>
##$CPDPRG6= <mlev>
##$CPDPRG7= <mlev>
##$CPDPRG8= <mlev>
##$CPDPRGB= <>
##$CPDPRGT= <>
##$D= (0..31)
0 1 0 0 0 0 0 0 0 0 0 0.03 2e-05 3e-06 0 0 0 0 0 0 0 0 0 0 0 0 0 0 0 0 
0 0 
##$DATE= 1703075824
##$DBL= (0..7)
120 120 120 11 120 120 24 19 
##$DBP= (0..7)
150 150 150 150 150 150 150 150 
##$DBP07= 0
##$DBPNAM0= <>
$$ [...]
##$SUBNAM3= <"">
##$SUBNAM4= <"">
##$SUBNAM5= <"">
##$SUBNAM6= <"">
##$SUBNAM7= <"">
##$SUBNAM8= <"">
##$SUBNAM9= <"">
##$SW= 501.771253377433
##$SWIBOX= (0..15)
0 1 3 0 0 0 0 0 0 0 0 0 0 0 0 0 
##$SW_h= 40650.406504065
##$TD= 32768
##$TD0= 1
##$TE= 0
##$TE2= 300
##$TE3= 300
##$TEG= 300
##$TL= (0..7)
0 120 53 12 22 120 120 120 
##$TP= (0..7)
150 150 150 150 150 150 150 150 
##$TP07= 0
##$TPNAME0= <>
##$TPNAME1= <>
##$TPNAME2= <>
##$TPNAME3= <>
##$TPNAME4= <>
##$TPNAME5= <>
##$TPNAME6= <>
##$TPNAME7= <>
##$TPOAL= (0..7)
0.5 0.5 0.5 0.5 0.5 0.5 0.5 0.5 
##$TPOFFS= (0..7)
0 0 0 0 0 0 0 0 
##$TUNHIN= 0
##$TUNHOUT= 0
##$TUNXOUT= 0
##$USERA1= <user>
##$USERA2= <user>
##$USERA3= <user>
##$USERA4= <user>
##$USERA5= <user>
##$V9= 5
##$VALIST= <valist>
##$VCLIST= <CCCCCCCCCCCCCCC>
##$VD= 0
##$VDLIST= <DDDDDDDDDDDDDDD>
##$VPLIST= <PPPPPPPPPPPPPPP>
##$VTLIST= <TTTTTTTTTTTTTTT>
##$WBST= 1024
##$WBSW= 4
##$XGAIN= (0..3)
0 0 0 0 
##$XL= 0
##$YL= 0
##$YMAX_a= 2492
##$YMIN_a= -5339
##$ZGOPTNS= <>
##$ZL1= 120
##$ZL2= 120
##$ZL3= 120
##$ZL4= 120
##$ABSF1= 248.5645
##$ABSF2= -253.2056
##$ABSG= 5
##$ABSL= 3
##$ALPHA= 0
##$AQORDER= 0
##$ASSFAC= 0
##$ASSFACI= 0
##$ASSFACX= 0
##$ASSWID= 0
##$AUNMP= <proc_1d>
##$AZFE= 0.1
##$AZFW= 0.5
##$BCFW= 0
##$BC_mod= 2
##$BYTORDP= 0
##$COROFFS= 0
##$CY= -3
##$DATMOD= 1
##$DC= 0
##$DFILT= <>
##$DTYPP= 0
##$F1P= 0
##$F2P= 0
##$FCOR= 1
##$FTSIZE= 65536
##$FT_mod= 6
##$GAMMA= 0
##$GB= 0
##$INTBC= 1
##$INTSCL= 6.047779e-11
##$ISEN= 30
##$LB= 10
##$LEV0= 0
##$LPBIN= 0
##$MAXI= 10000
##$MC2= 0
##$MEAN= 0
##$ME_mod= 0
##$MI= 50
##$NCOEF= 0
##$NC_proc= -12
##$NLEV= 6
##$NOISF1= 182.463
##$NOISF2= 159.3651
##$NSP= 0
##$NTH_PI= 0
##$NZP= 0
##$OFFSET= 248.5645
##$PC= 4
##$PHC0= -12583.22
##$PHC1= 1171.494
##$PH_mod= 1
##$PKNL= yes
##$PPARMOD= 0
##$PSCAL= 0
##$PSIGN= 0
##$REVERSE= no
##$SF= 81.0140089999694
##$SI= 65536
##$SIGF1= 159.3651
##$SIGF2= -187.1042
##$SINO= 113.3802
##$SIOLD= 16384
##$SREGLST= <1H.CDCl3>
##$SSB= 0
##$STSI= 65536
##$STSR= 0
##$SW_p= 40650.406504065
##$SYMM= 0
##$S_DEV= 0
##$TDeff= 32768
##$TDoff= 0
##$TI= <>
##$TILT= no
##$TM1= 0
##$TM2= 0
##$TOPLEV= 0
##$USERP1= <user>
##$USERP2= <user>
##$USERP3= <user>
##$USERP4= <user>
##$USERP5= <user>
##$WDW= 1
##$XDIM= 65536
##$YMAX_p= 546410102
##$YMIN_p= -174457655
$$ End of Bruker specific parameters
$$ ---------------------------------
##NTUPLES= NMR SPECTRUM
##VAR_NAME=  FREQUENCY,     SPECTRUM/REAL,   SPECTRUM/IMAG
##SYMBOL=    X,             R,               I
##VAR_TYPE=  INDEPENDENT,   DEPENDENT,       DEPENDENT
##VAR_FORM=  AFFN,          ASDF,            ASDF
##VAR_DIM=   65536,         65536,           65536
##UNITS=     HZ,            ARBITRARY UNITS, ARBITRARY UNITS
##FACTOR=    0.620285442955139, 1,           1
##FIRST=     20137.2065510682, 0,            0
##LAST=      -20513.1999529968, 0,           0
##MIN=       -20513.1999529968, -174457655,  0
##MAX=       20137.2065510682, 546410102,    0
$$ Real data points
##PAGE= N=1
##DATA TABLE= (X++(R..R)), XYDATA
$$ [...]
12297d2587899J034692R5410j115756k393957l473678m102402m135127l591225
$$ -42587899 -41553207 -41457797 -42573553 -44967510 -48441188 -52543590 -56678717 -60269942
12289f0269942k638203j514527m36189M68630J174945J733382K227344K741588
$$ -60269942 -62908145 -64422672 -64858861 -64390231 -63215286 -61481904 -59254560 -56512972
12281e6512972L344920M068568M872555N625982O138089O238977N856954N033731
$$ -56512972 -53168052 -49099484 -44226929 -38600947 -32462858 -26223881 -20366927 -15333196
12273a5333196L870867K457905Q39586r61580k893014m828324o560325p841955
$$ -15333196 -11462329 -9004424 -8164838 -9126418 -12019432 -16847756 -23408081 -31250036
12265c1250036q463979q334160p515071o199501m637748l053788j587558k86264
$$ -31250036 -39714015 -48048175 -55563246 -61762747 -66400495 -69454283 -71041841 -71328105
12257g1328105Q57262J849469K666101L266669L634576L808141L884623L999973
$$ -71328105 -70470843 -68621374 -65955273 -62688604 -59054028 -55245887 -51361264 -47361291
12249d7361291M290253M840106N636107O554326P396360P954993Q073260P675255
$$ -47361291 -43071038 -38230932 -32594825 -26040499 -18644139 -10689146 -2615886 5059369
12241E059369O772716N461025L909040K336094R71837O786m50385l96096O8489
$$ 5059369 11832085 17293110 21202150 23538244 24510081 24516867 24066482 23670386 23738875
12232B3738875P62120J470302K001092K224413K077732J550123O74625m58414
$$ 23738875 24500995 25971297 27972389 30196802 32274534 33824657 34499282 34040868
12224C4040868j688143k801670l592727l937641l850255l482998l065193k805087
$$ 34040868 32352725 29551055 25958328 22020687 18170432 14687434 11622241 8817154
12216H817154k808109l054441l437187l823723m099091m176368l987686l480530
$$ 8817154 6009045 2954604 -482583 -4306306 -8405397 -12581765 -16569451 -20049981
12208b0049981k634611j493247j84099J095496K131360K760012K918962K661597
$$ -20049981 -22684592 -24177839 -24361938 -23266442 -21135082 -18375070 -15456108 -12794511
12200a2794511K140045J570707J193464J225532J809381K964066M559982O335215
$$ -12794511 -10654466 -9083759 -7890295 -6664763 -4855382 -1891316 2668666 9003881
12192I003881P956933R112496R598382R368477Q518575P221137N655952L976188
$$ 9003881 16960814 26073310 35671692 45040169 53558744 60779881 66435833 70412021
12184G0412021K311306P79861n08850j463491k020540k152264j873832j247091
$$ 70412021 72723327 73503188 72994338 71530847 69510307 67358043 65484211 64237120
12176F4237120l75692O12183J591219K464807L172258L673216L930810L922329
$$ 64237120 63861428 64473611 66064830 68529637 71701895 75375111 79305921 83228250
12168H3228250L675545L290580K909873K645714K517138K442612K290089J945154
$$ 83228250 86903795 90194375 93104248 95749962 98267100 100709712 102999801 104944955
12160A04944955J354036N28389m68577j531989k523263l296384l747514l863067
$$ 104944955 106298991 106827380 106358803 104826814 102303551 99007167 95259653 91396586
12152I1396586l734216l529204l439160l618263m133730m939060n881903o747686
$$ 91396586 87662370 84133166 80694006 77075743 72942013 68002953 62121050 55373364
12144E5373364p324208p460600p094334o239524m959224l354276j573267J88048
$$ 55373364 48049156 40588556 33494222 27254698 22295474 18941198 17367931 17555979
12136A7555979J724558K880148L585006L855290L773947L471331L102344K814003
$$ 17555979 19280537 22160685 25745691 29600981 33374928 36846259 39948603 42762606
12128D2762606K712757K842679L171821L583410L885454L856633L322807K231204
$$ 42762606 45475363 48318042 51489863 55073273 58958727 62815360 66138167 68369371
12120F8369371O84548j084337k789523m186824n144725n667705n876583n961003
$$ 68369371 69053919 67969582 65180059 60993235 55848510 50180805 44304222 38343219
12112C8343219o112976o453999o983896p577389q024630q089999p574540o383471
$$ 38343219 32230243 25776244 18792348 11214959 3190329 -4899670 -12474210 -18857681
12104a8857681m584922k419626k34581J631533K945265L611903L653547L171870
$$ -18857681 -23442603 -25862229 -26096810 -24465277 -21520012 -17908109 -14254562 -11082692
12096a1082692K324743J316008L80295k49905l91580M2366J014500K364190L843876
$$ -11082692 -8757949 -7441941 -7061646 -7311551 -7703131 -7660765 -6646265 -4282075 -438199
12087d38199N184854O172646O701148O780948O502178N980195N318529M600207
$$ -438199 4746655 10919301 17620449 24401397 30903575 36883770 42202299 46802506
12079D6802506L889463L222832K593602J951313J223170L38927p56586k093304
$$ 46802506 50691969 53914801 56508403 58459716 59682886 60021813 59265227 57171923
12071E7171923l652134n337444o976128q356659r289791r663018r471590q816580
$$ 57171923 53519789 48182345 41206217 32849558 23559767 13896749 4425159 -4391421
12063d391421p865195o785272n686382m598263l493946k341483j156747k7084
$$ -4391421 -12256616 -19041888 -24728270 -29326533 -32820479 -35161962 -36318709 -36345793
12055c6345793R12437J537190J787466J691708J361288R66828O90996O59165Q83608
$$ -36345793 -35433356 -33896166 -32108700 -30416992 -29055704 -28088876 -27397880 -26738715 -25855107
12046b5855107J264656J646751J882523J870116J571297J026178L53836k79107
$$ -25855107 -24590451 -22943700 -21061177 -19191061 -17619764 -16593586 -16239750 -16518857
12038a6518857p11932q34598o05819m7456P77076J792245K930526M127206N297843
$$ -16518857 -17230789 -18065387 -18671206 -18718662 -17941586 -16149341 -13218815 -9091609 -3793766
12029c793766O328046P093791P498027P494406P084001O295384N169145L761804
$$ -3793766 2534280 9628071 17126098 24620504 31704505 37999889 43169034 46930838
12021D6930838K166785N30982r60299k138789k923305l357108l579154l740609
$$ 46930838 49097623 49628605 48668306 46529517 43606212 40249104 36669950 32929341
12013C2929341l919639m089160m150236l996400l564922k858148j941257r21289
$$ 32929341 29009702 24920542 20770306 16773906 13208984 10350836 8409579 7488290
12005G488290R1866J027121J867987K630632L323963L920831M352763M528405
$$ 7488290 7580156 8607277 10475264 13105896 16429859 20350690 24703453 29231858
11997B9231858M374267L884155L142349K293452J477671P82612K37820j70674
$$ 29231858 33606125 37490280 40632629 42926081 44403752 45186364 45424184 45253510
11989D5253510m96099q29544j271329j872056k582259l254256l702842l788887
$$ 45253510 44757411 43927867 42656538 40784482 38202223 34947967 31245125 27456238
11981B7456238l475320k825882j957980r89923j6218Q88117J655795K223419K534333
$$ 27456238 23980918 21155036 19197056 18207133 18190915 19079032 20734827 22958246 25492579
11972B5492579K544038K230297J608318P41442k64925j289113k229125l032032
$$ 25492579 28036617 30266914 31875232 32616674 32351749 31062636 28833511 25801479
11964B5801479l701512m279663m815038n335398n834909o274502o592853o726485
$$ 25801479 22099967 17820304 13005266 7669868 1834959 -4439543 -11032396 -17758881
11956a7758881o630157o282618n675687m806077l689750k390525j030411K39500
$$ -17758881 -24389038 -30671656 -36347343 -41153420 -44843170 -47233695 -48264106 -48024606
11948d8024606J290807K052853K510443K684170K626624K433794K230826K105600
$$ -48024606 -46733799 -44680946 -42170503 -39486333 -36859709 -34425915 -32195089 -30089489
11940c0089489K030139J850755J380956N36535n90704j773963k771564l440281
$$ -30089489 -28059350 -26208595 -24827639 -24291104 -24881808 -26655771 -29427335 -32867616
11932c2867616l770058l825587l644163l170265k278481q67084J044673L273237
$$ -32867616 -36637674 -40463261 -44107424 -47277689 -49556170 -50423254 -49378581 -46105344
11924d6105344N496680P335467Q464228Q719060Q151894O996416N558698M096216
$$ -46105344 -40608664 -33273197 -24808969 -16089909 -7938015 -941599 4617099 8713315
11916H713315K755513J591837O30784r1847n40149p10150o39246l83710O899M93699
$$ 8713315 11468828 13060665 13691449 13599602 13059453 12349303 11710057 11326347 11333246 11826945
11906A1826945J038010J598595K142920K658205L146094L599809L980767M218394
$$ 11826945 12864955 14463550 16606470 19264675 22410769 26010578 29991345 34209739
11898C4209739M240800M012558L542376K851864J941401P97301n57828k016772
$$ 34209739 38450539 42463097 46005473 48857337 50798738 51596039 51038211 49021439
11890D9021439l388703m454884n043200n080472m607924l769700k784240j894961
$$ 49021439 45632736 41177852 36134652 31054180 26446256 22676556 19892316 17997355
11882A7997355j299987j085760j203964j508803j830994k046428k110803k053367
$$ 17997355 16697368 15611608 14407644 12898841 11067847 9021419 6910616 4857249
11874D857249j937519j809741j668882j478189j210120q87404n88014m09880m18295
$$ 4857249 2919730 1109989 -558893 -2037082 -3247202 -4134606 -4722620 -5132500 -5550795
11865e550795o08821r08622j213666j435209j527388j489448j356205j188243
$$ -5550795 -6159616 -7068238 -8281904 -9717113 -11244501 -12733949 -14090154 -15278397
11857a5278397j059287j034613j144922j368978j636078j849040j917913j788604
$$ -15278397 -16337684 -17372297 -18517219 -19886197 -21522275 -23371315 -25289228 -27077832
11849b7077832j453122r39090k87705M67454J313724K263233L345565M583616
$$ -27077832 -28530954 -29470044 -29757749 -29290295 -27976571 -25713338 -22367773 -17784157
11841a7784157N949629P315982Q437958R006714Q770914P667296N876121L759265
$$ -17784157 -11834528 -4518546 3919412 12926126 21697040 29364336 35240457 38999722
11833C8999722J718090N9210j062464j620639j665094j289055o24797J57962Q75491
$$ 38999722 40717812 40777022 39714558 38093919 36428825 35139770 34514973 34672935 35548426
11824C5548426J376447J591235J555856J389296J229706J165413J201718J273899
$$ 35548426 36924873 38516108 40071964 41461260 42690966 43856379 45058097 46331996
11816D6331996J285443J150271Q31836L67179j46443o03561r41914j152020j251227
$$ 46331996 47617439 48767710 49599546 49966725 49820282 49216721 48274807 47122787 45871560
11807D5871560j263017j219945j168328j153366j195744j283428j383127j457757
$$ 45871560 44608543 43388598 42220270 41066904 39871160 38587732 37204605 35746848
11799C5746848j476735j413330j231653q79722l11204M65551J349910K164637
$$ 35746848 34270113 32856783 31625130 30745408 30434204 30899755 32249665 34414302
11791C4414302K721718K889771K619124J926040Q71294m41726j859473l191069
$$ 34414302 37136020 40025791 42644915 44570955 45442249 45000523 43141050 39949981
11783C9949981m255500m942363n245923n247139n054329m741484m323051l776723
$$ 39949981 35694481 30752118 25506195 20259056 15204727 10463243 6140192 2363469
11775B363469l090341k293537j453503o49326M7405N77503Q97803R90591Q66508
$$ 2363469 -726872 -3020409 -4473912 -5123238 -5075833 -4498330 -3600527 -2609936 -1743428
11766a743428N49971N8024o06716j443933k437220l541464m678182n740198o611273
$$ -1743428 -1193457 -1135433 -1742149 -3186082 -5623302 -9164766 -13842948 -19583146 -26194419
11757b6194419p199523p466394p426722p114541o540585n679130m497285l000781
$$ -26194419 -33393942 -40860336 -48287058 -55401599 -61942184 -67621314 -72118599 -75119380
11749g5119380j256285O24120K516111M305559N891496P181700Q096720Q587700
$$ -75119380 -76375665 -75751545 -73235434 -68929875 -63038379 -55856679 -47759959 -39172259
11741c9172259Q659506Q383246P887567P332037O872175O620394O607391O763417
$$ -39172259 -30512753 -22129507 -14241940 -6909903 -37728 6582666 13190057 19953474
11733A9953474O945004P004056O856324O503309O003194N423822M806068M139237
$$ 19953474 26898478 33902534 40758858 47262167 53265361 58689183 63495251 67634488
11725F7634488L345306K289271Q40285j027059l155164n224921o888126p929739
$$ 67634488 70979794 73269065 74109350 73082291 69927127 64702206 57814080 49884341
11717D9884341q347202q301873p999452p593377p158736o720105o292628n905813
$$ 49884341 41537139 33235266 25235814 17642437 10483701 3763596 -2529032 -8434845
11709h434845n596727n379814n223055n060555m838060m552985m255512m014199
$$ -8434845 -14031572 -19411386 -24634441 -29694996 -34533056 -39086041 -43341553 -47355752
11701d7355752l874530l831566l820071l721984l396416k732924j710289m27577
$$ -47355752 -51230282 -55061848 -58881919 -62603903 -66000319 -68733243 -70443532 -70871109
11693g0871109R18085K101852K953691L411161L520923L396242L158792K899693
$$ -70871109 -69953024 -67851172 -64897481 -61486320 -57965397 -54569155 -51410363 -48510670
11685d8510670K679217K550104K565755K755098L093888L517040L971496M457326
$$ -48510670 -45831453 -43281349 -40715594 -37960496 -34866608 -31349568 -27378072 -22920746
11677b2920746N012311N654737O340412O969892P431944P643226P560066P169555
$$ -22920746 -17908435 -12253698 -5913286 1056606 8488550 16131776 23691842 30861397
11669C0861397O482040N535591M401300L170293J918544O70918o01839j935535
$$ 30861397 37343437 42879028 47280328 50450621 52369165 53040083 52438244 50502709
11661E0502709l296248m531541n398180n659738n190190m019395k312325l22165
$$ 50502709 47206461 42674920 37276740 31617002 26426812 22407417 20095092 19772927
11653A9772927J649472L289568M326451M596160M095886K993622J579775J75779
$$ 19772927 21422399 24711967 29038418 33634578 37730464 40724086 42303861 42479640
11645D2479640r57732j670446j920761j748896j249475n43248K58323J081997
$$ 42479640 41521908 39851462 37930701 36181805 34932330 34389082 34647405 35729402
11637C5729402J891837K657519L320059L785857L955665L768541L231701K420078
$$ 35729402 37621239 40278758 43598817 47384674 51340339 55108880 58340581 60760659
11629F0760659J452306M61229m31080j133329j594249j791852j712930j353053
$$ 60760659 62212965 62674194 62243114 61109785 59515536 57723684 56010754 54657701
11621E4657701p47270M138P57217J384295J818519K049647K092043J962788J678353
$$ 54657701 53910431 53914569 54671786 56056081 57874600 59924247 62016290 63979078 65657431
11612F5657431J255300P10941P2467o09233j262557j825782k282870k665464l006294
$$ 65657431 66912731 67623672 67696139 67086906 65824349 63998567 61715697 59050233 56043939
11603E6043939l276637l365713l132938k503508j539116m35361N47333J175826
$$ 56043939 52767302 49401589 46268651 43765143 42226027 41790666 42337999 43513825
11595D3513825J320409R95824L55552l67281r55455j290944j376128j287067j103452
$$ 43513825 44834234 45830058 46185610 45818329 44862874 43571930 42195802 40908735 39805283
11586C9805283q66974n81323k31386J97652O98108J211701J616037J751902J486174
$$ 39805283 38938309 38356986 38125600 38323252 39021360 40233061 41849098 43601000 45087174
11577D5087174P71464l32152j673957l047520m231559n037040n354100n178211
$$ 45087174 45858638 45526486 43852529 40805009 36573450 31536410 26182310 21004099
11569B1004099m600477l771626k864996k050205j465264j175341j136561j203618
$$ 21004099 16403622 12631996 9767000 7716795 6251531 5076190 3939629 2736011
11561B736011j196464r91851n83669q2902L29773M69305K07794m82072j515291
$$ 2736011 1539547 547696 -35973 -118875 210898 680203 887997 405925 -1109366
11552a109366k720408l890875m837543n422379n569796n266522m562448l570502
$$ -1109366 -3829774 -7720649 -12558192 -17980571 -23550367 -28816889 -33379337 -36949839
11544c6949839k449127j359973m23659K91508P44857R01635P48192L27984k48784
$$ -36949839 -39398966 -40758939 -41182598 -40891090 -40146233 -39244598 -38496406 -38168422 -38417206
11535c8417206q41377j330597j645679j757841j663763j380711r52566m50471
$$ -38417206 -39258583 -40589180 -42234859 -43992700 -45656463 -47037174 -47989740 -48440211
11527d8440211M3824M65827P86213J001911J106887J070582Q49140M27829j34002
$$ -48440211 -48396387 -47930560 -47144347 -46142436 -45035549 -43964967 -43115827 -42687998 -42822000
11518d2822000o91160j051102j047197o06549K24308J302944K441835L460174
$$ -42822000 -43513160 -44564262 -45611459 -46218008 -45993700 -44690756 -42248921 -38788747
11510c8788747M223508M666663M795477M668145M369964L998745L662441L471819
$$ -38788747 -34565239 -29898576 -25103099 -20434954 -16064990 -12066245 -8403804 -4931985
11502d931985L510646L787362M198029M538671M582636M191876L395974K385465
$$ -4931985 -1421339 2366023 6564052 11102723 15685359 19877235 23273209 25658674
11494B5658674J424314P39889M52687N68552J016042J697419K525429L427605
$$ 25658674 27082988 27822877 28275564 28844116 29860158 31557577 34083006 37510611
11486C7510611M317557N059868N470832N377191M705136L535785K080463N90888
$$ 37510611 41828168 46888036 52358868 57736059 62441195 65976980 68057443 68648331
11478F8648331p30503j763671k446089k733389k587604k002996j049905R7764
$$ 68648331 67917828 66154157 63708068 60974679 58387075 56384079 55334174 55431938
11470E5431938J185601J960544K271074K116678J611444Q98252Q3226p76396j651397
$$ 55431938 56617539 58578083 60849157 62965835 64577279 65475531 65558757 64782361 63130964
11461F3130964k518639l348296m099789m730612n213988n544400n718751n715561
$$ 63130964 60612325 57264029 53164240 48433628 43219640 37675240 31956489 26240928
11453B6240928n507124n104144m590042m105866l791103l720362l872352m141652
$$ 26240928 20733804 15629660 11039618 6933752 3142649 -577713 -4450065 -8591717
11445h591717m381740m456708m278455l815893l080537k106340r40540L50707
$$ -8591717 -12973457 -17430165 -21708620 -25524513 -28605050 -30711390 -31651930 -31301223
11437c1301223J670396K884784L832858M356627M352835L834151K969333K064918
$$ -31301223 -29630827 -26746043 -22913185 -18556558 -14203723 -10369572 -7400239 -5335321
11429e335321J475418J475082K154812L393587M907796O344565P379940P797525
$$ -5335321 -3859903 -2384821 -230009 3163578 8071374 14415939 21795879 29593404
11421B9593404P534535O683986N448704M063598K723733J553890O25438p699k91405
$$ 29593404 37127939 43811925 49260629 53324227 56047960 57601850 58227288 58219589 57928184
11412E7928184j89428K75495R87443J737901K270203K352399J848934P65993p42103
$$ 57928184 57738756 58014251 59001694 60739595 63009798 65362197 67211131 67977124 67235021
11403F7235021k411446l950563n140538n902435o291248o426585o412633o292952
$$ 67235021 64823575 60873012 55732474 49830039 43538791 37112206 30699573 24406621
11395B4406621o049010n630824n006307m206552l332175k505921j805673j234610
$$ 24406621 18357611 12726787 7720480 3513928 181753 -2324168 -4129841 -5364451
11387e364451p50227l21358L2669K42484K23563p4484o34066j377150k208462
$$ -5364451 -6114678 -6436036 -6403367 -6160883 -5937320 -6011804 -6645870 -8023020 -10231482
11378a0231482l052131l846256m512033m949479n081322m904422m492699l947411
$$ -10231482 -13283613 -17129869 -21641902 -26591381 -31672703 -36577125 -41069824 -45017235
11370d5017235l347210k744752k199198j793585j605389j650690j850895k053186
$$ -45017235 -48364445 -51109197 -53308395 -55101980 -56707369 -58358059 -60208954 -62262140
11362f2262140k094993j873705j382124o93548Q8126Q78861J636954K353067L025366
$$ -62262140 -64357133 -66230838 -67612962 -68306510 -68218384 -67339523 -65702569 -63349502 -60324136
11353f0324136L643054M191011M668579N098766N507122N878569O131966O148233
$$ -60324136 -56681082 -52490071 -47821492 -42722726 -37215604 -31337035 -25205069 -19056836
11345a9056836N842568N227324M414676L554924K755181K036350J358409O93876
$$ -19056836 -13214268 -7986944 -3572268 -17344 2737837 4774187 6132596 6826472
11337F826472R0521l29898m38147j75310M17667J230771K137269L023043L783581
$$ 6826472 6916993 6587095 6148948 5973638 6391305 7622076 9759345 12782388 16565969
11328A6565969M314710M524521M364910L853277L059064K064733R39326k49919
$$ 16565969 20880679 25405200 29770110 33623387 36682451 38747184 39686510 39436591
11320C9436591j405595k391724l072457l376195l337687l084099k770150k503957
$$ 39436591 38030996 35639272 32566815 29190620 25852933 22768834 19998684 17494727
11312A7494727k313818k175455k068027k001924j991893k007877j960184j738336
$$ 17494727 15180909 13005454 10937427 8935503 6943610 4935733 2975549 1237213
11304A237213j267214n31075M43463J611108K906090M222272N410659O313141
$$ 1237213 -30001 -561076 -117613 1493495 4399585 8621857 14032516 20345657
11296B0345657O812067O857986O460271N659761M512663L094552J509223j15967
$$ 20345657 27157724 34015710 40475981 46135742 50648405 53742957 55252180 55136213
11288E5136213j649740k978018m015665m711257n052367n070263m835187m439292
$$ 55136213 53486473 50508455 46492790 41781533 36729166 31658903 26823716 22384424
11280B2384424l976173l525585l141534k840276k597605k369871k134331j919267
$$ 22384424 18408251 14882666 11741132 8900856 6303251 3933380 1799049 -120218
11272a20218j796477j841184k092842k544214l155096l866633m602250n265182
$$ -120218 -1916695 -3757879 -5850721 -8394935 -11550031 -15416664 -20018914 -25284096
11264b5284096n750052n968210n867149n428814m655445l566005k214063p13374
$$ -25284096 -31034148 -37002358 -42869507 -48298321 -52953766 -56519771 -58733834 -59447208
11256e9447208P54114J964568K710007K866284K440926J577597N14669m83749
$$ -59447208 -58693094 -56728526 -54018519 -51152235 -48711309 -47133712 -46619043 -47102792
11248d7102792j197931j500140j364669q41345j4367J024588K178839L339462
$$ -47102792 -48300723 -49800863 -51165532 -52006877 -52021244 -50996656 -48817817 -45478355
11240d5478355M385360N191602N642507N658015N238838M506243L692887L069335
$$ -45478355 -41092995 -35901393 -30258886 -24600871 -19362033 -14855790 -11162903 -8093568
11232h093568K844523L099618L782813M746537N792414O706802P289174P377886
$$ -8093568 -5249045 -2149427 1633386 6379923 12172337 18879139 26168313 33546199
11224C3546199O868457N718840L949074J652791r75781l626135n906916p444218
$$ 33546199 40414656 46133496 50082570 51735361 50759580 47133445 41226529 33782311
11216C3782311q005149p583538o403392m838871l285967k037437j209839p50416
$$ 33782311 25777162 18193624 11790232 6951361 3665394 1627957 418118 -332298
11208c32298n14371l65769k44180j66144j77570l01289n11867p37541q74811q14158
$$ -332298 -846669 -1212438 -1456618 -1622762 -1800332 -2101621 -2613488 -3351029 -4225840 -5039998
11198e039998m83559J02483Q24810J498304J950697K093573J946825J611375J212752
$$ -5039998 -5523557 -5421074 -4596264 -3097960 -1147263 946310 2893135 4504510 5717262
11189E717262Q48145N65068L79484L12530M09410P18770J244461J906132K543221
$$ 5717262 6565407 7130475 7509959 7822489 8231899 8950669 10195130 12101262 14644483
11180A4644483K970922L060384K793671K258286J590689R12219K93626k48214
$$ 14644483 17615405 20675789 23469460 25727746 27318435 28230654 28524280 28276066
11172B8276066p35545j205035j676800k130211k504055k722667k729794k510573
$$ 28276066 27540521 26335486 24658686 22528475 20024420 17301753 14571959 12061386
11164A2061386k095427j549388r51083l67523J63267O30451J031435J354162J579844
$$ 12061386 9965959 8416571 7465488 7097965 7261232 7891683 8923118 10277280 11857124
11155A1857124J703933J749195J748730J712664J618784J444992J209567R70471
$$ 11857124 13561057 15310252 17058982 18771646 20390430 21835422 23044989 24015460
11147B4015460P80256O44357N24048L74899J80310m4820k73752m89839o92081
$$ 24015460 24795716 25440073 25964121 26339020 26519330 26474510 26200758 25710919 25018838
11138B5018838q78365j021928j070428r77729p39402l95579n969L64010O31750
$$ 25018838 24140473 23118545 22048117 21070388 20330986 19935407 19929438 20293448 20925198
11129B0925198O96558M84890J9032n55511j020622j185967r76786m63854J70480
$$ 20925198 21621756 22106646 22125678 21570167 20549545 19363578 18386792 17922938 18093418
11120A8093418P06727R68746Q80766M86480p0171n94813r08963r10877o06906
$$ 18093418 18800145 19768891 20649657 21136137 21065966 20471153 19562190 18651313 18044407
11111A8044407j00896M52545R10344J192159J298210J289853J252348J265882
$$ 18044407 17943511 18396056 19306400 20498559 21796769 23086622 24338970 25604852
11103B5604852J393021J670872K096883K612643L099011L395856L355957K924604
$$ 25604852 26997873 28668745 30765628 33378271 36477282 39873138 43229095 46153699
11095D6153699K201251J424051Q64664O98457R39101J465537K096701K661544
$$ 46153699 48354950 49779001 50643665 51342122 52281223 53746760 55843461 58505005
11087E8505005L050215L247201L330150L420080L604232L877088M128675M181490
$$ 58505005 61555220 64802421 68132571 71552651 75156883 79033971 83162646 87344136
11079H7344136L863831L094347J932269N55249q21595k025784k962461l610704
$$ 87344136 91207967 94302314 96234583 96789832 95968237 93942453 90979992 87369288
11071H7369288m005990m211561m274901m193398l925731l448113k807315k123002
$$ 87369288 83363298 79151737 74876836 70683438 66757707 63309594 60502279 58379277
11063E8379277j536458j143668r58289r28544r95157j144953j415595j848096
$$ 58379277 56842819 55699151 54740862 53812318 52817161 51672208 50256613 48408517
11055D8408517k427827l059381l590013l866922l801901l412725k815034k164682
$$ 48408517 45980690 42921309 39331296 35464374 31662473 28249748 25434714 23270032
11047B3270032j585588j125096p49358l63394J55291R04780J893955L001070L999173
$$ 23270032 21684444 20559348 19809990 19446596 19601887 20506667 22400622 25401692 29400865
11038B9400865M652292M829488M563691M019312L395958K831323K352280J883351
$$ 29400865 34053157 38882645 43446336 47465648 50861606 53692929 56045209 57928560
11030E7928560J294822M69155o33666j934573l240364m302411m908255m961448
$$ 57928560 59223382 59692537 59058871 57124298 53883934 49581523 44673268 39711820
11022C9711820m505876l686509k686863j696370r16678n59682p91658j641323
$$ 39711820 35205944 31519435 28832572 27136202 26219524 25659842 24868184 23226861
11014B3226861k943272m372127n556366o209455o213605n626644m625651l426779
$$ 23226861 20283589 15911462 10355096 4145641 -2067964 -7694608 -12320259 -15747038
11006a5747038k216112j104509j07629Q42979J856157L026045M396553N951786
$$ -15747038 -17963150 -19067659 -19175288 -18332309 -16476152 -13450107 -9053554 -3101768
10998c101768P612403R230594J0606492J1540996J1895304J1610220J0679611
$$ -3101768 4510635 13741229 24347721 35888717 47784021 59394241 70073852
10991G0073852R122457O993734M424003J642227j049368l339265m977378n828334
$$ 70073852 79196309 86190043 90614046 92256273 91206905 87867640 82890262 77061928
10983G7061928n901488n355710m469179l568293k934349k727372k957664l505859
$$ 77061928 71160440 65804730 61335551 57767258 54832909 52105537 49147873 45642014
10975D5642014m172810m741103n035390m968156m558286l915245l189993k507842
$$ 45642014 41469204 36728101 31692711 26724555 22166269 18251024 15061031 12553189
10967A2553189j919004j404275r33568n21903k25030p8827m7166l4183M7377K11300
$$ 12553189 10634185 9229910 8296342 7774439 7549409 7470582 7423416 7389233 7436610 7647910
10957G647910L91221M98946N02194M56556M59808N63723P18871P99264O84393
$$ 7647910 8039131 8538077 9040271 9496827 9956635 10520358 11239229 12038493 12722886
10948A2722886L35932j76944p09629j110737j294286j276564j152738j028694
$$ 12722886 13058818 12881874 12172245 11061508 9767222 8490658 7337920 6309226
10940F309226r59625r37917r25925q95757q50034q27201q99783j157036j663139
$$ 6309226 5349601 4411684 3485759 2590002 1739968 912767 12984 -1144052 -2807191
10931b807191k409024l291959m136428m738872m916377m555277l653371k331623
$$ -2807191 -5216215 -8508174 -12644602 -17383474 -22299851 -26855128 -30508499 -32840122
10923c2840122p97527P21211K032144L002873L567612L731308L568372L205597
$$ -32840122 -33637649 -32916438 -30884294 -27881421 -24313809 -20582501 -17014129 -13808532
10915a3808532K787344K430219K181060K000093J787820J446626R39180L08764
$$ -13808532 -11021188 -8590969 -6409909 -4409816 -2621996 -1175370 -236190 72574
10907G2574l40864q83618j206575j234971r45714l72092L95346J211776J894647
$$ 72574 -268290 -1151908 -2358483 -3593454 -4539168 -4911260 -4515914 -3304138 -1409491
10898a409491K262012K184142J625315O56241n65014j830634k924159l658724
$$ -1409491 852521 3036663 4661978 5318219 4753205 2922571 -1588 -3660312
10890c660312l913322l661914k978357k004768q96636K23749J286091K268000
$$ -3660312 -7573634 -11235548 -14213905 -16218673 -17115309 -16891560 -15605469 -13337469
10882a3337469L178534M032225M822179N513886O069124O474214O737003O852890
$$ -13337469 -10158935 -6126710 -1304531 4209355 10278479 16752693 23489696 30342586
10874C0342586O779434O451748N828218M928497L837158K675510J562539N86154
$$ 30342586 37122020 43573768 49401986 54330483 58167641 60843151 62405690 62991844
10866F2991844k04981p92230j173098j356331j370170j272543j144779j064551
$$ 62991844 62786863 61994633 60821535 59465204 58095034 56822491 55677712 54613161
10858E4613161j078910j200890j422904j715902k006084k165542k053373j589535
$$ 54613161 53534251 52333361 50910457 49194555 47188471 45022929 42969556 41380021
10850D1380021q02751J81782J194899K078130K726025L117472L324594L477400
$$ 41380021 40577270 40759052 41953951 44032081 46758106 49875578 53200172 56677572
10842E6677572L686231L965272M214128M277516M041876L497963K729906J852910
$$ 56677572 60363803 64329075 68543203 72820719 76862595 80360558 83090464 84943374
10834H4943374R53309O6152q08732j668708k472139l133566l565843l743550l733647
$$ 84943374 85896683 85962835 85154103 83485395 81013256 77879690 74313847 70570297 66836650
10825F6836650l663786l652860l751759l920757m043562l973045l601143k926978
$$ 66836650 63172864 59520004 55768245 51847488 47803926 43830881 40229738 37302760
10817C7302760k083216j298209q11939p92122j289835k241845l499904m866272
$$ 37302760 35219544 33921335 33109396 32317274 31027439 28785594 25285690 20419418
10809B0419418o131407p116494p712192p896715p728359p321785o813639o315113
$$ 20419418 14288011 7171517 -540675 -8437390 -16165749 -23487534 -30301173 -36616286
10801c6616286n862248n397228m807177m006459l012475j966557j084613n62943
$$ -36616286 -42478534 -47875762 -52682939 -56689398 -59701873 -61668430 -62753043 -63315986
10793f3315986m92135q27410j424637k108024k727918l192669l478736l621415
$$ -63315986 -63808121 -64635531 -66060168 -68168192 -70896110 -74088779 -77567515 -81188930
10785h1188930l686855l736853l802324l868779l869908l695787l227072k387320
$$ -81188930 -84875785 -88612638 -92414962 -96283741 -100153649 -103849436 -107076508 -109463828
10777a09463828j185337K73698J807475L196250M235248M788207M823755M423784
$$ -109463828 -110649165 -110375467 -108567992 -105371742 -101136494 -96348287 -91524532 -87100748
10769h7100748L767447L096464K661258K653285L146215M073381N251605O438077
$$ -87100748 -83333301 -80236837 -77575579 -74922294 -71776079 -67702698 -62451093 -56013016
10761e6013016P394776P937958P964274P459842O498648N223068L797324K349521
$$ -56013016 -48618240 -40680282 -32716008 -25256166 -18757518 -13534450 -9737126 -7387605
10753g387605R41618m09900j684928k826215l741936m331652m516808m269639
$$ -7387605 -6445987 -6855887 -8540815 -11367030 -15108966 -19440618 -23957426 -28227065
10745b8227065l637227k747768j784310r26329k79518J75310N87523J185815K184566
$$ -28227065 -31864292 -34612060 -36396370 -37322699 -37602217 -37426907 -36839384 -35653569 -33469003
10736c3469003L682531N598160P674113R552036J0883615J1429364J1112323J0021814
$$ -33469003 -29786472 -24188312 -16514199 -6962163 3921452 15350816 26463139 36484953
10728C6484953Q377733O466044M558156K838488J371135J22052r78401j973143
$$ 36484953 44862686 51328730 55886886 58725374 60096509 60218561 59240160 57267017
10720E7267017k854601l585415m134655m495728m679669m702202m577498m312759
$$ 57267017 54412416 50827001 46692346 42196618 37516949 32814747 28237249 23924490
10712B3924490l897424l296899k464755j372898m6979J407673K806883L931404
$$ 23924490 20027066 16730167 14265412 12892514 12845535 14253208 17060091 20991495
10704B0991495M605173M762964M460456L827299L009155K136617J316587O23943
$$ 20991495 25596668 30359632 34820088 38647387 41656542 43793159 45109746 45733689
10696D5733689R2275k78901m97341n54929m33617j37339K82137P35646J139081
$$ 45733689 45825964 45547063 45049722 44494793 44061176 43923837 44205974 44941620 46080701
10687D6080701J450985J673513J822799J901665J896281J789901J576076J262100
$$ 46080701 47531686 49205199 51027998 52929663 54825944 56615845 58191921 59454021
10679E9454021Q61636L79384k00918r09535j763808k741598l775650m768342n612902
$$ 59454021 60315657 60695041 60494123 59584588 57820780 55079182 51303532 46535190 40922288
10670D0922288o213956o506693o468212o111761n468623m577299l494540k321327
$$ 40922288 34708332 28201639 21733427 15621666 10153043 5575744 2081204 -240123
10662b40123j220221m00538o4970l36384j200304k491461l927429n173581n921761
$$ -240123 -1460344 -1860882 -1925852 -2262236 -3462540 -5954001 -9881430 -15055011 -20976772
10653b0976772n966683n257712l902616k118866j57249J763000L478977M868213
$$ -20976772 -26943455 -32201167 -36103783 -38222649 -38379898 -36616898 -33137921 -28269708
10645b8269708N819365O224987O009888N173170L808598K089276K30798j547566
$$ -28269708 -22450343 -16225356 -10215468 -5042298 -1233700 855576 1086374 -461192
10637d61192l055806m158317m786636m937679m662513m050686l211015k252954
$$ -461192 -3516998 -7675315 -12461951 -17399630 -22062143 -26112829 -29323844 -31576798
10629c1576798j277824l80567L52984Q66305J159820J300101J396298J554638
$$ -31576798 -32854622 -33235189 -32882205 -32015900 -30856080 -29555979 -28159681 -26605043
10621b6605043J835881K235933K696012L133707L476855L683478L740737L645716
$$ -26605043 -24769162 -22533229 -19837217 -16703510 -13226655 -9543177 -5802440 -2156724
10613b156724L378576K886708K099391R73598m57706k071679l687979n126567
$$ -2156724 1221852 4108560 6207951 7181549 6723843 4652164 964185 -4162382
10605d162382o260173p040416p486892p639400p497658o995048o039091m598774
$$ -4162382 -10422555 -17462971 -24949863 -32589263 -40086921 -47081969 -53121060 -57719834
10597e7719834k775416q04609J010707K394875L180165L352379L053121K534888
$$ -57719834 -60495250 -61299859 -60289152 -57894277 -54714112 -51361733 -48308612 -45773724
10589d5773724K079208J909033K131973K731855L599941M584784N539903O352286
$$ -45773724 -43694516 -41785483 -39653510 -36921655 -33321714 -28736930 -23197027 -16844741
10581a6844741O943388P250545P209506O755198N843684M487375K788115R44130
$$ -16844741 -9901353 -2650808 4558698 11313896 17157580 21644955 24433070 25377200
10573B5377200p90288k184260l105230l545175l592993l383204l049246k691204
$$ 25377200 24586912 22402652 19297422 15752247 12159254 8776050 5726804 3035600
10565C035600k362153k078119j843033j665152j553137j506318j516758j575733
$$ 3035600 673447 -1404672 -3247705 -4912857 -6465994 -7972312 -9489070 -11064803
10557a1064803j665262j737649j711638j504304j081640m88492J68573P77073
$$ -11064803 -12730065 -14467714 -16179352 -17683656 -18765296 -19253788 -19085215 -18308142
10549a8308142J275940J674210K017935K330578K572429K650478K475272K029977
$$ -18308142 -17032202 -15357992 -13340057 -11009479 -8437050 -5786572 -3311300 -1281323
10541a281323J406587P80784L34901J75613K96076N97549R45627J225097J371246
$$ -1281323 125264 906048 1240949 1416562 1712638 2310187 3255814 4480911 5852157
10532E852157J370512J234834R69095N58506j4841p44518j583807k444323l204915
$$ 5852157 7222669 8457503 9426598 9985104 9970263 9225745 7641938 5197615 1992700
10523A992700l739097l964276l880726l554797l050157k374117j496612m19363
$$ 1992700 -1746397 -5710673 -9591399 -13146196 -16196353 -18570470 -20067082 -20486445
10515b0486445P81889J985460L091269M066528M938325N746495O492929P121364
$$ -20486445 -19704556 -17719096 -14627827 -10561299 -5622974 123521 6616450 13737814
10507A3737814P541720P682029P531428P147437O629960O084986N601252N250652
$$ 13737814 21279534 28961563 36492991 43640428 50270388 56355374 61956626 67207278
10499F7207278N104765N243933N740226O623977P864163R375536J1031874J2658710
$$ 67207278 72312043 77555976 83296202 89920179 97784342 107159878 118191752 130850462
10491A30850462J4005249J4722526J4389113J2626253R302387M728410l26295
$$ 130850462 144855711 159578237 173967350 186593603 195895990 200624400 200298105
10484B00298105m885933q166028r858808j0142998r479554q375319p234418o302977
$$ 200298105 195412172 187246144 177387336 167244338 157764784 149389465 142155047 135852070
10476A35852070n673823n332497n220934n275931n418843n525357n430944m997150
$$ 135852070 130178247 124845750 119624816 114348885 108930042 103404685 97973741 92976591
10468I2976591m204736l202780k261503j645509j489458j756878k291839k904689
$$ 92976591 88771855 85569075 83307572 81662063 80172605 78415727 76123888 73219199
10460G3219199l429849l741263l748987l402053k704764j736064o51207L50664
$$ 73219199 69789350 66048087 62299100 58897047 56192283 54456219 53805012 54155676
10452E4155676J087649J458044J474921J254915R61570P26851N95609N29617M62210
$$ 54155676 55243325 56701369 58176290 59431205 60392775 61119626 61715235 62244852 62707062
10443F2707062L54438K14267Q2361O337J1862P4278J10784J2733k96923q23285
$$ 62707062 63061500 63275767 63358128 63364465 63376327 63450605 63561389 63574122 63277199 62453914
10433F2453914j500377k218473k852216l283756l429283l267255k851680k297091
$$ 62453914 60953537 58735064 55882848 52599092 49169809 45902554 43050874 40753783
10425D0753783j740935j304312j067580j059421j249045j544465j814737j941798
$$ 40753783 39012848 37708536 36640956 35581535 34332490 32788025 30973288 29031490
10417B9031490j875258j652318j371743j143559j042321j080366j210289j357684
$$ 29031490 27156232 25503914 24132171 22988612 21946291 20865925 19655636 18297952
10409A8297952j465018j515310j523969j517145j514759j512655j457368j236945
$$ 18297952 16832934 15317624 13793655 12276510 10761751 9249096 7791728 6554783
10401F554783p19076J75513J422367K906651M477411N983620P265862Q136039
$$ 6554783 5835707 6011220 7433587 10340238 14817649 20801269 28067131 36203170
10393C6203170Q394304P894493O619847M716491K461233J83624j815568l319335
$$ 36203170 44597474 52491967 59111814 63828305 66289538 66473162 64657594 61338259
10385F1338259m220242m528435m363363l917674l391107k921376k555346k278533
$$ 61338259 57118017 52589582 48226219 44308545 40917438 37996062 35440716 33162183
10377C3162183k069708j922852j813581j651434j282883n63470N51077J962850
$$ 33162183 31092475 29169623 27356042 25704608 24421725 23858255 24409332 26372182
10369B6372182L461890M797898N750927O181478O060368N480238M644308L825177
$$ 26372182 29834072 34631970 40382897 46564375 52624743 58104981 62749289 66574466
10361F6574466L290350L208392L577007M222320M881001N317347N406593N153212
$$ 66574466 69864816 73073208 76650215 80872535 85753536 91070883 96477476 101630688
10353A01630688M660915M080782L549978L135546K813001K498680K114140J634795
$$ 101630688 106291603 110372385 113922363 117057909 119870910 122369590 124483730 126118525
10345A26118525J093371N48547M8784l87838p75133j148077j544230j977057k406949
$$ 126118525 127211896 127760443 127809227 127421389 126646256 125498179 123953949 121976892 119569943
10336A19569943k732073k824788k609032k129742j557687j119327r97429j262205
$$ 119569943 116837870 114013082 111404050 109274308 107716621 106597294 105599865 104337660
10328A04337660j860885k653754l466066m131665m523062m574281m293274l747391
$$ 104337660 102476775 99823021 96356955 92225290 87702228 83127947 78834673 75087282
10320G5087282l020922k181766j297531m83269R1770K81374P3739l61564p38531
$$ 75087282 72066360 69884594 68587063 68103794 68195564 68476938 68550677 68189113 67450582
10311F7450582p89993l90505L94956J353033K225132K807617K990820K735080
$$ 67450582 66660589 66270084 66665040 68018073 70243205 73050822 76041642 78776722
10303G8776722K038896R46712m17756j845238l086745l925807m236336m006992
$$ 78776722 80815618 81762330 81344574 79499336 76412591 72486784 68250448 64243456
10295F4243456l332432k376567j319658l13258N37087J166710J547775J697510
$$ 64243456 60911024 58534457 57214799 56901541 57438628 58605338 60153113 61850623
10287F1850623J684273J612267J586277J675297J890533K181158K448015K575553
$$ 61850623 63534896 65147163 66733440 68408737 70299270 72480428 74928443 77503996
10279G7503996K473038K104213J489238O83456k48369j248981k276549l307629
$$ 77503996 79977034 82081247 83570485 84253941 84005572 82756591 80480042 77172413
10271G7172413m334789n356433o359299p297429q074359q540204q518161p865704
$$ 77172413 72837624 67481191 61121892 53824463 45750104 37209900 28691739 20826035
10263B0826035o552646m716042k653240p45842O53143J321117J226318N40615
$$ 20826035 14273389 9557347 6904107 6158265 6811408 8132525 9358843 9899458
10255I899458l94757j152149j337791p12810P31059K768061N005318O997221Q370269
$$ 9899458 9504701 8352552 7014761 6301951 7033010 9801071 14806389 21803610 30173879
10246C0173879Q913313Q601567P558914N993731M142503K234322M73683r66714
$$ 30173879 39087192 47688759 55247673 61241404 65383907 67618229 68091912 67125198
10238F7125198j956835k435234k440433k116926j675227j322307j201530j367276
$$ 67125198 65168363 62733129 60292696 58175770 56500543 55178236 53976706 52609430
10230E2609430j791104k384877l031880l622877m091517m437733m725281n048151
$$ 52609430 50818326 48433449 45401569 41778692 37687175 33249442 28524161 23476010
10222B3476010n479886o033313o649745p214621p587266p638572p289831o532776
$$ 23476010 17996124 11962811 5313066 -1901555 -9488821 -17127393 -24417224 -30950000
10214c0950000n412873l987398k295637l66382J747748L938595O034401P822111
$$ -30950000 -36362873 -40350271 -42645908 -43012290 -41264542 -37325947 -31291546 -23469435
10206b3469435R097636R729147R704685R137476Q223459P168093O111365N083455
$$ -23469435 -14371799 -4642652 5062033 14199509 22422968 29591061 35702426 40785881
10198D0785881M016622K811084J415780j26244j688557l107541m230887m952707
$$ 40785881 44802503 47613587 49029367 48903123 47214566 44107025 39876138 34923431
10190C4923431n236392n124221m724451m172945l587033l041506k581825k256800
$$ 34923431 29687039 24562818 19838367 15665422 12078389 9036883 6455058 4198258
10182D198258k134372k281825k727110l433037m298250n175744n897245o301708
$$ 4198258 2063886 -217939 -2945049 -6378086 -10676336 -15852080 -21749325 -28051033
10174b8051033o265618n723788m672999l167741j322975O80708K614744M257974
$$ -28051033 -34316651 -40040439 -44713438 -47881179 -49204154 -48523446 -45908702 -41650728
10166d1650728N467374O218576O590724O714525O724273O734165O826471P034406
$$ -41650728 -36183354 -29964778 -23374054 -16659529 -9935256 -3201091 3625380 10659786
10158A0659786P326614P615818P797787P797752P594153P211280O697728O112393
$$ 10659786 17986400 25602218 33400005 41197757 48791910 56003190 62700918 68813311
10150F8813311N522800N001564M605854M345239M164271L961502L636329L130117
$$ 68813311 74336111 79337675 83943529 88288768 92453039 96414541 100050870 103180987
10142A03180987K435101J573331N67735n74187j854981l262183m736691o155947
$$ 103180987 105616088 107189419 107757154 107182967 105327986 102065803 97329112 91173165
10134I1173165p347658q131371q371224q022747p160732n974913m724160l657854
$$ 91173165 83825507 75694136 67322912 59300165 52139433 46164520 41440360 37782506
10126C7782506k935158k579637k491466k511684k505790k420835k283909k149712
$$ 37782506 34847348 32267711 29776245 27264561 24758771 22337936 20054027 17904315
10118A7904315k042948j942999j819483j682117j597422j655303j910584k341513
$$ 17904315 15861367 13918368 12098885 10416768 8819346 7164043 5253459 2911946
10110B911946k849111l290545l524572l451732l040841k335249j436021m69167
$$ 2911946 62835 -3227710 -6752282 -10204014 -13244855 -15580104 -17016125 -17485292
10102a7485292M49395J242826J894385K453922L017320L677398M467412N327558
$$ -17485292 -17035897 -15793071 -13898686 -11444764 -8427444 -4750046 -282634 5044924
10094E044924O111243O627460O703868O249524N293336L981661K537559J200403
$$ 5044924 11156167 17783627 24487495 30737019 36030355 40012016 42549575 43749978
10086D3749978J65626m61845o88321o15455l90739j48996K1143O8318n7075m23974
$$ 43749978 43915604 43453759 42765438 42149983 41759244 41610248 41631391 41699709 41642634 41218660
10076D1218660j094618k062367l208239m326133n207871n722938n835812n566558
$$ 41218660 40124042 38061675 34853436 30527303 25319432 19596494 13760682 8194124
10068H194124m948384m022470k861750j587919l58639O71299J397470J804260
$$ 8194124 3245740 -776730 -3638480 -5226399 -5585038 -4913739 -3516269 -1712009
10060a712009J977952K079850K276737K652641L151480L598010L799788L671480
$$ -1712009 265943 2345793 4622530 7275171 10426651 14024661 17824449 21495929
10052B1495929L296619K883409K649455K716911L074540L601390M113935M418249
$$ 21495929 24792548 27675957 30325412 33042323 36116863 39718253 43832188 48250437
10044D8250437M375437L973239L355535K760101K380798K244257K190803J968399
$$ 48250437 52625874 56599113 59954648 62714749 65095547 67339804 69530607 71499006
10036G1499006J366252L05184j144651k798475m415804n767311o692357p122614
$$ 71499006 72865258 73170442 72025791 69227316 64811512 59044201 52351844 45229230
10028D5229230p061727o545494n623527m377653k949362j535287l37835N03851
$$ 45229230 38167503 31622009 25998482 21620829 18671467 17136180 16798345 17302196
10020A7302196R63640J133267J179690J273705J523541J946155K485246L053494
$$ 17302196 18265836 19399103 20578793 21852498 23376039 25322194 27807440 30860934
10012C0860934L566217L954319M170485M203439M091495L912746L746238L629095
$$ 30860934 34427151 38381470 42551955 46755394 50846889 54759635 58505873 62134968
10004F2134968L540338L416522L179223K758223K112911J254642K55285p75196
$$ 62134968 65675306 69091828 72271051 75029274 77142185 78396827 78652112 77876916
9996G7876916j733835k561984l253607l838291m352875m811836n189290n430585
$$ 77876916 76143081 73581097 70327490 66489199 62136324 57324488 52135198 46704613
9988D6704613n495178n400297n225031n065559m972859m915484m789304m468365
$$ 46704613 41209435 35809138 30584107 25518548 20545689 15630205 10840901 6372536
9980F372536l873014l024288k057973j188750o38516n61241r99478j890692l110377
$$ 6372536 2499522 -524766 -2582739 -3771489 -4410005 -4971246 -5970724 -7861416 -10971793
9971a0971793m516276n964905p302375q355406q946474q938390q293120p110770
$$ -10971793 -15488069 -21452974 -28755349 -37110755 -46057229 -54995619 -63288739 -70399509
9963g0399509n609925m040624k577723j269533p4818J053459K109982L040429
$$ -70399509 -76009434 -80050058 -82627781 -83897314 -83972132 -82918673 -80808691 -77768262
9955g7768262L786938M333571M721329N025795N314341N614933N918956O207554
$$ -77768262 -73981324 -69647753 -64926424 -59900629 -54586288 -48971355 -43052399 -36844845
9947c6844845O469594O695330O862482O938174O896881O736257O479745O169420
$$ -36844845 -30375251 -23679921 -16817439 -9879265 -2982384 3753873 10233618 16403038
9939A6403038N853591N570257N333721N137014M970131M835371M744221M703280
$$ 16403038 22256629 27826886 33160607 38297621 43267752 48103123 52847344 57550624
9931E7550624M707388M743595M796387M852099M909515M991206N135600N363664
$$ 57550624 62258012 67001607 71797994 76650093 81559608 86550814 91686414 97050078
9923I7050078N644319N889243N983970N840611N451458M917163M420984M149863
$$ 97050078 102694397 108583640 114567610 120408221 125859679 130776842 135197826 139347689
9915A39347689M213604M624416N343746O342039P620696R201101J1120018J3450626
$$ 139347689 143561293 148185709 153529455 159871494 167492190 176693291 187813309 201263935
9907B01263935J6323750J9901070K4275057K9329499L4636208L9434339M2675203
$$ 201263935 217587685 237488755 261763812 291093311 325729519 365163858 407839061
9900D07839061M3127567L9629937L1565509J9397514M850514r569562k1531849
$$ 407839061 450966628 490596565 522162074 541559588 546410102 536840540 515308691
9893E15308691k9715613l4030610l5234010l4344557l2227127k9450610k6330309
$$ 515308691 485593078 451562468 416328458 381983901 349756774 320306164 293975855
9886B93975855k3043781j9745500j6626961j3899391j1727180j0167679r154655
$$ 293975855 270932074 251186574 234559613 220660222 208933042 198765363 189610708
9879A89610708q529094q104037p742610p416826p211407p260074p644969q319642
$$ 189610708 181081614 172977577 165234967 157818141 150606734 143346660 135701691 127382049
9871A27382049r103735r749795j0038809r855733r221109q276375p227962o267981
$$ 127382049 118278314 108528519 98489710 88633977 79412868 71136493 63908531 57640550
9863E7640550n510525m980749m652823m491718m462023m514303m586414m632347
$$ 57640550 52130025 47149276 42496453 38004735 33542712 29028409 24441995 19809648
9855A9809648m649262m666253m695316m686722m534589m138150l476086k640188
$$ 19809648 15160386 10494133 5798817 1112095 -3422494 -7560644 -11036730 -13676918
9847a3676918j807667j172647q71005r23815j218747j546395j687151j507007
$$ -13676918 -15484585 -16657232 -17528237 -18452052 -19670799 -21217194 -22904345 -24411352
9839b4411352j006107k96627M62940J129982J610633J868668J927164J870130
$$ -24411352 -25417459 -25714086 -25251146 -24121164 -22510531 -20641863 -18714699 -16844569
9831a6844569J835264J981295K424483L168222M072921M899237N406910N448858
$$ -16844569 -15009305 -13028010 -10603527 -7435305 -3362384 1536853 6943763 12392621
9823A2392621N009755M188393L159860K142277J358780R78250J048761J466789
$$ 12392621 17402376 21590769 24750629 26892906 28251686 29229936 30278697 31745486
9815C1745486K013685K445548K587298K385820J908556J300834P23633K92522
$$ 31745486 33759171 36204719 38792017 41177837 43086393 44387227 45110860 45403382
9807D5403382L9333q5736j71483k86970m41894n86692o44438n47614k57323K37002
$$ 45403382 45442715 45356979 45185496 44898526 44456632 43869940 43225502 42677888 42420565 42657567
9797D2657567R22900J763005K689849L611783M435377N089008N523465N683278
$$ 42657567 43580467 45343472 48033321 51645104 56080481 61169489 66692954 72376232
9789G2376232N474996M773854L486355J636948n84623k858722m838625o259134
$$ 72376232 77851228 82625082 86111437 87748385 87163762 84305040 79466415 73207281
9781G3207281o993731p046199o503371n487229m132908k597038j076998J91431
$$ 73207281 66213550 59167351 52663980 47176751 43043843 40446805 39369807 39561238
9773C9561238R76121J112690N50521o42494k303756m203369o070711p634050q674874
$$ 39561238 40537359 41650049 42200570 41558076 39254320 35050951 28980240 21346190 12671316
9764A2671316r073366q819221p987239o699033n090080l287738j401902M69348
$$ 12671316 3597950 -5221271 -13208510 -19907543 -24997623 -28285361 -29687263 -29217915
9756b9217915K226363L766910N008714N917221O506488O807456O835940O595600
$$ -29217915 -26991552 -23224642 -18215928 -12298707 -5792219 1015237 7851177 14446777
9748A4446777O115249N485779M862307M422403M297825M513957M971650N483284
$$ 14446777 20562026 26047805 30910112 35332515 39630340 44144297 49115947 54599231
9740E4599231N839883N870647N474996M632877L402024J900114K73988j326382
$$ 54599231 60439114 66309761 71784757 76417634 79819658 81719772 81993760 80667378
9732H0667378k754921l869666m552965m756550m540434m065931l533432l098116
$$ 80667378 77912457 74042791 69489826 64733276 60192842 56126911 52593479 49495363
9724D9495363k815134k644318k499209k295448j967519j465398p66110Q8728R62879
$$ 49495363 46680229 44035911 41536702 39241254 37273735 35808337 35042227 35130955 36093834
9715C6093834J648709J948760J764586J127720J53875j034125k349048l722806
$$ 36093834 37742543 39691303 41455889 42583609 42737484 41703359 39354311 35631505
9707C5631505n063243o233796p075310p450783p282490o566583n370835l827826
$$ 35631505 30568262 24334466 17259156 9808373 2525883 -4040700 -9411535 -13239361
9699a3239361k125590m82397R05361J927094K593946L016514L334435L639403
$$ -13239361 -15364951 -15847348 -14941987 -13014893 -10420947 -7404433 -4069998 -430595
9691d30595L930221M114790M054522L634224K829256J738185N62964m56858j128458
$$ -430595 3499626 7614416 11668938 15303162 18132418 19870603 20433567 19976709 18848251
9682A8848251j370817j227023q16753k61952L61306J016295J664147K232782K625766
$$ 18848251 17477434 16250411 15433658 15171706 15533012 16549307 18213454 20446236 23072002
9673B3072002K765424K639357K317410J925654J593849J409978J403271J550199
$$ 23072002 25837426 28476783 30794193 32719847 34313696 35723674 37126945 38677144
9665C8677144J787181K024984K168297K135677J869161J335815N37336m68495
$$ 38677144 40464325 42489309 44657606 46793283 48662444 49998259 50535595 50067100
9657E0067100j557857k568093l353080l824780l949985l717747l121534k177860
$$ 50067100 48509243 45941150 42588070 38763290 34813305 31095558 27974024 25796164
9649B5796164r56375M18607J801928L064806M106735M850142N245558N292899
$$ 25796164 24839789 25258396 27060324 30125130 34231865 39082007 44327565 49620464
9641D9620464N052560M622468M092094L510066K890077K244959J616318J075213
$$ 49620464 54673024 59295492 63387586 66897652 69787729 72032688 73649006 74724219
9633G4724219O95880N24179N59769P53184J009233J196486J174842Q45557K02676
$$ 74724219 75420099 75944278 76504047 77257231 78266464 79462950 80637792 81483349 81686025
9624H1686025o49631j532471k264281k732432k932544k962448k976114l117581
$$ 81686025 81036394 79503923 77239642 74507210 71574666 68612218 65636104 62518523
9616F2518523l464223m003743m649061n275555n761499o019940o015178n759504
$$ 62518523 59054300 55050557 50401496 45125941 39364442 33344502 27329324 21569820
9608B1569820n296564m690371m032160l449515l086256l044795l325274l809441
$$ 21569820 16273256 11582885 7550725 4101210 1014954 -2029841 -5355115 -9164556
9600i164556m305511m625514m650216m353046l781774l016362k129722j172519
$$ -9164556 -13470067 -18095581 -22745797 -27098843 -30880617 -33896979 -36026701 -37199220
9592c7199220j84575P83910J661739K365183K821006K993396K898744K591416
$$ -37199220 -37383795 -36599885 -34938146 -32572963 -29751957 -26758561 -23859817 -21268401
9584b1268401K122218J503880P24381j94571j150723j980334k534407k750878
$$ -21268401 -19146183 -17642303 -16917922 -17112493 -18263216 -20243550 -22777957 -25528835
9576b5528835k674444k425931k148917j952989j867508j828182j713317j415576
$$ -25528835 -28203279 -30629210 -32778127 -34731116 -36598624 -38426806 -40140123 -41555699
9568d1555699r09064k77200L09595O57690O31111K09247n14510j390990k285178
$$ -41555699 -42464763 -42741963 -42432368 -41774678 -41143567 -40934320 -41448830 -42839820 -45124998
9559d5124998l109957l814912m357194m682961m728077m435489l786773k840663
$$ -45124998 -48234955 -52049867 -56407061 -61090022 -65818099 -70253588 -74040361 -76881024
9551g6881024j756582p72921j27696N0110j82196n88118q47316o90839r512J111312
$$ -76881024 -78637606 -79410527 -79538223 -79488113 -79670309 -80258427 -81105743 -81796582 -81806094 -80694782
9541h0694782K441190L712223M730304N430777N854719O078108O154086O101460
$$ -80694782 -78253592 -74541369 -69811065 -64380288 -58525569 -52447461 -46293375 -40191915
9533d0191915N923148N619790N187241M614200L893656L039413K089815J096219
$$ -40191915 -34268767 -28648977 -23461736 -18847536 -14953880 -11914467 -9824652 -8728433
9525h728433J11279q12651j624393k289341k813321l244554l632483l965440m142992
$$ -8728433 -8617154 -9429805 -11054198 -13343539 -16156860 -19401414 -23033897 -26999337 -31142329
9516c1142329m019967l498369k599345j464915k97672P13280J441094J837433
$$ -31142329 -35162296 -38660665 -41260010 -42724925 -43022597 -42309317 -40868223 -39030790
9508c9030790J923921J762644J413474R02083K25080o07334j523516k376193k975729
$$ -39030790 -37106869 -35344225 -33930751 -33028668 -32803588 -33410922 -34934438 -37310631 -40286360
9499d0286360l151376k803788j922058n68032J143451L044015M899002O416924
$$ -40286360 -43437736 -46241524 -48163582 -48731614 -47588163 -44544148 -39645146 -33228222
9491c3228222P305044P358017O538380N007768L089814J176536l82445j361388
$$ -33228222 -25923178 -18565161 -12026781 -7019013 -3929199 -2752663 -3135108 -4496496
9483d496496j686618j420162p20090K10361J177168K035191K694808L102941L231232
$$ -4496496 -6183114 -7603276 -8323366 -8113005 -6935837 -4900646 -2205838 897103 4128335
9474D128335L091651K759794K366974K051144J901287J938801K142450K482697
$$ 4128335 7219986 9979780 12346754 14397898 16299185 18237986 20380436 22863133
9466B2863133K931237L447675L972410M442823M818225N087718N254079N309636
$$ 22863133 25794370 29242045 33214455 37657278 42475503 47563221 52817300 58126936
9458E8126936N223415M946465M430651L651726K627599J425771J57827j039301
$$ 58126936 63350351 68296816 72727467 76379193 79006792 80432563 80590390 79551089
9450G9551089k034532k739242l133330l265014l222766l093766k928297k724108
$$ 79551089 77516557 74777315 71643985 68378971 65156205 62062439 59134142 56410034
9442E6410034k435927k005063j393606o05396L12785J280754K192508K920709
$$ 56410034 53974107 51969044 50575438 49970042 50282827 51563581 53756089 56676798
9434E6676798L329705L306678K804150J871143O51941o49531j822743k700820
$$ 56676798 60006503 63313181 66117331 67988474 68640415 67990884 66168141 63467321
9426F3467321l196141l314764l143973k813671k445406k109710j807342j482716
$$ 63467321 60271180 56956416 53812443 50998772 48553366 46443656 44636314 43153598
9418D3153598j070991n64644o1992K44534J49474m55440j505283k763632l903246
$$ 43153598 42082607 41517963 41455971 41700505 41849979 41394539 39889256 37125624 33222378
9409C3222378m629518m790276m419056l691240k822925j977103j229990n98684
$$ 33222378 28592860 23802584 19383528 15692288 12869363 10892260 9662270 9063586
9401I063586q5199L06187N78158P42628P97163O98811L73521k31393j085255k045412
$$ 9063586 8978387 9284574 9862732 10605360 11402523 12101334 12474855 12243462 11158207 9112795
9391I112795k883020l355939l299457k692641j663981m31788P87029J850909K716556
$$ 9112795 6229775 2873836 -425621 -3118262 -4782243 -5214031 -4427002 -2576093 140463
9382A40463L407596L956151M361403M595253M641829M524787M294266L994370
$$ 140463 3548059 7504210 11865613 16460866 21102695 25627482 29921748 33916118
9374C3916118L649563L274961K881985K463107J974920J345743N08597n58799
$$ 33916118 37565681 40840642 43722627 46185734 48160654 49506397 50014994 49456195
9366D9456195j801221l069309m134723m750601m741780m076398k873995j350023
$$ 49456195 47654974 44585665 40450942 35700341 30958561 26882163 24008168 22658145
9358B2658145K58876J743851K940788L739986M103809M076719L766149L300825
$$ 22658145 22917021 24660872 27601660 31341646 35445455 39522174 43288323 46589148
9350D6589148K795669K338049J981684J734631J553339J362821J096633P26258
$$ 46589148 49384817 51722866 53704550 55439181 56992520 58355341 59451974 60178232
9342F0178232K62793k55264p69677j210588j520788j689188j763030j821510j930379
$$ 60178232 60441025 60185761 59416084 58205496 56684708 54995520 53232490 51410980 49480601
9333D9480601k112441k347168k585375k763208k815634k695713k396770j966047
$$ 49480601 47368160 45020992 42435617 39672409 36856775 34161062 31764292 29798245
9325B9798245j501199j127438r58625j053874j390681j872324k365627k743772
$$ 29798245 28297046 27169608 26210983 25157109 23766428 21894104 19528477 16784705
9317A6784705k910904k808938k424770j806640j072427l81908J31424M32046O02556
$$ 16784705 13873801 11064863 8640093 6833453 5761026 5379118 5510542 5942588 6545144
9308F545144P85769J078739J446819J716619J659204J121080J29689j090020k200270
$$ 6545144 7330913 8409652 9856471 11573090 13232294 14353374 14483063 13393043 11192773
9299A1192773k885029k957213k396606j335779l1112J176143J933273J986900
$$ 11192773 8307744 5350531 2953925 1618146 1587034 2763177 4696450 6683350
9291F683350J283686j819j533594k938051l921834m331873m140902l385129k113324
$$ 6683350 7967036 7965217 6431623 3493572 -428262 -4760135 -8901037 -12286166 -14399490
9282a4399490l94588J629432L718664N589357P021714P933725Q363951Q389846
$$ -14399490 -14794078 -13164646 -9445982 -3856625 3165089 11098814 19462765 27852611
9274B7852611Q056830P368034O325752M980607L450265J896856M78189o99942
$$ 27852611 35909441 43277475 49603227 54583834 58034099 59930955 60409144 59709202
9266E9709202j607861k284117k800549l214732l532842l707617l678309l427102
$$ 59709202 58101341 55817224 53016675 49801943 46269101 42561484 38883175 35456073
9258C5456073l007919k521830k056218j635398j221674p65279k61894K29441O21858
$$ 35456073 32448154 29926324 27870106 26234708 25013034 24247755 23985861 24215302 24837160
9249B4837160Q60375R62247J016517J151028J484809K077892K891120L776300
$$ 24837160 25697535 26659782 27676299 28827327 30312136 32390028 35281148 39057448
9241C9057448M513435M887435M768860M156476L160832J943314O50406o20705
$$ 39057448 43570883 48458318 53227178 57383654 60544486 62487800 63138206 62517501
9233F2517501j818796k919619l913672m799214n565484o168161o524025o545828
$$ 62517501 60698705 57779086 53865414 49066200 43500716 37332555 30808530 24262702
9225B4262702o200237n543796m708281l849968l100556k542710k206475k074767
$$ 24262702 18062465 12518669 7810388 3960420 859864 -1682846 -3889321 -5964088
9217e964088k094091k191002k290103k327504k257454k052280j695099j169190
$$ -5964088 -8058179 -10249181 -12539284 -14866788 -17124242 -19176522 -20871621 -22040811
9209b2040811m55143M56280J542862K738090L935725N006705N819648O261144
$$ -22040811 -22495954 -22039674 -20496812 -17758722 -13822997 -8816292 -2996644 3264500
9201C264500O255049N780000M885183L701275K433453J319866N58114K32064K81494
$$ 3264500 9519549 15299549 20184732 23886007 26319460 27639326 28197440 28429504 28710998
9192B8710998N34103P83997Q77899P69819N22024K58215R8910J12408K96521N88137
$$ 28710998 29245101 30029098 30906997 31676816 32198840 32457055 32555965 32668373 32964894 33553031
9182C3553031Q94995J144988J335678J549514J909519K493443L265416M078005
$$ 33553031 34448026 35593014 36928692 38478206 40387725 42881168 46146584 50224589
9174E0224589M743137N118462N154475M890443M422010L859656L281453K693846
$$ 50224589 54967726 60086188 65240663 70131106 74553116 78412772 81694225 84388071
9166H4388071K036261J248474L57780m94702j123962j412017j367630j098737
$$ 84388071 86424332 87672806 88030586 87535884 86411922 84999905 83632275 82533538
9158H2533538p41538m07967j68187m6745k0106k7409j329R9194K77942N12840
$$ 82533538 81792000 81384033 81215846 81169101 81148995 81121586 81120257 81219451 81497393 82010233
9148H2010233P71209J015939J205059J290912J221629R49628M52775k39462j038413
$$ 82010233 82781442 83797381 85002440 86293352 87514981 88464609 88917384 88677922 87639509
9139H7639509j823085k487299k973456l273563l407659l402210l280680l065305
$$ 87639509 85816424 83329125 80355669 77082106 73674447 70272237 66991557 63926252
9131F3926252k785741k489746k246295k130321k190002k415227k729981l015620
$$ 63926252 61140511 58650765 56404470 54274149 52084147 49668920 46938939 43923319
9123D3923319l152166l058690k720675k197029j599976j050708o32722l71783
$$ 43923319 40771153 37712463 34991788 32794759 31194783 30144075 29511353 29139570
9115B9139570k50445k36626l00884m16293n50944o62995p04020o35129m52416
$$ 29139570 28889125 28652499 28351615 27935322 27384378 26721383 26017363 25382234 24929818
9106B4929818k04390J6123J03635k2569l88787r49993j594559k180403k591832
$$ 24929818 24725428 24741551 24845186 24822617 24433830 23483837 21889278 19708875 17117043
9097A7117043k783217k782702k661009k489820k308550k108955j845407j470631
$$ 17117043 14333826 11551124 8890115 6400295 4091745 1982790 137383 -1333248
9089a333248r77590m19730J03419M87263O72330O81534O18733O15754P52619J005258
$$ -1333248 -2310838 -2730568 -2627149 -2139886 -1467556 -786022 -167289 448465 1201084 2206342
9079B206342J258632J371610J243776Q45239K08664n91585j452578k249156k848062
$$ 2206342 3464974 4836584 6080360 6925599 7134263 6542678 5090100 2840944 -7118
9070g118l137581l061331k635635j939877j086785j88717O64710J408585J988134
$$ -7118 -3144699 -6206030 -8841665 -10781542 -11868327 -12057044 -11392334 -9983749 -7995615
9061g995615K347977K447150K295683J976595J619820J337335J168146J073165
$$ -7995615 -5647638 -3200488 -904805 1071790 2691610 4028945 5197091 6270256
9053F270256R73293P90628M65660m0255p34051j570193k442357l203100l701559
$$ 6270256 7243549 8034177 8499837 8459582 7725531 6155338 3712981 509881 -3191678
9044c191678l819950l503884k789123j811253p72777J34245Q06297J248276J517329
$$ -3191678 -7011628 -10515512 -13304635 -15115888 -15888665 -15754420 -14948123 -13699847 -12182518
9035a2182518J637948J563757J221853N99655k07214j031816j724585k219567
$$ -12182518 -10544570 -8980813 -7758960 -7159305 -7366519 -8398335 -10122920 -12342487
9027a2342487k535636k729525k841886k864372k739483k394835j793270r61703
$$ -12342487 -14878123 -17607648 -20449534 -23313906 -26053389 -28448224 -30241494 -31203197
9019c1203197K1352J057111K041236K862678L418161L652474L591640L334996
$$ -31203197 -31181845 -30124734 -28083498 -25220820 -21802659 -18150185 -14558545 -11223549
9011a1223549L012947K744257K611277K645839K819139L045807L213779L230162
$$ -11223549 -8210602 -5466345 -2855068 -209229 2609910 5655717 8869496 12099658
9003A2099658L054022K695100K187914J572002Q96057K30738l37396p33994r22607
$$ 12099658 15153680 17848780 20036694 21608696 22504753 22735491 22398095 21664101 20741494
8994B0741494r09541p36901m80796k50462j68465l27547p47678j363524k052250
$$ 20741494 19831953 19095052 18614256 18363794 18195329 17867782 17120104 15756580 13704330
8985A3704330k684501l168141l462707l566607l500360l305818l054090k834489
$$ 13704330 11019829 7851688 4388981 822374 -2677986 -5983804 -9037894 -11872383
8977a1872383k711589k677332k645833k510254k225270j849547j512909j335701
$$ -11872383 -14583972 -17261304 -19907137 -22417391 -24642661 -26492208 -28005117 -29340818
8969b9340818j362396j548323j788930j958617j943028j669644j136045m16373
$$ -29340818 -30703214 -32251537 -34040467 -35999084 -37942112 -39611756 -40747801 -41164174
8961d1164174L71144J120868J776938K318474K708753K863781K681682K116808
$$ -41164174 -40793030 -39672162 -37895224 -35576750 -32867997 -30004216 -27322534 -25205726
8953b5205726J238653K27671o90672j334583j633324j643730j508302j376989
$$ -25205726 -23967073 -23739402 -24430074 -25764657 -27397981 -29041711 -30550013 -31927002
8945c1927002j337174j387428j455144j434429j229085p98765j96634M29118Q84376
$$ -31927002 -33264176 -34651604 -36106748 -37541177 -38770262 -39569027 -39765661 -39336543 -38452167
8936c8452167J006827P28897R5467p65782j702228k593004l375858m031925m542980
$$ -38452167 -37445340 -36716443 -36620976 -37386758 -39088986 -41681990 -45057848 -49089773 -53632753
8927e3632753m853482m866041m478297l643944k421016r70677N01638J829613
$$ -53632753 -58486235 -63352276 -67830573 -71474517 -73895533 -74866210 -74364572 -72534959
8919g2534959K942212L861805M654681N371675O014390O537504O870375O933489
$$ -72534959 -69592747 -65730942 -61076261 -55704586 -49690196 -43152692 -36282317 -29348828
8911b9348828O644300N930779M768043L223718J477968k01963j524954k256939
$$ -29348828 -22704528 -16773749 -12005706 -8781988 -7304020 -7505983 -9030937 -11287876
8903a1287876k298915j734116q11129J45947Q62039J203796J193811R49377N90541
$$ -11287876 -13586791 -15320907 -16132036 -15986089 -15124050 -13920254 -12726443 -11777066 -11186525
8894a1186525J73685l14820r11728j615383k344569k927774l124599k693544j508394
$$ -11186525 -11012840 -11327660 -12239388 -13854771 -16199340 -19127114 -22251713 -24945257 -26453651
8885b6453651L29782K476291M464379N898400O594400O594698O081886N268111
$$ -26453651 -26123869 -23647578 -19183199 -13284799 -6690399 -95701 5986185 11254296
8877A1254296M316528L312311K276639J204283R6482j030840k156773l258410
$$ 11254296 15570824 18883135 21159774 22364057 22460539 21429699 19272926 16014516
8869A6014516m295281n190718n833890o108919n938062n322465m367148l273447
$$ 16014516 11719235 6528517 694627 -5414292 -11352354 -16674819 -21041967 -24315414
8861b4315414k283256j585469j235715j150017j182677j227210j260046j304118
$$ -24315414 -26598670 -28184139 -29419854 -30569871 -31752548 -32979758 -34239804 -35543922
8853c5543922j364102j400185j357229j211543r90261p50588n39243l63157j92297
$$ -35543922 -36908024 -38308209 -39665438 -40876981 -41867242 -42617830 -43157073 -43520230 -43712527
8844d3712527Q351K44884M90570P17113R29302J161780J429757J672230J742641
$$ -43712527 -43704176 -43459292 -42968722 -42251609 -41322307 -40160527 -38730770 -37058540 -35315899
8835c5315899J470721P63833l18648j570198k719127l533464l885771l753990
$$ -35315899 -33845178 -33081345 -33399993 -34970191 -37689318 -41222782 -45108553 -48862543
8827d8862543l183931k256816j082303J97923J422933K449238L189775L625297
$$ -48862543 -52046474 -54303290 -55385593 -55187670 -53764737 -51315499 -48125724 -44500427
8819d4500427L779685L682217L349758K799576K070918J226099L28079n77569
$$ -44500427 -40720742 -37038525 -33688767 -30889191 -28818273 -27592174 -27264095 -27841664
8811b7841664j449818k217498k762539k950448k692936j994809r49992L03666
$$ -27841664 -29291482 -31508980 -34271519 -37221967 -39914903 -41909712 -42859704 -42556038
8803d2556038J630994K918093M067058M989978N616868N913066N891816N609814
$$ -42556038 -40925044 -38006951 -33939893 -28949915 -23333047 -17419981 -11528165 -5918351
8795e918351N142397M549186L853363L052898K156894J217112L29453l93979q62437
$$ -5918351 -775954 3773232 7626595 10679493 12836387 14053499 14382952 13988973 13126536
8786A3126536j033531r17259n53817K1002P92370J743511K809935L856296M706379
$$ 13126536 12093005 11175746 10621929 10642931 11435301 13178812 15988747 19845043 24551422
8777B4551422N212476N321572N100273M702595M290258L942472L608244L136457
$$ 24551422 29763898 35085470 40185743 44888338 49178596 53121068 56729312 59865769
8769E9865769K369137J240255j77512j698227l099382m209135m966785n435021
$$ 59865769 62234906 63475161 63297649 61599422 58500040 54290905 49324120 43889099
8761D3889099n761828o107050o562534p101850p587652p836025p701750p134147
$$ 43889099 38127271 32020221 25457687 18355837 10768185 2932160 -4769590 -11903737
8753a1903737o175728m919304l467414j927860m38712Q17804J647762J918715
$$ -11903737 -18079465 -22998769 -26466183 -28394043 -28832755 -28014951 -26367189 -24448474
8745b4448474J630933R43126J35640m78587o65635l57565L34178J191730K004546
$$ -24448474 -22817541 -21874415 -21738775 -22217362 -22882997 -23240562 -22906384 -21714654 -19710108
8736a9710108K651440L110156L409099L565857L553110L313245K815015K111989
$$ -19710108 -17058668 -13948512 -10539413 -6973556 -3420446 -107201 2707814 4819803
8728D819803J349738P03897K91790J26333J43548K70932M73333P38789J022918
$$ 4819803 6169541 6873438 7165228 7291561 7435109 7706041 8179374 8918163 9941081
8719I941081J209019J129739O44258k81942j547726k949217m246359n226759n747881
$$ 9941081 11150100 12279839 12924097 12642155 11094429 8145212 3898853 -1327906 -7075787
8710g075787n755963n285542m441631l367007k202562j055371J2561R74113J817830
$$ -7075787 -12831750 -18117292 -22558923 -25925930 -28128492 -29183863 -29171302 -28197189 -26379359
8701b6379359K533775L111320L546968L853131M053914M162036M153652L970574
$$ -26379359 -23845584 -20734264 -17187296 -13334165 -9280251 -5118215 -964563 3006011
8693C006011L557104K900641K039808J041233k1737j068438k003355k724598l148642
$$ 3006011 6563115 9463756 11503564 12544797 12523060 11454622 9451267 6726669 3578027
8684C578027l235365l003018k528442j923117j282523o36073N6495Q47256J725284
$$ 3578027 342662 -2660356 -5188798 -7111915 -8394438 -9030511 -8974016 -8126760 -6401476
8675f401476K592066L307986L763199L911035L751837L309040K636670J848009
$$ -6401476 -3809410 -501424 3261775 7172810 10924647 14233687 16870357 18718366
8667A8718366J120084O45867N53215Q39436J362559J898349K237620K276054K050011
$$ 18718366 19838450 20484317 21037532 21876968 23239527 25137876 27375496 29651550 31701561
8658C1701561J701417J398992J270179J384157J779144K487223L515666M793388
$$ 31701561 33402978 34801970 36072149 37456306 39235450 41722673 45238339 50031727
8650E0031727O136078P275640P945399P968754P306227O054050M410334K621943
$$ 50031727 56167805 63443445 71388844 79357598 86663825 92717875 97128209 99750152
8642I9750152R22397n18886j614706k346016k739009k852260k768758k577097
$$ 99750152 100672549 100153663 98538957 96192941 93453932 90601672 87832914 85255817
8634H5255817k341097k076726j755320j332857p85398j28034N90054J303068J943590
$$ 85255817 82914720 80837994 79082674 77749817 76964419 76836385 77426439 78729507 80673097
8625H0673097K453065K795725K974356L030848L019059K963639K835473K561492
$$ 80673097 83126162 85921887 88896243 91927091 94946150 97909789 100745262 103306754
8617A03306754K058708J269479J83947j150066k624970m080653n329746o205383
$$ 103306754 105365462 106634941 106818888 105668822 103043852 98963199 93633453 87428070
8609H7428070o616688o579273o197280n608807m931644m233578l524359k764477
$$ 87428070 80811382 74232109 68034829 62426022 57494378 53260800 49736441 46971964
8601D6971964j902288r41574L15P02853R36579N85778k80522j428612k550267
$$ 46971964 45069676 44128102 44128417 44831270 45767849 46353627 46073105 44644493 42094226
8592D2094226l370353l723893l578787l009561k149347j149092j55366P00268
$$ 42094226 38723873 34999980 31421193 28411632 26262285 25113193 24957827 25658095
8584B5658095J311180J607485J566239J217654O47354q840n86989r39861r90669
$$ 25658095 26969275 28576760 30142999 31360653 32008007 31999167 31412178 30472317 29481648
8575B9481648p61305l47569J46309O63536J197034J742698K250790K618773K729282
$$ 29481648 28720343 28372774 28519083 29182619 30379653 32122351 34373141 36991914 39721196
8566C9721196K503374J937639J112931J77749o89083j331482j669111j722307
$$ 39721196 42224570 44162209 45275140 45452889 44763806 43432324 41763213 40040906
8558D0040906j590136j394399j227269j130241j100257j103409j089613j016031
$$ 40040906 38450770 37056371 35829102 34698861 33598604 32495195 31405582 30389551
8550C0389551q77614p23350o37828o94819r14732j254348j628838j942116k104587
$$ 30389551 29511937 28788587 28150759 27455940 26541208 25286860 23658022 21715906 19611319
8541A9611319k040158j697721j070374k05215Q12472J892916K966382L979259
$$ 19611319 17571161 15873440 14803066 14597851 15410323 17303239 20269621 24248880
8533B4248880M868477N539196N867193N728384N039924L793470K071733M8777
$$ 24248880 29117357 34656553 40523746 46252130 51292054 55085524 57157257 57206034
8525E7206034k029074l890850n313757o189746o543879o490341o156038n621003
$$ 57206034 55176960 51286110 45972353 39782607 33238728 26748387 20592349 14971346
8517A4971346m905930m003438k927906j755368o31964K57979P54895P88038M02587
$$ 14971346 10065416 6061978 3134072 1378704 746740 1004719 1759614 2547652 2950239
8508B950239k68673j068400j867114k575639l128191l466685l541733l322870
$$ 2950239 2681566 1613166 -253948 -2829587 -5957778 -9424463 -12966196 -16289066
8500a6289066k807146k023111j028796R9012J279849K438573L505455M415114
$$ -16289066 -19096212 -21119323 -22148119 -22049107 -20769258 -18330685 -14825230 -10410116
8492a0410116N107198N521435N588028N233704M419509L191492J700671J67831
$$ -10410116 -5302918 218517 5806545 11040249 15459758 18651250 20351921 20519752
8484B0519752j186973k207238k828296l074624l043454k882939k760351k818366
$$ 20519752 19332779 17125541 14297245 11222621 8179167 5296228 2535877 -282489
8476b82489l133320l696772m427193n197189n857983o257692o260200n766832
$$ -282489 -3415809 -7112581 -11539774 -16736963 -22594946 -28852638 -35112838 -40879670
8468d0879670m737586l211979j328361O73919K494072L855322M602109M755415
$$ -40879670 -45617256 -48829235 -50157596 -49483677 -46989605 -43134283 -38532174 -33776759
8460c3776759M490789M044697L593892L171616K670651J932846Q65453m94460
$$ -33776759 -29285970 -25241273 -21647381 -18475765 -15805114 -13872268 -13006815 -13501275
8452a3501275k002946l487003m813911n913588o760106p340418p633082p606862
$$ -13501275 -15504221 -18991224 -23805135 -29718723 -36478829 -43819247 -51452329 -59059191
8444e9059191p238103o533704n538817m319994k941278j463466K6344J387554
$$ -59059191 -66297294 -72830998 -78369815 -82689809 -85631087 -87094553 -87068209 -85680655
8436h5680655K445793L067630L244424L120207K935957K923949L215998L806673
$$ -85680655 -83234862 -80167232 -76922808 -73802601 -70866644 -67942695 -64726697 -60920024
8428f0920024M568652N297222N770930N823885N412229M642333L739805K970497
$$ -60920024 -56351372 -51054150 -45283220 -39459335 -34047106 -29404773 -25664968 -22694471
8420b2694471K548721K568017K977295L610359M257614M746429M989736M984788
$$ -22694471 -20145750 -17577733 -14600438 -10990079 -6732465 -1986036 3003700 7988488
8412G988488M780734M449642M076627L754891L566376L551004L684949L879708
$$ 7988488 12769222 17218864 21295491 25050382 28616758 32167762 35852711 39732419
8404C9732419L998083L886610L432294K631377J621420O32828j19565n26982o01248
$$ 39732419 43730502 47617112 51049406 53680783 55302203 55935031 55815466 55288484 54687236
8395E4687236m28529j17619K27922N23110P11343P64018O67507M15497K3954m42914
$$ 54687236 54258707 54141088 54369010 54892120 55603463 56367481 57034988 57450485 57474439 57031525
8385E7031525q69230j125931j131564q90961m83531j6705M12266P21636Q35106
$$ 57031525 56162295 55036364 53904800 53013839 52530308 52513603 52925869 53647505 54482611
8376E4482611O88676K59017m13673j232192k074699k830954l423347l805967l949496
$$ 54482611 55171287 55430304 55016631 53784439 51709740 48878786 45455439 41649472 37699976
8367C7699976l832439l455448k868938k179825j515344r63794n38628j94117J21760
$$ 37699976 33867537 30412089 27543151 25363326 23847982 22884188 22345560 22151443 22273203
8358B2273203M17788O46046P28236N98936K35936l37066j066243j879796k684213
$$ 22273203 22690991 23337037 24065273 24664209 24900145 24563079 23496836 21617040 18932827
8349A8932827l356601l759701l790678l436768k791124k011663j258869o62548
$$ 18932827 15576226 11816525 8025847 4589079 1797955 -213708 -1472577 -2135125
8341b135125l23694l12951o41687j232798j934596k580131l048817l288573l294951
$$ -2135125 -2458819 -2771770 -3413457 -4646255 -6580851 -9160982 -12209799 -15498372 -18793323
8332a8793323l075940k634244j977115j136448j72752Q41999J839098K745340
$$ -18793323 -21869263 -24503507 -26480622 -27617070 -27789822 -26947823 -25108725 -22363385
8324b2363385L467714L904122L986549L723424L206033K577314J987988J562415
$$ -22363385 -18895671 -14991549 -11005000 -7281576 -4075543 -1498229 489759 2052174
8316B052174J380861J474862J829117K383906L037306L652718M078309M181580
$$ 2052174 3433035 4907897 6737014 9120920 12158226 15810944 19889253 24070833
8308B4070833L895652L259710K419937J566323Q28357J99416m50643j281985k375349
$$ 24070833 27966485 31226195 33646132 35212455 36040812 36240228 35789585 34507600 32132251
8299C2132251l670085m971582o016767o572352o528455n942167n004423l949127
$$ 32132251 28462166 23490584 17473817 10901465 4373010 -1569157 -6573580 -10522707
8291a0522707k958687k114360j403255p60868j17998N71218J327167K158216L069105
$$ -10522707 -13481394 -15595754 -16999009 -17759877 -17877875 -17306657 -15979490 -13821274 -10752169
8282a0752169M051403N065495O038703O892288P580463Q107500Q503616Q773004
$$ -10752169 -6700766 -1635271 4403432 11295720 18876183 26983683 35487299 44260303
8274D4260303Q850885Q603918P883350O606346M819464K706318N35656j421333
$$ 44260303 53111188 61715106 69598456 76204802 81024266 83730584 84266240 82844907
8266H2844907k968247m029558m649482m938315m987798m807689m331679l491176
$$ 82844907 79876660 75847102 71197620 66259305 61271507 56463818 52132139 48640963
8258D8640963k302661r09025M45065J482829J977341J821135J065606q5557j337293
$$ 48640963 46338302 45429277 45874342 47357171 49334512 51155647 52221253 52135696 50798403
8249E0798403k406889l131543l524820l744776l989333m384637m933493n539016
$$ 50798403 48391514 45259971 41735151 37990375 34001042 29616405 24682912 19143896
8241A9143896o064207o380705o393476o056265n387235m475006l462432k509663
$$ 19143896 13079689 6698984 305508 -5750757 -11137992 -15612998 -19075430 -21585093
8233b1585093j748184j234953r16134o20671j08546Q26000K241456L996701N801095
$$ -21585093 -23333277 -24568230 -25484364 -26105035 -26213581 -25387581 -23146125 -19149424 -13348329
8224a3348329P339202Q388314Q858890Q756994Q128814P042137N602988L965414
$$ -13348329 -6009127 2379187 11238077 19995071 28123885 35166022 40769010 44734424
8216D4734424K309268Q00613m41943j372760k039378k577924l158019l890376
$$ 44734424 47043692 47844305 47402362 46029602 43990224 41412300 38254281 34363905
8208C4363905m756001n610600o261543o563228o472081o037726n349885m484316
$$ 34363905 29607904 23997304 17735761 11172533 4700452 -1337274 -6687159 -11171475
8200a1171475l482354k363953j146516J50062J502743K872736M189341N354276
$$ -11171475 -14653829 -17017782 -18164298 -18014236 -16511493 -13638757 -9449416 -4095140
8192d095140O267417O845942P019438O722430N915963M632936L004625J234604
$$ -4095140 2172277 9018219 16037657 22760087 28676050 33308986 36313611 37548215
8184C7548215m71163j976920l249460m326809n234629n904549o166714n844666
$$ 37548215 37077052 35100132 31850672 27523863 22289234 16384685 10217971 4373305
8176D373305m894046l479121j927121n96769K49874N11213K43249l82110j134625
$$ 4373305 -520741 -3999862 -5926983 -6523752 -6273878 -5762665 -5519416 -5901526 -7036151
8167g036151j786784k167700k198360j896946j347598o42475J69367J089145K129067
$$ -7036151 -8822935 -10990635 -13188995 -15085941 -16433539 -17076014 -16906647 -15817502 -13688435
8158a3688435L265861M428127N518175O436621P088456P380667P232380O602133
$$ -13688435 -10422574 -5994447 -476272 5960349 13048805 20429472 27661852 34263985
8150C4263985N516894M082708K466280Q52959n98567j782425k644701l167646
$$ 34263985 39780879 43863587 46329867 47182826 46584259 44801834 42157133 38989487
8142C8989487l357998l249170k912085k459330k026315j724852j588065j545358
$$ 38989487 35631489 32382319 29470234 27010904 24984589 23259737 21671672 20126314
8134B0126314j457791j202761p53575j98611L06021O04332N82064J80889n85716
$$ 20126314 18668523 17465762 16712187 16513576 16819597 17423929 18005993 18186882 17601166
8125A7601166j610142k696650l621183m215828m418224m259282l817110l180676
$$ 17601166 15991024 13294374 9673191 5457363 1039139 -3220143 -7037253 -10217929
8117a0217929k440081j690868j030907n35335k13749K1309L38444R19386J878948
$$ -10217929 -12658010 -14348878 -15379785 -15915120 -16128869 -16107560 -15769116 -14849730 -12970782
8108a2970782L221007M840916O549900Q103866R246658R778603R628192Q880018
$$ -12970782 -9749775 -4908859 1641041 9744907 18991565 28770168 38398360 47278378
8100D7278378P732756O413923N110574L951494L020749K358520J939720J668140
$$ 47278378 55011134 61425057 66535631 70487125 73507874 75866394 77806114 79474254
8092G9474254J417859J099001O91355K21576k82605q11977j357271j881502k316235
$$ 79474254 80892113 81991114 82682469 82904045 82621440 81809463 80452192 78570690 76254455
8083G6254455k588654k661553k561906k382304k254031k303131k607988l175654
$$ 76254455 73665801 71004248 68442342 66060038 63806007 61502876 58894888 55719234
8075E5719234l944967m810970n655950o374923o893099p177442p238969p117936
$$ 55719234 51774267 46963297 41307347 34932424 28039325 20861883 13622914 6504978
8067F504978o852550o448643n873905n085504m073668k890396j645295m76962
$$ 6504978 -347572 -6796215 -12670120 -17755624 -21829292 -24719688 -26364983 -26841945
8059b6841945M79971J123783J414790J397978J194423R47809P53355O20911M97667
$$ -26841945 -26361974 -25238191 -23823401 -22425423 -21231000 -20283191 -19529836 -18908925 -18411258
8050a8411258L25333Q4404k00578m86123p38600r44359j097132j179615j161251
$$ -18411258 -18085925 -18001521 -18202099 -18688222 -19426822 -20371181 -21468313 -22647928 -23809179
8041b3809179j013989p23208k77145L47439J169214K153620L177042M051852M607649
$$ -23809179 -24823168 -25546376 -25823521 -25476082 -24306868 -22153248 -18976206 -14924354 -10316705
8032a0316705M770101M580444M151365L604229L033567K506307K069637J744892
$$ -10316705 -5546604 -966160 3185205 6789434 9823001 12329308 14398945 16143837
8024A6143837J513233J315951J078492P42465K83826k86267r24808j556616k079800
$$ 16143837 17657070 18973021 20051513 20793978 21077804 20791537 19866729 18310113 16230313
8015A6230313k389503k415094k149358j651760j024265l69870K51676Q50150J490003
$$ 16230313 13840810 11425716 9276358 7624598 6600333 6230463 6482139 7332289 8822292
8006H822292K232961L077482L950684M766573N496111O174848O832912P411216
$$ 8822292 11055253 14132735 18083419 22849992 28346103 34520951 41353863 48765079
7998D8765079P743554P623505O904802N569128L731691J594849o23206k753224
$$ 48765079 56508633 64132138 71036940 76606068 80337759 81932608 81309402 78556178
7990G8556178m702446o431241p900054r030378r708588r823404r306222q153160
$$ 78556178 73853732 67422491 59522437 50492059 40783471 30960067 21653845 13500685
7982A3500685o428959m262479j839477O11045K845306M648907N879472O481293
$$ 13500685 7071726 2809247 969770 1580815 4426121 9075028 14954500 21435793
7974B1435793O462709N858744M713313L094104J123362j002652l023348m655130
$$ 21435793 27898502 33757246 38470559 41564663 42688025 41685373 38662025 34006895
7966C4006895n652198n863257n261426l939061k075805J04115K367354M486460
$$ 34006895 28354697 22491440 17230014 13290953 11215148 11319263 13686617 18173077
7958A8173077O239022P417191P868031P547539O544152N048553L290505J478657
$$ 18173077 24412099 31829290 39697321 47244860 53789012 58837565 62128070 63606727
7950F3606727k39592j795143l183986m422088n491933o318116o788994o809252
$$ 63606727 63367135 61571992 58388006 53965918 48473985 42155869 35366875 28557623
7942B8557623o354079n499005m407475l274695k253748j406441p06018q3116N19890
$$ 28557623 22203544 16704539 12297064 9022369 6768621 5362180 4656162 4573046 5092936
7933E092936J121064J709864K276643K823158L337756L763383M001848L959923
$$ 5092936 6214000 7923864 10200507 13023665 16361421 20124804 24126652 28086575
7925B8086575L596840K935281K039757R92513j14496j173619k052093k594498
$$ 28086575 31683415 34618696 36658453 37650966 37536470 36362851 34310758 31716260
7917C1716260k655297k162089j175463J02377J386850K407159K989021L090809
$$ 31716260 29060963 26898874 25723411 25825788 27212638 29619797 32608818 35699627
7909C5699627K790539K242757J628635J110476P88206O60329O11102M47924j7664
$$ 35699627 38490166 40732923 42361558 43472034 44260240 44920569 45531671 45979595 45961931
7900D5961931q85457k119036l548505m914633n939794o406428o218060n423139
$$ 45961931 45076474 42957438 39408933 34494300 28554506 22148078 15930018 10506879
7892A0506879m198611k800912j495866m88245J18161L13215J45716l01485r15717
$$ 10506879 6308268 3507356 2011490 1523245 1641406 1954621 2100337 1798852 883135
7883H83135j562633k117777k503797k699541k715110k562100k248864j800792
$$ 883135 -679498 -2797275 -5301072 -8000613 -10715723 -13277823 -15526687 -17327479
7875a7327479j280335p81040l90578j44685q424R4646K25424L91892N60327O96239
$$ -17327479 -18607814 -19388854 -19779432 -19924117 -19932541 -19837895 -19612471 -19220579 -18660252 -17964013
7865a7964013P91638Q58360R06030R33999R45303R66365J050872J258624J619901
$$ -17964013 -17172375 -16314015 -15407985 -14473986 -13528683 -12562318 -11511446 -10252822 -8632921
7856h632921K111001K663715L206436L707104M184016M672722N166123N564457
$$ -8632921 -6521920 -3858205 -651769 3055335 7239351 11912073 17078196 22642653
7848B2642653N676859N295467M311707K796588R79624q59525k501545l827835
$$ 22642653 28319512 33614979 37926686 40723274 41702898 40843373 38341828 34513993
7840C4513993m795184n401366n679025n706670n606308n512740n521566n638373
$$ 34513993 29718809 24317443 18638418 12931748 7325440 1812700 -3708866 -9347239
7832i347239n761339n720525n359766m608995l500722k133528o26489Q99430K315151
$$ -9347239 -15108578 -20829103 -26188869 -30797864 -34298586 -36432114 -37058603 -36159173 -33844022
7823c3844022L478017M245066M502943M199991L364152K098320N59801j059327
$$ -33844022 -30366005 -26120939 -21617996 -17418005 -14053853 -11955533 -11395732 -12455059
7815a2455059k543630l671929m259313m214904l577046k493916j159549K51292
$$ -12455059 -14998689 -18670618 -22929931 -27144835 -30721881 -33215797 -34375346 -34124054
7807c4124054J614249K853892L934347M857535N661413O403390P128568P840250
$$ -34124054 -32509805 -29655913 -25721566 -20864031 -15202618 -8799228 -1670660 6169590
7799F169590Q490417Q991082R232298R095601Q467414P265897N484608L236214
$$ 6169590 14660007 23651089 32883387 41978988 50446402 57712299 63196907 66433121
7791F6433121P67043j579831l451852m594517m932039m582006l796573k858760
$$ 66433121 67200164 65620333 62168481 57573964 52641925 48059919 44263346 41404586
7783D1404586j982540j261398o84828k04864J95609M79741N88672M95570K37577
$$ 41404586 39422046 38160648 37475820 37270956 37466565 37946306 38534978 39030548 39268125
7774C9268125r3245l87239n57765n66616m27749j92476P5295L23659N27903O89304
$$ 39268125 39174880 38787641 38229876 37663260 37235511 37043035 37118330 37441989 37969892 38659196
7764C8659196Q19189R24137J011481J113927J306401J690127K348946L305319
$$ 38659196 39478385 40402522 41414003 42527930 43834331 45524458 47873404 51178723
7756E1178723M497647N784888O978342P893131Q395738Q421448P963091P060021
$$ 51178723 55676370 61461258 68439600 76332731 84728469 93149917 101113008 108173029
7748A08173029N804004M343675K861747J528385M56472l24874q76759j331887
$$ 108173029 113977033 118320708 121182455 122710840 123167312 122842438 121965679 120633792
7740A20633792j843937k520636l380628m362471n371080o319191p136631p758683
$$ 120633792 118789855 116269219 112888591 108526120 103155040 96835849 89699218 81940535
7732H1940535q124082q196308p988832p564318p002459o362992n671116m924211
$$ 81940535 73816453 65620145 57631313 50066995 43064536 36701544 31030428 26106217
7724B6106217m100788l167469k099202r17958K75153J309978K009827K277749
$$ 26106217 22005429 18837960 16738758 15820800 16095953 17405931 19415758 21693507
7716B1693507K157149J828179J538277J505674J848410K566954L569592M711971
$$ 21693507 23850656 25678835 27217112 28722786 30571196 33138150 36707742 41419713
7708D1419713N831250O769804P389255P579245P270607O457620N216278L695499
$$ 41419713 47250963 54020767 61410022 68989267 76259874 82717494 87933772 91629271
7700I1629271K073817N03753r22624k172719l253001m195049n055648n914216
$$ 91629271 93703088 94206841 93284217 91111498 87858497 83663448 78607800 72693584
7692G2693584o848876p895518r015488j0093548j0966301j1467257j1475374j0954059
$$ 72693584 65844708 57949190 48933702 38840154 27873853 16406596 4931222 -6022837
7684f022837r962235q625725p084838n456050l830930k294581r26775K24447J167928
$$ -6022837 -15985072 -24610797 -31695635 -37151685 -40982615 -43277196 -44203971 -43979524 -42811596
7675d2811596J961651K675125L353152M003977M608075N132171N541892N814174
$$ -42811596 -40849945 -38174820 -34821668 -30817691 -26209616 -21077445 -15535553 -9721379
7667i721379N946669N956114N862048N663686N326169M790139M003461K954721
$$ -9721379 -3774710 2181404 8043452 13707138 19033307 23823446 27826907 30781628
7659C0781628J685168K76102j169919k540216l722089m622588n191686n435237
$$ 30781628 32466796 32742898 31572979 29032763 25310674 20688086 15496400 10061163
7651A0061163n416248n248107n070277m998171n072921n257658n488730n728991
$$ 10061163 4644915 -603192 -5673469 -10671640 -15744561 -21002219 -26490949 -32219940
7643c2219940n967380o173751o269288o149948n739265n021296m033207k837857
$$ -32219940 -38187320 -44361071 -50630359 -56780307 -62519572 -67540868 -71574075 -74411932
7635g4411932j508958j39953J144281K206170K953497L402565L693404M032564
$$ -74411932 -75920890 -76060843 -74916562 -72710392 -69756895 -66354330 -62660926 -58628362
7627e8628362M590514N413034O397679P346799Q060934Q413152Q367450P953737
$$ -58628362 -54037848 -48624814 -42227135 -34880336 -26819402 -18406250 -10038800 -2085063
7619b085063P238604O311072N271283M209889L188279K234513J351497N24197
$$ -2085063 5153541 11464613 16735896 20945785 24134064 26368577 27720074 28244271
7611B8244271k74305j067649j852205k579072l152937l445048l315856k651620
$$ 28244271 27969966 26902317 25050112 22471040 19318103 15873055 12557199 9905579
7603I905579j415821L04247K288838M231823N821761O817182P088704O628882
$$ 9905579 8489758 8794005 11082843 15314666 21136427 27953609 35042313 41671195
7595D1671195N542469M021766K307598O45797p47183j709852k163696k141382
$$ 41671195 47213664 51235430 53543028 54188825 53441642 51731790 49568094 47426712
7587D7426712j791272j337279j002177r26542j117221j447425j712447j718807
$$ 47426712 45635440 44298161 43295984 42369442 41252221 39804796 38092349 36373542
7579C6373542j363031o63568K55887J209054J999713K481995K617014K496091
$$ 36373542 35010511 34346943 34602830 35811884 37811597 40293592 42910606 45406697
7571D5406697K307580K257646K483343K996988L683127M347225M793233M892079
$$ 45406697 47714277 49971923 52455266 55452254 59135381 63482606 68275839 73167918
7563G3167918M609748L992852L137391K166588J218280M22488j39236m69000o44676
$$ 73167918 77777666 81770518 84907909 87074497 88292777 88715265 88576029 88107029 87462353
7554H7462353p61324q63926r28561r08258q02517o91434p07489r63747j482224
$$ 87462353 86701029 85837103 84908542 84000284 83197767 82506333 81798844 80835097 79352873
7545G9352873k164219k823006l265055l375371l158607k717422k190440j693070
$$ 79352873 77188654 74365648 71100593 67725222 64566615 61849193 59658753 57965683
7537E7965683j292942j018880q74669q30920q01758o42785j95135O44375J873388
$$ 57965683 56672741 55653861 54779192 53948272 53146514 52503729 52308594 52952969 54826357
7528E4826357L380142M973848O427433P524227Q103628Q088774P481150O332052
$$ 54826357 58206499 63180347 69607780 77132007 85235635 93324409 100805559 107137611
7520A07137611M720335K754012N84849j588925l548261n104348o153851o707297
$$ 107137611 111857946 114611958 115196807 113607882 110059621 104955273 98801422 92094125
7512I2094125o868637o774193o530037o188981n777053n339834m965105m760558
$$ 92094125 85225488 78451295 71921258 65732277 59955224 54615390 49650285 44889727
7504D4889727m803868n103388n595013o170060o712256p128205p366290p418520
$$ 44889727 40085859 34982471 29387458 23217398 16505142 9376937 2010647 -5407873
7496e407873p300140p017333o550480n871973m986148l956761k897257j926737
$$ -5407873 -12708013 -19725346 -26275826 -32147799 -37133947 -41090708 -43987965 -45914702
7488d5914702j116398m58360J18699O89276J265572J779860K132507K265603K201956
$$ -45914702 -47031100 -47489460 -47370761 -46681485 -45415913 -43636053 -41503546 -39237943 -37035987
7479c7035987K026163J834590J693073J619190J588133J559154J512305J468431
$$ -37035987 -35009824 -33175234 -31482161 -29862971 -28274838 -26715684 -25203379 -23734948
7471b3734948J466707J508279J511641J324167P92295j53511j457386k968230
$$ -23734948 -22268241 -20759962 -19248321 -17924154 -17131859 -17285370 -18742756 -21710986
7463b1710986m513725n954601p179941q070700q495053q360029p676355o578080
$$ -21710986 -26224711 -32179312 -39359253 -47429953 -55925006 -64285035 -71961390 -78539470
7455g8539470n284587m034460l017147k311648j849023j428688p99879K23650
$$ -78539470 -83824057 -87858517 -90875664 -93187312 -95036335 -96465023 -97264902 -97041252
7447i7041252J673939L411001N186137O751938P956785Q772770R253735R465118
$$ -97041252 -95367313 -91956312 -86770175 -80018237 -72061452 -63288682 -54034947 -44569829
$$ [...]
##END NTUPLES=NMR SPECTRUM
##END=
