##TITLE=31Pdec_LR-350-C1
 CDCl3
  64 sc
 29.11.2023
##JCAMPDX= 6.0         $$ Bruker NMR JCAMP-DX V2.0
##DATA TYPE= NMR SPECTRUM
##DATA CLASS= NTUPLES
##ORIGIN= UXNMR, Bruker Analytische Messtechnik GmbH
##OWNER= root
$$ XWIN-NMR		Version 3.5
$$ Wed Nov 29 14:19:00 2023 Russian Standard Time (UT+4h)  she@DPX200
##.OBSERVE FREQUENCY= 81.013821
##.OBSERVE NUCLEUS= ^31P
##.ACQUISITION MODE= SIMULTANEOUS
##.ACQUISITION SCHEME= undefined
##.AVERAGES= 64
##.DIGITISER RES= 16
##SPECTROMETER/DATA SYSTEM= spect
##.PULSE SEQUENCE= zgpg30
##.SOLVENT NAME= CDCl3
##.SHIFT REFERENCE= (INTERNAL, CDCl3, 0, 248.564)
##AUDIT TRAIL= $$ (NUMBER, WHEN, WHO, WHERE, WHAT)
$$ ##TITLE= Audit trail, XWIN-NMR		Version 3.5
$$ ##JCAMPDX= 5.01
$$ ##ORIGIN= Bruker BioSpin GmbH
$$ ##OWNER= she
$$ F:/spectra/data/she/nmr/P31/1/pdata/1/auditp.txt
$$ ##AUDIT TRAIL=  $$ (NUMBER, WHEN, WHO, WHERE, WHAT)
(   1,<2023-11-29 14:17:14.78 +0400>,<she>,<DPX200>,
      <continue with go, POWCHK disabled, PULCHK disabled
       configuration hash MD5:
       00 E9 B6 7A A2 85 ED C7 34 08 36 98 17 FE 4E 26
       data hash MD5: 32K
       0C 02 32 0B FD 07 9D E9 18 79 F5 88 C6 97 BD C0>)
(   2,<2023-11-29 14:17:16.40 +0400>,<she>,<DPX200>,
      <Start of raw data processing
       efp BC_mod = 2 LB = 10 FT_mod = 6 PKNL = 1 PHC0 = -11465.84 PHC1 = -619.9055 SI = 64K 
       data hash MD5: 64K
       5A 8C 87 07 31 9E C8 62 32 32 E2 D1 A3 03 F0 4C>)
(   3,<2023-11-29 14:17:39.42 +0400>,<she>,<DPX200>,
      <pk PHC0 = -348.638 PHC1 = 942.5992 
       data hash MD5: 64K
       89 4E E9 47 82 1D BD 04 5E 6C 4B A6 9A 2C 55 C3>)
(   4,<2023-11-29 14:17:43.50 +0400>,<she>,<DPX200>,
      <abs ABSG = 5 
       data hash MD5: 64K
       3B F3 F6 FB 92 94 BB 1F 27 65 51 4F B2 A6 C3 54>)
$$ ##END=
$$ 
$$ hash MD5
$$ 4E D9 44 F9 08 2F 14 D0 F3 0F 8D E3 E2 7B 70 64
##$RELAX= 
##$RELAX= 
##$RELAX= 
##$RELAX= 
##$RELAX= 
##$RELAX= 
##$RELAX= 
##$RELAX= 
##$RELAX= 
$$ Bruker specific parameters
$$ --------------------------
##$DU= <F:/spectra>
##$EXPNO= 1
##$NAME= <P31>
##$PROCNO= 1
##$TYPE= <nmr>
##$USER= <she>
##$AMP= (0..31)
100 100 100 100 100 100 100 100 100 100 100 100 100 100 100 100 100 100 
100 100 100 100 100 100 100 100 100 100 100 100 100 100 
##$AQSEQ= 0
##$AQ_mod= 1
##$AUNM= <au_zg>
##$AUTOPOS= <>
##$BF1= 81.014009
##$BF2= 200.13
##$BF3= 200.13
##$BF4= 200.13
##$BF5= 200.13
##$BF6= 200.13
##$BF7= 200.13
##$BF8= 200.13
##$BYTORDA= 1
##$CFDGTYP= 0
##$CFRGTYP= 5
##$CHEMSTR= <none>
##$CNST= (0..31)
1 1 145 1 1 1 1 1 1 1 1 1 1 1 1 1 1 1 1 1 1 1 1 1 1 1 1 1 1 1 1 1 
##$CPDPRG= <waltz16>
##$CPDPRG1= <>
##$CPDPRG2= <waltz16>
##$CPDPRG3= <>
##$CPDPRG4= <mlev>
##$CPDPRG5= <mlev>
##$CPDPRG6= <mlev>
##$CPDPRG7= <mlev>
##$CPDPRG8= <mlev>
##$CPDPRGB= <>
##$CPDPRGT= <>
##$D= (0..31)
0 1 0 0 0 0 0 0 0 0 0 0.03 2e-05 3e-06 0 0 0 0 0 0 0 0 0 0 0 0 0 0 0 0 
0 0 
##$DATE= 1701252959
##$DBL= (0..7)
120 120 120 11 120 120 24 19 
##$DBP= (0..7)
150 150 150 150 150 150 150 150 
##$DBP07= 0
##$DBPNAM0= <>
$$ [...]
##$SUBNAM3= <"">
##$SUBNAM4= <"">
##$SUBNAM5= <"">
##$SUBNAM6= <"">
##$SUBNAM7= <"">
##$SUBNAM8= <"">
##$SUBNAM9= <"">
##$SW= 501.771253377433
##$SWIBOX= (0..15)
0 1 3 0 0 0 0 0 0 0 0 0 0 0 0 0 
##$SW_h= 40650.406504065
##$TD= 32768
##$TD0= 1
##$TE= 0
##$TE2= 300
##$TE3= 300
##$TEG= 300
##$TL= (0..7)
0 120 53 12 22 120 120 120 
##$TP= (0..7)
150 150 150 150 150 150 150 150 
##$TP07= 0
##$TPNAME0= <>
##$TPNAME1= <>
##$TPNAME2= <>
##$TPNAME3= <>
##$TPNAME4= <>
##$TPNAME5= <>
##$TPNAME6= <>
##$TPNAME7= <>
##$TPOAL= (0..7)
0.5 0.5 0.5 0.5 0.5 0.5 0.5 0.5 
##$TPOFFS= (0..7)
0 0 0 0 0 0 0 0 
##$TUNHIN= 0
##$TUNHOUT= 0
##$TUNXOUT= 0
##$USERA1= <user>
##$USERA2= <user>
##$USERA3= <user>
##$USERA4= <user>
##$USERA5= <user>
##$V9= 5
##$VALIST= <valist>
##$VCLIST= <CCCCCCCCCCCCCCC>
##$VD= 0
##$VDLIST= <DDDDDDDDDDDDDDD>
##$VPLIST= <PPPPPPPPPPPPPPP>
##$VTLIST= <TTTTTTTTTTTTTTT>
##$WBST= 1024
##$WBSW= 4
##$XGAIN= (0..3)
0 0 0 0 
##$XL= 0
##$YL= 0
##$YMAX_a= 4777
##$YMIN_a= -5422
##$ZGOPTNS= <>
##$ZL1= 120
##$ZL2= 120
##$ZL3= 120
##$ZL4= 120
##$ABSF1= 248.5645
##$ABSF2= -253.2056
##$ABSG= 5
##$ABSL= 3
##$ALPHA= 0
##$AQORDER= 0
##$ASSFAC= 0
##$ASSFACI= 0
##$ASSFACX= 0
##$ASSWID= 0
##$AUNMP= <proc_1d>
##$AZFE= 0.1
##$AZFW= 0.5
##$BCFW= 0
##$BC_mod= 2
##$BYTORDP= 0
##$COROFFS= 0
##$CY= -3
##$DATMOD= 1
##$DC= 0
##$DFILT= <>
##$DTYPP= 0
##$F1P= 0
##$F2P= 0
##$FCOR= 1
##$FTSIZE= 65536
##$FT_mod= 6
##$GAMMA= 0
##$GB= 0
##$INTBC= 1
##$INTSCL= 6.047779e-11
##$ISEN= 30
##$LB= 10
##$LEV0= 0
##$LPBIN= 0
##$MAXI= 10000
##$MC2= 0
##$MEAN= 0
##$ME_mod= 0
##$MI= 50
##$NCOEF= 0
##$NC_proc= -9
##$NLEV= 6
##$NOISF1= 182.463
##$NOISF2= 159.3651
##$NSP= 0
##$NTH_PI= 0
##$NZP= 0
##$OFFSET= 248.5645
##$PC= 4
##$PHC0= -11814.48
##$PHC1= 322.6937
##$PH_mod= 1
##$PKNL= yes
##$PPARMOD= 0
##$PSCAL= 0
##$PSIGN= 0
##$REVERSE= no
##$SF= 81.0140089999694
##$SI= 65536
##$SIGF1= 159.3651
##$SIGF2= -187.1042
##$SINO= 113.3802
##$SIOLD= 16384
##$SREGLST= <1H.CDCl3>
##$SSB= 0
##$STSI= 65536
##$STSR= 0
##$SW_p= 40650.406504065
##$SYMM= 0
##$S_DEV= 0
##$TDeff= 32768
##$TDoff= 0
##$TI= <>
##$TILT= no
##$TM1= 0
##$TM2= 0
##$TOPLEV= 0
##$USERP1= <user>
##$USERP2= <user>
##$USERP3= <user>
##$USERP4= <user>
##$USERP5= <user>
##$WDW= 1
##$XDIM= 65536
##$YMAX_p= 285438466
##$YMIN_p= -53960319
$$ End of Bruker specific parameters
$$ ---------------------------------
##NTUPLES= NMR SPECTRUM
##VAR_NAME=  FREQUENCY,     SPECTRUM/REAL,   SPECTRUM/IMAG
##SYMBOL=    X,             R,               I
##VAR_TYPE=  INDEPENDENT,   DEPENDENT,       DEPENDENT
##VAR_FORM=  AFFN,          ASDF,            ASDF
##VAR_DIM=   65536,         65536,           65536
##UNITS=     HZ,            ARBITRARY UNITS, ARBITRARY UNITS
##FACTOR=    0.620285442955139, 1,           1
##FIRST=     20137.2065510682, 0,            0
##LAST=      -20513.1999529968, 0,           0
##MIN=       -20513.1999529968, -53960319,   0
##MAX=       20137.2065510682, 285438466,    0
$$ Real data points
##PAGE= N=1
##DATA TABLE= (X++(R..R)), XYDATA
$$ [...]
$$ plain form
42735 -3169882 -3428446 -3750325 -4099491 -4439376 -4740904 -4982379 -5144689 -5208431 -5157821 -4990013
42725 -4990013 -4722362 -4390360 -4036334 -3696809 -3396913 -3153459 -2981282 -2896242 -2912498 -3036647
42715 -3036647 -3263007 -3572818 -3937771 -4327076 -4716661 -5097080 -5474682 -5862433 -6264232
42706 -6264232 -6663429 -7024645 -7307904 -7484862 -7546782 -7501646 -7364928 -7150243 -6863867 -6504435
42696 -6504435 -6067454 -5552576 -4970149 -4343560 -3705721 -3091154 -2527217 -2028120 -1593368
42687 -1593368 -1209618 -853915 -497194 -108726 337381 853797 1432283 2040780 2628056
42678 2628056 3135130 3508535 3709513 3716156 3520750 3127313 2552718 1830056 1009457 152336
42668 152336 -680457 -1441530 -2104727 -2664752 -3129978 -3512626 -3820360 -4051952 -4197785 -4244255
$$ packed form
42735c169882k58564l21879l49166l39885l01528k41475j62310o3742N0610J67808
42725d990013K67651L32002L54026L39525K99896K43454J72177Q5040j6256j24149
42715c036647k26360l09811l64953l89305l89585l80419l77602l87751m01799
42706f264232l99197l61216k83259j76958o1920M5136J36718K14685K86376L59432
42696f504435M36981N14878N82427O26589O37839O14567N63937M99097M34752
42687a593368L83750L55703L56721L88468M46107N16416N78486O08497N87276
42678B628056N07074L73405K00978O643j95406l93437n74595p22662q20599q57121
42668A52336q32793p61073o63197n60025m65226l82648l07734k31592j45833m6470
$$ plain form
42658 -4244255 -4179987 -4002048 -3721208 -3365447 -2979822 -2620990 -2347342 -2208431 -2237065 -2444597
42648 -2444597 -2818422 -3321990 -3899096 -4483170 -5009493 -5426618 -5703569 -5830789 -5814878 -5669711
42638 -5669711 -5408350 -5039682 -4570931 -4014078 -3392205 -2741854 -2109273 -1541830 -1078406
42629 -1078406 -742519 -539353 -455511 -460548 -511200 -560147 -568871 -519745 -420102 -294164 -166481
42618 -166481 -46700 75337 222327 415459 661491 946501 1237893 1492816 1669395 1737097
42608 1737097 1683384 1514662 1250743 914916 524702 88377 -391763 -912671 -1464258 -2025284
42598 -2025284 -2561933 -3030119 -3382523 -3579223 -3598410 -3442970 -3140021 -2733274 -2271257 -1795917
42588 -1795917 -1334918 -898653 -482674 -76356 323980 704003 1029787 1257097 1345328 1268226
$$ packed form
42658d244255O4268J77939K80840L55761L85625L58832K73648J38911k8634k07532
42648b444597l73825n03568n77106n84074n26323m17125k76951j27220J5911J45167
42638e669711K61361L68668M68751N56853O21873O50351O32581N67443M63424
42629a078406L35887K03166Q3842n037n0652m8947q724M9126R9643J25938J27683
42618a66481J19781J22037J46990J93132K46032K85010K91392K54923J76579O7702
42608A737097n3713j68722k63919l35827l90214m36325m80140n20908n51587n61026
42598b025284n36649m68186l52404j96700j9187J55440L02949M06747M62017M75340
42588a795917M60999M36265M15979M06318M00336L80023L25784K27310Q8231p7102
$$ plain form
42578 1268226 1018170 606088 60384 -573839 -1237076 -1862669 -2390285 -2781224 -3027307
42569 -3027307 -3148375 -3181552 -3169953 -3155129 -3171568 -3240339 -3362581 -3516684 -3662387 -3751654
42559 -3751654 -3742673 -3611393 -3356015 -2993788 -2553089 -2064539 -1553368 -1034185 -509703 25511
42549 25511 577684 1146736 1723323 2291012 2831121 3326170 3759899 4115808 4378247 4537710
42539 4537710 4597218 4574567 4497679 4395127 4286899 4180216 4071817 3953880 3818432 3657162
42529 3657162 3458392 3206032 2883720 2482869 2010146 1489880 959446 459224 21728
42520 21728 -334994 -607403 -802075 -931236 -1011008 -1061490 -1105819 -1166744 -1262284 -1403309 -1594021
42509 -1594021 -1833600 -2116919 -2434028 -2769900 -3105667 -3421178 -3697627 -3918642 -4069249
$$ packed form
42578A268226k50056m12082n45704o34223o63237o25593n27616l90939k46083
42569c027307j21068l3177J1599J4824j6439o8771j22242j54103j45703q9267
42559c751654Q981J31280K55378L62227M40699M88550N11171N19183N24482N35214
42549B5511N52173N69052N76587N67689N40109M95049M33729L55909K62439J59463
42539D537710N9508k2651p6888j02552j08228j06683j08399j17937j35448j61270
42529C657162j98770k52360l22312m00851m72723n20266n30434n00222m37496
42520B1728l56722k72409j94672j29161p9772n0482m4329o0925r5540j41025j90712
42509a594021k39579k83319l17109l35872l35767l15511k76449k21015j50607
$$ plain form
42500 -4069249 -4134277 -4099455 -3956636 -3710091 -3378630 -2991820 -2584315 -2192939 -1856159 -1611255
42490 -1611255 -1486632 -1492685 -1617401 -1829573 -2087440 -2348602 -2578510 -2756374 -2877041 -2947198
42480 -2947198 -2976436 -2967432 -2911181 -2790281 -2587798 -2295687 -1917992 -1468569 -966555 -432775
42470 -432775 112464 651218 1169519 1657225 2104968 2499370 2819498 3036877 3119340 3037373
42460 3037373 2770881 2314351 1679045 891968 -7438 -971442 -1947845 -2883412 -3728348
42451 -3728348 -4443149 -5006437 -5418992 -5699816 -5875609 -5970280 -6000306 -5975962 -5904473 -5792420
42441 -5792420 -5648005 -5484549 -5324299 -5199756 -5150122 -5212827 -5412924 -5754999 -6221505 -6777730
42431 -6777730 -7379477 -7978329 -8522338 -8954628 -9215063 -9248612 -9019248 -8523571 -7797420 -6912032
$$ packed form
42500d069249o5028L4822J42819K46545L31461L86810M07505L91376L36780K44904
42490a611255J24623o053j24716k12172k57867k61162k29908j77864j20667p0157
42480b947198k9238R004N6251J20900K02483K92111L77695M49423N02014N33780
42470d32775N45239N38754N18301M87706M47743L94402L20128K17379Q2463q1967
42460C037373k66492m56530o35306p87077q99406r64004r76403r35567q44936
42451c728348p14801n63288m12555k80824j75793r4671l0026K4344P1489J12053
42441e792420J44415J63456J60250J24543M9634o2705k00097l42075m66506n56225
42431f777730o01747n98852n44009m32290k60435l3549K29364M95677P26151Q85388
$$ plain form
42421 -6912032 -5961169 -5043442 -4244463 -3623149 -3206170 -2992412 -2964499 -3100260 -3377834 -3773952
42411 -3773952 -4260220 -4802144 -5361347 -5898666 -6376663 -6762313 -7030633 -7168416 -7176570 -7070238
42401 -7070238 -6876799 -6632336 -6377780 -6156081 -6009859 -5976659 -6079800 -6317962 -6661138 -7058486
42391 -7058486 -7455797 -7813350 -8115323 -8368151 -8591326 -8805853 -9024096 -9243354 -9445285
42382 -9445285 -9601805 -9684472 -9671696 -9550210 -9312950 -8959059 -8498943 -7960797 -7391703 -6849487
42372 -6849487 -6388336 -6045629 -5836383 -5756161 -5787857 -5906140 -6076700 -6252903 -6375886 -6382657
42362 -6382657 -6221140 -5865450 -5323346 -4632390 -3848053 -3030491 -2234842 -1505678 -873990
42353 -873990 -355303 51364 363308 611343 832768 1060421 1311729 1582813 1849414 2071897
$$ packed form
42421f912032R50863R17727P98979O21314M16979K13758K7913j35761k77574l96118
42411c773952m86268n41924n59203n37319m77997l85650k68320j37783q154J06332
42401g070238J93439K44463K54556K21699J46222L3200j03141k38162l43176l97348
42391g058486l97311l57553l01973k52828k23175k14527k18243k19258k01931
42382i445285j56520q2667J2776J21486K37260L53891M60116N38146N69094N42216
42372f849487M61151L42707K09246Q0222l1696j18283j70560j76203j22983o771
42362f382657J61517L55690N42104O90956P84337Q17562P95649P29164O31688
42353h73990N18687M06667L11944K48035K21425K27653K51308K71084K66601K22483
$$ plain form
42343 2071897 2200933 2184025 1975418 1549709 914240 113315 -779219 -1676332 -2496636 -3179921
42333 -3179921 -3696356 -4047667 -4259161 -4363829 -4384689 -4324583 -4169187 -3900299 -3510195 -3008874
42323 -3008874 -2422445 -1786143 -1136322 -504073 88191 626581 1102422 1507811 1832927
42314 1832927 2067328 2204999 2250061 2218748 2135460 2025206 1907628 1796307 1702425 1638650
42304 1638650 1619632 1658495 1761332 1922501 2122762 2331068 2509580 2620597 2633485 2529855
42294 2529855 2306297 1975499 1566754 1124976 705171 360563 127475 14452 2234 55007
42284 55007 136755 224231 310706 400023 495334 589154 659927 676299 606072 424965 121563
42273 121563 -302012 -831374 -1440531 -2091813 -2737153 -3322112 -3791135 -4091687 -4177556 -4014402
$$ packed form
42343B071897J29036j6908k08607m25709o35469q00925q92534q97113q20304o83285
42333c179921n16435l51311k11494j04668k0860O0106J55396K68888L90104N01321
42323c008874N86429O36302O49821O32249N92264N38390M75841M05389L25116
42314A832927K34401J37671M5062l1313q3288j10254j17578j11321r3882o3775
42304A638650j9018L8863J02837J61169K00261K08306J78512J11017J2888j03630
42294B529855k23558l30798m08745m41778m19805l44608k33088j13023j2218N2773
42284E5007Q1748Q7476Q6475Q9317R5311R3820P0773J6372p0227j81107l03402
42273A21563m23575n29362o09157o51282o45340n84959m69023l00552q5869J63154
$$ plain form
42263 -4014402 -3588632 -2915555 -2040587 -1031033 38096 1098665 2100439 3016451 3840949
42254 3840949 4579661 5236246 5802280 6256396 6571817 6726081 6707153 6515074 6162057 5673116
42244 5673116 5086100 4449067 3815316 3238675 2770538 2457053 2334151 2420735 2713644 3187763
42234 3187763 3801303 4503076 5238251 5951631 6590217 7107789 7472272 7673502 7726907 7670178
42224 7670178 7553956 7430912 7347356 7338457 7425853 7616440 7902428 8262817 8665695 9070995
42214 9070995 9434569 9714634 9879841 9916601 9833493 9661558 9449257 9251025 9111384 9050976
42204 9050976 9061603 9111992 9159235 9158940 9071038 8862802 8511785 8009278 7362876 6596481 5747503
42193 5747503 4862720 3994582 3197944 2524671 2013893 1680127 1506271 1447673 1446650 1450343
$$ packed form
42263d014402M25770O73077Q74968J009554J069129J060569J001774R16012Q24498
42254C840949P38712O56585N66034M54116L15421J54264j8928j92079l53017m88941
42244E673116n87016o37033o33751n76641m68137l13485j22902Q6584K92909M74119
42234C187763O13540P01773P35175P13380O38586N17572L64483K01230N3405n6729
42224G670178j16222j23044q3556q899Q7396J90587K85988L60389M02878M05300
42214I070995L63574K80065J65207L6760q3108j71935k12301j98232j39641o0408
42204I050976J0627N0389M7243k95q7902k08236l51017n02507o46402p66395q48978
42193E747503q84783q68138p96638o73273n10778l33766j73856n8598j023L693
$$ plain form
42183 1450343 1424474 1359912 1271990 1192610 1156162 1184352 1277810 1419016 1583811 1754056 1924859
42172 1924859 2103815 2303603 2532265 2786801 3053696 3315413 3557924 3773936 3959583
42163 3959583 4106925 4198383 4208998 4117048 3916690 3624599 3277484 2923486 2611854 2383198
42153 2383198 2261279 2247688 2321241 2443183 2568113 2658245 2695503 2685494 2651764 2625054 2633991
42142 2633991 2700171 2836510 3046927 3326219 3659842 4024715 4393436 4742823 5063168 5361516
42132 5361516 5655332 5959941 6278010 6598158 6903541 7184556 7447331 7712901 8007882
42123 8007882 8351516 8744508 9164366 9570385 9917302 10171276 10319989 10372934 10353725 10288430
42113 10288430 10193766 10069933 9903137 9677813 9390661 9056203 8700440 8348415 8014526
$$ packed form
42183A450343k5869o4562q7922p9380l6448K8190R3458J41206J64795J70245J70803
42172A924859J78956J99788K28662K54536K66895K61717K42511K16012J85647
42163C959583J47342R1458J0615r1950k00358k92091l47115l53998l11632k28656
42153B383198j21919j3591P3553J21942J24930R0132L7258j0009l3730k6710Q937
42142B633991O6180J36339K10417K79292L33623L64873L68721L49387L20345K98348
42132E361516K93816L04609L18069L20148L05383K81015K62775K65570K94981
42123H007882L43634L92992M19858M06019L46917K53974J48713N2945j9209o5295
42113A0288430r4664j23833j66796k25324k87152l34458l55763l52025l33889
$$ plain form
42104 8014526 7700298 7398812 7102365 6810135 6533309 6295440 6126502 6051529 6078794 6194683
42094 6194683 6369029 6567195 6760444 6929090 7060394 7146846 7187457 7189572 7167888 7140776
42084 7140776 7126950 7144038 7207265 7325987 7499227 7714523 7952518 8194342 8425897 8636209
42074 8636209 8812715 8938609 8994417 8961760 8826432 8580334 8223357 7765253 7225716 6631593
42064 6631593 6012591 5397650 4812374 4276144 3798774 3378727 3004549 2658364 2319046
42055 2319046 1964452 1574077 1132568 632424 74539 -532305 -1170701 -1812413 -2417662
42046 -2417662 -2939313 -3332731 -3568239 -3640884 -3572914 -3407852 -3199060 -2997844 -2845181 -2768000
42036 -2768000 -2778299 -2873015 -3034661 -3235029 -3443788 -3639705 -3818384 -3991319 -4177228 -4392102
$$ packed form
42104H014526l14228l01486k96447k92230k76826k37869j68938p4973K7265J15889
42094F194683J74346J98166J93249J68646J31304Q6452M0611K115k1684k7112
42084G140776j3826J7088O3227J18722J73240K15296K37995K41824K31555K10312
42074H636209J76506J25894N5808l2657j35328k46098l56977m58104n39537n94123
42064F631593o19002o14941n85276n36230m77370m20047l74178l46185l39318
42055B319046l54594l90375m41509n00144n57885o06844o38396o41712o05249
42046b417662n21651l93418k35508p2645O7970J65062K08792K01216J52663P7181
42036b768000j0299r4716j61646k00368k08759j95917j78679j72935j85909k14874
$$ plain form
42026 -4392102 -4643418 -4928611 -5234807 -5539234 -5812675 -6026450 -6158974 -6197489 -6135778 -5972735
42016 -5972735 -5714388 -5376130 -4980395 -4549648 -4099797 -3638750 -3169847 -2695951 -2220703
42007 -2220703 -1747218 -1276976 -810855 -351394 96577 528708 945828 1356904 1777586
41998 1777586 2225245 2713796 3250489 3834033 4452838 5084405 5698723 6266317 6767076
41989 6767076 7194269 7551094 7842356 8066957 8216046 8277817 8245464 8122598 7922833 7665325
41979 7665325 7370952 7061528 6760224 6490270 6271704 6118587 6038622 6034917 6107898 6255117
41969 6255117 6468028 6727726 7004455 7264321 7480841 7643456 7756563 7830540 7873236 7889256
41959 7889256 7885957 7877829 7882390 7909546 7953884 7997270 8019832 8010192 7967896 7898678 7808214 7698541
$$ packed form
42026d392102k51316k85193l06196l04427k73441k13775j32524l8515O1711J63043
42016e972735K58347L38258L95735M30747M49851M61047M68903M73896M75248
42007b220703M73485M70242M66121M59461M47971M32131M17120M11076M20682
41998A777586M47659M88551N36693N83544O18805O31567O14318N67594N00759
41989F767076M27193L56825K91262K24601J49089O1771l2353j22866j99765k57508
41979G665325k94373l09424l01304k69954k18566j53117p9965l705P2981J47219
41969F255117K12911K59698K76729K59866K16520J62615J13107P3977M2696J6020
41959G889256l299q128M561K7156M4338M3386K2562r640m2296o9218r0464j09673
$$ plain form
41947 7698541 7567202 7407359 7208004 6954638 6631293 6224772 5731142 5162028 4546023
41938 4546023 3921847 3325377 2778134 2284795 1841281 1447546 1116073 870162 732650
41929 732650 711455 789843 926614 1066681 1158200 1169498 1098425 970030 824981 706361
41919 706361 651171 686315 824770 1060569 1366613 1699547 2010635 2257383 2411604 2462760
41909 2462760 2416811 2290755 2103867 1868203 1582140 1230870 795972 271246 -323914 -943187
41899 -943187 -1525982 -2016434 -2378206 -2599983 -2692571 -2680242 -2588400 -2430929 -2202563 -1880802
41889 -1880802 -1437737 -857627 -152950 628879 1412716 2114496 2662348 3009938 3138421
41880 3138421 3051088 2766864 2314872 1728264 1036642 260378 -588856 -1501425 -2461843 -3444498
$$ packed form
41947G698541j31339j59843j99355k53366l23345m06521m93630n69114o16005
41938D546023o24176n96470n47243m93339m43514l93735l31473k45911j37512
41929G32650k1195P8388J36771J40067R1519J1298p1073j28395j45049j18620
41919G06361n5190L5144J38455K35799L06044L32934L11088K46748J54221N1156
41909B462760m5949j26056j86888k35664k86063l51270m34898n24726n95160o19273
41899i43187n82795m90452l61772k21777r2588J2329R1842J57471K28366L21761
41889a880802M43065N80110P04677P81829P83837P01780N47852L47590J28483
41880C138421q7333k84224m51992n86608o91622p76264q49234r12569r60418r82655
$$ plain form
41870 -3444498 -4413620 -5325458 -6132211 -6789226 -7265490 -7553799 -7675339 -7675265 -7609289 -7525005
41860 -7525005 -7445085 -7360200 -7235013 -7023186 -6683147 -6188754 -5533944 -4732885 -3816966 -2830082
41850 -2830082 -1824420 -857987 7264 708848 1189274 1403060 1324341 953616 320323
41841 320323 -522020 -1507290 -2569332 -3649732 -4699030 -5673750 -6533075 -7238750 -7760243
41832 -7760243 -8083659 -8218275 -8193870 -8047899 -7809863 -7493224 -7099513 -6629741 -6093127 -5506678
41822 -5506678 -4888006 -4249604 -3599881 -2948384 -2308602 -1695942 -1124825 -609068 -164278
41813 -164278 192785 450052 607766 682343 703379 704653 712947 739872 781026 823247 855970
41802 855970 880276 910885 970520 1079857 1247389 1462606 1694527 1896925 2020740 2031272
$$ packed form
41870c444498r69122r11838q06753o57015m76264k88309j21540P4O5976Q4284
41860g525005P9920Q4885J25187K11827L40039M94393O54810Q01059R15919R86884
41850b830082J005662R66433Q65251P01584M80426K13786p8719l70725o33293
41841C20323q42343r85270j062042j080400j049298r74720q59325p05675n21493
41832g760243l23416j34616K4405J45971K38036L16639L93711M69772N36614N86449
41822e506678O18672O38402O49723O51497O39782O12660N71117N15757M44790
41813a64278L57063K57267J57714P4577K1036J274Q294K6925M1154M2221L2723
41802H55970K4306L0609N9635J09337J67532K15217K31921K02398J23815J0532
$$ plain form
41792 2031272 1923807 1729918 1510542 1338607 1278363 1368379 1612784 1982866 2428465 2894911
41782 2894911 3338930 3738037 4091508 4413891 4723198 5027469 5315554 5557674 5716221
41773 5716221 5760471 5676397 5467326 5148335 4740504 4268564 3760876 3248915 2765081 2339304
41763 2339304 1994717 1742075 1574266 1464876 1374646 1265301 1115068 928496 735826 581625
41753 581625 506991 532925 652506 834543 1034136 1202549 1292894 1264856 1092825 776119
41743 776119 344002 -150705 -647945 -1097835 -1469701 -1749351 -1928787 -1996459 -1934385 -1723360
41733 -1723360 -1352220 -824971 -161424 608177 1449791 2328559 3207356 4044741 4796964
41724 4796964 5425071 5903862 6227686 6409621 6473720 6443357 6331196 6136264 5850209 5469571
$$ packed form
41792B031272j07465j93889k19376j71935o0244R0016K44405L70082M45599M66446
41782B894911M44019L99107L53471L22383L09307L04271K88085K42120J58547
41773E716221M4250q4074k09071l18991m07831m71940n07688n11961m83834m25777
41763B339304l44587k52642j67809j09390r0230j09345j50233j86572j92670j54201
41753E81625p4634K5934J19581J82037J99593J68413R0345k8038j72031l16706
41743G76119m32117m94707m97240m49890l71866k79650j79436o7672O2074K11025
41733a723360L71140N27249O63547P69601Q41614Q78768Q78797Q37385P52223
41724D796964O28107M78791L23824J81935O4099l0363j12161j94932k86055l80638
$$ plain form
41714 5469571 5007445 4498429 3994214 3550850 3211633 2992033 2874071 2814243 2761305 2673833
41704 2673833 2528977 2322210 2064329 1780104 1506413 1285242 1151239 1119005 1176416 1287028
41694 1287028 1400669 1468253 1455014 1347011 1149313 878635 554959 195630 -186683 -582648
41684 -582648 -983645 -1380269 -1762179 -2117151 -2428255 -2672398 -2825002 -2870588 -2812595 -2675301
41674 -2675301 -2497289 -2321186 -2183850 -2107934 -2095882 -2130069 -2181704 -2225265 -2250508 -2265922 -2293619
41663 -2293619 -2359738 -2484634 -2676119 -2927943 -3223482 -3541073 -3856449 -4141330 -4362107 -4482956
41653 -4482956 -4473266 -4315071 -4006776 -3563547 -3016702 -2412565 -1808031 -1260654 -815273 -492987
41643 -492987 -287727 -171405 -104699 -49097 23658 127006 260050 411304 564071 703078
$$ packed form
41714E469571m62126n09016n04215m43364l39217k19600j17962n9828n2938q7472
41704B673833j44856k06767k57881k84225k73691k21171j34003l2234N7411J10612
41694A287028J13641O7584j3239j08003j97698k70678l23676l59329l82313l95965
41684e82648m00997l96624l81910l54972l11104k44143j52604m5586N7993J37294
41674b675301J78012J76103J37336P5916J2052l4187n1635m3561k5243j5414k7697
41663b293619o6119j24896j91485k51824k95539l17591l15376k84881k20777j20849
41653d482956R690J58195L08295M43229N46845O04137O04534N47377M45381L22286
41643d92987K05260J16322O6706N5602P2755J03348J33044J51254J52767J39007
$$ plain form
41633 703078 821771 927009 1036845 1170852 1338196 1530463 1722580 1880728 1974472 1989810
41623 1989810 1938189 1855828 1791472 1787776 1865815 2019541 2220424 2427423 2597049 2690722 2679065
41612 2679065 2543809 2278067 1885188 1375991 764857 66692 -702656 -1522078 -2360034
41603 -2360034 -3173070 -3910214 -4521780 -4968989 -5231030 -5307424 -5215128 -4981986 -4639820 -4220219
41593 -4220219 -3753691 -3270644 -2801628 -2374759 -2009762 -1710819 -1462879 -1235592 -994996
41584 -994996 -718210 -404446 -77348 222723 453971 590123 631702 606024 555821 522272
41574 522272 530798 585304 670832 760670 823768 830796 758907 595215 338370 -2604 -412237
41563 -412237 -873818 -1372910 -1896603 -2429395 -2949940 -3432658 -3853895 -4198892 -4466019 -4667039
$$ packed form
41633G03078J18693J05238J09836J34007J67344J92267J92117J58148R3744J5338
41623A989810n1621q2361o4356l696P8039J53726K00883K06999J69626R3673j1657
41612B679065j35256k65742l92879n09197o11134o98165p69348q19422q37956
41603b360034q13036p37144o11566m47209k62041p6394R2296K33142L42166M19601
41593d220219M66528M83047M69016M26869L64997K98943K47940K27287K40596
41584i94996K76786L13764L27098L00071K31248J36152M1579k5678n0203l3549
41574E22272Q526N4506Q5528Q9838O3098P028p1889j63692k56845l40974m09633
41563d12237m61581m99092n23693n32792n20545m82718m21237l44997k67127k01020
$$ plain form
41553 -4667039 -4823303 -4958090 -5086660 -5207848 -5301841 -5336742 -5282178 -5123589 -4869055 -4544531
41543 -4544531 -4181249 -3804207 -3427992 -3058879 -2697760 -2340376 -1975950 -1587752 -1158268
41534 -1158268 -678295 -155486 383521 899880 1354771 1720596 1986849 2160670 2264012
41525 2264012 2328681 2390178 2481873 2631027 2856551 3167001 3558297 4013252 4505970 5010832
41515 5010832 5510972 6000509 6480030 6950803 7412871 7866718 8314626 8759740 9204263
41506 9204263 9648668 10091895 10531682 10964490 11384400 11780875 12137075 12431434 12642948
41497 12642948 12756810 12766862 12675013 12490846 12233156 11931529 11624366 11351747 11145072 11018109
41487 11018109 10963987 10959410 10972956 10972405 10928529 10817033 10621908 10340287 9984903 9580477 9155333
$$ packed form
41553d667039j56264j34787j28570j21188r3993l4901N4564J58589K54534L24524
41543d544531L63282L77042L76215L69113L61119L57384L64426L88198M29484
41534a158268M79973N22809N39007N16359M54891L65825K66253J73821J03342
41525B264012O4669O1497R1695J49154K25524L10450L91296M54955M92718N04862
41515E010832N00140M89537M79521M70773M62068M53847M47908M45114M44523
41506I204263M44405M43227M39787M32808M19910L96475L56200K94359K11514
41497A2642948J13862J0052r1849j84167k57690l01627l07163k72619k06675j26963
41487A1018109n4122m577J3546n51m3876j11496j95125k81621l55384m04426m25144
$$ plain form
41476 9155333 8733935 8334790 7972742 7661323 7412624 7235610 7134732 7109319 7153513 7256872
41466 7256872 7405711 7584665 7778121 7971707 8153559 8314181 8444321 8532091 8561371 8512418
41456 8512418 8364418 8099457 7707310 7189801 6563337 5858574 5116650 4381954 3692877
41447 3692877 3073591 2529623 2048293 1604058 1168348 721362 260216 -201361 -640644
41438 -640644 -1034380 -1362721 -1608580 -1755604 -1787401 -1689536 -1455281 -1093965 -636990 -135711
41428 -135711 350188 769168 1092104 1319469 1479789 1620189 1791711 2033842 2363059 2768553
41418 2768553 3215668 3655467 4037445 4321679 4486606 4530350 4466357 4316647 4106254 3860830
41408 3860830 3607045 3373511 3189123 3077042 3046164 3085344 3165015 3245975 3290357 3269399
$$ packed form
41476I155333m21398l99145l62048l11419k48699j77014j00878k5413M4194J03359
41466G256872J48839J78954J93456J93586J81852J60622J30140Q7770K9280m8953
41456H512418j48000k64961l92147n17509o26464p04763p41924p34696o89077
41447C692877o19286n43968m81330m44235m35710m46986m61146m61577m39283
41438f40644l93736l28341k45859j47024l1797R7865K34255L61316M56975N01279
41428a35711M85899M18980L22936K27365J60320J40400J71522K42131L29217M05494
41418B768553M47115M39799L81978K84234J64927M3744o3993j49710k10393k45424
41408C860830k53785k33534j84388j12081l0878L9180P9671Q0960M4382k0958
$$ plain form
41398 3269399 3166164 2975041 2701126 2361299 1985870 1617036 1300848 1073853 950651
41389 950651 918993 944531 982274 989994 939879 825719 663661 485969 329830 225589 189045
41378 189045 219950 305229 423686 550610 662946 745383 794773 819143 830382 834131 822549
41367 822549 774239 661755 462641 167778 -216526 -670744 -1164205 -1656141 -2099062 -2446560
41357 -2446560 -2662264 -2724851 -2627962 -2377919 -1991211 -1491210 -904309 -258086 417020 1086009
41347 1086009 1712915 2270215 2747701 3153307 3504392 3815299 4089144 4318029 4489995
41338 4489995 4597359 4641021 4628471 4567335 4459490 4300563 4085838 3818365 3512843 3191897
41328 3191897 2877324 2582920 2313847 2072086 1862938 1697286 1587867 1541849 1554052 1604838
$$ packed form
41398C269399j03235j91123k73915l39827l75429l68834l16188k26995j23202
41389I50651l1658K5538L7743P720n0115j14160j62058j77692j56139j04241l6544
41378A89045L0905Q5279J18457J26924J12336Q2437M9390K4370J1239L749j1582
41367H22549m8310j12484j99114k94863l84304m54218m93461m91936m42921l47498
41357b446560k15704o2587R6889K50043L86708N00001N86901O46223O75106O68989
41347A086009O26906N57300M77486M05606L51085L10907K73845K28885J71966
41338D489995J07364M3662j2550o1136j07845j58927k14725k67473l05522l20946
41328C191897l14573k94404k69073k41761k09148j65652j09419m6018J2203N0786
$$ plain form
41318 1604838 1664746 1704657 1706935 1671723 1615236 1561782 1534471 1548809 1610481 1716516 1858680
41307 1858680 2027677 2216538 2422181 2645576 2891367 3166429 3476170 3819535 4186592
41298 4186592 4561918 4932193 5292094 5643413 5987537 6316164 6606035 6821093 6921639
41289 6921639 6876660 6673788 6323009 5854291 5312170 4749343 4218538 3762105 3402242 3137076
41279 3137076 2945003 2794187 2651983 2491627 2296732 2064036 1802834 1529520 1258686
41270 1258686 995067 730445 447008 125497 -245601 -663906 -1112599 -1565268 -1993866
41261 -1993866 -2376827 -2704994 -2983563 -3229337 -3464204 -3707437 -3969500 -4249349 -4536251
41252 -4536251 -4816260 -5081322 -5336178 -5597882 -5886695 -6212993 -6568150 -6925025 -7247692
$$ packed form
41318A604838N9908L9911K278l5212n6487n3454k7311J4338O1672J06035J42164
41307A858680J68997J88861K05643K23395K45791K75062L09741L43365L67057
41298D186592L75326L70275L59901L51319L44124L28627K89871K15058J00546
41289F921639m4979k02872l50779m68718n42121n62827n30805m56433l59863k65166
41279C137076j92073j50816j42204j60356j94895k32696k61202k73314k70834
41270A258686k63619k64622k83437l21511l71098m18305m48693m52669m28598
41261a993866l82961l28167k78569k45774k34867k43233k62063k79849k86902
41252d536251k80009k65062k54856k61704k88813l26298l55157l56875l22667
$$ plain form
41243 -7247692 -7504715 -7679251 -7772453 -7801134 -7792540 -7778190 -7787125 -7838936 -7938003 -8070597 -8205492
41232 -8205492 -8298100 -8298301 -8161724 -7862291 -7401715 -6811722 -6147849 -5477429 -4866482 -4369242
41222 -4369242 -4021603 -3837896 -3810624 -3913774 -4109876 -4359000 -4626246 -4885472 -5119759 -5320635
41212 -5320635 -5487044 -5622957 -5732514 -5813711 -5854007 -5830964 -5718161 -5493779 -5148767 -4692892
41202 -4692892 -4157690 -3594487 -3065763 -2630811 -2330704 -2178701 -2159604 -2237442 -2367934 -2510915
41192 -2510915 -2638432 -2736225 -2799828 -2828867 -2822700 -2778403 -2690435 -2551449 -2354196 -2094573 -1775365
41181 -1775365 -1409732 -1023026 -651490 -336881 -117290 -16290 -34489 -148166 -316796 -495933
41171 -495933 -648581 -750378 -789447 -764761 -684587 -563057 -413099 -238080 -27832 236608
$$ packed form
41243g247692k57023j74536r3202k8681Q594J4350q935n1811r9067j32594j34895
41232h205492r2608k01J36577K99433M60576N89993O63873O70420O10947M97240
41222d369242L47639J83707K7272j03150j96102k49124k67246k59226k34287k00876
41212e320635j66409j35913j09557q1197m0296K3043J12803K24382L45012M55875
41202d692892N35202N63203N28724M34952L00107J52003J9097p7838j30492j42981
41192b510915j27517r7793o3603k9039O167M4297Q7968J38986J97253K59623L19208
41181a775365L65633L86706L71536L14609K19591J01000j8199j13677j68630j79137
41171d95933j52648j01797l9069K4686Q0174J21530J49958J75019K10248K64440
$$ plain form
41161 236608 570784 973579 1420354 1865985 2255900 2540035 2684540 2677737 2529039 2262072
41151 2262072 1905506 1485890 1025639 546462 74972 -355302 -709688 -963838 -1112867
41142 -1112867 -1171137 -1163365 -1114065 -1041517 -957211 -868624 -782796 -707966 -650647 -608832 -566653
41131 -566653 -496128 -366097 -152826 153345 546912 1009634 1513423 2021739 2489980 2868030
41121 2868030 3107846 3174954 3058237 2772457 2352590 1844328 1296701 759939 286851 -67379
41111 -67379 -250694 -223610 32406 511376 1183908 2001017 2899845 3810821 4664769 5398420
41101 5398420 5959421 6313224 6451352 6396107 6196493 5915075 5610979 5326085 5079450 4871339
41091 4871339 4694192 4544440 4428477 4359626 4349098 4397783 4494208 4618703 4749836 4869147
$$ packed form
41161B36608L34176M02795M46775M45631L89915K84135J44505o803j48698k66967
41151B262072l56566m19616m60251m79177m71490m30274l54386k54150j49029
41142a112867n8270P772M9300P2548Q4306Q8587Q5828P4830N7319M1815M2179
41131e66653P0525J30031K13271L06171L93567M62722N03789N08316M68241L78050
41121B868030K39816O7108j16717k85780m19867n08262n47627n36762m73088l54230
41111f7379j83315K7084K56016M78970O72532Q17109Q98828R10976Q53948P33651
41101E398420N61001L53803J38128n5245j99614k81418l04096k84894k46635k08111
41091D871339j77147j49752j15963o8851j0528M8685R6425J24495J31133J19311
$$ plain form
41081 4869147 4963017 5022807 5045102 5032897 4996990 4955355 4928481 4931215 4964883 5014007 5049454
41070 5049454 5036829 4947407 4768409 4508777 4197190 3872600 3572247 3323542 3142781 3038337
41060 3038337 3013796 3068464 3196062 3384116 3615563 3872108 4137608 4400116 4652397 4891439
41050 4891439 5116943 5328574 5522544 5689988 5819631 5904448 5948400 5968460 5990486 6041727
41040 6041727 6144219 6311409 6547646 6849235 7206073 7603241 8021771 8438203 8824074
41031 8824074 9147566 9378742 9496679 9494167 9376658 9156520 8847516 8463642 8021965 7545512
41021 7545512 7062796 6604014 6196723 5864195 5627483 5508914 5532626 5719276 6076733 6592326
41011 6592326 7231684 7945268 8680021 9391725 10053334 10655728 11201153 11694234 12136783
$$ packed form
41081D869147R3870N9790K2295j2205l5907m1635k6874K734L3668M9124L5447
41070E049454j2625q9422j78998k59632l11587l24590l00353k48705j80761j04444
41060C038337k4541N4668J27598J88054K31447K56545K65500K62508K52281K39042
41050D891439K25504K11631J93970J67444J29643Q4817M3952K0060K2026N1241
41040F041727J02492J67190K36237L01589L56838L97168M18530M16432L85871
41031H824074L23492K31176J17937k512j17509k20138l09004l83874m41677m76453
41021G545512m82716m58782m07291l32528k36712j18569K3712J86650L57457N15593
41011F592326O39358P13584P34753P11704O61609O02394N45425M93081M42549
$$ plain form
41002 12136783 12529157 12875775 13190066 13495011 13817708 14178657 14579093 14991608 15359371
40993 15359371 15606621 15658794 15465860 15019477 14356120 13545044 12667553 11797191 10987747
40984 10987747 10270939 9661719 9167284 8795462 8559831 8481652 8589795 8917805 9495310
40975 9495310 10333324 11408870 12657709 13980567 15260840 16386420 17268366 17852077 18119977
40966 18119977 18087296 17794916 17303556 16690260 16043883 15455557 15004518 14744444 14695829 14846324
40956 14846324 15157883 15578830 16058724 16562159 17076225 17607614 18169830 18765948 19375286
40947 19375286 19951150 20431211 20755025 20879511 20785497 20474644 19961531 19266816 18414730
40938 18414730 17433936 16358313 15225178 14071885 12933866 11845574 10842153 9958378
$$ packed form
41002A2136783L92374L46618L14291L04945L22697L60949M00436M12515L67763
40993A5359371K47250N2173j92934m46383o63357q11076q77491q70362q09444
40984A0987747p16808o09220m94435l71822k35631p8179J08143L28010N77505
40975I495310Q38014J075546J248839J322858J280273J125580Q81946N83711K67900
40966A8119977l2681k92380m91360o13296o46377n88326m51039k60074m8615J50495
40956A4846324L11559M20947M79894N03435N14066N31389N62216N96118O09338
40947A9375286N75864M80061L23814J24486r4014l10853n13113o94715q52086
40938A8414730r80794j075623j133135j153293j138019j088292j003421q83775
$$ plain form
40930 9958378 9224043 8658772 8270114 8055867 8007647 8111606 8345171 8673343 9049980 9426371
40920 9426371 9763624 10041906 10261382 10435073 10578411 10701173 10804775 10884572 10934898 10954625
40910 10954625 10951666 10945131 10963876 11040881 11204501 11469418 11830786 12263611 12726647 13168420
40900 13168420 13533775 13771185 13840875 13721668 13413549 12935328 12320084 11611175 10858922
40891 10858922 10116227 9432454 8846900 8383836 8050069 7834847 7711463 7640447 7575019 7469358
40881 7469358 7287922 7011911 6639830 6183532 5664329 5112288 4567175 4077049 3692511
40872 3692511 3458433 3406742 3552618 3894190 4414393 5083361 5860133 6693208 7520829 8273355
40862 8273355 8880115 9280869 9438539 9348462 9040637 8573990 8023594 7463657 6951657 6519947
$$ packed form
40930I958378p34335n65271l88658k14247m8220J03959K33565L28172L76637L76391
40920I426371L37253K78282K19476J73691J43338J22762J03602P9797N0326J9727
40910A0954625k959o535J8745P7005J63620K64917L61368M32825M63036M41773
40900A3168420L65355K37410O9690j19207l08119m78221o15244p08909p52253
40891A0858922p42695o83773n85554m63064l33767k15222j23384p1016o5428j05661
40881G469358j81436k76011l72081m56298n19203n52041n45113m90126l84538
40872C692511k34078n1691J45876L41572N20203O68968P76772Q33075Q27621P52526
40862H273355O06760M00754J57670r0077l07825m66647n50396n59937n12000m31710
$$ plain form
40852 6519947 6177893 5921298 5741856 5631479 5581962 5583724 5625877 5696578 5782035 5864934 5925185
40841 5925185 5944409 5911789 5826746 5696010 5527589 5327256 5101328 4864032 4643457 4480737
40831 4480737 4421904 4506355 4756595 5171696 5724886 6365582 7026417 7634564 8124320 8446678
40821 8446678 8572819 8491496 8203247 7715659 7042603 6207463 5247286 4213805 3168968
40812 3168968 2175979 1289610 549550 -21507 -415820 -636444 -693041 -599334 -372836 -35795
40802 -35795 384680 858227 1353700 1841640 2297299 2705021 3062405 3380373 3676526 3963421
40792 3963421 4237397 4474137 4634002 4675445 4571116 4320311 3953239 3525570 3105157 2755960
40782 2755960 2525595 2440925 2511510 2737104 3114960 3644285 4326368 5160172 6135218 7225549
$$ packed form
40852F519947l42054k56595j79442j10377m9517J762M2153P0701Q5457Q2899O0251
40841E925185J9224l2620q5043j30736j68421k00333k25928k37296k20575j62720
40831D480737n8833Q4451K50240M15101N53190O40696O60835O08147M89756L22358
40821H446678J26141q1323k88249m87588o73056q35140r60177j033481j044837
40812C168968r92989q86369p40060n71057l94313k20624n6597R3707K26498L37041
40802c5795M20475M73547M95473M87940M55659M07722L57384L17968K96153K86895
40792C963421K73976K36740J59865M1443j04329k50805l67072m27669m20413l49197
40782B755960k30365q4670P0585K25594L77856N29325O82083Q33804R75046J090331
$$ plain form
40772 7225549 8387982 9565551 10695402 11719582 12595374 13299750 13824230 14163035 14303703
40763 14303703 14228664 13928150 13416049 12737938 11965686 11181405 10458964 9850721 9382526
40754 9382526 9055663 8853042 8747700 8711715 8722901 8766754 8833609 8914021 8996077 9066091 9110851
40743 9110851 9118750 9079329 8983068 8823199 8598788 8316602 7989942 7634841 7265696 6892858
40733 6892858 6523702 6166389 5833157 5539944 5302340 5131450 5033114 5010477 5066932 5206699
40723 5206699 5432443 5740939 6118805 6541315 6976845 7396036 7780573 8126173 8438611
40714 8438611 8726407 8994528 9241056 9456424 9624367 9724343 9735682 9643630 9446096 9157561
40704 9157561 8806381 8425740 8044057 7681594 7354304 7079386 6876147 6760935 6740087 6805799
$$ packed form
40772G225549J162433J177569J129851J024180Q75792P04376N24480L38805J40668
40763A4303703p5039l00514n12101o78111p72252p84281p22441o08243m68195
40754I382526l26863k02621j05342l5985J1186M3853O6855Q0412Q2056P0014M4760
40743I110851P899l9421r6261j59869k24411k82186l26660l55101l69145l72838
40733F892858l69156l57313l33232k93213k37604j70890r8336k2637N6455J39767
40723E206699K25744L08496L77866M22510M35530M19191L84537L45600L12438
40714H438611K87796K68121K46528K15368J67943R9976J1339r2052j97534k88535
40704I157561l51180l80641l81683l62463l27290k74918k03239j15212k0848O5712
$$ plain form
40694 6805799 6936931 7103640 7273355 7416050 7508053 7534555 7491299 7385593 7236302 7071782
40684 7071782 6924433 6822039 6778798 6790794 6838843 6897284 6943715 6964809 6956455 6920239 6859947
40673 6859947 6780524 6688862 6594225 6507673 6442089 6413575 6441677 6544964 6732711 6998348 7320032
40662 7320032 7667863 8012287 8328823 8598737 8807882 8945091 8999834 8959553 8809042 8534050
40652 8534050 8128365 7600447 6975291 6289685 5582323 4883122 4207031 3555844 2926950
40643 2926950 2323688 1761585 1268358 879441 631403 554068 661863 947227 1380474 1917537
40633 1917537 2511271 3119294 3705133 4235986 4682317 5020796 5238085 5333230 5318677 5220150
40623 5220150 5074233 4923064 4807697 4762279 4809285 4955150 5187142 5473906 5771443 6033599
$$ packed form
40694F805799J31132J66709J69715J42695R2003K6502m3256j05706j49291j64520
40684G071782j47349j02394m3241J1996M8049N8441M6431K1094q354l6216o0292
40673F859947p9423r1662r4637q6552o5584k8514K8102J03287J87747K65637L21684
40662G320032L47831L44424L16536K69914K09145J37209N4743m0281j50511k74992
40652H534050m05685n27918o25156o85606p07362o99201o76091o51187o28894
40643B926950o03262n62103m93227l88917k48038p7335J07795K85364M33247N37063
40633A917537N93734O08023N85839N30853M46331L38479K17289R5145j4553r8527
40623E220150j45917j51169j15367m5418M7006J45865K31992K86764K97537K62156
$$ plain form
40613 6033599 6223576 6321686 6325972 6246630 6099172 5900457 5667361 5415984 5161726 4921988
40603 4921988 4719746 4583156 4539931 4611853 4815036 5164484 5675832 6359839 7212225 8205186
40593 8205186 9285493 10380359 11409159 12297167 12987654 13450137 13683629 13713667 13582845
40584 13582845 13337718 13017618 12649684 12250200 11829293 11395956 10961845 10543184 10160479
40575 10160479 9835703 9587105 9422956 9337532 9312887 9326465 9359468 9399966 9439569 9468713
40565 9468713 9476393 9455357 9408579 9351742 9309462 9306953 9361587 9478841 9654025 9876956 10135433
40554 10135433 10416466 10708038 11003561 11306640 11631018 11993692 12404924 12861241 13344879
40545 13344879 13828841 14284576 14689482 15032455 15315929 15553084 15759932 15944496 16097759
$$ packed form
40613F033599J89977R8110M286p9342j47458j98715k33096k51377k54258k39738
40603D921988k02242j36590m3225P1922K03183L49448N11348O84007Q52386R92961
40593H205186J080307J094866J028800Q88008O90487M62483K33492L0038j30822
40584A3582845k45127l20100l67934l99484m20907m33337m34111m18661l82705
40575A0160479l24776k48598j64149q5424k4645J3578L3003M0498L9603K9144
40565I468713P680k1036m6778n6837m2280k509N4634J17254J75184K22931K58477
40554A0135433K81033K91572K95523L03079L24378L62674M11232M56317M83638
40545A3344879M83962M55735M04906L42973K83474K37155K06848J84564J53263
$$ plain form
40536 16097759 16191127 16182417 16028690 15702120 15203714 14569010 13861374 13154179 12509967 11966225
40526 11966225 11531947 11192266 10916322 10665917 10404473 10105019 9754493 9352121 8902200
40517 8902200 8404903 7850772 7223261 6508692 5707762 4842189 3954230 3101062 2346794
40508 2346794 1753785 1374905 1248686 1397421 1825298 2513965 3417016 4458847 5542713
40499 5542713 6568052 7451855 8145791 8641651 8963060 9149193 9240426 9272434 9277251 9284893
40489 9284893 9320946 9400714 9523973 9674681 9827641 9960081 10062101 10139907 10210677 10293401
40479 10293401 10400911 10535398 10687539 10839420 10970774 11065889 11118034 11130864 11118580 11105229
40469 11105229 11121062 11194759 11344033 11568867 11849632 12149728 12422238 12620578 12711536 12685953
$$ packed form
40536A6097759R3368q710j53727l26570m98406o34704p07636p07195o44212n43742
40526A1966225m34278l39681k75944k50405k61444k99454l50526m02372m49921
40517H902200m97297n54131o27511p14569q00930q65573q87959q53168p54268
40508B346794n93009l78880j26219J48735M27877O88667R03051J041831J083866
40499E542713J025339Q83803O93936M95860L21409J86133R1233L2008M817P642
40489I284893L6053P9768J23259J50708J52960J32440J02020P7806P0770Q2724
40479A0293401J07510J34487J52141J51881J31354R5115N2145J2830j2284j3351
40469A1105229J5833P3697J49274K24834K80765L00096K72510J98340R0958k5583
$$ plain form
40459 12685953 12561404 12374849 12169054 11980073 11831355 11734707 11693795 11706065 11762889 11850936
40449 11850936 11956850 12073283 12201779 12349331 12519897 12705713 12883876 13021271 13086855
40440 13086855 13066129 12970598 12837041 12716876 12661090 12706944 12869889 13141290 13491626 13878059
40430 13878059 14253607 14574522 14804979 14921133 14916037 14803368 14616099 14398837 14196662 14045048
40420 14045048 13964329 13960094 14028684 14164882 14367829 14642677 14998458 15444464 15986694 16624131
40410 16624131 17344127 18117710 18897927 19624910 20238674 20695645 20981209 21111665 21124470
40401 21124470 21062192 20958503 20832316 20690595 20535806 20373260 20216033 20087146 20017969 20041170
40391 20041170 20178681 20429620 20765097 21133998 21478225 21751466 21934226 22039208 22104649
$$ packed form
40459A2685953j24549j86555k05795j88981j48718r6648m0912J2270N6824Q8047
40449A1850936J05914J16433J28496J47552J70566J85816J78163J37395O5584
40440A3086855k0726r5531j33557j20165n5786M5854J62945K71401L50336L86433
40430A3878059L75548L20915K30457J16154n096j12669j87269k17262k02175j51614
40420A4045048q0719m235O8590J36198K02947K74848L55781M46006N42230O37437
40410A6624131P19996P73583P80217P26983O13764M56971K85564J30456J2805
40401B1124470o2278j03689j26187j41721j54789j62546j57227j28887o9177K3201
40391B0041170J37511K50939L35477L68901L44227K73241J82760J04982O5441
$$ plain form
40382 22104649 22178099 22297291 22476042 22700998 22940116 23158282 23331943 23455958 23541059 23605805
40372 23605805 23668354 23741450 23831085 23937792 24058731 24188978 24321353 24445276 24545665 24602750
40362 24602750 24593995 24499096 24307104 24022139 23664236 23265015 22860765 22485366 22164140 21909775
40352 21909775 21722363 21594061 21515208 21477059 21469282 21475553 21472892 21437585 21355245 21229082 21081576
40341 21081576 20948958 20871548 20883658 21005316 21236872 21557470 21928114 22299292 22621915 22859420
40331 22859420 22997477 23046848 23036681 23000527 22962476 22931174 22903732 22874408 22840596 22802890 22762400
40320 22762400 22720512 22682477 22661162 22676773 22752367 22908733 23161930 23523752 24002976 24605554
40310 24605554 25333300 26181997 27140946 28195744 29334313 30553247 31860289 33270697
$$ packed form
40382B2104649P3450J19192J78751K24956K39118K18166J73661J24015Q5101O4746
40372B3605805O2549P3096Q9635J06707J20939J30247J32375J23923J00389N7085
40362B4602750q755r4899j91992k84965l57903l99221m04250l75399l21226k54365
40352B1909775j87412j28302p8853l8149p777O271k661l5307q2340j26163j47506
40341B1081576j32618p7410J2110J21658K31556L20598L70644L71178L22623K37505
40331B2859420J38057M9371j0167l6154l8051l1302k7442k9324l3812l7706m0490
40320B2762400m1888l8035k1315J5611P5594J56366K53197L61822M79224O02578
40310B4605554P27746Q48697R58949J054798J138569J218934J307042J410408
$$ plain form
40302 33270697 34799026 36450306 38214429 40065675 41967571 43881613 45776943 47637502
40294 47637502 49464707 51276392 53104331 54991123 56984446 59125993 61435767 63897622
40286 63897622 66453854 69012504 71463386 73694022 75598879 77081982 78057724 78454073
40278 78454073 78219118 77329840 75801701 73696238 71121628 68221383 65151158 62050448
40270 62050448 59019444 56109217 53327323 50654414 48063910 45537343 43071788 40679918
40262 40679918 38385606 36218291 34208376 32384267 30769751 29379813 28214634 27254400
40254 27254400 26458851 25773932 25144156 24525945 23896282 23253462 22611049 21989294 21407953
40245 21407953 20881903 20419312 20022136 19688467 19415156 19198937 19036051 18921902 18851505
$$ packed form
40302C3270697J528329J651280J764123J851246J901896J914042J895330J860559
40294D7637502J827205J811685J827939J886792J993323K141547K309774K461855
40286F3897622K556232K558650K450882K230636J904857J483103R75742L96349
40278G8454073k34955q89278j528139k105463k574610k900245l070225l100710
40270F2050448l031004k910227k781894k672909k590504k526567k465555k391870
40262D0679918k294312k167315k009915j824109j614516j389938j165179r60234
40254B7254400p95549o84919o29776o18211o29663o42820o42413o21755n81341
40245B1407953n26050m62591l97176l33669k73311k16219j62886j14149p0397
$$ plain form
40236 18851505 18820108 18823845 18861553 18937766 19064064 19255841 19525331 19875304 20297071 20772912
40226 20772912 21280769 21798818 22307751 22789415 23223184 23584153 23846280 23989606 24008151
40217 24008151 23916362 23753392 23583073 23486465 23547029 23833870 24389672 25225890 26323787 27639650
40207 27639650 29113878 30682820 32290285 33895681 35477511 37031831 38565313 40084444
40199 40084444 41585924 43054144 44466806 45803407 47049905 48197626 49239568 50167593
40191 50167593 50971072 51636218 52146826 52487871 52650860 52637006 52455320 52116961 51630151
40182 51630151 50999133 50227940 49327745 48324939 47265272 46209505 45220228 44345532 43607696
40173 43607696 43001768 42503025 42078407 41696724 41334471 40976821 40615683 40247040 39868370
$$ packed form
40236A8851505l1397L737L7708P6213J26298J91777K69490L49973M21767M75841
40226B0772912N07857N18049N08933M81664M33769L60969K62127J43326J8545
40217B4008151r1789j62970j70319r6608O0564K86841N55802Q36218J097897J315863
40207B7639650J474228J568942J607465J605396J581830J554320J533482J519131
40199D0084444J501480J468220J412662J336601J246498J147721J041942R28025
40191E0167593Q03479O65146N10608L41045J62989j3854j81686l38359m86810
40182E1630151o31018p71193r00195j002806j059667j055767r89277q74696p37836
40173D3607696o05928m98743m24618l81683l62253l57650l61138l68643l78670
$$ plain form
40164 39868370 39475648 39060396 38609021 38106513 37543592 36923832 36267532 35611618 35006435
40155 35006435 34510024 34179603 34060649 34176036 34518997 35052535 35714663 36426616 37102179
40146 37102179 37658974 38032694 38191353 38142517 37927913 37606828 37236648 36859701 36500313
40137 36500313 36169716 35873590 35617997 35411621 35263801 35179297 35152880 35168141 35202678 35236672
40127 35236672 35258465 35263682 35251273 35223020 35188599 35170931 35204716 35326680 35562920 35920188 36383828
40116 36383828 36921106 37488319 38041607 38550394 39008803 39438511 39880133 40377314 40962173
40107 40962173 41648921 42436741 43318091 44286974 45342783 46488198 47723144 49039230 50418781
40098 50418781 51839623 53283566 54745004 56235817 57783923 59424944 61189566 63091364
$$ packed form
40164C9868370l92722m15252m51375n02508n62921o19760o56300o55914o05183
40155C5006435m96411l30421j18954J15387L42961N33538O62128P11953O75563
40146C7102179N56795L73720J58659m8836k14604l21085l70180l76947l59388
40137C6500313l30597k96126k55593k06376j47820q4504k6417J5261L4537L3994
40127C5236672K1793N217j2409k8253l4421j7668L3785J21964K36240L57268M63640
40116C6383828N37278N67213N53288N08787M58409M29708M41622M97181N84859
40107D0962173O86748P87820Q81350R68883J055809J145415J234946J316086J379551
40098E0418781J420842J443943J461438J490813J548106J641021J764622J901798
$$ plain form
40090 63091364 65120082 67243322 69416346 71596573 73757827 75900560 78056598 80288023
40082 80288023 82679201 85321980 88298228 91667858 95468814 99727837 104473732 109744275
40074 109744275 115583508 122031971 129114549 136829523 145141565 153981621 163255770 172861370
40066 172861370 182703463 192702019 202783951 212861016 222801060 232402452 241380790 249374912
40058 249374912 255975938 260777604 263439097 263745748 261651132 257288065 250945320 243018595
40050 243018595 233952336 224188397 214128991 204112664 194399802 185167544 176515854 168483494
40042 168483494 161068129 154244498 147978117 142234925 136987111 132214667 127903610 124043799
40034 124043799 120628736 117656346 115127435 113040157 111382691 110128605 109238107 108665017
$$ packed form
40090F3091364K028718K123240K173024K180227K161254K142733K156038K231425
40082H0288023K391178K642779K976248L369630L800956M259023M745895N270543
40074A09744275N839233O448463P082578P714974Q312042Q840056R274149R605600
40066A72861370R842093R998556J0081932J0077065R940044R601392Q978338P994122
40058B49374912O601026M801666K661493L06651k094616m363067o342745p926725
40050B43018595r066259r763939j0059406j0016327r712862r232258q651690q032360
40042A68483494p415365o823631o266381n743192n247814m772444m311057l859811
40034A24043799l415063k972390k528911k087278j657466j254086q90498n73090
$$ plain form
40026 108665017 108366325 108310251 108479494 108868623 109477028 110300592 111325677 112528422 113880548
40017 113880548 115359816 116959913 118693812 120588504 122674952 124980202 127526018 130332815
40009 130332815 133423969 136826298 140566176 144664418 149134251 153984449 159225688 164875246
40001 164875246 170955864 177488345 184481535 191925060 199788668 208027912 216591282 225421083
39993 225421083 234442040 243537930 252524733 261133658 269015260 275767462 280981253 284293681
39985 284293681 285438466 284286145 280865509 275359295 268073412 259388353 249707441 239414520
39977 239414520 228846225 218277355 207915884 197905817 188337418 179263136 170714835
39970 170714835 162717131 155293824 148467897 142257700 136672339 131708596 127350510 123570812
$$ packed form
40026A08665017k98692n6074J69243L89129O08405Q23564J025085J202745J352126
40017A13880548J479268J600097J733899J894692K086448K305250K545816K806797
40009A30332815L091154L402329L739878M098242M469833M850198N241239N649558
40001A64875246O080618O532481O993190P443525P863608Q239244Q563370Q829801
39993B25421083R020957R095890Q986803Q608925P881602O752202N213791L312428
39985B84293681J144785j152321l420636n506214p285883q685059r680912j0292921
39977B39414520j0568295j0568870j0361471j0010067r568399r074282q548301
39970A70714835p997704p423307o825927o210197n585361m963743m358086l779698
$$ plain form
39962 123570812 120332232 117587769 115281192 113349775 111729677 110362215 109198586 108201195
39954 108201195 107341115 106592824 105928436 105313828 104708160 104067737 103353768 102541397 101625624
39945 101625624 100621054 99556209 98465340 97379874 96320576 95292291 94283805 93273126
39937 93273126 92234963 91146471 89990161 88755677 87442623 86064555 84651471 83246790
39929 83246790 81896976 80637391 79481884 78421793 77434062 76493765 75586193 74715070 73904192
39920 73904192 73191336 72616806 72211933 71992089 71955482 72086777 72364081 72767223 73284332
39911 73284332 73914491 74666930 75559133 76615324 77864652 79337800 81061966 83055314
39903 83055314 85322230 87850369 90610320 93558056 96639437 99795620 102968724 106107209
$$ packed form
39962A23570812l238580k744463k306577j931417j620098j367462j163629r97391
39954A08201195q60080p48291o64388o14608o05668o40423p13969q12371r15773
39945A01625624j004570j064845j090869j085466j059298j028285j008486j010679
39937I3273126j038163j088492j156310j234484j313054j378068j413084j404681
39929H3246790j349814j259585j155507j060091r87731r40297r07572q71123q10878
39920G3904192p12856n74530m04873k19844l6607J31295K77304M03142N17109
39911G3284332O30159P52439Q92203J056191J249328J473148J724166J993348
39903H3055314K266916K528139K759951K947736L081381L156183L173104L138485
$$ plain form
39895 106107209 109169453 112122889 114936946 117571688 119967846 122044713 123708856 124870700
39887 124870700 125462136 125448645 124833280 123653499 121973531 119875186 117449996 114794397
39879 114794397 112007070 109185105 106416553 103770527 101289212 98986120 96852273 94868569
39871 94868569 93019269 91300375 89719432 88288914 87019117 85914464 84972311 84181498
39863 84181498 83521164 82963638 82483514 82069288 81730152 81493056 81391729 81454014 81693046
39854 81693046 82103700 82663050 83334104 84073043 84838872 85602000 86347944 87075393 87791706
39845 87791706 88510488 89253434 90054159 90958787 92019847 93285290 94788109 96540700 98534119
39836 98534119 100740356 103117040 105615125 108188733 110803934 113442810 116101537 118784188
$$ packed form
39895A06107209L062244K953436K814057K634742K396158K076867J664143J161844
39887A24870700N91436j3491o15365j179781j679968k098345k425190k655599
39879A14794397k787327k821965k768552k646026k481315k303092k133847j983704
39871I4868569j849300j718894j580943j430518j269797j104653r42153p90813
39863H4181498o60334n57526m80124m14226l39136k37096j01327O2285K39032
39854H1693046M10654N59350O71054P38939P65829P63128P45944P27449P16313
39845H7791706P18782P42946Q00725R04628J061060J265443J502819J752591J993419
39836I8534119K206237K376684K498085K573608K615201K638876K658727K682651
$$ plain form
39828 118784188 121495496 124234969 126992746 129746482 132459418 135081147 137551951 139809314
39820 139809314 141793580 143450422 144730145 145586042 145975407 145866257 145249388 144150477
39812 144150477 142634648 140799273 138757803 136622255 134491068 132443874 130540118 128817863
39804 128817863 127292003 125954390 124778636 123729411 122772632 121882023 121039712 120232176
39796 120232176 119445554 118664572 117876404 117076351 116269821 115467469 114676021 113890670 113092707
39787 113092707 112251072 111324890 110267141 109031931 107585061 105912749 104023460 101943773
39779 101943773 99714100 97387811 95030966 92717454 90518622 88492137 86675642 85086593
39771 85086593 83725348 82578184 81619890 80818094 80140854 79565689 79085568 78708146 78448160
$$ packed form
39828A18784188K711308K739473K757777K753736K712936K621729K470804K257363
39820A39809314J984266J656842J279723Q55897L89365j09150o16869j098911
39812A44150477j515829j835375k041470k135548k131187k047194j903756j722255
39804A28817863j525860j337613j175754j049225r56779q90609q42311q07536
39796A20232176p86622p80982p88168q00053q06530q02352p91448p85351p97963
39787A13092707q41635r26182j057749j235210j446870j672312j889289k079687
39779A01943773k229673k326289k356845k313512k198832k026485j816495j589049
39771H5086593j361245j147164r58294q01796o77240n75165m80121l77422k59986
$$ plain form
39762 78448160 78317060 78315321 78431009 78643929 78931538 79272892 79649471 80043718 80436166 80801762
39752 80801762 81107146 81311415 81371437 81250191 80925165 80393976 79674612 78799137 77803267
39743 77803267 76717556 75564724 74362447 73127253 71876074 70624997 69385905 68162156
39735 68162156 66945616 65717981 64456937 63144179 61771529 60343670 58878162 57403535
39727 57403535 55955941 54575166 53300757 52167792 51201046 50407795 49772385 49257057 48811467
39718 48811467 48388455 47958998 47518445 47080675 46664247 46279510 45923891 45585511 45248872
39709 45248872 44896290 44504700 44043068 43475353 42768480 41900554 40865788 39676734 38365844
39700 38365844 36985466 35602795 34288420 33102749 32087604 31266912 30653627 30256488
$$ packed form
39762G8448160j31100j739J15688K12920K87609L41354L76579L94247L92448L65596
39752H0801762L05384K04269O0022j21246l25026n31189p19364q75475r95870
39743G7803267j085711j152832j202277j235194j251179j251077j239092j223749
39735F8162156j216540j227635j261044j312758j372650j427859j465508j474627
39727E7403535j447594j380775j274409j132965r66746p93251o35410n15328m45590
39718D8811467m23012m29457m40553m37770m16428l84737l55619l38380l36639
39709D5248872l52582l91590m61632n67715p06873q67926j034766j189054j310890
39700C8365844j380378j382671j314375j185671j015145q20692o13285l97139
$$ plain form
39692 30256488 30082349 30134161 30406695 30881876 31525952 32291351 33124366 33975461 34806528
39683 34806528 35591804 36314361 36962524 37528778 38010176 38408120 38726928 38972819 39154473
39674 39154473 39283694 39373325 39432388 39462659 39461150 39427931 39373805 39322911 39309715 39373169 39550617
39663 39550617 39872379 40356950 41006795 41805368 42716999 43691204 44670987 45602101 46440042
39654 46440042 47153596 47725828 48153930 48449136 48637345 48759431 48868337 49020545 49263715
39645 49263715 49626305 50114480 50716645 51411354 52173829 52978660 53798631 54601076 55344827
39636 55344827 55981882 56466011 56765232 56871133 56799627 56583818 56263936 55878610 55458332
39627 55458332 55020428 54565643 54077705 53527495 52882365 52118369 51230068 50232494 49154494
$$ packed form
39692C0256488j74139N1812K72534M75181O44076P65399Q33015Q51095Q31067
39683C4806528P85276P22557O48163N66254M81398L97944L18808K45891J81654
39674C9154473J29221Q9631N9063L0271j509l3219n4126n0894j3196O3454J77448
39663C9550617L21762M84571O49845P98573R11631R74205R79783R31114Q37941
39654D6440042P13554N72232M28102K95206J88209J22086J08906J52208K43170
39645D9263715L62590M88175O02165O94709P62475Q04831Q19971Q02445P43751
39636E5344827O37055M84129K99221J05901p1506k15809l19882l85326m20278
39627E5458332m37904m54785m87938n50210o45130p63996q88301r97574j078000
$$ plain form
39618 49154494 48028789 46885753 45753875 44663892 43651101 42752396 41999401 41412525
39610 41412525 41000309 40764048 40703550 40819714 41112613 41576424 42193393 42929359 43733948
39601 43733948 44547514 45313712 45993305 46573661 47069477 47512724 47934117 48343210 48716393
39592 48716393 48998598 49117851 49006325 48620105 47951443 47030437 45916645 44684259 43405796
39583 43405796 42138502 40915879 39745194 38610978 37483524 36330000 35124606 33854310
39575 33854310 32518772 31126014 29687322 28215138 26725784 25245607 23815887 22491195
39567 22491195 21329236 20375649 19650955 19146300 18830237 18662703 18607937 18638591 18729599 18848163
39557 18848163 18949094 18980346 18896518 18673588 18318345 17868766 17385569 16938629 16593359 16400356
$$ packed form
39618D9154494j125705j143036j131878j089983j012791q98705p52995n86876
39610D1412525m12216k36261o0498J16164K92899M63811O16969P35966Q04589
39601D3733948Q13566P66198O79593N80356M95816M43247M21393M09093L73183
39592D8716393K82205J19253j11526l86220o68662r21006j113792j232386j278463
39583D3405796j267294j222623j170685j134216j127454j153524j205394j270296
39575C3854310j335538j392758j438692j472184j489354j480177j429720j324692
39567B2491195j161959r53587p24694n04655l16063j67534n4766L0654R1008J18564
39557A8848163J00931L1252q3828k22930l55243m49579m83197m46940l45270j93003
$$ plain form
39547 16400356 16388380 16559295 16885470 17312883 17772941 18200973 18553308 18813878 18988098
39538 18988098 19090315 19133304 19123281 19059092 18934766 18746298 18500861 18221863 17944103 17700593
39528 17700593 17508963 17364612 17242459 17105297 16915664 16647558 16293502 15864119 15382020
39519 15382020 14875829 14378772 13929989 13571925 13339998 13249327 13288590 13426721 13628110 13866592
39509 13866592 14132034 14430113 14778741 15203011 15729200 16378838 17164087 18084222 19122012
39500 19122012 20240446 21382840 22479597 23461303 24273421 24886529 25299190 25535014 25637131
39491 25637131 25661808 25671392 25727193 25883708 26184511 26658674 27317387 28152676 29140601 30248654
39481 30248654 31444140 32699583 33992374 35298655 36585210 37806151 38909480 39851326
$$ packed form
39547A6400356j1976J70915L26175M27413M60058M28032L52335K60570J74220
39538A8988098J02217M2989j0023o4189j24326j88468k45437k78998k77760k43510
39528A7700593j91630j44351j22153j37162j89633k68106l54056m29383m82099
39519A5382020n06191m97057m48783l58064k31927r0671L9263J38131K01389K38482
39509A3866592K65442K98079L48628M24270N26189O49638P85249R20135J037790
39500A9122012J118434J142394J096757R81706Q12118O13108M12661K35824J02117
39491B5637131K4677R584N5801J56515L00803M74163O58713Q35289R87925J108053
39481C0248654J195486J255443J292791J306281J286555J220941J103329R41846
$$ plain form
39473 39851326 40608914 41183531 41591854 41851440 41968423 41933278 41726436 41331222 40747991
39464 40747991 40002774 39147220 38251215 37391423 36637838 36039336 35610811 35326879 35126758
39455 35126758 34930749 34662749 34269685 33730300 33051459 32256748 31374849 30432865 29454886
39446 29454886 28463136 27479465 26526864 25630974 24820291 24123526 23564905 23160917 22921571
39437 22921571 22855219 22971991 23281280 23783853 24464421 25290467 26217461 27195132 28170297
39428 28170297 29087830 29895114 30551723 31039594 31366852 31563059 31669117 31726606 31769472 31819114
39418 31819114 31882983 31956467 32027410 32082235 32112168 32117457 32107840 32099197 32107647 32142855 32202512 32270375
39406 32270375 32319394 32318716 32240952 32066222 31781949 31380144 30855548 30208074 29450144 28614903
$$ packed form
39473C9851326P57588N74617M08323K59586J16983l5145k06842l95214n83231
39464D0747991p45217q55554q96005q59792p53585n98502m28525k83932k00121
39455C5126758j96009k68000l93064n39385o78841p94711q81899r41984r77979
39446B9454886r91750r83671r52601q95890q10683o96765n58621m03988k39346
39437B2921571o6352J16772L09289N02573O80568Q26046R26994R77671R75165
39428B8170297R17533Q07284O56609M87871L27258J96207J06058N7489M2866M9642
39418C1819114O3869P3484P0943N4825K9933N289r617q643Q450L5208N9657O7863
39406C2270375M9019o78p7764j74730k84273m01805n24596o47474p57930q35241
$$ plain form
39396 28614903 27758667 26953596 26272113 25768576 25464574 25343598 25358437 25448836 25560779 25657955
39386 25657955 25722170 25746494 25726876 25655786 25519730 25302205 24992089 24593546 24131013 23645052
39376 23645052 23180896 22776494 22456258 22231022 22099630 22048491 22050879 22070878 22073086 22032474
39366 22032474 21936929 21780781 21555451 21246086 20837994 20328568 19735860 19097496 18460681
39357 18460681 17869382 17354920 16932165 16599703 16341668 16130987 15935873 15730010 15502817
39348 15502817 15263601 15036268 14847926 14718254 14654255 14650389 14691969 14760335 14838344 14914063
39338 14914063 14981233 15037119 15079327 15102528 15095628 15041140 14918543 14711164 14413255 14033888
39328 14033888 13596693 13136583 12694435 12309883 12013030 11817763 11720138 11702906 11743641 11822127
$$ packed form
39396B8614903q56236q05071o81483n03537l04002j20976J4839R0399J11943R7176
39386B5657955O4215K4324j9618p1090j36056k17525l10116l98543m62533m85961
39376B3645052m64156m04402l20236k25236j31392n1139K388J9999K208m0612
39366B2032474r5545j56148k25330l09365m08092n09426n92708o38364o36815
39357A8460681n91299n14462m22755l32462k58035k10681j95114k05863k27193
39348A5502817k39216k27333j88342j29672o3999l866M1580O8366P8009P5719
39338A4914063O7170N5886M2208K3201o900n4488j22597k07379k97909l79367
39328A4033888m37195m60110m42148l84552k96853j95267r7625j7232M0735P8486
$$ plain form
39318 11822127 11924420 12043826 12180063 12337137 12519842 12729548 12960798 13200365 13430217
39309 13430217 13634811 13810428 13970583 14141423 14347359 14596016 14874068 15157646 15429399
39300 15429399 15689936 15957620 16260233 16625555 17074726 17618283 18254032 18966895 19730516
39291 19730516 20509444 21261193 21939005 22496752 22896330 23116195 23158264 23049796 22838390
39282 22838390 22581753 22337190 22155015 22075825 22128163 22323847 22652291 23078162 23546188 23993318
39272 23993318 24364238 24624216 24764475 24799161 24756814 24671121 24574563 24495587 24457144 24474196
39262 24474196 24550400 24676914 24835869 25007270 25174614 25324931 25443263 25506162 25479919 25326215
39252 25326215 25012872 24524198 23866010 23063886 22156600 21188076 20200866 19232779 18316255
$$ packed form
39318A1822127J02293J19406J36237J57074J82705K09706K31250K39567K29852
39309A3430217K04594J75617J60155J70840K05936K48657K78052K83578K71753
39300A5429399K60537K67684L02613L65322M49171N43557O35749P12863P63621
39291A9730516P78928P51749O77812N57747L99578K19865M2069j08468k11406
39282B2838390k56637k44563j82175p9190N2338J95684L28444M25871M68026M47130
39272B3993318L70920K59978J40259L4686m2347q5693r6558p8976l8443J7052
39262B4474196P6204J26514J58955J71401J67344J50317J18332O2899k6243j53704
39252B5326215l13343m88674o58188q02124r07286r68524r87210r68087r16524
$$ plain form
39243 18316255 17478214 16738457 16107471 15586583 15171631 14857135 14636784 14499846 14427474
39234 14427474 14392554 14362730 14304235 14186005 13985360 13694369 13322457 12891240 12423103 11930375
39224 11930375 11412146 10860311 10269938 9646298 9003564 8356349 7710055 7056039 6373458
39215 6373458 5635550 4817110 3901851 2890050 1805949 701554 -347940 -1258514 -1956293
39206 -1956293 -2392168 -2546318 -2424365 -2050781 -1462914 -704947 179381 1153939 2194576
39197 2194576 3289165 4433282 5622137 6840437 8054198 9209882 10244007 11100668
39189 11100668 11749052 12192415 12465161 12621464 12721849 12821678 12962133 13163733 13424136
39180 13424136 13721670 14023168 14292338 14496073 14609194 14619403 14532265 14373032 14181856 14002376
$$ packed form
39243A8316255q38041p39757o30986n20888m14952l14496k20351j36938p2372
39234A4427474l4920k9824n8495j18230k00645k90991l71912m31217m68137m92728
39224A1930375n18229n51835n90373o23640o42734o47215o46294o54016o82581
39215F373458p37908q18440r15259j011801j084101j104395j049494r10574o97779
39206a956293m35875j54150J21953L73584N87867P57967Q84328R74558J040637
39197B194576J094589J144117J188855J218300J213761J155684J034125Q56661
39189A1100668O48384M43363K72746J56303J00385R9829J40455K01600K60403
39180A3424136K97534L01498K69170K03735J13121J0209q7138j59233j91176j79480
$$ plain form
39170 14002376 13867956 13791066 13758763 13734476 13665934 13499189 13196268 12749835 12187269 11561100
39160 11561100 10930175 10340737 9816092 9358484 8960369 8617943 8339599 8145702 8061160
39151 8061160 8105621 8286153 8594081 9004407 9475722 9951367 10365092 10652803 10767238 10689123
39141 10689123 10429780 10024994 9523905 8977913 8432688 7923601 7473280 7090810 6773520
39132 6773520 6511708 6294018 6109538 5945061 5780916 5591756 5356275 5072733 4770463
39123 4770463 4506970 4348127 4340545 4491891 4770862 5126113 5511710 5903988 6302067 6715417
39113 6715417 7148510 7591186 8017332 8389431 8665303 8804642 8774304 8552202 8130253 7517056
39103 7517056 6740335 5848174 4907401 3997988 3203617 2599936 2242768 2158809 2341235 2752013
$$ packed form
39170A4002376j34420p6890l2303k4287o8542j66745l02921m46433n62566o26169
39160A1561100o30925n89438n24645m57608l98115l42426k78344j93897q4542
39151H061160M4461J80532L07928M10326M71315M75645M13725K87711J14435p8115
39141A0689123k59343m04786n01089n45992n45225n09087m50321l82470l17290
39132F773520k61812k17690j84480j64477j64145j89160k35481k83542l02270
39123D770463k63493j58843p582J51346K78971L55251L85597L92278L98079M13350
39113F715417M33093M42676M26146L72099K75872J39339l0338k22102m21949o13197
39103G517056p76721q92161r40773r09413p94371o03681l57168q3959J82426M10778
$$ plain form
39093 2752013 3330575 4005607 4705112 5361659 5913695 6306668 6497042 6459189 6192029 5722030
39083 5722030 5101025 4399604 3697372 3070997 2581828 2266441 2133430 2166808 2333085 2588688
39073 2588688 2885827 3176298 3413751 3556974 3577538 3471694 3270001 3035388 2845824 2767583
39063 2767583 2831892 3026204 3302978 3599065 3854224 4021076 4067388 3977158 3754950 3430856
39053 3430856 3058772 2703334 2419058 2232383 2136608 2100806 2084873 2051503 1972354 1831157
39043 1831157 1625796 1367733 1077063 775565 482746 217446 2360 -134387 -164846 -72798
39033 -72798 135359 428128 758151 1079430 1363750 1607778 1827537 2044518 2272456 2512204
39023 2512204 2754795 2986818 3192673 3354192 3452384 3474427 3423456 3324821 3223891 3175535
$$ packed form
39093B752013N78562O75032O99505O56547N52036L92973J90374l7853k67160m69999
39083E722030o21005p01421p02232o26375m89169l15387j33011L3378J66277K55603
39073B588688K97139K90471K37453J43223K0564j05844k01693k34613j89564p8241
39063B767583O4309J94312K76774K96087K55159J66852M6312r0230k22208l24094
39053C430856l72084l55438k84276j86675r5775l5802j5933l3370p9149j41197
39043A831157k05361k58063k90670l01498k92819k65300k15086j36747l0459R2048
39033g2798K08157K92769L30023L21279K84320K44028K19759K16981K27938K39748
39023B512204K42591K32023K05855J61519R8192K2043n0971r8635j00930m8356
$$ plain form
39013 3175535 3229481 3416197 3735970 4153519 4601993 4999503 5275738 5398602 5388455 5313042
39003 5313042 5266041 5338993 5596867 6063093 6715585 7493209 8310840 9078549 9718221 10172914
38993 10172914 10409777 10420723 10222573 9854245 9368878 8823201 8269422 7752799 7313385
38984 7313385 6987603 6805891 6786334 6928284 7210968 7598364 8046473 8508369 8936268 9283575
38974 9283575 9508989 9581555 9484272 9215197 8786506 8222002 7553265 6814799 6039279 5254310
38964 5254310 4481259 3735131 3023536 2344314 1683900 1019173 323429 -425088 -1233795
38955 -1233795 -2087507 -2945231 -3746586 -4427835 -4940280 -5261831 -5398326 -5378276 -5245481 -5050526
38945 -5050526 -4841094 -4653735 -4510901 -4423395 -4394449 -4422093 -4500027 -4618802 -4767705 -4936191
$$ packed form
39013C175535N3946J86716L19773M17549M48474L97510K76235J22864j0147p5413
39003E313042m7001P2952K57874M66226O52492P77624Q17631P67709O39672M54693
38993A0172914K36863J0946j98150l68328m85367n45677n53779n16623m39414
38984G313385l25782j81712j9557J41950K82684L87396M48109M61896M27899L47307
38974I283575K25414P2566r7283k69075m28691n64504o68737p38466p75520p84969
38964E254310p73051p46128p11595o79222o60414o64727o95744p48517q08707
38955a233795q53712q57724q01355o81249n12445l21551j36495K0050J32795J94955
38945e050526K09432J87359J42834Q7506K8946k7644p7934j18775j48903j68486
$$ plain form
38935 -4936191 -5114348 -5293170 -5466058 -5632150 -5799969 -5987429 -6214582 -6490404 -6801077
38926 -6801077 -7107913 -7356848 -7494416 -7483131 -7311747 -6998352 -6585411 -6127743 -5677576 -5272926
38916 -5272926 -4933943 -4667181 -4472711 -4347645 -4283449 -4260607 -4247112 -4204224 -4097455 -3907497
38906 -3907497 -3636172 -3304416 -2942472 -2576550 -2218921 -1866420 -1506683 -1126802 -718927
38897 -718927 -280613 188558 690692 1230749 1814457 2444090 3113671 3805337 4489448 5130320
38887 5130320 5695545 6163122 6522064 6767980 6898811 6913965 6816207 6614373 6325408 5974208
38877 5974208 5589998 5200223 4825071 4474817 4149610 3840797 3534654 3219795 2896457
38868 2896457 2582295 2309148 2109690 1999729 1966344 1970062 1960727 1897992 1765695 1575702
$$ packed form
38935d936191j78157j78822j72888j66092j67819j87460k27153k75822l10673
38926f801077l06836k48935j37568J1285J71384L13395M12941M57668M50167M04650
38916e272926L38983K66762J94470J25066O4196K2842J3495M2888J06769J89958
38906c907497K71325L31756L61944L65922L57629L52501L59737L79881M07875
38897g18927M38314M69171N02134N40057N83708O29633O69581O91666O84111O40872
38887E130320N65225M67577L58942K45916J30831J5154r7758k01834k88965l51200
38877E974208l84210l89775l75152l50254l25207l08813l06143l14859l23338
38868B896457l14162k73147j99458j09961l3385L718r335o2735j32297j89993
$$ plain form
38858 1575702 1364155 1184562 1098542 1162708 1412646 1849232 2432836 3086604 3706032 4172575
38848 4172575 4371766 4215655 3664307 2737588 1511359 99573 -1370557 -2782307 -4046237
38839 -4046237 -5107152 -5941412 -6548097 -6939403 -7134699 -7159348 -7045573 -6831408 -6555967
38830 -6555967 -6253125 -5947185 -5651484 -5367827 -5085188 -4780013 -4422174 -3987049 -3468454
38821 -3468454 -2885221 -2278005 -1699191 -1202023 -833154 -628177 -607146 -769666 -1093318 -1539440
38811 -1539440 -2065143 -2634875 -3224763 -3818422 -4398855 -4943030 -5423192 -5814261 -6102902
38802 -6102902 -6293018 -6404667 -6466963 -6508043 -6545978 -6583986 -6611596 -6610946 -6565206 -6465746 -6315764
38791 -6315764 -6129482 -5927462 -5730266 -5553360 -5404306 -5280619 -5167064 -5034770 -4846445
$$ packed form
38858A575702k11547j79593q6020O4166K49938M36586N83604O53768O19428M66543
38848D172575J99191j56111n51348r26719j226229j411786j470130j411750j263930
38839d046237j060915q34260o06685l91306j95296k4649J13775K14165K75441
38830f555967L02842L05940K95701K83657K82639L05175L57839M35125N18595
38821c468454N83233O07216N78814M97168L68869K04977K1031j62520l23652m46122
38811a539440n25703n69732n89888n93659n80433n44175m80162l91069k88641
38802f102902j90116j11649o2296m1080l7935l8008k7610O50M5740R9460J49982
38791f315764J86282K02020J97196J76906J49054J23687J13555J32294J88325
$$ plain form
38782 -4846445 -4568280 -4183226 -3698568 -3144312 -2563304 -1996321 -1466910 -972463 -486984
38773 -486984 24976 590916 1219133 1898458 2606627 3320784 4023723 4702761 5343131 5921842
38763 5921842 6408104 6771489 6992882 7071323 7023497 6877627 6665439 6414829 6145087 5866551
38753 5866551 5585134 5308569 5049210 4820824 4631913 4480326 4351639 4220825 4056066
38744 4056066 3824459 3499127 3066166 2529455 1912364 1256056 614014 42163 -414355
38735 -414355 -733629 -922370 -1010269 -1035672 -1030119 -1008451 -966213 -882998 -730736 -485575 -138432
38724 -138432 302131 815857 1379395 1970537 2567218 3145495 3679848 4145723 4523489 4803362
38714 4803362 4989388 5098432 5152052 5164954 5137682 5058436 4911761 4687306 4383821 4009284
$$ packed form
38782d846445K78165L85054M84658N54256N81008N66983N29411M94447M85479
38773d86984N11960N65940O28217O79325P08169P14157P02939O79038O40370N78711
38763E921842M86262L63385K21393P8441m7826j45870k12188k50610k69742k78536
38753E866551k81417k76565k59359k28386j88911j51587j28687j30814j64759
38744D056066k31607l25332m32961n36711o17091o56308o42042n71851m56518
38735d14355l19274j88741q7899k5403N553K1668M2238Q3215J52262K45161L47143
38724a38432M40563N13726N63538N91142N96681N78277N34353M65875L77766K79873
38714D803362J86026J09044N3620J2902k7272p9246j46675k24455l03485l74537
$$ plain form
38704 4009284 3580765 3125012 2677045 2274477 1949363 1721839 1598117 1572025 1627930 1743970
38694 1743970 1896079 2063602 2235950 2417282 2625525 2885049 3216948 3632485 4131828
38685 4131828 4705732 5336496 5996442 6644964 7227458 7680301 7943489 7976915 7772321 7355064
38675 7355064 6776300 6100375 5391574 4702090 4063017 3481347 2945149 2435474 1939335
38666 1939335 1456878 999267 580016 207024 -118844 -398977 -631593 -810771 -929997
38657 -929997 -986250 -980931 -917136 -795580 -612026 -358247 -26999 380573 848741 1345993
38647 1345993 1830240 2258381 2596561 2827633 2953460 2991197 2965402 2900518 2817593 2735154
38637 2735154 2670538 2638828 2649884 2705533 2797781 2907554 3004197 3047278 2992156 2798945 2442498
$$ packed form
38704D009284m28519m55753m47967m02568l25114k27524j23722k6092N5905J16040
38694A743970J52109J67523J72348J81332K08243K59524L31899M15537M99343
38685D131828N73904O30764O59946O48522N82494M52843K63188L3426k04594m17257
38675G355064n78764o75925p08801o89484o39073n81670n36198n09675m96139
38666A939335m82457m57611m19251l72992l25868k80133k32616j79178j19226
38657i29997n6253N319O3795J21556J83554K53779L31248M07572M68168M97252
38647A345993M84247M28141L38180K31072J25827L7737k5795o4884q2925q2439
38637B735154o4616l1710J1056N5649R2248J09773R6643M3081n5122j93211l56447
$$ plain form
38626 2442498 1920050 1253946 488915 -314958 -1092137 -1783199 -2345968 -2762519 -3038603
38617 -3038603 -3195225 -3256390 -3238979 -3149129 -2985513 -2746119 -2433622 -2055966 -1621983 -1135025
38607 -1135025 -589031 29420 732812 1522118 2379689 3269037 4140634 4940578 5620046
38598 5620046 6144509 6500821 6699240 6769042 6749735 6681314 6595654 6509827 6422898 6318865
38588 6318865 6176536 5982669 5741717 5476744 5220674 5001347 4826746 4677673 4513461
38579 4513461 4290566 3985986 3613378 3223529 2889903 2687125 2671075 2865942 3260219 3811459
38569 3811459 4457499 5129810 5764390 6308174 6722109 6983239 7086450 7044231 6882437 6632502
38559 6632502 6323540 5978205 5613291 5242554 4878280 4530357 4204333 3900748 3617135
$$ packed form
38626B442498n22448o66104p65031q03873p77179o91062n62769m16551k76084
38617c038603j56622o1165J7411Q9850J63616K39394L12497L77656M33983M86958
38607a135025N45994O18451P03392P89306Q57571Q89348Q71597P99944O79468
38598E620046N24463L56312J98419O9802j9307o8421q5660q5827q6929j04033
38588F318865j42329j93867k40952k64973k56070k19327j74601j49073j64212
38579D513461k22895l04580l72608l89849l33626k02778j6050J94867L94277N51240
38569C811459O46040O72311O34580N43784M13935K61130J03211m2219j61794k49935
38559F632502l08962l45335l64914l70737l64274l47923l26024l03585k83613
$$ plain form
38550 3617135 3352316 3110828 2904161 2746907 2649778 2614738 2636150 2706511 2820968 2975984
38540 2975984 3162639 3359976 3534524 3648464 3673065 3600001 3444291 3238025 3019148 2820914
38530 2820914 2665706 2564161 2517964 2522917 2569584 2642194 2718980 2775459 2788983 2742860 2630762
38519 2630762 2461956 2264057 2078721 1950294 1913123 1983489 2157513 2413168 2714881 3020561
38509 3020561 3290327 3494800 3620284 3668747 3652019 3581892 3460264 3274758 3003728 2629921
38499 2629921 2155993 1611936 1047934 515416 46817 -355060 -713810 -1065857 -1444410
38490 -1444410 -1868312 -2339180 -2845191 -3366504 -3878356 -4351603 -4753922 -5054875 -5234906
38481 -5234906 -5294185 -5255312 -5156685 -5039168 -4932949 -4850727 -4788987 -4734775 -4673432 -4593456 -4487693
$$ packed form
38550C617135k64819k41488k06667j57254r7129l5040K1412P0361J14457J55016
38540B975984J86655J97337J74548J13940K4601p3064j55710k06266k18877j98234
38530B820914j55208j01545m6197M953M6667P2610P6786N6479J3524m6123j12098
38519B630762j68806j97899j85336j28427l7171P0366J74024K55655L01713L05680
38509C020561K69766K04473J25484M8463j6728p0127j21628j85506k71030l73807
38499B629921m73928n44057n64002n32518m68599m01877l58750l52047l78553
38490a444410m23902m70868n06011n21313n11852m73247m02319l00953j80031
38481e234906n9279L8873R8627J17517J06219Q2222O1740N4212O1343P9976J05763
$$ plain form
38470 -4487693 -4353259 -4192875 -4017200 -3845214 -3700952 -3607674 -3581432 -3625577 -3728234 -3864631
38460 -3864631 -4003024 -4109730 -4150612 -4091617 -3902293 -3561673 -3062160 -2409237 -1619083 -716625
38450 -716625 265919 1290747 2316033 3297022 4187987 4946472 5539114 5946651 6166142
38441 6166142 6210007 6102413 5874279 5558696 5188075 4792719 4399445 4029627 3697685 3411074
38431 3411074 3171104 2972866 2804530 2649062 2490704 2323562 2155467 2002960 1880812
38422 1880812 1794285 1739414 1709481 1701402 1717070 1759306 1825884 1905698 1979471 2025660 2031231 2004383
38410 2004383 1982057 2023972 2192016 2525235 3024742 3655016 4356600 5061227 5704808 6238146
38400 6238146 6635086 6895695 7042531 7110696 7135492 7143119 7148924 7163127 7198226 7270727 7394989
$$ packed form
38470d487693J34434J60384J75675J71986J44262R3278K6242m4145j02657j36397
38460c864631j38393j06706m0882N8995J89324L40620M99513O52923P90154R02458
38450g16625R82544J024828J025286R80989Q90965P58485N92642M07537K19491
38441F166142M3865j07594k28134l15583l70621l95356l93274l69818l31942k86611
38431C411074k39970j98238j68336j55468j58358j67142j68095j52507j22148
38422A880812q6527n4871k9933q079J5668M2236O6578P9814P3773M6189N571k6848
38410B004383k2326M1915J68044L33219M99507O30274P01584P04627O43581N33338
38400F238146L96940K60609J46836O8165K4796P627N805J4203L5099P2501J24262
$$ plain form
38389 7394989 7574561 7799219 8051090 8315269 8586225 8864655 9147141 9416576 9640634
38380 9640634 9779597 9798734 9678239 9416458 9026896 8532516 7960460 7337972 6688924 6030795
38370 6030795 5373129 4718770 4068348 3426608 2807194 2232605 1729228 1321202 1026976
38361 1026976 858931 823630 921342 1145548 1482872 1912600 2405656 2925053 3430010 3883246
38351 3883246 4258248 4543123 4739676 4859015 4916493 4928180 4908863 4870197 4818781 4755722
38341 4755722 4679129 4588584 4488369 4385994 4285407 4178722 4043475 3849743 3573921 3210253
38331 3210253 2773513 2293572 1806988 1349076 946698 611868 338138 102555 -125559
38322 -125559 -370741 -637439 -902631 -1119388 -1230593 -1187236 -964165 -567324 -29722 601950
$$ packed form
38389G394989J79572K24658K51871K64179K70956K78430K82486K69435K24058
38380I640634J38963J9137j20495k61781l89562m94380n72056o22488o49048o58129
38370F030795o57666o54359o50422o41740o19414n74589n03377m08026k94226
38361A026976j68045l5301R7712K24206L37324M29728M93056N19397N04957M53236
38351C883246L75002K84875J96553J19339N7478J1687j9317l8666n1416o3059
38341D755722p6593r0545j00215j02375j00587j06685j35247j93732k75822l63668
38331C210253m36740m79941m86584m57912m02378l34830k73730k35583k28114
38322a25559k45182k66698k65192k16757j11205M3357K23071L96841N37602O31672
$$ plain form
38312 601950 1283617 1985286 2692963 3401177 4100271 4765187 5352727 5810561 6094177 6182822
38302 6182822 6086595 5842535 5502660 5118840 4729467 4352151 3984275 3609285 3204339 2746904
38292 2746904 2221716 1629874 997059 373413 -179579 -610411 -895061 -1041492 -1081562 -1057468
38282 -1057468 -1009243 -965840 -940514 -930915 -922816 -894457 -818832 -664085 -394643 24400 619175
38271 619175 1397433 2341552 3407711 4531807 5639622 6658230 7526838 8205584 8680108
38262 8680108 8960253 9073936 9059522 8959217 8813526 8655860 8508056 8379190 8268871 8172751
38252 8172751 8086168 8003856 7917753 7816500 7687780 7521175 7308961 7045287 6726767 6356231
38242 6356231 5947464 5526346 5125757 4776257 4497785 4296508 4167045 4097265 4072527 4078008
$$ packed form
38312F01950O81667P01669P07677P08214O99094O64916N87540M57834K83616Q8645
38302F182822r6227k44060l39875l83820l89373l77316l67876l74990m04946m57435
38292B746904n25188n91842o32815o23646n52992m30832k84650j46431m0070K4094
38282a057468M8225M3403K5326R599Q099K8359P5625J54747K69442M19043N94775
38271F19175P78258R44119J066159J124096J107815J018608Q68608O78746M74524
38262H680108K80145J13683j4414j00305j45691j57666j47804j28866j10319r6120
38252H172751q6583q2312q6103j01253j28720j66605k12214k63674l18520l70536
38242F356231m08767m21118m00589l49500k78472k01277j29463o9780k4738N481
$$ plain form
38232 4078008 4099699 4125759 4149488 4173405 4211592 4286963 4422465 4629161 4896910 5192968
38222 5192968 5470307 5682482 5798862 5814216 5749896 5647128 5555075 5517511 5562537 5698952
38212 5698952 5919839 6210398 6555158 6940400 7350810 7763459 8145042 8456837 8666104
38203 8666104 8756904 8733279 8613701 8422263 8182854 7917343 7643975 7373264 7104213 6826213
38193 6826213 6527571 6205134 5868690 5539525 5247402 5028727 4924031 4971657 5197799 5606775
38183 5606775 6176197 6860076 7599863 8339545 9037998 9672973 10236310 10725042 11133894
38174 11133894 11452062 11664538 11757096 11722901 11567094 11305828 10960021 10548623 10087118 9592253
38164 9592253 9088323 8608861 8191106 7865318 7643611 7513175 7437369 7364866 7243214 7031480
$$ packed form
38232D078008K1691K6060K3729K3917L8187P5371J35502K06696K67749K96058
38222E192968K77339K12175J16380J5354o4320j02768r2053l7564M5026J36415
38212E698952K20887K90559L44760L85242M10410M12649L81583L11795K09267
38203H666104R0800k3625j19578j91438k39409k65511k73368k70711k69051k78000
38193F826213k98642l22437l36444l29165k92123k18675j04696M7626K26142M08976
38183E606775N69422O83879P39787P39682O98453O34975N63337M88732M08852
38174A1133894L18168K12476R2558l4195j55807k61266l45807m11398m61505m94865
38164I592253n03930m79462m17755l25788k21707j30436p5806p2503j21652k11734
$$ plain form
38154 7031480 6708515 6275840 5754502 5175499 4566550 3942109 3302946 2644972 1970452
38145 1970452 1294602 645475 59311 -425912 -777334 -973286 -1006769 -884809 -624374 -248088
38135 -248088 216882 736600 1268716 1765964 2185187 2496881 2688923 2762224 2722196 2572912
38125 2572912 2318620 1971272 1557323 1116513 690810 309420 -20377 -310487 -579687
38116 -579687 -840543 -1093760 -1331573 -1544895 -1727248 -1872737 -1971420 -2008096 -1967541 -1843525
38106 -1843525 -1645345 -1396933 -1128176 -862519 -607082 -350879 -73448 239700 583549
38097 583549 930596 1240339 1474577 1608850 1634644 1554246 1374108 1101259 743049 307643
38087 307643 -196659 -762260 -1380954 -2040512 -2722439 -3403889 -4062680 -4681285 -5247215 -5751284
$$ packed form
38154G031480l22965m32675n21338n79003o08949o24441o39163o57974o74520
38145A970452o75850o49127n86164m85223l51422j95952l3483J21960K60435L76286
38135b48088M64970N19718N32116M97248M19223L11694J92042P3301m0028j49284
38125B572912k54292l47348m13949m40810m25703l81390l29797k90110k69200
38116e79687k60856k53217k37813k13322j82353j45489r8683l6676M0555J24016
38106a843525J98180K48412K68757K65657K55437K56203K77431L13148L43849
38097E83549L47047L09743K34238J34273K5794q0398j80138k72849l58210m35406
38087C07643n04302n65601o18694o59558o81927o81450o58791o18605n65930n04069
$$ plain form
38077 -5751284 -6187010 -6552191 -6850440 -7089931 -7279038 -7421490 -7514469 -7550868 -7523579 -7428270
38067 -7428270 -7262672 -7023517 -6704113 -6295070 -5788455 -5183287 -4488980 -3724604 -2914978
38058 -2914978 -2086896 -1267772 -485489 233494 868415 1407892 1849397 2194358 2442752
38049 2442752 2591353 2636525 2578868 2426702 2197360 1916970 1619077 1341734 1122931 994973
38039 994973 978755 1078876 1281334 1556209 1866176 2178112 2472571 2747184 3013933 3293082
38029 3293082 3606396 3970680 4392169 4863351 5364678 5871677 6364089 6831160 7269512
38020 7269512 7675725 8039624 8342567 8560388 8668084 8644587 8477770 8169006 7734392 7200087
38010 7200087 6593247 5934462 5237346 4515213 3788313 3084189 2429681 1840493 1316391
$$ packed form
38077e751284m35726l65181k98249k39491j89107j42452r2979l6399K7289R5309
38067g428270J65598K39155L19404M09043N06615O05168O94307P64376Q09626
38058b914978Q28082Q19124P82283P18983O34921N39477M41505L44961K48394
38049B442752J48601M5172n7657j52166k29342k80390k97893k77343k18803j27958
38039I94973j6218J00121K02458K74875L09967L11936K94459K74613K66749K79149
38029C293082L13314L64284M21489M71182N01327N06999M92412M67071M38352
38020G269512M06213L63899L02943K17821J07696k3497j66817l08764m34614n34305
38010G200087o06840o58785o97116p22133p26900p04124o54508n89188n24102
$$ plain form
38001 1316391 845612 415181 19882 -336388 -648025 -918342 -1164474 -1410979 -1675056
37992 -1675056 -1953000 -2216433 -2419537 -2511832 -2449790 -2204167 -1764551 -1144042 -384322 443217
37982 443217 1246102 1930432 2425391 2702358 2781031 2721382 2605313 2513993 2507277 2611707
37972 2611707 2821450 3110870 3450568 3816510 4187807 4538331 4831895 5026211 5082975 4977651
37962 4977651 4704585 4276324 3718150 3060307 2331491 1555882 752570 -65190 -891230
37953 -891230 -1725733 -2570831 -3424289 -4275606 -5108164 -5907471 -6670539 -7408699 -8139589 -8872606
37943 -8872606 -9598291 -10288838 -10907510 -11418602 -11792252 -12005506 -12044844 -11912714 -11634482 -11258784
37933 -11258784 -10847530 -10459857 -10139179 -9908666 -9772240 -9715273 -9704542 -9692585 -9629363 -9476409
$$ packed form
38001A316391m70779m30431l95299l56270l11637k70317k46132k46505k64077
37992a675056k77944k63433k03104r2295O2042K45623M39616O20509P59720Q27539
37982D43217Q02885O84330M94959K76967P8673n9649j16069r1320o716J04430
37972B611707K09743K89420L39698L65942L71297L50524K93564J94316N6764j05324
37962D977651k73066m28261n58174o57843p28816p75609q03312q17760q26040
37953h91230q34503q45098q53458q51317q32558p99307p63068p38160p30890p33017
37943h872606p25685o90547o18672n11092l73650k13254l9338J32130K78232L75698
37933a1258784M11254L87673L20678K30513J36426N6967J0731J1957O3222J52954
$$ plain form
37923 -9476409 -9214862 -8843404 -8370065 -7805259 -7160344 -6450340 -5696470 -4925666 -4167408
37914 -4167408 -3449838 -2796274 -2222309 -1734319 -1330832 -1006893 -759117 -588136 -497235 -488492
37904 -488492 -558655 -696010 -878865 -1076632 -1254759 -1383066 -1444491 -1440133 -1388362 -1318780 -1263308
37893 -1263308 -1246451 -1276835 -1343211 -1417828 -1466620 -1461032 -1384854 -1233091 -1005924 -704042 -329470
37882 -329470 109437 593399 1091316 1562915 1963720 2252411 2400474 2401134 2272568 2052993
37872 2052993 1790017 1528624 1300754 1118202 971007 832743 670778 456479 171236
37863 171236 -192122 -630330 -1131059 -1673713 -2229454 -2761041 -3224646 -3576292 -3783132 -3835319
37853 -3835319 -3751609 -3574394 -3356290 -3145943 -2980609 -2887456 -2889174 -3007269 -3259465 -3652549
$$ packed form
37923i476409K61547L71458M73339N64806O44915P10004P53870P70804P58258
37914d167408P17570O53564N73965M87990M03487L23939K47776J70981R0901Q743
37904d88492p0163j37355j82855j97767j78127j28307o1425M358N1771O9582N5472
37893a263308J6857l0384o6376p4617m8792N588P6178J51763K27167L01882L74572
37882c29470M38907M83962M97917M71599M00805K88691J48063O60j28566k19575
37872B052993k62976k61393k27870j82552j47195j38264j61965k14299k85243
37863A71236l63358m38208n00729n42654n55741n31587m63605l51646k06840n2187
37853c835319Q3710J77215K18104K10347J65334R3153j718j18095k52196l93084
$$ plain form
37843 -3652549 -4175351 -4796627 -5469927 -6144122 -6775459 -7336539 -7819116 -8230283 -8583923
37834 -8583923 -8890775 -9151154 -9354031 -9483687 -9530434 -9497856 -9400119 -9249992 -9046030 -8768528
37824 -8768528 -8387063 -7874450 -7219368 -6432753 -5546730 -4606945 -3661433 -2751431 -1908518
37815 -1908518 -1157235 -517723 -3964 381374 651163 834100 971166 1109457 1293965
37806 1293965 1557520 1910112 2330563 2765337 3138544 3372165 3408392 3223177 2825479 2246251
37796 2246251 1526406 710574 -153066 -1011104 -1805604 -2478401 -2977255 -3261999 -3310375 -3123694
37786 -3123694 -2730178 -2181908 -1543501 -875990 -222653 398148 991929 1580633 2191889
37777 2191889 2848689 3562700 4332374 5144998 5980879 6817783 7633567 8405929 9110471
$$ packed form
37843c652549n22802o21276o73300o74195o31337n61080m82577m11167l53640
37834h583923l06852k60379k02877j29656m6747L2578R7737J50127K03962K77502
37824h768528L81465N12613O55082P86615Q86023R39785R45512R10002Q42913
37815a908518P51283O39512N13759L85338K69789J82937J37066J38291J84508
37806A293965K63555L52592M20451M34774L73207K33621L6227j85215l97698n79228
37796B246251p19845q15832q63640q58038p94500o72797m98854k84744m8376J86681
37786c123694L93516N48270O38407O67511O53337O20801N93781N88704O11256
37777B191889O56800P14011P69674Q12624Q35881Q36904Q15784P72362P04542
$$ plain form
37768 9110471 9720025 10206968 10547729 10727536 10744188 10610413 10354001 10014882 9639014 9270027
37758 9270027 8940478 8665578 8441975 8251917 8070321 7872274 7640897 7375912 7099864
37749 7099864 6856284 6697103 6664239 6774891 7017497 7358168 7752125 8154421 8527177 8843485
37739 8843485 9088932 9260622 9362656 9397880 9358498 9220608 8946890 8497375 7843463 6978927
37729 6978927 5924324 4724791 3443175 2150557 916105 -201782 -1161989 -1945170
37721 -1945170 -2556622 -3026337 -3403790 -3746656 -4106314 -4515251 -4980140 -5481049 -5975246
37712 -5975246 -6404635 -6706722 -6827926 -6735539 -6424014 -5913677 -5243351 -4459862 -3607462 -2720188
37702 -2720188 -1819533 -917331 -20193 868424 1748677 2623945 3497085 4365030 5215452
$$ packed form
37768I110471O09554M86943L40761J79807J6652j33775k56412l39119l75868l68987
37758I270027l29549k74900k23603j90058j81596j98047k31377k64985k76048
37749G099864k43580j59181l2864J10652K42606L40671L93957M02296L72756L16308
37739H843485K45447J71690J02034L5224l9382j37890k73718m49515o53912q64536
37729F978927j054603j199533j281616j292618j234452j117887r60207p83181
37721a945170o11452m69715l77453l42866l59658m08937m64889n00909m94197
37712e975246m29389l02087j21204R2387L11525N10337O70326P83489Q52400Q87274
37702b720188R00655R02202Q97138Q88617Q80253Q75268Q73140Q67945Q50422
$$ plain form
37693 5215452 6027381 6774795 7431654 7977668 8404069 8717625 8941023 9108944 9260481
37684 9260481 9429098 9631980 9862057 10086656 10254924 10312116 10215278 9944429 9505559 8925155
37674 8925155 8238967 7480439 6675310 5846064 5022777 4250488 3584136 3071234 2732292
37665 2732292 2551008 2479211 2452892 2411773 2316208 2157479 1958992 1767615 1637832 1614681
37655 1614681 1722076 1960188 2310707 2745074 3230614 3732692 4214920 4640737 4977947
37646 4977947 5204964 5316044 5322897 5251686 5136466 5011855 4907769 4847525 4848910 4926887 5095989
37635 5095989 5369986 5757729 6256923 6849256 7498531 8150695 8735418 9172113 9383441
37626 9383441 9313733 8943887 8295114 7420696 6391085 5278578 4145492 3037867 1985432
$$ packed form
37693E215452Q11929P47414O56859N46014M26401L13556K23398J67921J51537
37684I260481J68617K02882K30077K24599J68268N7192r6838k70849m38870n80404
37674H925155o86188p58528q05129q29246q23287p72289o66352n12902l38942
37665B732292j81284p1797k6319m1119r5565j58729j98487j91377j29783k3151
37655A614681J07395K38112L50519M34367M85540N02078M82228M25817L37210
37646D977947K27017J11080O853p1211j15220j24611j04086o0244J385P7977J69102
37635E095989K73997L87743M99194N92333O49275O52164N84723M36695K11328
37626I383441o9708l69846o48773q74418j029611j112507j133086j107625j052435
$$ plain form
37617 1985432 1006604 115249 -674193 -1344644 -1876853 -2251551 -2452863 -2472394 -2312485 -1986681
37607 -1986681 -1516801 -928472 -248554 493788 1264456 2024348 2733640 3357980 3873200
37598 3873200 4267850 4544963 4722673 4831211 4905478 4976346 5064979 5181584 5327450 5498916
37588 5498916 5691653 5902106 6123400 6337948 6513480 6607489 6578089 6394707 6043720 5528562
37578 5528562 4866569 4085156 3219355 2311126 1408414 561142 -186402 -804226 -1282905
37569 -1282905 -1635642 -1895863 -2110489 -2329334 -2592263 -2917564 -3295961 -3693468 -4062566
37560 -4062566 -4356928 -4543665 -4609579 -4561155 -4419233 -4209823 -3954439 -3665195 -3347536 -3007244
37550 -3007244 -2654413 -2300182 -1949399 -1596701 -1230385 -841550 -431731 -14233 390584
$$ packed form
37617A985432r78828q91355p89442o70451n32209l74698k01312j9531J59909L25804
37607a986681M69880N88329O79918P42342P70668P59892P09292O24340N15220
37598C873200L94650K77113J77710J08538P4267P0868Q8633J16605J45866J71466
37588E498916J92737K10453K21294K14548J75532R4009k9400j83382l50987n15158
37578E528562o61993p81413q65801r08229r02712q47272p47544o17824m78679
37569a282905l52737k60221k14626k18845k62929l25301l78397l97507l69098
37560d062566k94362j86737o5914M8424J41922K09410K55384K89244L17659L40292
37550c007244L52831L54231L50783L52698L66316L88835M09819M17498M04817
$$ plain form
37541 390584 762568 1088277 1364387 1595743 1787393 1934693 2019424 2016857 1909456 1696371
37531 1696371 1391180 1010603 564397 54658 -515673 -1132470 -1765786 -2372892 -2905848
37522 -2905848 -3319795 -3580464 -3669849 -3587713 -3347019 -2965511 -2459135 -1841713 -1130288 -352062
37512 -352062 451478 1225815 1910595 2451169 2810932 2980483 2980446 2856561 2668200 2474470
37502 2474470 2323082 2244446 2249611 2330114 2460256 2603349 2721122 2782641 2769607 2677255 2511624
37491 2511624 2284618 2008863 1694434 1348394 977050 591013 212376 -120074 -353893
37482 -353893 -436647 -334488 -45974 394444 922248 1454697 1906760 2208958 2322352 2245548
37472 2245548 2012218 1681553 1324580 1008241 780022 658102 630937 665286 717481 743538
$$ packed form
37541C90584L71984L25709K76110K31356J91650J47300Q4731k567j07401k13085
37531A696371l05191l80577m46206n09739n70331o16797o33316o07106n32956
37522b905848m13947k60669q9385Q2136K40694L81508N06376O17422P11425P78226
37512c52062Q03540P74337O84780N40574L59763J69551l7j23885j88361j93730
37502B474470j51388p8636N165Q0503J30142J43093J17773O1519j3034r2352j65631
37491B511624k27006k75755l14429l46040l71344l86037l78637l32450k33819
37482c53893q2754J02159K88514M40418N27804N32449M52063L02198J13394p6804
37472B245548k33330l30665l56973l16339k28219j21920k7165L4349N2195K6057
$$ plain form
37462 743538 707781 590980 396249 148623 -113213 -348951 -526146 -624205 -635111 -564419
37452 -564419 -433260 -278723 -149789 -98662 -170252 -393326 -775541 -1302933 -1943760 -2656286
37442 -2656286 -3398885 -4139069 -4857918 -5548559 -6209900 -6837700 -7415380 -7908419 -8267315
37433 -8267315 -8441023 -8395616 -8127606 -7664010 -7050231 -6334164 -5554945 -4739320 -3903841 -3060038
37423 -3060038 -2220438 -1403190 -632569 65830 673081 1183614 1607426 1967872 2297400
37414 2297400 2632792 3009520 3454399 3977982 4570612 5205411 5847495 6464626 7034404
37405 7034404 7546736 8003207 8414465 8794837 9153867 9487517 9773767 9976054 10054646 9982741
37395 9982741 9761451 9426696 9043107 8685760 8416557 8264297 8215299 8217448 8196450 8079242
$$ packed form
37462G43538l5757j16801j94731k47626k61836k35738j77195r8059j0906P0692
37452e64419J31159J54537J28934N1127p1590k23074l82215n27392o40827p12526
37442b656286p42599p40184p18849o90641o61341o27800n77680m93039l58896
37433h267315j73708M5407K68010M63596O13779P16067P79219Q15625Q35479Q43803
37423c060038Q39600Q17248P70621O98399O07251N10533M23812L60446L29528
37414B297400L35392L76728M44879N23583N92630O34799O42084O17131N69778
37405G034404N12332M56471M11258L80372L59030L33650K86250K02287P8592p1905
37395I982741k21290l34755l83589l57347k69203j52260m8998K149k0998j17208
$$ plain form
37385 8079242 7816402 7395287 6839683 6197974 5526945 4879199 4298423 3820817 3477446
37376 3477446 3293632 3285586 3456706 3794829 4270411 4836317 5430951 5985269 6431920 6714158
37366 6714158 6793505 6655652 6312672 5799079 5161547 4446390 3691216 2925194 2176526 1480153
37356 1480153 878188 411217 106038 -32219 -19826 111329 319891 558836 778533 932732
37346 932732 989139 941026 812236 649554 504191 412184 384492 410378 468344 535754 592754
37335 592754 623129 616852 574644 509723 442858 393229 371919 381890 421896 489076 577812 676078
37323 676078 761921 802890 761011 603282 312649 -107684 -639055 -1256241 -1933314 -2644176
37313 -2644176 -3360922 -4053484 -4690696 -5241143 -5673204 -5955460 -6059238 -5964644 -5669359 -5195666
$$ packed form
37385H079242k62840m21115n55604o41709o71029o47746n80776m77606l43371
37376C477446j83814q046J71120L38123M75582N65906N94634N54318M46651K82238
37366F714158P9347j37853l42980n13593o37532p15157p55174p66022p48668o96373
37356A480153o01965m66971l05179j38257J2393J31155K08562K38945K19697J54199
37346I32732N6407m8113j28790j62682j45363r2007k7692K5886N7966O7410N7000
37335E92754L0375o277m2208o4921o6865m9629k1310R971M0006O7180Q8736R8266
37323F76078Q5843M0969m1879j57729k90633m20333n31371o17186o77073p10862
37313b644176p16746o92562o37212n50447m32061k82256j03778R4594K95285M73693
$$ plain form
37303 -5195666 -4588761 -3902885 -3180704 -2437910 -1662072 -824264 105922 1150182 2316896
37294 2316896 3597758 4962835 6356884 7703283 8919444 9939734 10734756 11315839
37286 11315839 11722352 12000128 12183245 12286861 12311232 12252757 12116357 11922931 11706877 11504139
$$ packed form
37303e195666O06905O85876P22181P42794P75838Q37808R30186J044260J166714
37294B316896J280862J365077J394049J346399J216161J020290P95022N81083
37286A1315839M06513K77776J83117J03616K4371n8475j36400j93426k16054k02738
$$ [...]
##END NTUPLES=NMR SPECTRUM
##END=
