##TITLE=31Pdec_LR-0169-RM1
 , 64 sc
 17.2.2023
##JCAMPDX= 6.0         $$ Bruker NMR JCAMP-DX V2.0
##DATA TYPE= NMR SPECTRUM
##DATA CLASS= NTUPLES
##ORIGIN= UXNMR, Bruker Analytische Messtechnik GmbH
##OWNER= root
$$ XWIN-NMR		Version 3.5
$$ Fri Feb 17 14:53:48 2023 Russian Standard Time (UT+4h)  she@DPX200
##.OBSERVE FREQUENCY= 81.013821
##.OBSERVE NUCLEUS= ^31P
##.ACQUISITION MODE= SIMULTANEOUS
##.ACQUISITION SCHEME= undefined
##.AVERAGES= 64
##.DIGITISER RES= 16
##SPECTROMETER/DATA SYSTEM= spect
##.PULSE SEQUENCE= zgpg30
##.SOLVENT NAME= CDCl3
##.SHIFT REFERENCE= (INTERNAL, CDCl3, 0, 248.564)
##AUDIT TRAIL= $$ (NUMBER, WHEN, WHO, WHERE, WHAT)
$$ ##TITLE= Audit trail, XWIN-NMR		Version 3.5
$$ ##JCAMPDX= 5.01
$$ ##ORIGIN= Bruker BioSpin GmbH
$$ ##OWNER= she
$$ F:/spectra/data/she/nmr/P31/1/pdata/1/auditp.txt
$$ ##AUDIT TRAIL=  $$ (NUMBER, WHEN, WHO, WHERE, WHAT)
(   1,<2023-02-17 14:52:26.20 +0400>,<she>,<DPX200>,
      <continue with go, POWCHK disabled, PULCHK disabled
       configuration hash MD5:
       00 E9 B6 7A A2 85 ED C7 34 08 36 98 17 FE 4E 26
       data hash MD5: 32K
       B4 DF E0 7F 6D B5 69 93 80 6A 4C AA 08 92 6D 1D>)
(   2,<2023-02-17 14:52:39.07 +0400>,<she>,<DPX200>,
      <Start of raw data processing
       efp BC_mod = 2 LB = 1 FT_mod = 6 PKNL = 1 PHC0 = -10996.32 PHC1 = 128.2127 SI = 64K 
       data hash MD5: 64K
       F8 6C D4 3E C7 20 84 99 C3 3B 2B 53 70 36 EB 6A>)
(   3,<2023-02-17 14:53:00.48 +0400>,<she>,<DPX200>,
      <pk PHC0 = -121.0134 PHC1 = 319.2 
       data hash MD5: 64K
       8E C8 3E 1B 2A D3 63 3A 64 14 32 E5 94 51 66 1C>)
(   4,<2023-02-17 14:53:21.32 +0400>,<she>,<DPX200>,
      <pk PHC0 = -9.902759 PHC1 = 26.20002 
       data hash MD5: 64K
       A9 A0 72 46 11 0C AF F1 1A DD 2B D3 77 F2 B6 5B>)
$$ ##END=
$$ 
$$ hash MD5
$$ 8C 1D 75 30 DA E8 55 7A 7D 08 4F CF 28 52 7C 6C
##$RELAX= 
##$RELAX= 
##$RELAX= 
##$RELAX= 
##$RELAX= 
##$RELAX= 
##$RELAX= 
##$RELAX= 
##$RELAX= 
$$ Bruker specific parameters
$$ --------------------------
##$DU= <F:/spectra>
##$EXPNO= 1
##$NAME= <P31>
##$PROCNO= 1
##$TYPE= <nmr>
##$USER= <she>
##$AMP= (0..31)
100 100 100 100 100 100 100 100 100 100 100 100 100 100 100 100 100 100 
100 100 100 100 100 100 100 100 100 100 100 100 100 100 
##$AQSEQ= 0
##$AQ_mod= 1
##$AUNM= <au_zg>
##$AUTOPOS= <>
##$BF1= 81.014009
##$BF2= 200.13
##$BF3= 200.13
##$BF4= 200.13
##$BF5= 200.13
##$BF6= 200.13
##$BF7= 200.13
##$BF8= 200.13
##$BYTORDA= 1
##$CFDGTYP= 0
##$CFRGTYP= 5
##$CHEMSTR= <none>
##$CNST= (0..31)
1 1 145 1 1 1 1 1 1 1 1 1 1 1 1 1 1 1 1 1 1 1 1 1 1 1 1 1 1 1 1 1 
##$CPDPRG= <waltz16>
##$CPDPRG1= <>
##$CPDPRG2= <waltz16>
##$CPDPRG3= <>
##$CPDPRG4= <mlev>
##$CPDPRG5= <mlev>
##$CPDPRG6= <mlev>
##$CPDPRG7= <mlev>
##$CPDPRG8= <mlev>
##$CPDPRGB= <>
##$CPDPRGT= <>
##$D= (0..31)
0 1 0 0 0 0 0 0 0 0 0 0.03 2e-05 3e-06 0 0 0 0 0 0 0 0 0 0 0 0 0 0 0 0 
0 0 
##$DATE= 1676631067
##$DBL= (0..7)
120 120 120 11 120 120 24 19 
##$DBP= (0..7)
150 150 150 150 150 150 150 150 
##$DBP07= 0
$$ [...]
##$SUBNAM2= <"">
##$SUBNAM3= <"">
##$SUBNAM4= <"">
##$SUBNAM5= <"">
##$SUBNAM6= <"">
##$SUBNAM7= <"">
##$SUBNAM8= <"">
##$SUBNAM9= <"">
##$SW= 501.771253377433
##$SWIBOX= (0..15)
0 1 3 0 0 0 0 0 0 0 0 0 0 0 0 0 
##$SW_h= 40650.406504065
##$TD= 32768
##$TD0= 1
##$TE= 0
##$TE2= 300
##$TE3= 300
##$TEG= 300
##$TL= (0..7)
0 120 53 12 22 120 120 120 
##$TP= (0..7)
150 150 150 150 150 150 150 150 
##$TP07= 0
##$TPNAME0= <>
##$TPNAME1= <>
##$TPNAME2= <>
##$TPNAME3= <>
##$TPNAME4= <>
##$TPNAME5= <>
##$TPNAME6= <>
##$TPNAME7= <>
##$TPOAL= (0..7)
0.5 0.5 0.5 0.5 0.5 0.5 0.5 0.5 
##$TPOFFS= (0..7)
0 0 0 0 0 0 0 0 
##$TUNHIN= 0
##$TUNHOUT= 0
##$TUNXOUT= 0
##$USERA1= <user>
##$USERA2= <user>
##$USERA3= <user>
##$USERA4= <user>
##$USERA5= <user>
##$V9= 5
##$VALIST= <valist>
##$VCLIST= <CCCCCCCCCCCCCCC>
##$VD= 0
##$VDLIST= <DDDDDDDDDDDDDDD>
##$VPLIST= <PPPPPPPPPPPPPPP>
##$VTLIST= <TTTTTTTTTTTTTTT>
##$WBST= 1024
##$WBSW= 4
##$XGAIN= (0..3)
0 0 0 0 
##$XL= 0
##$YL= 0
##$YMAX_a= 10113
##$YMIN_a= -14821
##$ZGOPTNS= <>
##$ZL1= 120
##$ZL2= 120
##$ZL3= 120
##$ZL4= 120
##$ABSF1= 0
##$ABSF2= 0
##$ABSG= 0
##$ABSL= 0
##$ALPHA= 0
##$AQORDER= 0
##$ASSFAC= 0
##$ASSFACI= 0
##$ASSFACX= 0
##$ASSWID= 0
##$AUNMP= <proc_1d>
##$AZFE= 0.1
##$AZFW= 0.5
##$BCFW= 0
##$BC_mod= 2
##$BYTORDP= 0
##$COROFFS= 0
##$CY= -3
##$DATMOD= 1
##$DC= 0
##$DFILT= <>
##$DTYPP= 0
##$F1P= 0
##$F2P= 0
##$FCOR= 1
##$FTSIZE= 65536
##$FT_mod= 6
##$GAMMA= 0
##$GB= 0
##$INTBC= 1
##$INTSCL= 6.047779e-11
##$ISEN= 30
##$LB= 1
##$LEV0= 0
##$LPBIN= 0
##$MAXI= 10000
##$MC2= 0
##$MEAN= 0
##$ME_mod= 0
##$MI= 50
##$NCOEF= 0
##$NC_proc= -8
##$NLEV= 6
##$NOISF1= 182.463
##$NOISF2= 159.3651
##$NSP= 0
##$NTH_PI= 0
##$NZP= 0
##$OFFSET= 248.5645
##$PC= 4
##$PHC0= -11127.23
##$PHC1= 473.6127
##$PH_mod= 1
##$PKNL= yes
##$PPARMOD= 0
##$PSCAL= 0
##$PSIGN= 0
##$REVERSE= no
##$SF= 81.0140089999694
##$SI= 65536
##$SIGF1= 159.3651
##$SIGF2= -187.1042
##$SINO= 113.3802
##$SIOLD= 16384
##$SREGLST= <1H.CDCl3>
##$SSB= 0
##$STSI= 65536
##$STSR= 0
##$SW_p= 40650.406504065
##$SYMM= 0
##$S_DEV= 0
##$TDeff= 32768
##$TDoff= 0
##$TI= <>
##$TILT= no
##$TM1= 0
##$TM2= 0
##$TOPLEV= 0
##$USERP1= <user>
##$USERP2= <user>
##$USERP3= <user>
##$USERP4= <user>
##$USERP5= <user>
##$WDW= 1
##$XDIM= 65536
##$YMAX_p= 298229033
##$YMIN_p= -66255798
$$ End of Bruker specific parameters
$$ ---------------------------------
##NTUPLES= NMR SPECTRUM
##VAR_NAME=  FREQUENCY,     SPECTRUM/REAL,   SPECTRUM/IMAG
##SYMBOL=    X,             R,               I
##VAR_TYPE=  INDEPENDENT,   DEPENDENT,       DEPENDENT
##VAR_FORM=  AFFN,          ASDF,            ASDF
##VAR_DIM=   65536,         65536,           65536
##UNITS=     HZ,            ARBITRARY UNITS, ARBITRARY UNITS
##FACTOR=    0.620285442955139, 1,           1
##FIRST=     20137.2065510682, 0,            0
##LAST=      -20513.1999529968, 0,           0
##MIN=       -20513.1999529968, -66255798,   0
##MAX=       20137.2065510682, 298229033,    0
$$ Real data points
##PAGE= N=1
##DATA TABLE= (X++(R..R)), XYDATA
$$ [...]
44415 7073395 7621316 12413941 13398102 8011186 1453541 -1970847 -2953918 -2654354 -413923
44406 -413923 2732934 3394096 408266 -3510409 -5572668 -5167427 -2552475 811756 1156684
44397 1156684 -3594853 -8925399 -8139478 -1893973 2495699 1946566 1267469 4144037 7217530
44388 7217530 6354205 2847367 -250885 -2432882 -2730778 1573517 8633865 10447647
44380 10447647 3392599 -4989897 -6186662 -2564689 -1545806 -2763209 -452721 4305507
44372 4305507 4178721 -1999421 -7159583 -7327583 -5961339 -5236427 -2041998 4155142 7723684
44363 7723684 5357883 1082893 -1427774 -4616709 -10390804 -14551948 -13682337 -11508862
44355 -11508862 -12054066 -12127586 -7796308 -3056718 -3601601 -6089742 -3199174 3088856 3516719
44346 3516719 -3438544 -8630826 -6125004 -1000067 55461 -1641321 -891136 3383965
44338 3383965 8514744 12173847 12695897 9201519 4217003 2314775 3808307 4120117
44330 4120117 1637507 819404 4125006 6562567 3408094 -1389381 -880258 3854889
44322 3854889 5057355 -464526 -7472676 -9931891 -7685228 -4551012 -3370395 -4388393
44314 -4388393 -6498440 -8660056 -10109012 -9274639 -3985396 4843617 11106771 9695786
44306 9695786 4501342 4181405 9119972 10230737 3436668 -3480420 -3705920 -1848215
44298 -1848215 -3505452 -3295023 5141350 14072947 11049643 -35051 -2710906 7178549
44290 7178549 15669928 12693527 5144142 2346636 2267870 623493 1691195 8965917
44282 8965917 13956778 6815852 -6924970 -12163892 -4615322 5109730 7494533 4865251
44274 4865251 4391316 7584665 10230440 9068828 5604858 3937860 5519022 6799996
44266 6799996 3877157 -1392205 -3911194 -3780877 -6253014 -11794153 -13276019 -6839755
44258 -6839755 1027513 2378059 -1921914 -6197838 -8664500 -10065395 -8989219 -5388466
44250 -5388466 -4043873 -7506824 -10223233 -7002030 -2273455 -2369053 -3541166 2031409
44242 2031409 11975017 16754435 14739132 12368817 10120312 1040183 -14921577 -26925266
44234 -26925266 -27254555 -19615966 -10279607 -719438 7153756 8501753 3960999 1998313
44226 1998313 6728334 10804916 6838116 -895305 -3405183 -409684 753238 -3481092
44218 -3481092 -9179926 -11064366 -7731908 -1948515 1386204 -690471 -5602986 -8387505
44210 -8387505 -8783141 -10455392 -12693012 -9852715 -1584663 3689602 -164314 -8685491
44202 -8685491 -14080169 -14849611 -13539041 -11020473 -8292852 -8114115 -9418958 -6191962
44194 -6191962 2381454 7506772 3546054 -1898700 475685 6519412 5760407 -1192520
44186 -1192520 -4483112 -1624966 284162 -1210449 334570 7931174 14971220 15130032
44178 15130032 10488297 6375634 4739923 5311780 7207655 7120065 1702944 -6485862
44170 -6485862 -10946703 -9872997 -6672857 -2110371 5761464 13131975 11994651 3316304
44162 3316304 -1419814 3161071 7909252 4212450 -1798475 375587 8034177 9339134
44154 9339134 1437502 -6226052 -5811255 934055 8887477 15516502 18993747 17022527
44146 17022527 10184292 2521053 -2450296 -3537846 -765472 3430486 3432864 -3573253
44138 -3573253 -11590652 -11917286 -5314664 -1543921 -5715232 -11774055 -11814603 -5597983 2260880
44129 2260880 8706199 12046062 10795663 7268573 7568041 13089023 16551257 12130130
44121 12130130 5190988 4843016 9998803 11157693 4822906 -2448970 -4991569 -4697686
44113 -4697686 -4485582 -2829477 1232583 3966525 2603957 265282 571589 1756834
44105 1756834 1109871 1061532 4805512 8970945 7365304 479431 -5187354 -6749889 -7686456
44096 -7686456 -10562564 -12863995 -11692760 -7959828 -3958549 -209522 3745098 8018437
44088 8018437 12366598 14892895 11471888 525482 -11920366 -16821553 -12367773 -4964808
44080 -4964808 437869 5157949 10344332 12312306 8468816 3199683 2933722 7772037
44072 7772037 11849885 10629108 5505701 2412639 6438523 15579104 20566060 15246846
44064 15246846 6237964 5483905 12988539 15925486 7689804 -2058801 -2122327 4668109
44056 4668109 8561873 7690473 6479672 5910472 5428755 8591331 15669174 16212658 2243964
44047 2243964 -15065390 -16893540 -3537071 6045215 2329993 -3758535 -1962658 2027753
44039 2027753 651717 -922500 4326750 11064697 10717887 6557556 7302756 11811803
44031 11811803 12313959 8393686 5813421 4552476 -122202 -6364188 -7117010 -2449016
44023 -2449016 551251 859374 5314319 14813087 19344398 11831682 -1163027 -8105107
44015 -8105107 -5893402 288402 5216630 6483442 3252626 -2253779 -4221561 1089843
44007 1089843 9944263 14579547 11654731 5273552 1893755 3254551 4488912 141084
43999 141084 -7497654 -9280693 -1446141 7067749 5808310 -1738267 -2888993 4945654
43991 4945654 10773208 8069420 4392733 7038596 10420953 7181778 2466362 5039579
43983 5039579 10909766 9534795 2521955 1651197 9234973 14913628 13405388 11132240
43975 11132240 11524288 7887422 -2631134 -10853499 -9975915 -7126530 -10736469 -16096985
43967 -16096985 -14548680 -8708541 -6373766 -6202305 -2620364 657558 -3539210 -10259839
43959 -10259839 -7969261 2020085 7161820 4459632 3237928 5525468 1511678 -10173005
43951 -10173005 -15385108 -6763974 2864082 1101902 -4282527 -686096 6317183 2810085
43943 2810085 -8391203 -11095932 -1114254 9052630 10924790 9689479 10765010 10810890
43935 10810890 6865605 3322081 4407553 7924474 10706367 13209030 15329669 14470305
43927 14470305 11026385 9721748 12589526 15964717 16438245 14545869 11405048 7367042
43919 7367042 4699329 5528136 6958372 4990226 2713489 6125572 12058354 10659190
43911 10659190 1227868 -5667378 -4684165 -2430682 -3419951 -2167206 3699725 5261837
43903 5261837 -2478842 -8149344 610080 17304100 25260007 20320240 11713316 4866423
43895 4866423 -2316262 -7938767 -5492576 3498507 8420928 4446855 -1263790 -1383315
43887 -1383315 2292745 4862048 5820577 6426337 5736098 3193662 531297 -1550185 -4118951
43878 -4118951 -5764181 -3017696 2729479 4326440 -1742457 -9645988 -11662394 -7988125
43870 -7988125 -5507213 -8936856 -16088979 -20767335 -18748465 -11676342 -5169022 -2056053
43862 -2056053 959749 7567531 15314328 19129678 19045372 18384746 15939181 7804630 -2886485
43853 -2886485 -6932071 -2209173 2639338 1644725 262791 4701295 10129143 7906397
43845 7906397 -635816 -6752937 -7490690 -7160887 -7219382 -4208795 1595670 4432489 2344005
43836 2344005 520308 2209426 3416049 644143 -3005697 -4736254 -8308085 -16072226
43828 -16072226 -20493408 -13451592 -880951 2970548 -4393744 -10873493 -9089922 -6296070
43820 -6296070 -9284761 -11337142 -4309734 5520147 6624259 1296953 1102507 6116233
43812 6116233 4542960 -5830927 -11710053 -5069758 4267105 4896631 666985 1260695
43804 1260695 5900873 8135277 9487440 15624780 23249624 23180532 14790045 6619272
43796 6619272 3323185 1578555 -1338261 -3823564 -4917065 -5040436 -2021077 5826802
43788 5826802 13197445 12571695 5335385 100376 310066 1867994 2345905 2880531 1059687
43779 1059687 -7058562 -16368753 -15627062 -4063305 6142515 8095347 9090917 15149000
43771 15149000 18640195 11025600 -1465120 -6315752 -2720264 130840 -1294480 -2017918
43763 -2017918 430050 2410432 1926347 1493308 1967463 461382 -3599112 -5721842 -2140768
43754 -2140768 4819322 8950861 6346993 -690158 -5113068 -2103471 4418581 5404378
43746 5404378 -1240384 -6533496 -2358014 6643938 9140128 2571213 -4325198 -3935490
43738 -3935490 2062196 8296679 13270221 17708461 19431225 14933693 5510209 -2149588
43730 -2149588 -3109113 83688 1081817 -1789744 -3908418 -1580513 2978199 5900907
43722 5900907 6847301 6484284 3089226 -3054531 -5801186 -663245 6927795 9007020
43714 9007020 7823003 11030330 16146490 12735795 1056140 -5560212 -1118434 4071238
43706 4071238 1358623 -2883045 -890515 2303581 -140786 -2976455 611078 4236501
43698 4236501 -791764 -7497811 -2823271 9893903 15354066 10717235 8192147 13191219
43690 13191219 16801462 12518735 5065071 -1138877 -7920309 -13396065 -10108455 1024918
43682 1024918 7791943 4361055 -106526 2467060 6496026 4921137 2515394 6101136
43674 6101136 10865333 8685514 3209193 3805723 8860045 8125750 380280 -3451895
43666 -3451895 3420837 13870161 16777423 10168321 904119 -4346949 -4366384 -1748070
43658 -1748070 1167206 4256300 7822262 9977448 8029870 2566699 -2553664 -4747717
43650 -4747717 -4327799 -1639866 3065626 6356725 3688861 -3416579 -7867487 -7171992
43642 -7171992 -7008299 -11045878 -13754046 -8985932 -278405 4206743 3119898 1331465
43634 1331465 726548 -1205975 -4857740 -7082665 -6146945 -3096647 1369765 7083650
43626 7083650 12432891 16279804 20180322 24261572 23346646 13322640 -105194 -6069063
43618 -6069063 -2082689 3880680 5849096 7169044 12342478 18027173 17569697 10978642
43610 10978642 5028367 4661542 8388460 11815927 12312071 9867847 6199027 4058013
43602 4058013 5446913 9236139 12013555 12503142 13230334 15535188 15128876 7364802 -3527688
43593 -3527688 -7094152 -1196857 2967428 -3738719 -13942239 -13669985 -3022800 4273745
43585 4273745 1553660 -2628715 -61686 4937987 5074767 2197606 1923537 3539130
43577 3539130 3701984 4345577 8257674 11490315 8851556 3113686 187169 -1221568
43569 -1221568 -5845096 -10766107 -8475301 154577 6235090 6438755 6277756 8498389
43561 8498389 8141446 2457429 -2968316 -2678969 778559 2265193 2092207 3780197 7330194
43552 7330194 9050377 6397556 664128 -3849564 -3089870 2001187 4831478 924068
43544 924068 -4869561 -4088203 3147096 8018677 5483540 71346 -2334220 -1822089 -1001622
43535 -1001622 -333112 -77767 -1699764 -4312658 -4399052 -1396409 1420518 3362459 7330513
43526 7330513 12110039 11294576 4080239 -607762 3125557 8249647 5373809 -2529103
43518 -2529103 -5069382 -389790 3510007 1956746 -1114792 -1444703 241450 2837535
43510 2837535 7576321 13523011 16217142 13855574 10199418 8490199 6802880 2792196
43502 2792196 -808676 125652 4201885 5968442 3661967 1112483 1159777 1288528 -1584708
43493 -1584708 -5094572 -4617259 -1350917 -1656103 -6842879 -9324670 -3313001 5232861
43485 5232861 6041123 -593704 -4428434 -633978 4100549 3217859 -339180 -1290231 -1365385
43476 -1365385 -4513507 -7773899 -5057663 2079549 4944335 -909571 -10321862 -15096975
43468 -15096975 -12024781 -4354675 1526215 1383416 -2333288 -2706716 2638764 7937284
43460 7937284 8116452 6793949 9634779 13894786 12787440 7650547 5926108 7603515
43452 7603515 4728715 -3375594 -5792911 3513842 14946629 17177550 13823448 16026244
43444 16026244 23780751 26393304 19736125 11482618 7871248 5659492 829834 -3655546
43436 -3655546 -4185092 -3426367 -4487150 -3783358 2806697 10629472 11425857 5952272 3061419
43427 3061419 6414993 10515799 11185393 11205928 12204517 9581774 1436340 -4814783 -2625260
43418 -2625260 2371865 305264 -7539951 -11468902 -9484643 -9148667 -12525417 -11210090
43410 -11210090 -894988 9365449 9480407 2387536 -1830390 -252905 2345378 3207896
43402 3207896 3765852 4216058 3058051 1011576 -270539 -1896270 -4807138 -5410879 -423113
43393 -423113 5835864 6114025 1236571 -1046583 1798810 3963093 1698519 -836885
43385 -836885 829597 4546130 5983349 4819022 2736413 -115938 -2698839 -1231333
43377 -1231333 5810078 13854081 17443902 16682512 14719469 11725182 6216510 506005
43369 506005 -711273 2676527 5305030 3580453 110303 -977712 -206264 -1251542
43361 -1251542 -4369733 -4522501 2566964 13806466 20160437 15352897 2447933 -8883015
43353 -8883015 -11374267 -6182962 -551235 -234938 -4333798 -7468799 -6551442 -3735268
43345 -3735268 -1670903 1498202 8564042 16171264 17353070 12399204 10841423 18794336
43337 18794336 29573045 32045888 24193749 12705427 2897753 -3976301 -6013917 -1409551
43329 -1409551 6143833 9574972 6662045 1126126 -3670020 -6514112 -5523160 -725287
43321 -725287 1827316 -3002311 -9011084 -5184633 6458471 10914155 1625415 -9550053
43313 -9550053 -10077202 -4114997 -3555296 -9927677 -15158141 -14721159 -10271599 -3131932 5426900
43304 5426900 10004827 6050850 -2248272 -6481470 -5034487 -2850810 -2197396 -1078157
43296 -1078157 600627 875919 1013414 3705246 6454775 3932124 -3138103 -8325409
43288 -8325409 -8636743 -6362022 -2064967 6220639 15791924 19501868 15793082 11365144
43280 11365144 10799772 10211071 4976321 -2221707 -5689694 -4570665 -1974426 336224
43272 336224 2368268 3510006 3203469 2505404 2760755 3915212 4923604 4196059 118609
43263 118609 -6151706 -9758282 -8366134 -7753726 -14691958 -24724731 -25360306 -13333775
43255 -13333775 -126394 3710132 1591143 2366167 5905184 5210809 -1426196 -8306148
43247 -8306148 -10325972 -6991487 -396792 5488892 5923488 1205245 -1109544 4579578
43239 4579578 13204773 15881573 12750119 11123899 12339916 9702292 888235 -6186753
43231 -6186753 -3829291 5080656 11422277 10566264 5316128 1177202 1607655 5714135
43223 5714135 8621815 6112470 -115471 -4335651 -4315274 -3282143 -3622003 -3306384 -774977
43214 -774977 1203975 -21639 -2359666 -2647381 -1897783 -2579398 -3067434 271171 6571052
43205 6571052 10816550 10634720 8531773 6913998 4984508 2065290 608066 3445443
43197 3445443 9677578 15053801 15563656 10054056 987731 -6455832 -8045731 -5069993
43189 -5069993 -3840801 -8642441 -16285063 -20053105 -18235392 -15424333 -14977188 -14145776
43181 -14145776 -9326764 -3097765 -1437031 -4696396 -6380758 -2431975 2702411 2581109
43173 2581109 -1806050 -3626767 151213 5398654 7267176 5762425 3743785 2942463
43165 2942463 3589598 4985782 4757563 452119 -6338139 -10535901 -10378803 -10149517 -13165927
43156 -13165927 -15944802 -13934338 -9653860 -8806891 -10227539 -7190884 1151313 7452899
43148 7452899 7421318 5861822 7465509 8550751 4299946 -1041951 780539 9249074
43140 9249074 15248147 13632583 8485204 5115434 3726068 3307573 5559638 10792401
43132 10792401 14223350 11322666 5128787 4101086 12428526 24510207 29753656 23031108
43124 23031108 10800119 5473566 11701820 19961925 17470575 4121496 -7742618 -9160544
43116 -9160544 -3616225 964318 1834209 -463069 -6338794 -13792682 -16702089 -13137212
43108 -13137212 -10378403 -14262602 -18295426 -12540671 98625 7235318 5327294 3054698
43100 3054698 5232844 5367447 -1359444 -8537865 -9005566 -6348252 -7674277 -11428100
43092 -11428100 -11570213 -9434799 -11471063 -16814278 -16687623 -7537918 2636604 3902283
43084 3902283 -4344908 -14153456 -17912341 -14556258 -8832813 -5740744 -5394093 -4243931
43076 -4243931 -1635987 -1668973 -5864786 -8025373 -1942039 7994164 10677641 2988500
43068 2988500 -5652195 -5249405 3268437 10944687 11254419 5136954 -1383328 -2258437 3611294
43059 3611294 10720152 12205844 7499820 2132675 -319858 -1899897 -4481966 -5251314
43051 -5251314 -1443049 4234141 7369216 8520476 11337313 15350970 15634757 10099098
43043 10099098 3203762 975832 4573586 9768852 11283324 7155749 131350 -4855955
43035 -4855955 -5188453 -2231513 1649362 5739769 9296833 10058996 7890373 7877303 14787253
43026 14787253 24723457 27737724 20219033 9624757 4331136 3832730 3227738 2708984
43018 2708984 5767881 10247790 9295484 2246574 -2769045 -293595 4633856 5033874
43010 5033874 3178601 6054777 12297069 12231610 2183400 -8741595 -10267080 -4309412
43002 -4309412 -1368171 -6026116 -11700037 -10231580 -2425974 3375841 1703580 -3506905
42994 -3506905 -3909492 2411610 7764637 4709423 -3247015 -5819691 -460611 4269363
42986 4269363 2784157 2380221 11703542 24548379 25819198 12960746 612765 862595
42978 862595 8433535 11165339 7059036 2654658 156065 -3677797 -7929876 -7047818
42970 -7047818 -1155975 2018848 -1129949 -3742251 1180224 9621807 11979001 6520200
42962 6520200 902660 1026448 4334421 5461417 3869161 3143035 5420673 9523314
42954 9523314 13586529 16977602 19496187 20563467 20049239 18837621 17497036 14983066
42946 14983066 10160894 4727820 2704631 5587680 9452453 9316009 5818354 4454891
42938 4454891 7549673 10488010 8300397 3190765 1700590 5629789 10104517 11034389
42930 11034389 10231896 11113286 12839768 12266423 9845063 9428801 12152312 14285932 12699016
42921 12699016 9394009 7798162 6556100 1181492 -7945160 -13601685 -10350992 -2060215
42913 -2060215 3189977 4000331 6335921 13159807 19139332 18429868 12899777 8214067
42905 8214067 5443442 2284694 253725 3576163 10760684 14095350 9711397 2615025
42897 2615025 -1050274 -1630545 -2233895 -2066846 1418268 6547052 8696464 6344918 1989838
42888 1989838 -1785786 -3761181 -3000624 174361 3265839 4613722 5592650 6826542
42880 6826542 5164717 -909494 -5603389 -2001854 7081999 11203880 5721210 -3092229
42872 -3092229 -7341514 -5612468 -78807 7772442 14943950 16048644 9417047 640332
42864 640332 -3934582 -4337668 -4217312 -4224973 -2525755 117857 329752 -2841995 -5695279
42855 -5695279 -3359070 4929917 13573683 14609962 6339911 -3068984 -4305177 1899276
42847 1899276 7695431 11196973 18192364 28979991 33358712 24887380 12209639 7783349
42839 7783349 10776526 10394159 3029761 -3326342 -1206805 7647359 16270169 19236471
42831 19236471 15294209 8210497 4639037 6941394 9685761 7625685 4166518 5903226
42823 5903226 11718047 14801499 13420088 11382886 9035691 2898842 -5420232 -8854182
42815 -8854182 -4894807 1832100 7990964 14176964 17978171 14017025 4074066 -1841833
42807 -1841833 1122087 6049266 5284743 382379 -3494958 -5285449 -4857826 159813
42799 159813 8095507 10821911 4632976 -2566735 -2060612 3365922 5406713 3329144
42791 3329144 2867792 5901856 9222277 10837161 10641920 7770698 3578519 3496372 9267854
42782 9267854 13699235 10636796 5450072 6644102 11382028 9915731 1562711 -4913758
42774 -4913758 -5330826 -3197479 404187 8042016 16394181 17747132 13191591 12269458
42766 12269458 16333991 14909218 3738273 -6228949 -5521350 -284396 -122375 -2011861
42758 -2011861 1804564 7683605 5795810 -2956207 -8390814 -7293619 -5591134 -4947470
42750 -4947470 -239109 7721347 9841684 4164452 2215012 12103647 24296178 24329255
42742 24329255 13862841 7502023 10718551 13112220 6342343 -1940646 601158 12168942
42734 12168942 18607891 12507604 1998340 -1549440 2065040 4126255 -401670 -7715095
42726 -7715095 -11108956 -7592501 1311831 11738451 19593997 22750662 21955942 18911892
42718 18911892 14613058 10973967 11706141 18101317 25346574 27079791 22924212 17408928
42710 17408928 12361250 5938889 -575590 -1737791 3602130 8559799 6991541 1619414
42702 1619414 -958300 366627 1763267 1578265 1599621 2713372 4098068 5767824 7445367
42693 7445367 5764898 -2499561 -14143719 -20751816 -17179259 -5945088 6624672 15084729
42685 15084729 16045315 9465647 242278 -5239355 -5792281 -5638924 -7075384 -7071999 -3101431
42676 -3101431 2056535 4738254 6005299 8529576 10607186 8523066 3756840 2444480
42668 2444480 7006903 12559994 12718248 5519155 -6878560 -19862151 -26235212 -19803514
42660 -19803514 -3289529 10977020 13431572 8335883 7210258 12476648 14210354 4635961
42652 4635961 -10107868 -16745820 -10235210 1745641 8467375 6944184 2891198 3013160
42644 3013160 7566092 10983436 9630622 6607636 6516431 7771092 4943225 -1919715
42636 -1919715 -6301190 -4644874 -679684 1816505 4019624 6502178 5881562 2234130
42628 2234130 2582227 9683574 14177008 7435573 -3466635 -5173317 1742880 5461473
42620 5461473 3747102 6609536 16573962 22268372 17262342 10792485 11596584 14021012
42612 14021012 10293161 5089397 5760130 7469092 1599664 -7985376 -10935357 -7494550
42604 -7494550 -5686843 -5551372 -981389 5238544 3977865 -2953665 -4032454 1760205
42596 1760205 2298263 -5912341 -9846758 -1501122 7841766 5528585 -3035974 -5458905
42588 -5458905 -2597945 -3649216 -8380570 -9109497 -6090176 -6356901 -9144747 -6523783
42580 -6523783 1300967 4743541 828958 -2192710 318157 2112948 -907967 -1741285
42572 -1741285 5571811 14001907 13549597 6911185 4788270 9309227 12542063 10222862
42564 10222862 6914251 6298060 5243487 952771 -2865589 -1688830 2261411 2720629
42556 2720629 -2625563 -10124216 -14281413 -11402425 -1404585 10847900 17666072 15485008
42548 15485008 9245973 7181863 11687311 17849749 20386927 18855310 15777197 12946973
42540 12946973 11057742 10534035 10801099 10228419 8492513 7712944 9333864 10815037 7898181
42531 7898181 480367 -5863222 -5600524 538495 6758860 9397601 10692641 14036780
42523 14036780 17566535 15923847 8220693 145291 -3557864 -4604282 -5733751 -3722104
42515 -3722104 5977160 19164516 24812927 18617064 8533517 4115964 5776618 8257886
42507 8257886 9541450 10870581 11443280 9285366 6060506 5668884 8387585 10619371
42499 10619371 10036813 7187627 2820910 -2136364 -4482057 -1306357 4911711 7979530
42491 7979530 5691386 2394291 3061716 7860797 13152453 15028570 11682215 5201099
42483 5201099 944537 2220868 6175583 8068707 7961019 8603319 8640703 4577922 -1148545
42474 -1148545 -1891845 2390346 4149803 394103 -2615636 -633399 1244094 -1625805
42466 -1625805 -4328506 -941115 4289644 3413729 -2179829 -4618855 -2312359 -389473
42458 -389473 -432832 590891 2072531 156854 -3393250 -2398728 2416802 3032263 -2423235
42449 -2423235 -5511814 -1004960 4378477 2513676 -4397788 -9127117 -10022343 -9251042
42441 -9251042 -5934946 1027831 7183719 7642228 5479214 7314703 12351076 13837228
42433 13837228 10611975 8699988 10589030 11364296 8257279 6152783 8615513 9738588
42425 9738588 1976176 -11109987 -17353072 -11287253 -1000339 2280050 -2790486 -8100845
42417 -8100845 -6825373 276644 8601498 15269121 19033604 18182363 12725711 7480976
42409 7480976 8193995 13689095 16214534 11686437 5413046 4144480 6228652 5032156
42401 5032156 -108373 -2982208 -573075 2736501 3322447 4492326 9851211 14948814
42393 14948814 12047574 1790650 -6414492 -6780194 -4106718 -5010446 -6914478 -2108716
42385 -2108716 8568310 13743737 6462388 -4850268 -6879562 284509 3818807 -2683381
42377 -2683381 -10227972 -8925749 -2798321 -1781514 -5029766 -3385673 3778694 6636957
42369 6636957 1760203 -1022625 5646914 14061299 13120685 5277474 1473876 3408531
42361 3408531 2129861 -6253277 -13853753 -12379448 -3261331 6694234 13214755 14605579
42353 14605579 9705985 468574 -7190203 -9251970 -7705761 -6022299 -4029945 -629714
42345 -629714 2279499 3440121 6900698 17092145 30155043 35899236 29224030 15260655
42337 15260655 2358321 -5683214 -8856610 -6936451 108306 9697929 17794587 21908891
42329 21908891 21474000 16884540 10380944 6267948 6982464 9411032 8415913 4125929
42321 4125929 1972395 4452952 7309043 6912147 7203418 13731784 23210620 26236323
42313 26236323 20627967 14412818 12855781 10245917 373320 -11151150 -13503717 -6151439
42305 -6151439 1471901 4691824 8313086 15214905 19793259 17178776 11410424 8690377
42297 8690377 8130197 5233701 270765 -2939970 -3390638 -2260325 1141996 6785253
42289 6785253 9846300 6081394 -52972 324982 8074456 14421682 12803412 6309672
42281 6309672 1495480 143981 -180472 -1634449 -4998153 -9890735 -13551245 -11983606
42273 -11983606 -4726603 3213536 5919025 1988779 -4929440 -9269180 -7266606 -20700
42265 -20700 6875071 8923826 7629272 7395622 8842364 9267235 8867960 10942843 15131054
42256 15131054 16123003 11301634 4813382 1467482 1098825 1834078 4318241 8722626
42248 8722626 11253237 8214538 1488467 -3631682 -4427147 -1999062 1289166 3228160
42240 3228160 3107315 3768151 9100098 17173201 20082730 14159194 5974865 3484440
42232 3484440 5365506 5225122 2877372 3670319 7971737 9457195 4902458 -1206688
42224 -1206688 -3908873 -3782066 -3176086 -1822331 72580 -1328317 -8500390 -16384228
42216 -16384228 -16353346 -7048294 2426028 2527914 -5147125 -9562591 -4010325 5440154
42208 5440154 8443570 4427608 2146763 5768193 9251419 7589271 5827009 10277904
42200 10277904 16489641 14752138 4860657 -3622645 -5251022 -4079283 -4081248 -2757300
42192 -2757300 2296041 7464212 8605485 7667115 8905973 11614071 11205182 5989167
42184 5989167 -730734 -4630823 -4085218 -618912 2542821 2849606 622234 -1185332
42176 -1185332 287272 5352692 11227264 13387150 9157305 1428238 -3023515 -813518
42168 -813518 4510453 8109025 9733583 10814970 9703302 5038464 613103 542819 2069929
42159 2069929 207593 -2495015 989657 10183360 16790647 16729886 14112139 12523213
42151 12523213 11007894 9824123 10970961 11324177 5121844 -4334553 -6203196 1142236
42143 1142236 6344735 3060118 -437215 3294103 8292695 7883775 8176692 16219574
42135 16219574 24353972 21040476 10469510 6230279 9926532 11121179 5756429 -333102
42127 -333102 -4970724 -11806692 -18595924 -17668846 -9940040 -5214831 -6405275 -6485518 -3460530
42118 -3460530 -4211712 -9313067 -8564392 1535345 9277846 5522095 -1771525 -1089858
42110 -1089858 4464875 4240733 -2047532 -5689674 -4023286 -2860067 -5703229 -9723877
42102 -9723877 -11672052 -10737382 -6729510 -1349411 642892 -2816624 -6538753 -4890915
42094 -4890915 -310658 1134343 -270562 521444 3938203 5779192 5655397 7540268
42086 7540268 11360786 11563149 6271501 1662396 3778751 10084497 12696348 7982515
42078 7982515 273711 -3410640 -881881 3471938 4589169 3120699 3374718 5538966
42070 5538966 4834375 80929 -2447212 2079545 8797182 9362901 3347497 -2542148
42062 -2542148 -4572662 -4920996 -5103317 -2789247 3319569 9753181 11501231 7228969
42054 7228969 749145 -1950770 1669798 7332517 8621867 5600180 4392595 6899136
42046 6899136 7468359 3311392 420456 2554314 2080504 -8157405 -19525538 -16578762
42038 -16578762 802186 16344548 18283073 10016265 -387536 -9092679 -12734057 -8147612
42030 -8147612 -479823 -693202 -9625726 -14734653 -8632258 -374139 -469822 -4558842 -2290983
42021 -2290983 5216118 8559708 6113018 5264983 9254956 12867885 11445643 6322087
42013 6322087 907718 -2305240 -1003367 4819587 10201759 9858036 4967115 794665
42005 794665 -892836 -1998843 -2699116 -1830530 -1085524 -2518808 -3212900 797606 6327570
41996 6327570 6355665 1452703 -205593 4400491 8390582 5985280 1167856 1096912 6187465
41987 6187465 11075182 11584579 7148087 -346239 -6994729 -9138516 -7626799 -6774779
41979 -6774779 -7360923 -4853099 2963183 11223236 14436272 13582687 12587394 11474833 8135401
41970 8135401 4071342 2548470 2325413 -977676 -7037132 -9510727 -4164984 5373617
41962 5373617 11989204 12768737 10457847 8941310 9378026 10344126 9996738 7399529 2759265
41953 2759265 -2036821 -3155275 2463308 12411913 19127382 18026496 13540460 12651011
41945 12651011 13814103 8902656 -3059237 -11948049 -10340470 -4173450 -3072945 -5701882
41937 -5701882 -3572653 3772105 7746340 5069399 3005710 6961975 11545088 9728030
41929 9728030 4494989 4087341 9229200 12566186 9941449 5564255 4513678 4908139
41921 4908139 502154 -10678565 -22437921 -25514889 -16845482 -3556051 3971720 3474322
41913 3474322 2414420 6750689 12346181 11952474 7242623 6722920 12307936 15898997
41905 15898997 11686178 4791934 3219727 6834969 10039163 11093577 12068756 12238646
41897 12238646 8838378 3548433 1324604 2591132 3073509 1861959 2633185 5512895
41889 5512895 5438688 1642346 994334 7064309 13109393 12470261 9446198 11498951 15771150
41880 15771150 13384517 4317553 -2597236 -3760314 -4292585 -6581143 -6148611 -1923199
41872 -1923199 -192171 -3279560 -3888139 2291843 6773731 233554 -11678563 -14750083
41864 -14750083 -5519486 5530676 9233636 7229129 5246237 4733442 3940125 1943125
41856 1943125 -1186832 -4778340 -6468628 -3675034 2759289 8912023 12266966 13643660
41848 13643660 14988998 17716197 22442490 27625873 29618646 27021333 23148214 20608012
41840 20608012 16171917 6385721 -4142722 -7249844 -3193355 -396836 -2727020 -5056919
41832 -5056919 -3300438 -549901 373696 2707293 8833996 13920257 12456357 6453501
41824 6453501 1566079 -734110 -1727930 -595322 2739964 3592837 -1710349 -8539546
41816 -8539546 -9489414 -5704205 -5538993 -12079366 -18727309 -18499423 -12352286 -6436908 -4987033
41807 -4987033 -7535941 -10372031 -9654261 -4942664 219256 2407008 1516827 -1561705
41799 -1561705 -7149192 -13363520 -14259044 -6804136 2850467 6261229 4142331 4202976 8526718
41790 8526718 10749794 6592476 -190486 -4542402 -6270038 -6614896 -4446999 454482
41782 454482 4670496 5197220 3219557 1574388 1353204 2292581 3154523 1147734 -4707549
41773 -4707549 -9349380 -6459508 1697380 5970460 3656638 2407765 7346481 12370492
41765 12370492 9962895 2548555 -2858541 -5181079 -6613739 -4948768 1933701 7492007
41757 7492007 2870233 -9060737 -15691127 -11533760 -4362616 -2466383 -3815244 -1739332
41749 -1739332 4750947 11017673 13503593 12368854 9473071 6773651 5922471 7746381
41741 7746381 12033888 17348402 20438734 17807724 10136759 3350073 2377955 5524920
41733 5524920 7990699 8500405 8272710 6057193 207719 -5452461 -4350423 3704876
41725 3704876 11655348 14286936 13204559 12157857 12679846 15330368 19946791 23147538
41717 23147538 20519076 12993008 6655642 4952794 5568507 5918767 6529513 7589081
41709 7589081 7460866 6362824 6511965 7315302 5997034 4188798 7232362 14911492 19966986
41700 19966986 18519572 14472014 10390666 2838912 -7972026 -12904061 -6106325 4760021
41692 4760021 9122335 7959148 8194452 8540462 2655050 -6833287 -9949723 -4970792
41684 -4970792 -1106264 -3676348 -6483879 -2434138 6199371 12402613 13652095 12518418
41676 12518418 11615780 10797715 7661346 672598 -6485873 -6398744 2259494 10093515 8586654
41667 8586654 2672849 2921072 8079321 7110185 -1563326 -6208870 -772142 5290373
41659 5290373 3166144 -805775 3233563 11211267 11262093 2562067 -3738304 -973345
41651 -973345 5778590 9310331 8621417 5971121 2556612 -172748 247380 3927681 7210303
41642 7210303 6319762 887735 -6243088 -10906616 -9897673 -3730667 3128506 6540486
41634 6540486 6397577 4571075 1228870 -3781362 -7213358 -3910620 7182411 20284864
41626 20284864 26768152 22220848 11129812 4411789 9099246 19527655 22569462 13290250
41618 13290250 840301 -3962145 -1577789 451724 -306680 -93650 2739750 5590649
41610 5590649 6877085 7274535 6319878 3619596 2742770 7557426 14590623 15388501 7504330
41601 7504330 -2442961 -7581056 -7137098 -3133751 3175443 9631655 13361576 14882069
41593 14882069 17384512 20448168 19722945 14520719 9846087 8449128 6793969 1916946
41585 1916946 -3753150 -7944589 -12487401 -17180171 -16444544 -8428238 -1364519 -2817995
41577 -2817995 -7289769 -3838425 6958424 14037648 13111215 11889233 15611627 17666820
41569 17666820 10547262 -1302554 -7201383 -4686767 -709923 -2010 452010 4171611
41561 4171611 8386213 8122576 4018922 1833044 4496911 8060583 6908647 879566
41553 879566 -4934221 -6426691 -4095574 -702025 1909957 2811682 1356786 -1538289
41545 -1538289 -2985431 -1047555 2453408 3480595 -25431 -6117181 -10560592 -10364775
41537 -10364775 -6260236 -1501308 2403999 7196144 13130408 15359196 9916400 1846167
41529 1846167 343767 5161943 6165857 -447916 -4612943 2369990 13248911 15111979
41521 15111979 8369648 4010336 5382594 5467168 1668975 58044 2460044 2046292
41513 2046292 -3196478 -4270298 4250950 13463840 13057314 6940188 5566488 8621162
41505 8621162 6993644 -869007 -6092918 -3103710 3293983 6195857 4435561 397793
41497 397793 -3613327 -5115339 -3147562 -1583439 -5275574 -11645748 -12035868 -3588478
41489 -3588478 5864266 7811179 3149607 -1142034 -1269683 1359505 4307285 6147368
41481 6147368 5839537 3289902 15846 -2308678 -3033538 -1849477 822627 2254110
41473 2254110 -477431 -5416421 -6414206 -1291910 4075740 3147610 -2509187 -5756312
41465 -5756312 -3478918 647359 2699313 3804459 7316054 12735529 14634237 8454998
41457 8454998 -2808429 -9521977 -5233116 5306111 11281559 8843254 4529546 4574500
41449 4574500 6280425 3626438 -3233519 -9435395 -13298775 -16698741 -18998925 -16869075
41441 -16869075 -10610895 -5496232 -5489472 -9383307 -13844210 -16445673 -15024997 -8437077
41433 -8437077 256818 5099953 4072209 1820960 3443307 7949161 10030090 6490735
41425 6490735 -715990 -6121494 -4407239 4995894 15481888 18225394 11706883 3853145
41417 3853145 2513348 6634506 9895410 10120412 10296647 11596532 10885462 6153378 81957
41408 81957 -3816837 -5504147 -6600674 -6723317 -4471554 -810894 1455084 1709437 2813956
41399 2813956 7337746 13485038 16030722 11723112 3422025 -2058715 -977039 3150872
41391 3150872 3861175 -138673 -3649138 -2484998 878956 1759069 521733 854280 2301272
41382 2301272 703998 -3174966 -2494996 4598941 9498095 5235164 -1396799 805535
41374 805535 8992091 8918803 -2898902 -12047326 -6625720 6139524 12346368 11507082
41366 11507082 12606038 16154146 14219340 6886590 4637527 11554464 18103891 15635610
41358 15635610 8203171 4005648 3736072 4512585 7805188 14795292 19372517 15190891
41350 15190891 6628738 3825237 8389844 12371085 10872056 7674798 7610597 10403695
41342 10403695 13403310 14373408 10655501 1823529 -5849291 -4625329 3003500 5348450
41334 5348450 -2289925 -10090470 -7791108 850392 5495399 5481336 8311661 14370606
41326 14370606 14890833 7222676 1460118 5948570 14038321 13373045 3727763 -3478866
41318 -3478866 -1998462 2020855 1277245 -2256889 -2449652 1443006 6041237 10538617
41310 10538617 15531576 17494289 11925024 2237691 -1608634 4239236 12029609 12877513
41302 12877513 7726135 3518120 2680783 2238428 1037530 1467167 4002992 5545272
41294 5545272 4635524 4164676 6868538 11158063 13720192 14355838 15922892 20008229 24182789
41285 24182789 24090850 18424630 11504956 9350778 12374016 14080235 9096344 558236
41277 558236 -3575965 -256138 6226476 10695302 11716157 9746998 5418894 1204745
41269 1204745 742091 4168779 7158432 6626734 4401412 3121751 1861214 -1073192
41261 -1073192 -3827913 -3311619 -2186 3307905 6204592 10031824 13206228 11564564
41253 11564564 4302454 -3901780 -8215106 -8565820 -7667212 -6304846 -2876078 3109247
41245 3109247 8938931 10642981 6834050 602105 -2869505 -1205257 3199304 6987472
41237 6987472 10362652 15421504 20589082 20562175 13482621 4934568 1668896 3421535
41229 3421535 4741011 3644081 3593518 6505490 9074673 8454585 6849829 6535323 4553102
41220 4553102 -1728425 -6633111 -1569941 11647423 20903038 19470672 13882716 11933083
41212 11933083 10602643 3410665 -6033269 -7901523 -1369783 4339289 4770624 6199579
41204 6199579 13656129 22020730 24716463 24223574 26727151 31011383 30536105 24289345
41196 24289345 18211270 16369492 17014504 17416761 16703597 13416079 6298085 -1041805
41188 -1041805 -2189826 2885505 6348575 3640606 563691 4220758 11756466 14903286
41180 14903286 12341044 9405170 7178598 1444933 -6454288 -7964021 -1083780 3374279
41172 3374279 -3280807 -13679296 -14794622 -7086363 -2187229 -4194009 -5446124 -1150136
41164 -1150136 4072272 6949526 10931993 15909939 14073487 3376822 -5112934 -2422049
41156 -2422049 4616786 4999744 647302 -142767 892359 -3351019 -8879498 -4832104
41148 -4832104 7194964 13997062 11808755 10557433 14231681 13597740 4746792 -991234
41140 -991234 4478752 10999798 5766317 -6228402 -10370356 -3903491 3561371 6179013
41132 6179013 6293581 5620693 3303541 1592231 3830254 7409039 6990156 3851613 4115428
41123 4115428 8283690 9977775 4976687 -4687732 -14797958 -21245471 -19992340 -11391538
41115 -11391538 -3367440 -3886566 -11164989 -16865032 -16969674 -13429706 -7667792 210227
41107 210227 7369108 10348602 9812678 7519277 2003217 -6031169 -9119768 -3130844
41099 -3130844 3079255 -263221 -6482799 -1468623 12356747 17703556 9069280 555761
41091 555761 2760130 8628471 9655806 10373014 16201246 20281422 15095330 7203863
41083 7203863 7483914 14050530 17158447 15208482 13896645 13950174 11491553 7806715 7930233
41074 7930233 11088440 11940391 9942443 8964868 9054016 6766037 2538061 179502 230568
41065 230568 727610 2651184 7377691 10870320 8307728 2838748 1729688 5161672
41057 5161672 6928713 4959096 2549417 87826 -5031348 -9944779 -7308082 3372869
41049 3372869 13670308 17461718 16545177 13558717 7969124 1921498 1418112 7138045
41041 7138045 11329974 8805735 4684811 5788390 9808190 9260523 2684323 -3816933
41033 -3816933 -4199760 2641673 13729444 23936800 28525673 27050034 24017546 23685343
41025 23685343 25218556 24320675 18346670 8887562 592816 -2423480 -611194 1211741
41017 1211741 160072 -347712 4068551 11357708 16250065 18782947 22476503 25195244
41009 25195244 21020722 12279604 9549750 15944968 21253037 17608759 11624507 12617361
41001 12617361 16864407 14359720 5878220 1378815 3741229 5925801 4562363 5032449
40993 5032449 10176648 14016510 12091609 10477745 17676934 31909057 43156359 46148077
40985 46148077 45650200 48443424 54167054 56452555 51979258 45950063 46645565 54915343
40977 54915343 62148265 60386202 51363640 42311319 35974184 30193560 25396666 25193965
40969 25193965 28916686 30926705 29946191 32080116 40291375 47487497 46482504 41538232
40961 41538232 41817121 46828004 48155689 44872054 46489326 57575340 68976239 70205263
40953 70205263 63227454 56729044 52570841 46952482 41399696 41968934 47477370 48591047
40945 48591047 41551953 34301383 34361259 37903865 37210589 33587670 35149691 44234685
40937 44234685 54204173 58410213 56772784 53313909 51763739 53843438 57946186 59476885
40929 59476885 56163957 52603514 55272408 63099049 67683325 63763670 55168540 49053013
40921 49053013 48255085 51291442 56479240 63300884 71054195 77557541 78965489 72473425
40913 72473425 61488468 55549897 60173792 68247556 67839466 58270201 50875464 52326637
40905 52326637 55655968 52249306 45250836 44221092 51391569 60353713 65357292 65268142
40897 65268142 60476989 52603867 46509963 46654099 51309989 54992821 56154925 57719460
40889 57719460 60381400 60738439 57062006 52460231 50635283 51517833 52292295 50557542
40881 50557542 46183752 42105582 42744936 49191533 56929084 61201009 63013684 65827753
40873 65827753 68068035 64876143 57280053 53024636 56068666 60822309 60087773 54177870
40865 54177870 48334671 44919627 42794943 41906453 43409050 46019598 46649329 44989145
40857 44989145 44035068 45377025 46974958 46927680 46979578 50047004 55387050 58688015 57341663
40848 57341663 53726022 51792419 51442368 48614851 41328108 33306129 29872011 31682351
40840 31682351 34736406 35862279 35678796 35943378 36374587 35385640 32740044 30259094 30229762
40831 30229762 33577694 39155375 44327584 46402943 44033142 38012200 31270134 27316659
40823 27316659 27258241 28684556 29240771 30757185 36886690 46513496 53556128 54959363
40815 54959363 54691302 56927644 59478180 58326998 55011221 53740005 53733515 51062999 46856881
40806 46856881 46498958 50408614 52739760 50731190 48453083 48709937 47936102 43059540
40798 43059540 37499471 35342085 34384655 30576025 25559914 23664300 23992445 21908256
40790 21908256 17120734 14005369 13877451 12913783 9238392 7072052 11005685 19162330
40782 19162330 24979249 24713160 21326150 20982753 26179323 32549134 33434729 28065023
40774 28065023 23286013 25428276 32177842 35139877 29486046 18417606 8809143 5226294
40766 5226294 7801125 13063379 16665249 17470395 18574169 22115723 24568779 21107023
40758 21107023 13965118 11454591 17701156 28057061 36353583 41721311 45271533 45074493
40750 45074493 39740737 33991349 34527839 40819028 45071115 42024289 34853618 30452098
40742 30452098 32126614 37857742 42826689 42761511 37608666 32769736 33791111 38958628
40734 38958628 40551126 34753488 26382824 21478317 19487196 16758658 14034420 14714435
40726 14714435 17623070 17925677 15261317 14802401 18678172 21930660 19943394 15487045
40718 15487045 14667960 18842851 24152508 27059153 27137437 25784010 24731298 24607882 23366980
40709 23366980 18432814 12113095 11270362 18330450 26165626 26517696 20571499 15716950
40701 15716950 14436187 13382136 12101642 14220117 18815266 19094786 13233975 9067902
40693 9067902 12671405 18477091 17612182 11491672 8887452 11680167 12488241 7358525
40685 7358525 2499220 4478050 9920814 10916501 7412697 7386863 14476248 21592473 20312120
40676 20312120 12864962 9404340 13957664 18879872 15974732 8546998 6966477 14004640
40668 14004640 20885856 19260808 11892923 8132117 11983812 18514562 20863938 17640089
40660 17640089 13152383 11853931 13099008 12055433 6838717 2961726 6939107 16265565
40652 16265565 21516853 19624416 18144483 22495571 26231319 21420563 13138831 13175456
40644 13175456 21259628 24084985 15150173 4895281 5433930 13472980 16342457 9961115
40636 9961115 2251175 690421 4434403 9280387 13912583 18938406 23873692 27401548
40628 27401548 28393302 25853982 20389508 16242967 18658360 27687651 37162493 41617450
40620 41617450 42373096 45228238 53938102 67603642 82688921 95314398 102380261 102524343
40612 102524343 96341449 85528013 72751924 61968720 55853499 51666313 43107149
40605 43107149 29129744 17731098 16561062 22009013 23349037 17007511 10129029 8685005
40597 8685005 8914398 4616991 -2431359 -5217689 -1759398 3364559 6801490 10100973
40589 10100973 14703413 17765148 15474580 8541816 2397156 2214146 8196239 15598972
40581 15598972 19495864 19245139 17418499 15310166 12176383 8614619 6864183 7083386
40573 7083386 7659731 10107808 17697781 26918942 27797763 17797829 7995148 8023477 11956978
40564 11956978 9100042 2454622 3071470 9480957 8341337 -3664176 -13856688 -13194669
40556 -13194669 -7604509 -4192758 -271090 5750942 5817251 -4299508 -13562171 -10011308
40548 -10011308 1494026 7889815 7048205 5598346 3927881 -2365000 -9774218 -9868614
40540 -9868614 -3513101 669906 850049 2418111 4966172 2338609 -4081062 -5907735
40532 -5907735 -3048760 -4497397 -11149310 -12325184 -4216478 2479393 210564 -3644091
40524 -3644091 -1300160 1810441 -1147811 -3958613 2308925 12615281 15285935 10665320
40516 10665320 8930461 12453708 13645485 9653595 6944121 9814813 14563682 17197239
40508 17197239 18226551 17556081 12621196 4579214 -366210 1083163 5428221 8618715
40500 8618715 10598487 11250107 7720618 -381441 -7642731 -8856885 -5385223 -2103348
40492 -2103348 -626158 1094727 4450686 8649458 12218752 13479903 10789180 4856074
40484 4856074 -182796 -717188 1697278 2314058 35000 -463196 5216260 15254048
40476 15254048 24058196 29046995 31505960 31221210 25386882 15230942 8899997 12628822
40468 12628822 21829319 26811728 25557145 23906118 23885181 20567353 12506198 6500416
40460 6500416 7368858 10414808 9768445 7529262 7844301 8054324 3983774 -849425 -421302
40451 -421302 3123641 3649993 2898917 7274428 14315248 14563729 7889381 5555437 12545486
40442 12545486 19609828 18436855 13709396 12419207 11127977 3990446 -4053039 -3762344
40434 -3762344 3101960 6517998 4136595 3185841 6540300 7927161 3441937 -1854915
40426 -1854915 -3056191 -3189167 -6638709 -10998387 -11325338 -8058204 -4880991 -1931027
40418 -1931027 3086424 9137538 12828364 13989102 15079142 15714814 13201012 8665655
40410 8665655 7041822 9475712 11022910 8497731 5791660 7491261 11146808 11077957
40402 11077957 7544093 6263681 9144655 11148019 7946411 2250835 -66562 2903052
40394 2903052 8537149 13915151 17543984 18094304 14707403 9100478 5327439 6125429
40386 6125429 9876052 12071208 10256666 6896719 5817239 5922125 1667408 -8004319
40378 -8004319 -14659107 -9440882 4168273 12867196 9722445 1783206 -784351 3036403
40370 3036403 8057785 12571790 18344045 23795110 24426395 19967086 15315171 13488665
40362 13488665 12437905 10340645 9864179 14417539 22465641 28553149 30081847 31430709
40354 31430709 39516390 54422228 66596924 66935300 58617222 53281484 54678286 53657132
40346 53657132 43333459 31194051 28180308 31795772 30659798 22741736 17244565 18388445
40338 18388445 19345211 15396777 12121103 14876345 19298127 19348294 17467932 18635487
40330 18635487 19967301 15374379 7385776 5001808 10171049 14565743 11500341 4823737
40322 4823737 3155755 9309833 18266798 23423261 22579435 18608149 15608313 14646647
40314 14646647 13474348 10260043 6241995 4106622 5302111 9817964 16702459 23289273
40306 23289273 25682944 22189306 15634398 10945856 10939743 14841732 19480334 21293411
40298 21293411 18797248 13875190 9428273 6024114 2880935 1147901 2449844 4643225
40290 4643225 4022250 2147625 4401196 10184122 11841069 7087367 4800975 11764923
40282 11764923 20174340 17589817 5464903 -2486618 751992 8304696 12215089 13671474
40274 13671474 16776278 20288033 21178910 20864581 22059346 23066461 20735278 16772307
40266 16772307 15800217 18183570 19603968 17734804 14981692 13636900 12234313 9020092
40258 9020092 6202224 7329235 11663326 15034802 16521854 19803037 25468051 26548233
40250 26548233 17316014 4136541 -33594 7252460 14041565 10552598 2335916 846922
40242 846922 6818503 11557489 11686338 12985558 19347606 26806411 31363556 35504572
40234 35504572 42423072 48912767 49493604 45183880 43189490 47953849 55662819 58468679
40226 58468679 52840640 42919026 35610772 33061609 31554417 28097350 25154610 26413809
40218 26413809 30327441 31718243 28680747 24065064 20739109 19242820 19820296 22739216
40210 22739216 26379168 28770346 31305175 37175620 45793286 52627689 55187763 55484632
40202 55484632 56045431 57257642 59199313 62227678 65131298 66378241 67186566 68989451
40194 68989451 68239427 59697334 45710079 35721034 34406603 36516543 36248625 35223711
40186 35223711 36991806 39623193 39332733 37127891 36243464 36093295 33942421 30300817
40178 30300817 28256546 29328170 33168705 38694908 42621323 40608075 33454027 28241881
40170 28241881 29461097 33376458 35607828 39066720 48180663 59967502 68515232 74995327
40162 74995327 85249924 100046141 116192462 135172813 160605859 186922062 200796577
40155 200796577 196986921 184903092 176190021 172942948 172046972 174185735 182306907 194689438
40147 194689438 204828113 206926895 198764382 181028890 156485600 129054713 102762126
40140 102762126 82093584 71367882 69981343 69516819 61087702 46096301 34401411
40133 34401411 30953453 30351277 26793120 22951595 24601500 31248264 37135506 38456400
40125 38456400 35078934 27864734 19296954 15254045 20783312 33128198 42454640 41548807
40117 41548807 33557227 28281257 30544619 34218274 30457215 20764263 16223469 21693856
40109 21693856 27776227 24642470 17475307 18090187 25155055 25785972 16773917 10146007
40101 10146007 13621810 19022233 17492766 14247420 17903411 24662670 25142300 20342429
40093 20342429 18386743 19735853 18166443 14101897 14497248 19570997 21186572 16001422
40085 16001422 10085060 8166412 7636673 6446440 8387098 15800165 23369110 24038275
40077 24038275 17346608 8980275 5343331 9799264 20094985 28411194 28282820 22165519
40069 22165519 17711219 16978611 15547973 12305475 11970634 15620170 16888917 12177185
40061 12177185 7914876 11871755 21933378 29183926 28936193 23767804 18173070 14856636
40053 14856636 14811390 17276504 20157493 22253880 23712105 23655155 20354434 14901749 11277444
40044 11277444 11235304 12470170 13144838 14456179 17334411 20503216 22912983 23899632 20782663
40035 20782663 12388474 5486989 9441701 21797171 28326557 22454436 15459813 19740225
40027 19740225 30191155 32534281 24462111 16924264 17038840 20974789 23579133 24915829
40019 24915829 25689020 24599650 22538967 22704952 24598073 23814205 19423402 15844462
40011 15844462 15634294 15860006 13773684 11267420 11316163 13859486 17125388 19620639 19455198
40002 19455198 15275177 9367535 6623538 9039177 14046198 19159031 25140050 33222801
39994 33222801 41725928 46954293 46484420 41693096 37983813 40840524 49718617 58022309
39986 58022309 61535323 63685143 68829775 74253609 74667771 71737502 72081045 77206817
39978 77206817 82415977 84900274 85899265 85297750 81475905 76612811 74631717 73536562
39970 73536562 67818071 59399568 57519932 65448246 75504539 80058547 79503583 76433455
39962 76433455 70603263 63900894 61964548 65633530 68234985 66311944 65027908 67331419
39954 67331419 66869069 59858278 55775264 65602265 84933565 99809547 106119400 112549992
39946 112549992 125803069 142980160 158669787 170603578 177395841 178888569 180764033
39939 180764033 191949265 214433576 239883547 257952667 264582897 262104188 255702170
39932 255702170 250992223 251751740 258510486 269744352 282334412 289641078 284194810 267142567
39924 267142567 250741762 244743481 243222668 232469121 210070072 187719621 175216880
39917 175216880 170127342 164976673 157119132 148422956 140993490 136429850 135261249 135163643
39909 135163643 133486103 132304809 136302676 144818875 151271674 151766145 148764899 144479124
39901 144479124 136652757 124133628 111402997 103309269 98721714 93045453 84418917 74546154
39893 74546154 65809469 59965910 57446827 56104320 53012518 48777397 47109168 48948483
39885 48948483 50661638 49769129 48642872 50240444 53760342 57043860 59825147 61857866
39877 61857866 61238616 57842666 55526886 57554198 62209113 66029316 68938438 72881247
39869 72881247 77660113 81812763 86039567 92313413 100749643 110326740 121498406 135440929
39861 135440929 152337358 173071092 199965263 231431644 257898501 269194848 266522333
39854 266522333 261588278 262030244 262746832 254825361 238595708 222908453 214252732 212535651
39846 212535651 216573392 226433585 237894310 241123547 230548962 212561057 197549205
39839 197549205 186791195 174237228 159924964 152385067 155341191 160779115 160549239 157625109
39831 157625109 158592383 160663117 155556477 143765951 135429292 136564601 142243418 144774316
39823 144774316 141842640 134533546 123395210 109579376 95859408 84186644 75032571
39816 75032571 69545835 68459329 68588903 65053892 57870413 52077055 50727053 52101509
39808 52101509 53923923 55167653 53580867 47512662 40969816 40420313 45447867 49577431
39800 49577431 51761751 58490280 71076340 79807953 76990623 68796543 66960991 73880900
39792 73880900 82943410 89215043 92468780 92953720 91749927 93712912 103543547 119626333
39784 119626333 136520690 151978960 167158517 182625168 199560614 222219704 252344608
39777 252344608 281990573 298229033 295531146 279389252 259009641 241791708 233926579
39770 233926579 239376619 255792068 274918247 288091103 289290377 275080958 247225364
39763 247225364 215178108 189883972 173077784 156930266 135713761 113313387 97003819
39756 97003819 88166330 82694200 77387774 71546597 63877000 52927202 41468190 36078774
39748 36078774 39380021 45408998 46780112 44839553 47066165 54162923 57001895 49886454
39740 49886454 39606194 34939986 33867940 30477731 28788399 36719114 48975310 51161635
39732 51161635 42137535 36623407 41443464 45462602 40618453 36257553 40551610 43003937
39724 43003937 32021637 18087954 19891954 34535515 41678110 33997040 23912481
39717 23912481 20812658 21139350 23085963 31890549 45114553 49877800 42182137 34218669
39709 34218669 34824589 36900381 33087886 30091270 36008024 44929868 46792915 43618800
39701 43618800 43240096 44124013 39602104 32047151 29815718 33179789 35340073 35222436
39693 35222436 37476709 41046503 39817493 35016712 35055946 40787569 42279725 34543666
39685 34543666 26213248 26383301 31558367 33743599 34696662 41836376 53103308 57053536
39677 57053536 49665898 41781890 44843617 55557874 61447953 58098091 52972300 52389165
39669 52389165 52760331 48137015 40360146 36261608 38229194 43108106 48496328 54497847
39661 54497847 59772586 61028664 57170953 50425482 43358478 37963224 36609331 39548153
39653 39548153 42161335 39511031 33428190 30216720 31547707 33072169 32115085 30507378
39645 30507378 28857717 24731648 18747073 16061349 18655106 22084867 23667555 28071688
39637 28071688 39588044 53322901 60076908 57680223 52298445 49545852 48540804 44861047
39629 44861047 36881177 28743103 27215439 34454659 44385271 48741220 46157551 41989600
39621 41989600 40055311 39440189 39331832 41144900 44582718 46966429 47864361 49169759
39613 49169759 49752329 46272617 40434263 38180605 39721540 38279611 31733272 27123810
39605 27123810 29348061 33774725 35431932 37128152 41768284 44551130 40791771 34748382
39597 34748382 32518884 32648050 32451871 36913835 50605027 65878933 70710402 65262945
39589 65262945 59721940 58288693 56938515 55547585 59515013 67841561 71019708 64268287
39581 64268287 53958206 47622958 45447968 44844815 45972205 48563539 49020771 44700460
39573 44700460 37350382 30138254 24993770 23844323 27849454 34085722 37299056 36142228
39565 36142228 33942317 33063504 32745299 32590571 33754793 36528250 40526202 46128704
39557 46128704 51484190 50847703 42468402 35576500 40661093 53564256 59170622 52214649
39549 52214649 44159755 45654633 51701116 50646847 41039874 32116641 30926607 35068621
39541 35068621 37267162 33739429 28147046 27496607 32871559 36502035 32002669 24441171
39533 24441171 23228055 27377223 27641364 23045611 23502632 32764989 40519338 37843904
39525 37843904 30363792 27727191 28603944 26182906 22104262 23530004 29729865 32748689
39517 32748689 30708720 30409846 35591048 41553011 44269136 47122268 53720050 59515940
39509 59515940 57251945 48982947 46040141 54905270 67804388 72011652 66133892 60508632
39501 60508632 61044114 61114107 54189085 46187955 45956706 49227058 44505943 32923497
39493 32923497 28466138 36513698 45399658 44354881 37997116 35842279 37570633 37284462
39485 37284462 34327804 31165175 27283856 23543193 25810489 35159528 40881047 33727978
39477 33727978 21096953 17823048 25332925 31574676 29970746 26684432 28383836 33323085
39469 33323085 36994774 38308668 37560327 34856158 32447064 32853558 33640980 29960831
39461 29960831 23157135 20626518 25502206 32071923 33578993 30267889 27873655 31082455
39453 31082455 38936995 44381751 40000821 27552247 18890850 22392884 31584232 33743088
39445 33743088 26842799 19914358 18788930 21011437 24331639 30003037 36200123 37821071
39437 37821071 35370640 35102850 37673043 36036469 28218705 22247835 22897658 23110075
39429 23110075 16261833 8776345 10948595 20771107 27026551 25670518 23654597 27083386
39421 27083386 33772948 38552874 39542076 37496488 33757669 30855505 31986462 38036527
39413 38036527 46415443 53232118 55825339 54089575 50736612 49294013 50418052 50993637
39405 50993637 47696228 40224604 30773405 22532024 19020531 21632146 26587891 27727314
39397 27727314 24178092 21987882 25981593 33270711 37463383 36354457 32679798 30035006
39389 30035006 30981836 36639053 44974479 51336071 53207411 52692727 52678999 53300566 53938139
39380 53938139 55073521 55640234 52424469 45383530 39802635 39324773 40334056 37490255
39372 37490255 31610475 27526963 27074513 28945709 32795146 38536550 43845173 46956997
39364 46956997 49426182 51781033 50235416 43378004 37922132 40136638 44801199 41772283
39356 41772283 31820015 26049667 29537446 35592498 37904281 38405539 39814632 39936993
39348 39936993 38267161 39630186 45136858 47089982 40095708 30957069 29473135 34234417
39340 34234417 36176679 32945611 30635497 32528989 34929778 34952518 34834758 36456069
39332 36456069 37765240 37308448 37367660 39718906 42195099 42374519 41516474 41878513 42718485
39323 42718485 42228154 41690222 44105524 48985311 51646606 48640647 41871962 35972158
39315 35972158 32891728 30978675 28974800 28425106 30936607 35079153 38315981 40717636
39307 40717636 43692605 45634370 42889019 35995229 30825778 31096804 33286544 32448121
39299 32448121 30204789 32414986 40274035 48442372 51966821 50861036 47212856 41793031
39291 41793031 35224576 29419150 25699925 23410443 21974460 22517047 25811080 30233928
39283 30233928 33576130 35627507 37042750 36620276 32283729 25241305 21134856 25165891
39275 25165891 36059173 46111275 48160344 42172071 34151505 29169469 27209428 25778278
39267 25778278 23745637 20899441 16143605 9244272 3390741 2837691 7780187 13928875
39259 13928875 17524790 18889621 20825217 25266182 31661955 37176616 38725921 36265592
39251 36265592 33235646 32020966 30666552 27021314 24145039 26762714 33105259 36059576
39243 36059576 33160218 29387603 28055448 25348660 17942045 10456290 9647152 14818218
39235 14818218 19624302 20649355 18677160 14043086 7179798 2393309 4290929 10293174
39227 10293174 12831493 9815170 7185907 9744181 15007078 18307300 18916187 18255567
39219 18255567 16299852 13065048 10615075 10752918 13085907 17104512 23005681 28607178
39211 28607178 29326272 24147024 18279160 16789527 18762241 20986812 23757042 28357382
39203 28357382 31608229 28726145 21040314 15971053 18661626 26716543 33374309 33605784
39195 33605784 27825369 21853580 21862803 27158762 30609286 29390731 31217680 43653083
39187 43653083 60251931 66274654 58356073 49185976 49645411 55038563 54695010 47913813
39179 47913813 42222290 40214810 37424115 32496573 30994190 36681554 44791927 47453881
39171 47453881 42951188 37010320 36374672 42585687 51137739 56089608 56141939 55695838 58721847
39162 58721847 62784833 61687641 53616792 43788889 38547380 39135479 41728561 41372461
39154 41372461 35432289 25531008 16939811 14076332 15906680 17592716 16741772 15322764
39146 15322764 15038253 14477470 12656877 11971491 14637539 18537900 19878170 18578356
39138 18578356 17997844 20195058 24108985 27576856 28595774 25635359 19734485 15576473
39130 15576473 17132974 22391700 25708309 25442406 25586367 29087764 33452069 34981214
39122 34981214 34443428 36152170 43160678 54738658 66380495 71138679 64321039 49575799
39114 49575799 37522005 34902304 37155491 35287840 27877999 21347837 19487306 18865813
39106 18865813 15952998 13163312 14379398 18253733 20178295 19040409 18158125 20247665
39098 20247665 24878908 30997056 38947299 48875314 58841177 65635117 66873104 62200240
39090 62200240 53373560 43348843 34569882 28051229 24248131 23613778 25062464 25208994
39082 25208994 21593041 16276614 13539442 13851416 13287900 9967344 7564915 9870596
39074 9870596 14714631 16987616 15949479 15286122 16554920 17193126 15701680 14286820
39066 14286820 14399100 13596188 9828762 5835498 5676315 8756819 10840492 9908846 7731383
39057 7731383 6269078 5614092 5298876 5107278 4860963 5375368 8403118 13165783 14922923
39048 14922923 10759824 4914735 3304830 4200818 1006321 -5741865 -7175574 629658
39040 629658 10074062 13416091 13557913 16696441 20150635 16605664 7511844 2603998
39032 2603998 6024999 11520997 13223635 13467578 16264389 19231798 17304330 11129779
39024 11129779 6755940 7919217 12080990 14147577 12176697 9097408 9416983 14320279
39016 14320279 20485785 24259913 25699968 26873524 27600394 25691793 20883193 15689772
39008 15689772 12361687 11364677 12564307 15359079 17959939 19147028 20309778 23041800
39000 23041800 25386724 23596349 17204333 9521461 4031784 3168888 8509244 17752733
38992 17752733 23591717 21265291 15702753 14818123 17432486 16000472 10360495 8441042
38984 8441042 11893052 12346608 6156454 1620849 4629610 7573198 2145235 -5376840
38976 -5376840 -3364406 6372585 11576851 8594225 6216408 10582284 17170827 19642845
38968 19642845 17655625 13399885 7730774 2308142 -358232 -1027259 -2925275 -5926489
38960 -5926489 -6588903 -4178161 -1024912 2941121 9254339 14141326 10519794 -979746
38952 -979746 -10153755 -9722572 -3780969 -535759 -2127545 -5166410 -6432056 -4395679
38944 -4395679 786381 5685832 5908141 2377145 840422 2819101 2564313 -3442243
38936 -3442243 -9437594 -7840715 201979 6828227 7311905 3474342 -625582 -2554835
38928 -2554835 -2529465 -3099129 -6039621 -8463783 -5604856 1210675 4484985 1084231 -2650863
38919 -2650863 -132581 6578048 11778832 14587627 16616128 16327451 12789707 10901039
38911 10901039 14950213 19927988 17575945 9240374 4161585 5779554 8542620 8785667
38903 8785667 9743270 13331874 15238513 12522583 9738636 12260470 17538144 17910730
38895 17910730 10198816 -796908 -7111311 -4206085 5459750 14035148 15134941 10007763
38887 10007763 5350763 5096157 6734302 5655931 381606 -6516366 -10073401 -6082380
38879 -6082380 4376852 14509031 19332559 21853017 26996323 31725352 28542673 18148214
38871 18148214 9895699 8150534 7073162 2132565 -2241155 -1692664 -177647 -2143135
38863 -2143135 -3713201 -20900 4600077 3255760 -949246 786788 8458108 13308078
38855 13308078 11716884 9135931 9528817 10457877 10641285 13353560 18970213 22008319
38847 22008319 19587891 16144482 15841892 16614077 15676908 14574910 14312254 11951428 7414509
38838 7414509 7234627 14661891 21475211 17698314 5683280 -3617901 -5498976 -4147624
38830 -4147624 -2719920 -353463 1254349 -1879912 -7343438 -6912674 971617 7512613
38822 7512613 6663757 4267292 8108403 15212312 16686275 11298934 6268984 6053308
38814 6053308 7609882 7018987 4574477 1728921 -2186316 -7737650 -12771495 -14106053
38806 -14106053 -10441007 -2919253 5519199 11002145 11095827 7405384 4512482 5413661
38798 5413661 8647490 10188127 7610269 2599958 -2107 3718332 12628056 21179953
38790 21179953 25178900 25818859 26522972 27334213 25401843 20767423 18415309 23102726
38782 23102726 33821073 44663612 50239919 49390987 44487526 38369863 32288096 26454546
38774 26454546 21752110 19694703 20402951 21791677 21592437 19417552 16276476 13134261
38766 13134261 10667876 9295027 8660946 8180745 8413721 10172777 12052767 11513624 9041489
38757 9041489 7704546 7374373 4167485 -1572199 -2306455 6299726 16724794 18722434
38749 18722434 13927867 12507639 16586785 17326711 10441714 4672518 9617136 22509550
38741 22509550 33148711 36432758 33869333 27414804 19060356 13808081 15771527 21768598
38733 21768598 24447428 21806379 18890599 19921029 23241736 24983849 24157173 22797659
38725 22797659 23355030 26755922 31549187 34900801 35547147 34837044 33571437 29897492
38717 29897492 22995190 16890333 16705571 21860837 26769793 27955489 26554740 23735747
38709 23735747 18260994 10262048 3526724 1248332 1897118 1924102 856828 1070315 3475862
38700 3475862 6105293 7110181 7233730 8539452 11542791 14204343 13651263 8998888
38692 8998888 2746542 -952796 -50955 3443527 5956076 6717465 8381102 12599027
38684 12599027 16643919 16817253 14650870 16224040 23806813 31258857 30853060 22992963
38676 22992963 15698766 15158139 20255271 26400862 31079331 34294150 36126678 35720754
38668 35720754 32098757 25882678 20594778 20407574 24762596 27661826 25373780 21921066
38660 21921066 22285309 23419510 19153518 11885540 10045375 13797208 13778809 6808466
38652 6808466 2052290 6150087 12438780 12820203 11326432 15877512 23553699 25373855
38644 25373855 21061573 17617454 16312649 12762793 8378644 9956477 17473965 22991804
38636 22991804 22783424 20641006 18347499 13704648 9758202 14056486 24529071 27560662
38628 27560662 16694966 3546047 2266205 11014682 17238333 15177394 9556308 6349437
38620 6349437 7890648 13847007 20023850 19415219 11104996 4624652 8299391 16747310
38612 16747310 18352472 12671417 10702573 17920680 26692965 28111775 23224254 18285876
38604 18285876 15180610 12037470 9504178 10547183 14870546 17877198 16031562 11015932
38596 11015932 7563789 8182082 10980210 12488489 11484535 9298976 7414147 6499693
38588 6499693 7196182 9396183 10812285 9163546 6189961 6168305 9553557 11900445 10659494
38579 10659494 8810191 9222293 9797573 7957743 6054491 7614330 11112894 12341820
38571 12341820 10740301 8790328 7444421 6973841 9750021 16330860 20889195 17303507
38563 17303507 8797233 4586413 7311022 11189069 12990606 16309116 22296858 24429669
38555 24429669 17723320 7197266 1366874 1438327 2493010 2159438 2263354 3656933
38547 3656933 5035546 6639359 10455519 15953281 19091158 17061520 12139079 9353993
38539 9353993 10822521 13440065 12987963 10053021 9417633 12371375 13248168 7507520 -80193
38530 -80193 -1728885 1089893 442899 -3130557 547011 13859826 23983498 20419133
38522 20419133 10385622 6664658 8033058 4486740 -3349901 -4803185 2226344 7846884
38514 7846884 7104778 6594018 10269400 11834101 7748378 6067314 13546264 23283349
38506 23283349 24894737 19678598 15620670 13255051 7402606 -714704 -3938265 -434073
38498 -434073 4607847 7731417 9749815 10780425 10763925 13656915 22493179 30926744 28811166
38489 28811166 16723508 6163843 4322344 7476759 10871824 15382829 21025905 22995400
38481 22995400 19146020 14209022 11993593 10113146 6776390 5741175 9298388 12801427
38473 12801427 11808796 8930728 8147567 8076064 6557253 6142296 8745335 10290360 7322667
38464 7322667 3826248 4580666 6754720 5460927 2861153 3849007 7068840 8398907
38456 8398907 9116405 12056245 14019652 11364205 8725251 11509898 13855030 6659081
38448 6659081 -5079218 -7074034 2459045 10357788 9627773 8343954 13234141 18360072
38440 18360072 16857411 12012372 9149455 6961787 4563820 7129269 15887870 21625551
38432 21625551 17596385 10954790 11425995 15676863 13673640 4948878 -2504755 -5434132
38424 -5434132 -6656475 -6306334 -2376902 1931240 1463759 -1518958 -673923 2971621 2759764
38415 2759764 -1004602 -721316 5124435 8451477 4385672 -1227287 -987857 4514905
38407 4514905 10181713 13394646 13882573 11808591 9335881 9573495 11316391 9522712
38399 9522712 3542886 -190593 3115423 9805436 13201012 11835648 8726187 6022889
38391 6022889 4200616 3941646 5478951 7948293 11350023 16425669 21019609 20621252
38383 20621252 15115042 10586772 10723950 10804495 5347461 -1925260 -2383120 4983753 12233277
38374 12233277 13859792 13024836 14514425 17087989 16461965 12309122 8249089 6629640
38366 6629640 6885031 8378669 11554673 15667949 17839181 16016501 12091964 10728529
38358 10728529 14787850 22349293 28604956 30556158 29226264 27025209 24144108 19278254
38350 19278254 13539029 10840239 12820971 15674924 14951513 12198900 12918485 17848590
38342 17848590 20826624 17377668 11450063 10117111 14584398 20827990 26949008 34327866
38334 34327866 42041317 46241723 46684143 48531356 54591690 59855847 57658439 48610766
38326 48610766 39399618 34320534 32070120 30391934 29699655 30727530 31498341 29261583
38318 29261583 24835208 22806006 26414617 33322502 37953203 37459465 33263685 27067307
38310 27067307 19039876 11227057 8300322 11457594 15331614 15421078 14935381 18441180
38302 18441180 22286687 19430403 11862547 8854057 12823611 16682516 16635583 17213613
38294 17213613 20332750 20138732 14389336 10938056 15455224 21704361 22769661 23643554
38286 23643554 32003570 43154744 46488590 43094503 44479530 54836959 65686264 68544475
38278 68544475 63485051 54491735 44870812 38108905 35708622 33698359 28040702 22431302
38270 22431302 22814825 25739654 22211593 13077041 9474834 15710868 22351533 20500980
38262 20500980 13472810 8929131 7521176 5577972 2913541 1791737 2405796 4341564
38254 4341564 9027359 16828038 24681111 29093479 28348645 21092795 8075813 -3501133
38246 -3501133 -4080963 6773198 18556881 22037654 17722803 10586272 4043048 2206550
38238 2206550 9377927 21609707 26397124 17743972 5303552 1267291 3997951 3267590
38230 3267590 -2703784 -5329890 675805 10585686 17268945 18625659 16123548 11455486
38222 11455486 6734753 4491766 5525956 8199936 10374952 11343941 12343188 15205811
38214 15205811 18995516 18833722 11745177 3273116 2624321 9934158 14808729 10576319
38206 10576319 3386370 2223545 5796170 6021025 546879 -5258067 -6797998 -4594470
38198 -4594470 -1101305 1940693 3553600 4404590 6519679 9607795 9951922 5551523
38190 5551523 -496544 -4310429 -5394429 -4001319 875870 7228675 8888901 3551554
38182 3551554 -2533034 -2899323 539374 2329416 1941857 1427642 -465836 -4963380 -8312978
38173 -8312978 -7006154 -3524493 41229 8332537 23424962 34505973 28805597 10549337
38165 10549337 -2849501 -3098190 1615252 1845177 -2033805 -6262409 -10738323 -15643797
38157 -15643797 -18847070 -19728890 -19076199 -14191574 -2110743 11329217 15102285 8265195
38149 8265195 2415295 5417677 11565384 12166043 7323055 2018285 -1763726 -3338991
38141 -3338991 -489393 6204921 12135213 16162770 22486752 30508647 31285259 21101474
38133 21101474 10802727 12412282 21980995 25550750 18734886 10566475 9118902 12273082
38125 12273082 13715415 11385907 8176016 8180863 13000134 19517824 22409374 20569156
38117 20569156 18170773 17376768 14891830 9494643 7257250 13160907 22272853 26345135
38109 26345135 25101518 23231080 20313854 13462058 7235222 9565982 17974116 21329168
38101 21329168 17223799 16045183 23532454 30522044 27345062 19144664 17261176 21721479
38093 21721479 23008212 18126091 14214529 16037065 19111680 17797739 13388630 10848784
38085 10848784 12139513 15637646 18611708 18020670 12272890 4471694 701347 2753747
38077 2753747 5777501 5682743 5174079 8608191 14118475 16012087 13218845 10059988 9556649
38068 9556649 11410059 16052062 24211570 31642729 31477082 24778189 21985435 29111842
38060 29111842 38426367 39122290 32339344 27589336 27275434 24195386 14709487 5589461
38052 5589461 4565915 10246469 15233517 15231491 11928242 9825563 12485727 19197470 23807763
38043 23807763 20049663 9763008 2623416 5740203 16336697 26285123 30612489 29665066
38035 29665066 26413224 24340525 25240423 26545020 23352996 15467686 9686440 12180346
38027 12180346 20673586 27019921 26082676 19818899 13929391 12287359 13541954 12446934
38019 12446934 6309935 -79055 495565 7463570 12459234 11257402 9838845 14768352
38011 14768352 22873256 25895688 21569550 14449286 8755711 6143248 8023363 13862297
38003 13862297 18603428 17614691 13218757 11024129 11293882 9992433 7086157 6734866
37995 6734866 9353515 10720303 9807752 10215796 12189219 10893396 5773034 4071968
37987 4071968 9956273 16431288 14508773 5959196 180232 1383910 5744258 9456718
37979 9456718 12468783 14277659 12835900 9426244 9244608 14449618 20368190 21118562
37971 21118562 16258676 9992186 6569425 8223639 14407346 20527869 20570420 14380484
37963 14380484 9713308 12994961 20236848 22071466 16363602 9878873 7683237 7797618
37955 7797618 8005205 10532900 15678656 17281976 10934335 2058314 -1366259 -671442
37947 -671442 -3057300 -8585172 -9914182 -4946924 -233287 249368 666364 4107600 6426546
37938 6426546 4672168 4095606 9728877 16708569 16693465 10148141 4922498 5178892 8362091
37929 8362091 11055036 11637130 9091454 5109944 5168044 11293548 16259466 12197783 3027037
37920 3027037 185340 6849449 14813508 17201775 15733408 14203064 13216654 13515632
37912 13515632 16471052 18762714 14646543 6398906 3886438 9982628 15793500 15776624
37904 15776624 17404988 27193535 36472451 33326862 22621753 19933515 27555764 31037042
37896 31037042 21683136 9227994 6431990 11763840 15410201 14837641 15007806 17361921
37888 17361921 17967870 15548692 13390889 12722982 11122887 9192223 12316196 22234988
37880 22234988 32054763 34682979 32868694 35053449 42884349 49210847 48751417 44214296
37872 44214296 39525829 33353713 24224939 17266868 19144342 28451086 37556367 42879538
37864 42879538 46704345 49243820 46903212 40566903 37987733 43392246 50476768 51010586
37856 51010586 45890386 41888097 40909988 38929362 33819212 28169725 24772587 24228915
37848 24228915 26610063 30936826 33422926 30687608 24442730 18888703 14383740 8622841
37840 8622841 3185487 2639225 6686255 9708189 9656006 10764535 14759601 16202639 11175553
37831 11175553 4735740 3715033 6456967 6462965 3336413 2802138 6940387 11524159 13590560
37822 13590560 15276345 18545727 21737577 23686914 26279365 29904244 30885602 27424973
37814 27424973 24464150 27642835 34536703 37334131 33837244 30525787 33288522 39461772
37806 39461772 41880411 38080697 32190141 28892041 28631115 28890626 27860477 26036292
37798 26036292 25474422 27972503 33023321 37464146 38490888 37326392 38249307 43101818
37790 43101818 48411486 49534367 46338828 42560594 40195830 37393639 32648284 28537625
37782 28537625 29042416 33858273 37430169 34437467 25594392 17153134 14418068 16491855
37774 16491855 18496743 18368123 18863210 21953371 24564676 23129231 19910585 19908064 22436330
37765 22436330 21703756 16626225 13774985 17767907 24627704 28897192 31738695 36163796
37757 36163796 39375059 37752229 35851842 41021176 50561259 54312595 50199282 46295451
37749 46295451 45255055 38878094 24209999 13534727 18161499 30463335 33985336 26468470
37741 26468470 20489987 23607387 30235346 33300271 32241380 27567068 18416946 8855047
37733 8855047 6512413 10660361 11060472 3701804 -1838071 2656129 10910738 12714512
37725 12714512 9778579 10443072 14163626 13105651 6482799 1756893 2073257 3108288
37717 3108288 3053659 5499463 10359308 11529926 7033065 3275806 5420671 10803558
37709 10803558 15465835 19611275 22318520 18839816 9242256 2728300 6105426 13573260
37701 13573260 15474401 12052095 10020664 9835928 6533204 1243765 1418510 8949948
37693 8949948 17102942 20748091 21418252 20450143 15728263 8452167 4823985 6249129
37685 6249129 5275333 -2830147 -11074409 -10502313 -3566104 718991 1138433 3916861 9240999
37676 9240999 8856961 -166607 -8394649 -6356056 2398032 7582227 7878395 12114346
37668 12114346 24391896 35506766 33764989 20666938 9963913 10998270 18110966
37661 18110966 19417363 12322223 5175544 4821322 8741700 11150258 10897413 9162895
37653 9162895 4154593 -5336435 -13378150 -11378828 46053 9974074 10289910 4828418
37645 4828418 2343373 4848406 7537009 7591755 7643748 10224365 12660903 9476800 -1049569
37636 -1049569 -13646692 -19770768 -15297323 -4497768 4578930 8122984 8072903 6574786
37628 6574786 3120947 -1558377 -3214566 723136 6330093 7429535 3206911 -1820563
37620 -1820563 -4181108 -4157707 -2807425 -18411 4109468 8640806 12599842 14197597
37612 14197597 10442921 1246846 -6638839 -4783385 6228225 15567366 14501293 6701734
37604 6701734 2544388 5370225 8333601 5102388 -1117244 -2288849 3348727 9326291
37596 9326291 10246945 8653949 9940817 13778922 15408031 14108626 14506353 18415514
37588 18415514 21129991 18723180 13956937 10734587 7172275 -70250 -7622638 -8173473
37580 -8173473 -329498 10127033 18161348 22867216 23408939 18350246 10378427 5585915
37572 5585915 5539677 4932399 -294634 -6736356 -8133349 -2746535 6118253 13633921 15478409
37563 15478409 9898823 464374 -5692386 -4499829 1834864 8499116 11968153 10276472
37555 10276472 3865305 -2762481 -4488147 -1808154 551547 1553364 4709291 10192429
37547 10192429 13087892 11896121 11574472 14553225 15986099 12709263 9911757 12913918
37539 12913918 18486006 20785587 20268781 20055595 19190673 16908817 17779220 23816659 26539763
37530 26539763 16952025 33050 -10770041 -10974321 -6949820 -2627539 4549246 14642434
37522 14642434 22656516 25989895 25864424 21656080 12933546 6045484 7722898 12369048
37514 12369048 7983811 -4214617 -9568064 -2396296 5579632 4963015 2839458 8433973
37506 8433973 16889731 18459138 14403624 12019988 11123041 7321001 3238716 4642622
37498 4642622 9011693 9062787 5250509 4481008 8137723 11221470 12307398 14805744 18479866
37489 18479866 18585419 14101350 9225197 6296315 4220828 3742898 6927485 11305662
37481 11305662 11871053 9211723 8398781 9593168 7718669 2462806 244845 3770232
37473 3770232 7228183 5251384 303011 -2157168 -346334 4665456 10797549 13456543
37465 13456543 8331935 -1124066 -5041359 362349 7511774 8810126 7044654 8915919
37457 8915919 13719991 15679351 14130310 13947043 17137869 20590263 22106237 22981090
37449 22981090 23618156 21371888 15073370 8926832 9062978 16175089 23032262 21234868
37441 21234868 11302221 3449828 5005643 9595496 5352391 -6650925 -11249966 -70433
37433 -70433 15343761 18810025 11260653 7135787 12502236 18241785 15858809 9623305
37425 9623305 8512073 13276760 17201030 15819103 11096294 7964454 10018859 17112607
37417 17112607 24729251 27042966 22587488 16013730 13170657 15525856 19834727 21666212
37409 21666212 18996163 14242219 12655366 16179070 19314789 14941011 4622187 -1698723
37401 -1698723 1745404 9027216 10903525 6595643 2623446 2826959 5027528 6577946
37393 6577946 7971286 10101399 11595790 10286496 5703108 5803 -2481559 1738991
37385 1738991 10586175 16578385 15032364 10260925 9460538 12255976 12192864 8069590 6423167
37376 6423167 10601080 14562105 12394428 8369796 10685159 18205866 20975038 13975686
37368 13975686 4015074 933103 6525459 14841518 20226648 21797553 21431619 20467815
37360 20467815 18907744 16496929 13822413 12249661 12597023 13975695 14422353 12811407
37352 12811407 10004755 8350612 10093620 15353461 20932028 22041142 16678593 8230382
37344 8230382 2671509 3077272 7469998 11616635 12825565 11139342 8209289 5824569
37336 5824569 5129702 6512245 9599274 12930473 14103782 11542897 6605639 2903197
37328 2903197 2682763 4461398 4910142 2634040 -472027 -1480543 21745 775602 -2479452
37319 -2479452 -7392969 -6470883 3852663 16468289 20585775 14858669 7914646 5431626
37311 5431626 3817102 -608387 -3939908 -1961804 1349895 221455 -2806127 -1768253
37303 -1768253 1352129 131942 -3286270 39856 10120150 15284114 8991666 -393699
37295 -393699 -2276588 1799628 3247302 -203338 -3395382 -1957680 4565903 14447741
37287 14447741 23166195 24446290 17408887 9657055 8163835 10646082 11415987 11293138
37279 11293138 14165959 17377678 15007437 9330403 8990718 14901892 17865066 13252233
37271 13252233 8639258 11253549 15674843 11898336 742699 -7351664 -6859486 -2352714
37263 -2352714 925547 3883528 8370369 11553126 10319337 7453831 8017815 11394446
37255 11394446 12393671 9827416 8064521 8628663 6423820 -1538330 -8632614 -6282531
37247 -6282531 3311492 9263526 6800718 3104433 6350197 14709961 19795767 17266897
37239 17266897 10614208 6684610 9656685 17459069 23095019 21909922 17468694 16540387
37231 16540387 19078366 19248449 16324296 16127685 19483782 18983059 12214558 8242095
37223 8242095 12979614 17497486 11893557 3190075 5664775 17865012 24391252 19570092
37215 19570092 14235624 16871806 22318726 24003066 24619837 27792534 29712092 26943975
37207 26943975 24115986 26002206 29007581 28056862 25510684 25591270 25960804 23045155 20455651
37198 20455651 23271409 28002660 27214134 21193030 16328939 14353016 12125380 10303026
37190 10303026 12710603 17612445 19173353 18290423 22386875 32250511 38317898 33922255
37182 33922255 24214584 17291297 13829680 11187458 10970798 14933476 18057683 14250374
37174 14250374 6894344 5648493 12780233 19879084 19603683 14470884 11305303 12101238
37166 12101238 14220589 16030662 17748031 18360724 16165040 12406905 10813295 12468889
37158 12468889 13864795 11781142 8348997 8959695 15507016 23748105 28178649 28312283
37150 28312283 28576065 31931098 35280147 32939266 24278029 15527628 12738270 14837234
37142 14837234 15972961 13503903 10418384 9903860 11209718 12285542 13158322 14138009
37134 14138009 13296272 9145872 4413049 3670953 7630270 12707831 16094152 18543232
37126 18543232 22082704 27281702 32563322 33952539 26613945 10561637 -5260735 -9422924
37118 -9422924 -345140 11800002 17710130 18990948 21635762 23931856 18525501 6233507
37110 6233507 -535054 7047790 20702882 23917796 13371200 4027004 10020646 26586472
37102 26586472 36824041 32716828 21761693 13743971 9899915 7825034 8476788 11949149
37094 11949149 12527036 6258891 -16333 3894468 16143318 23651924 19347334 10511673
37086 10511673 7243867 9763395 11477067 9150965 4857968 1178688 -792657 -469102
37078 -469102 1606001 3325062 3624691 4314378 7699195 13837682 21004885 26730320 27979242
37069 27979242 23613764 17573376 15729337 18164113 18886683 15100378 11572965 12349880
37061 12349880 13252493 8077670 -1071830 -5663627 -1644271 6518851 12186359 12949539
37053 12949539 11122683 11184649 16179962 23798364 26966563 21206847 10413707 2717263
37045 2717263 2151630 7258957 15625594 25326252 33068750 36008732 36075768 38649533 45918253
37036 45918253 54337502 59191118 58922230 54406034 46833833 37821168 29941049 25641209
37028 25641209 25712171 28708565 31595218 31817792 29409202 26240903 23223186 20234618
37020 20234618 18847501 21530354 26625307 28092223 23288896 17593347 17427382 21490627
37012 21490627 23329686 20437487 15993895 12955114 11302899 10618726 10909878 10920663 9372665
37003 9372665 7626175 7741100 8751668 8496260 7803322 8458256 8500547 5220299 2032495
36994 2032495 5322944 13280356 15274092 6244593 -4157839 -2539049 11297602 24212275
36986 24212275 25627831 18251463 11768538 10266626 9681072 6154548 2055170 1526052
36978 1526052 3633180 4518292 4735867 8362701 14145496 14360952 5954295 -3014695 -3049885
36969 -3049885 5136885 13819534 18669042 19870048 16992228 10322690 4753971 4835025
36961 4835025 7745237 8218400 7979901 12120161 18415917 19941818 17100102 16497031 18060828
36952 18060828 14990995 7933972 6420839 12112486 13252913 2703238 -9543897 -10489830
36944 -10489830 -1795017 5795004 8150026 8379733 7923538 6614206 6864992 8944197
36936 8944197 6778331 -2561366 -10005757 -5272152 7213424 13952366 11565837 9333211
36928 9333211 13436246 19554423 21971300 20281327 15551924 8673616 4108674 6678853
36920 6678853 12668954 12479125 4461887 -2100491 -578004 4775728 7878383 9932792
36912 9932792 14155002 18049882 17106460 11884531 6431868 3095202 2511972 4758656
36904 4758656 7038245 4501697 -2831619 -7836770 -4538226 4926418 14367439 20376513
36896 20376513 22470243 21363008 20115751 21807878 23460561 19106268 12063787 14616419
36888 14616419 28795130 37544498 26075792 4258282 -6005904 -782309 4165493
36881 4165493 9000 -3965517 712005 7434292 6958164 1855546 -711929 -1292943
36873 -1292943 -3610747 -5068297 -1598121 3494110 4942447 5131231 8729244 11725143
36865 11725143 6534803 -3866898 -7680384 -388133 10406778 17153866 20074815 20751301
36857 20751301 17207629 9414710 2338148 -996724 -3602156 -7631490 -9069760 -4017415
36849 -4017415 4378755 10018078 11176164 9643286 6358107 2353252 706106 2890532
36841 2890532 5733076 6087913 5862299 8179980 11150422 10158686 4742218 -844319 -2591413
36832 -2591413 702068 7478746 12938615 11576422 3905472 -2573033 -2874380 -810425
36824 -810425 -1220923 -1500602 1997107 4500904 -118010 -6125278 -1752746 11982503
36816 11982503 20483745 16025282 7472188 5184472 7076818 6264950 3244922 2358153
36808 2358153 3374211 4807198 9292830 16969864 19361112 10221139 -1446486 -611193
36800 -611193 12765107 23048491 20351046 12190395 10314544 14840671 17211865 13035984
36792 13035984 5963150 1776760 3107781 8210745 12131258 11058893 7476126 8078119
36784 8078119 14205223 17890066 11442014 -1552988 -9926958 -9026122 -5812304 -8105242
36776 -8105242 -13064795 -10737797 2101654 16431676 21509989 17862194 15422295 19300225
36768 19300225 22983913 18719708 9948892 7041159 12175172 16075372 11920710 5522714
36760 5522714 6241985 12531093 14259165 8219273 3159040 6848384 14675124 16220507
36752 16220507 9478419 2697321 3088912 8728392 12270007 9200580 1812762 -2351399
36744 -2351399 3584869 17925089 28906953 26065207 13592577 6441260 11311864 18643624
36736 18643624 17803061 12587051 13334033 19052634 18732472 9338220 935896 1128540 4473437
36727 4473437 2972862 -725245 1777544 10903966 17856788 15942528 7578516 -21527
36719 -21527 -2363834 -513059 1330829 734950 -205941 1824237 5879351 7850475 7158137
36710 7158137 7737902 11044758 13344214 12489099 11700076 12614794 10371453 1613746 -7314859
36701 -7314859 -7687878 -1156060 2565984 -476678 -4749084 -5473855 -4853043 -5964201 -7165393
36692 -7165393 -6246366 -5241889 -6735183 -8296074 -5009172 3209531 10165701 10140326 4654691
36683 4654691 1111697 4328146 10561508 11795101 5522608 -2619319 -6433541 -5788777
36675 -5788777 -4180913 -3577821 -4236776 -5955513 -6503029 -2627710 3967099 5995562 251692
36666 251692 -6683205 -7635739 -4735028 -3450787 -2218381 2577416 5587717 -1356582
36658 -1356582 -13289263 -15413972 -4578803 4974148 2161493 -5821615 -6058627 1548625
36650 1548625 7034024 5394554 112741 -4455792 -6426173 -4602522 -30261 2440047
36642 2440047 -187523 -3477575 -933982 6323180 10258213 5909064 -3194426 -9476002
36634 -9476002 -8670041 -3334909 -404040 -3711693 -8578612 -7203651 140259 4746473
36626 4746473 2086362 -2003040 -1579104 175944 -1784868 -4422137 -2358511 1152868
36618 1152868 -1254492 -7956203 -9612293 -3341205 3420063 4517521 2696646 3397880
36610 3397880 7273355 11250035 12233473 8395387 1171584 -3773113 -2461957 1010666
36602 1010666 14327 -3440731 -998862 7882804 13164414 8689082 798570 -2223626
36594 -2223626 -1360021 -1249110 -359930 5156157 12427100 15049178 12813458 10655806 9523287
36585 9523287 5841580 -284088 -3755537 -2723437 -1760523 -4030971 -5091308 1583134
36577 1583134 14974774 25730244 25301055 14891704 4553888 2552578 6270503 6303389
36569 6303389 -343091 -5905234 -3278042 3508049 5820229 3533031 3968300 9326703
36561 9326703 13644643 13211697 11881405 13029297 13484434 10219091 7422211 11042124
36553 11042124 19570304 25412946 23432245 14510561 3409460 -3281851 -672090 8125152
36545 8125152 12569100 7294721 937170 5115502 16882284 21305681 11885484 -1156770
36537 -1156770 -5998644 -3708216 -2131807 -2777492 -1602902 1717055 3729503 4523036
36529 4523036 7392992 11384870 11166860 5605273 503820 482442 2855438 2463737 -955359
36520 -955359 -3378009 -2233935 1226658 3980269 3608947 -261255 -5198246 -7435849
36512 -7435849 -5299919 -454874 4680839 9116989 12101147 12046075 8803591 5587410
36504 5587410 5963826 9182075 10873168 8867082 6192541 6845201 9938021 10544754 6867319
36495 6867319 4235098 9317693 20631029 27834017 22440136 7892813 -3085999 -979316
36487 -979316 11756196 23729513 25304397 17000997 8339242 7725802 13337506 16042404
36479 16042404 11564935 5521164 3978354 4214100 535436 -4761305 -4563158 438251
36471 438251 1848858 -2398321 -3857888 2547483 9558195 8977222 4264399 3272568 4587597
36462 4587597 1599848 -3425655 -1183952 8833624 15565123 12137403 4680714 1230756
36454 1230756 725290 -883653 -1262826 3223112 8164009 6323916 206340 1909 8143573
36445 8143573 14473980 10421135 1427350 -318366 8079651 17308337 17927747 10340860
36437 10340860 2131492 -419457 3631689 11202266 17574756 18778581 14430400 8388464
36429 8388464 4966666 4554195 4457241 3674161 4454801 8449918 13471125 15556388 12998828
36420 12998828 7194865 893703 -2956231 -1948452 4079810 12228186 18611180 21131821
36412 21131821 19996108 16915905 14586322 14990447 16688556 15744619 11134865 6707144
36404 6707144 5085585 2750852 -4069390 -10836626 -8633431 3092701 14251007 16658484
36396 16658484 13111438 10893018 11720471 12711542 12988454 13640581 13609820 11032979 7318638
36387 7318638 5222650 4248719 2694575 2754488 7812374 15134258 17535653 13348824 8876786
36378 8876786 9013320 10990206 10338280 7885088 6656357 5806373 2591777 -1850370 -3349600
36369 -3349600 -510425 3770563 6172766 6152429 6269496 10700766 21006312 31509307
36361 31509307 32616575 22461667 11741778 11709647 19915964 24134112 18873338 10660101
36353 10660101 6849529 7227636 9158230 13325444 19215136 20666257 12816602 913897
36345 913897 -4103816 1622636 11337255 16968435 17504395 16765030 16473413 14700840 10389053
36336 10389053 6519619 6912710 10643923 12402811 9620685 6437063 7666570 11309081
36328 11309081 11712132 8695757 7416018 8965664 8054881 2377959 -2429667 -1440431
36320 -1440431 1532685 -56459 -5492504 -8394789 -5620672 184237 4441412 3088544
36312 3088544 -5220460 -14696623 -14516038 -1681534 11985474 13298184 5212603 2084192
36304 2084192 9091250 16586915 16014408 11280945 10138058 12396944 12755166 10244324
36296 10244324 8745701 10235229 11971925 10078836 4145315 -1255949 1758 8678573
36288 8678573 17508214 18342761 11057176 2273402 -2937436 -3923092 -1443904 2393838
36280 2393838 3084321 -745613 -2448562 4334915 14113466 15702374 9273744 6145216
36272 6145216 10391815 13049249 8499494 4159994 7177419 12600736 13152477 11152545
36264 11152545 11512986 11431834 7169391 3761377 7282624 13423581 14392500 11721311 11239415
36255 11239415 10579906 4014662 -4195108 -4466905 2193116 6031996 5219659 7000476
36247 7000476 11709965 10277069 1447123 -2217427 7431344 20590723 22488896 12330009
36239 12330009 1289754 -2823155 -1066482 2914070 7071881 9473422 8054332 3234148
36231 3234148 -1061582 102392 8098595 17397890 18754700 8890629 -4653274 -12137867
36223 -12137867 -12924563 -12988243 -13502623 -9548247 -227355 7726443 8644124 4325165 -97416
36214 -97416 -1393137 1869257 8890995 14561460 13454321 7560430 4618257 7472854
36206 7472854 11042793 11288421 10524017 11278889 11239224 7873064 3264081 1301052 3722366
36197 3722366 10105790 17376039 19353679 12852349 4244067 2620280 6143855 4138061
36189 4138061 -5782870 -12809045 -8679926 1459502 8670938 11305653 10979589 6827871
36181 6827871 637471 -645171 5103134 10037228 7934291 3137965 1061107 -1305341
36173 -1305341 -6823586 -9111726 -2596445 5919787 7093891 3892465 4836662 8507279
36165 8507279 7697731 4093705 5073737 9275959 9227334 6040619 7431595 12433560 12477301
36156 12477301 7535572 6637220 11303876 13179077 10359801 11084435 17116965 18043300
36148 18043300 8025254 -4767954 -11541132 -13214588 -11504308 -3296131 8353516 11421780
36140 11421780 3136741 -2026073 5693575 14067377 8233374 -3786985 -2978979 10494694
36132 10494694 18657066 14434015 9377129 11251048 12344588 5743100 -2074493 -2834209
36124 -2834209 1023946 3494023 5145118 8071120 8838738 4978344 2003692 5336122
36116 5336122 10406618 9576935 4869253 4475434 9041823 11246616 8802612 8188125 13067619
36107 13067619 17515259 15447570 10465494 10282491 15192155 18443831 16465594 12439210
36099 12439210 9167901 4166873 -5014069 -14167388 -15501164 -6677477 6462588 16417255
36091 16417255 20452914 19664767 14758251 6048019 -3006964 -5789409 1749039 16053678
36083 16053678 28237418 31743534 27214831 19901410 13668036 8920416 5671239 5759267
36075 5759267 10204861 16172442 19546110 20045353 20531077 21035298 17667087 9399738 1713734
36066 1713734 -399640 237600 -2168941 -6602775 -6985960 -3006609 -1286269 -3972108
36058 -3972108 -4481279 713486 3768885 -3268359 -14322908 -16253827 -7610221 4050
36050 4050 -268977 -1935650 2155491 8170229 9035545 6894391 9395915 16938284 21665167
36041 21665167 18600690 11469248 6751001 6553592 8480405 9490220 8839159 8522449
36033 8522449 10546390 13322001 13003060 9413992 7005912 7774126 7845150 4915570 4091407
36024 4091407 10338977 19135330 21974087 18491222 15257430 14511293 12974535 11000002
36016 11000002 12875851 16890222 15464720 8479383 6275881 13653793 20068178 14160139
36008 14160139 1429276 -2606807 6099825 15293081 13629808 4759524 747259 6004997
36000 6004997 12517593 10810666 2079809 -3877323 -2095584 1458946 119151 -2842433
35992 -2842433 -604071 4374313 3731517 -2021713 -3365436 2300323 6414640 4804175
35984 4804175 5440956 13744897 21110316 17743115 8318215 3914924 4728952 2360044
35976 2360044 -4778032 -9794298 -9277805 -6823707 -5181178 -3448472 -1896275 -2312406
35968 -2312406 -3796837 -4093587 -3806431 -4064648 -2905037 218763 452225 -4743124 -8384478
35959 -8384478 -3280373 5388720 6796402 908185 -2285959 1857430 8290948 11740941
35951 11740941 10455990 2765772 -8899861 -13044061 -1428453 14953800 17115981 5643531
35943 5643531 586784 10837696 21142524 16674979 4115658 -2272359 -1694851 -1255309
35935 -1255309 -270985 5624162 11678028 9223472 496748 -3286620 2530622 11146028
35927 11146028 13930910 8335511 -2159605 -10308119 -9307653 337801 10075503 12605078
35919 12605078 8722417 2963954 -1670128 -1774008 5919160 17020813 20291121 12394189
35911 12394189 4492144 6946201 14812985 16763083 11149465 3760927 -3416708 -10085192
35903 -10085192 -10214095 567384 13741522 16694060 10732033 8204020 13163479 17783439
35895 17783439 17975514 18883259 21995893 19660793 8213825 -3398527 -4856483 2570211
35887 2570211 10030002 12527141 11201605 8612474 6632705 6480038 7635676 8408933
35879 8408933 8406333 7827559 4902333 -1469685 -6804160 -4441817 5252121 14579490 18495314
35870 18495314 19207056 19351100 16917563 10168360 2522958 -1313143 -948333 548753
35862 548753 352795 -2729360 -7459031 -9939394 -7861507 -5223367 -7864537 -13700798
35854 -13700798 -13715541 -4808522 5041697 8381549 8809956 14052781 23139745 27731468
35846 27731468 24392332 18676479 16505071 16971734 15798251 12293197 9769915 10087754
35838 10087754 10448858 6944107 503692 -2937546 429381 6765902 8943695 5644241
35830 5644241 2548726 3845419 6235975 3799084 -3474197 -9159463 -8142976 -2525513
35822 -2525513 1285480 455395 -998974 2240125 9143919 12796277 8995840 1720422
35814 1720422 -1788158 641558 4992015 6905096 6200995 5942085 8504080 12415761
35806 12415761 13120129 8388778 2509765 1972949 7059078 12125003 14725108 18350181
35798 18350181 23975650 26092545 21770003 16862551 16741521 16854218 10422139 621463
35790 621463 -3899970 -2081070 302274 1562766 4198189 6055665 2633911 -1815140
35782 -1815140 2978034 17106841 27387092 24186320 12614851 3104937 -897744 -1245831
35774 -1245831 1440402 6762648 11661495 13085736 10680183 5299992 -1084287 -3858502
35766 -3858502 -41433 5614635 5648403 1267570 591624 4949243 6714490 2894040 155576
35757 155576 2214814 2838435 -2646311 -8554785 -8529140 -5461508 -4555194 -4462277 -2604917
35748 -2604917 -1367612 -1357071 3180963 13445442 18891804 11407798 -541812 -3435248
35740 -3435248 1768470 4066661 1405635 1323839 5122139 5767832 2237073 2898661 11649523
35731 11649523 21258873 24009901 20397785 14329625 7703352 2962886 3784428 9385961
35723 9385961 13601671 12708773 9774832 9198286 11145880 13035516 12918152 10510069 7797065
35714 7797065 7818554 9613056 7135297 -1602032 -7856919 -2631819 8378957 10089075
35706 10089075 -1548397 -14246424 -16467791 -10321083 -3883921 464182 4568567 8097492
35698 8097492 9626469 9988019 10133268 9135120 7357649 7639590 10528890 12420527 11077137
35689 11077137 9003252 9124322 11324235 14924470 19480084 21431744 16346376 7276170
35681 7276170 3908436 9105070 13178564 7420135 -2878181 -6256387 -1163380 4125374
35673 4125374 4797395 4033875 4900605 5791672 5413030 5919504 8596190 10921885 10486598
35664 10486598 8740918 8551718 9990884 10360133 7331797 1101143 -5658769 -9343372
35656 -9343372 -7719282 -1519250 6027094 11227112 12109530 9713233 7239887 6910090
35648 6910090 7755809 7516910 5938336 4413228 3346713 2553044 3417175 7031327 10449595
35639 10449595 9120197 3657177 -292823 -42811 1177335 1072302 2590266 7956087
35631 7956087 13441390 14854028 14252411 15631518 16796505 11854179 860410 -8858451
35623 -8858451 -11629023 -9202317 -6572896 -5553659 -4002932 606531 7826191 13496139
35615 13496139 12878666 5984038 -1172357 -2688046 509893 2205076 -1276481 -7010375
35607 -7010375 -9471339 -6830008 -2363326 -19810 567133 3275452 9203578 13816082
35599 13816082 13262490 10935476 12411264 15445214 12587212 4321183 600561 5920398
35591 5920398 12060682 11629714 9803292 13708188 18025028 13190234 3028082 629823
35583 629823 8088691 13698358 10474565 4841271 3881206 5813307 7696089 11457823
35575 11457823 16229740 14912377 5754029 -1711098 -486751 2488226 -1779457 -8539261
35567 -8539261 -6764909 2676850 8492547 6209308 2355924 1916723 2366717 1152644
35559 1152644 -422204 -2254551 -5774961 -8048355 -4447701 1380715 228285 -7025758
35551 -7025758 -7130817 6418070 21564751 23100853 12604450 3850368 3466132 5995469
35543 5995469 5646530 3292559 1571302 841744 1606232 5302082 11084164 15851580 18229326
35534 18229326 19070621 18159903 14445510 9729699 8039392 10379240 13201285 12821939
35526 12821939 9029129 4351969 1999367 3841008 7997774 9582170 6424154 2198694
35518 2198694 742172 65545 -3253036 -6467084 -3987724 3070804 7844258 8051462
35510 8051462 8043886 9898137 10287033 8249780 8341735 12547269 15836387 13952938 9905931
35501 9905931 8621897 10238526 12225625 12814925 9242314 -770846 -11772360 -12351117
35493 -12351117 -31885 12594242 13484896 6174606 1399894 668426 -1630974 -5094818
35485 -5094818 -4099261 937904 4377948 5952427 9572035 12688396 8740830 628116
35477 628116 -533112 7617546 14769755 14490347 12888438 15498348 16976277 11565001
35469 11565001 4184969 1999197 2466166 -598257 -4948128 -4102206 226586 220321 -4927485
35460 -4927485 -7411900 -3002297 2935614 3691060 -50218 -2254875 772594 6528965
35452 6528965 8963087 4980172 -1291758 -2649515 2098747 6660830 6375182 4026906
35444 4026906 3475334 2847879 -661544 -3789972 -1808061 2862058 3802426 583611 -1564564
35435 -1564564 -935866 -579319 -416961 3661059 10777892 12689499 4556365 -7190085
35427 -7190085 -12154487 -7639962 728049 6990830 9378167 8645889 6006091 2879025
$$ [...]
##END NTUPLES=NMR SPECTRUM
##END=
