##TITLE=31Pdec_LR-0169-C2-CH2Cl2
 CDCl3 64 sc
 28.8.2023
##JCAMPDX= 6.0         $$ Bruker NMR JCAMP-DX V2.0
##DATA TYPE= NMR SPECTRUM
##DATA CLASS= NTUPLES
##ORIGIN= UXNMR, Bruker Analytische Messtechnik GmbH
##OWNER= root
$$ XWIN-NMR		Version 3.5
$$ Mon Aug 28 14:30:45 2023 Russian Standard Time (UT+4h)  she@DPX200
##.OBSERVE FREQUENCY= 81.013821
##.OBSERVE NUCLEUS= ^31P
##.ACQUISITION MODE= SIMULTANEOUS
##.ACQUISITION SCHEME= undefined
##.AVERAGES= 64
##.DIGITISER RES= 16
##SPECTROMETER/DATA SYSTEM= spect
##.PULSE SEQUENCE= zgpg30
##.SOLVENT NAME= CDCl3
##.SHIFT REFERENCE= (INTERNAL, CDCl3, 0, 248.564)
##AUDIT TRAIL= $$ (NUMBER, WHEN, WHO, WHERE, WHAT)
$$ ##TITLE= Audit trail, XWIN-NMR		Version 3.5
$$ ##JCAMPDX= 5.01
$$ ##ORIGIN= Bruker BioSpin GmbH
$$ ##OWNER= she
$$ F:/spectra/data/she/nmr/P31/1/pdata/1/auditp.txt
$$ ##AUDIT TRAIL=  $$ (NUMBER, WHEN, WHO, WHERE, WHAT)
(   1,<2023-08-28 14:29:07.93 +0400>,<she>,<DPX200>,
      <continue with go, POWCHK disabled, PULCHK disabled
       configuration hash MD5:
       00 E9 B6 7A A2 85 ED C7 34 08 36 98 17 FE 4E 26
       data hash MD5: 32K
       71 D8 F8 D0 F7 F3 B5 20 7F 85 C5 AA E5 38 2B 49>)
(   2,<2023-08-28 14:29:09.79 +0400>,<she>,<DPX200>,
      <Start of raw data processing
       efp BC_mod = 2 LB = 5 FT_mod = 6 PKNL = 1 PHC0 = -10618.61 PHC1 = 11.08485 SI = 64K 
       data hash MD5: 64K
       D4 6F F2 80 90 50 25 83 B4 5F 50 8B 50 59 42 F5>)
(   3,<2023-08-28 14:29:40.68 +0400>,<she>,<DPX200>,
      <pk PHC0 = -102.1646 PHC1 = 0 
       data hash MD5: 64K
       F3 83 E0 51 D3 BF 12 2F F9 A6 AD 95 74 9E CF 92>)
(   4,<2023-08-28 14:29:44.56 +0400>,<she>,<DPX200>,
      <abs ABSG = 5 
       data hash MD5: 64K
       F9 65 85 AF C8 17 48 A3 7B 73 B7 C1 FC 38 4F C2>)
$$ ##END=
$$ 
$$ hash MD5
$$ 51 3A 1B A8 02 CD D7 BA 70 54 E3 13 6E 2E CA 68
##$RELAX= 
##$RELAX= 
##$RELAX= 
##$RELAX= 
##$RELAX= 
##$RELAX= 
##$RELAX= 
##$RELAX= 
##$RELAX= 
$$ Bruker specific parameters
$$ --------------------------
##$DU= <F:/spectra>
##$EXPNO= 1
##$NAME= <P31>
##$PROCNO= 1
##$TYPE= <nmr>
##$USER= <she>
##$AMP= (0..31)
100 100 100 100 100 100 100 100 100 100 100 100 100 100 100 100 100 100 
100 100 100 100 100 100 100 100 100 100 100 100 100 100 
##$AQSEQ= 0
##$AQ_mod= 1
##$AUNM= <au_zg>
##$AUTOPOS= <>
##$BF1= 81.014009
##$BF2= 200.13
##$BF3= 200.13
##$BF4= 200.13
##$BF5= 200.13
##$BF6= 200.13
##$BF7= 200.13
##$BF8= 200.13
##$BYTORDA= 1
##$CFDGTYP= 0
##$CFRGTYP= 5
##$CHEMSTR= <none>
##$CNST= (0..31)
1 1 145 1 1 1 1 1 1 1 1 1 1 1 1 1 1 1 1 1 1 1 1 1 1 1 1 1 1 1 1 1 
##$CPDPRG= <waltz16>
##$CPDPRG1= <>
##$CPDPRG2= <waltz16>
##$CPDPRG3= <>
##$CPDPRG4= <mlev>
##$CPDPRG5= <mlev>
##$CPDPRG6= <mlev>
##$CPDPRG7= <mlev>
##$CPDPRG8= <mlev>
##$CPDPRGB= <>
##$CPDPRGT= <>
##$D= (0..31)
0 1 0 0 0 0 0 0 0 0 0 0.03 2e-05 3e-06 0 0 0 0 0 0 0 0 0 0 0 0 0 0 0 0 
0 0 
##$DATE= 1693218461
##$DBL= (0..7)
120 120 120 11 120 120 24 19 
##$DBP= (0..7)
150 150 150 150 150 150 150 150 
##$DBP07= 0
##$DBPNAM0= <>
##$DBPNAM1= <>
$$ [...]
##$SUBNAM3= <"">
##$SUBNAM4= <"">
##$SUBNAM5= <"">
##$SUBNAM6= <"">
##$SUBNAM7= <"">
##$SUBNAM8= <"">
##$SUBNAM9= <"">
##$SW= 501.771253377433
##$SWIBOX= (0..15)
0 1 3 0 0 0 0 0 0 0 0 0 0 0 0 0 
##$SW_h= 40650.406504065
##$TD= 32768
##$TD0= 1
##$TE= 0
##$TE2= 300
##$TE3= 300
##$TEG= 300
##$TL= (0..7)
0 120 53 12 22 120 120 120 
##$TP= (0..7)
150 150 150 150 150 150 150 150 
##$TP07= 0
##$TPNAME0= <>
##$TPNAME1= <>
##$TPNAME2= <>
##$TPNAME3= <>
##$TPNAME4= <>
##$TPNAME5= <>
##$TPNAME6= <>
##$TPNAME7= <>
##$TPOAL= (0..7)
0.5 0.5 0.5 0.5 0.5 0.5 0.5 0.5 
##$TPOFFS= (0..7)
0 0 0 0 0 0 0 0 
##$TUNHIN= 0
##$TUNHOUT= 0
##$TUNXOUT= 0
##$USERA1= <user>
##$USERA2= <user>
##$USERA3= <user>
##$USERA4= <user>
##$USERA5= <user>
##$V9= 5
##$VALIST= <valist>
##$VCLIST= <CCCCCCCCCCCCCCC>
##$VD= 0
##$VDLIST= <DDDDDDDDDDDDDDD>
##$VPLIST= <PPPPPPPPPPPPPPP>
##$VTLIST= <TTTTTTTTTTTTTTT>
##$WBST= 1024
##$WBSW= 4
##$XGAIN= (0..3)
0 0 0 0 
##$XL= 0
##$YL= 0
##$YMAX_a= 2804
##$YMIN_a= -8796
##$ZGOPTNS= <>
##$ZL1= 120
##$ZL2= 120
##$ZL3= 120
##$ZL4= 120
##$ABSF1= 248.5645
##$ABSF2= -253.2056
##$ABSG= 5
##$ABSL= 3
##$ALPHA= 0
##$AQORDER= 0
##$ASSFAC= 0
##$ASSFACI= 0
##$ASSFACX= 0
##$ASSWID= 0
##$AUNMP= <proc_1d>
##$AZFE= 0.1
##$AZFW= 0.5
##$BCFW= 0
##$BC_mod= 2
##$BYTORDP= 0
##$COROFFS= 0
##$CY= -3
##$DATMOD= 1
##$DC= 0
##$DFILT= <>
##$DTYPP= 0
##$F1P= 0
##$F2P= 0
##$FCOR= 1
##$FTSIZE= 65536
##$FT_mod= 6
##$GAMMA= 0
##$GB= 0
##$INTBC= 1
##$INTSCL= 6.047779e-11
##$ISEN= 30
##$LB= 5
##$LEV0= 0
##$LPBIN= 0
##$MAXI= 10000
##$MC2= 0
##$MEAN= 0
##$ME_mod= 0
##$MI= 50
##$NCOEF= 0
##$NC_proc= -10
##$NLEV= 6
##$NOISF1= 182.463
##$NOISF2= 159.3651
##$NSP= 0
##$NTH_PI= 0
##$NZP= 0
##$OFFSET= 248.5645
##$PC= 4
##$PHC0= -10720.78
##$PHC1= 11.08485
##$PH_mod= 1
##$PKNL= yes
##$PPARMOD= 0
##$PSCAL= 0
##$PSIGN= 0
##$REVERSE= no
##$SF= 81.0140089999694
##$SI= 65536
##$SIGF1= 159.3651
##$SIGF2= -187.1042
##$SINO= 113.3802
##$SIOLD= 16384
##$SREGLST= <1H.CDCl3>
##$SSB= 0
##$STSI= 65536
##$STSR= 0
##$SW_p= 40650.406504065
##$SYMM= 0
##$S_DEV= 0
##$TDeff= 32768
##$TDoff= 0
##$TI= <>
##$TILT= no
##$TM1= 0
##$TM2= 0
##$TOPLEV= 0
##$USERP1= <user>
##$USERP2= <user>
##$USERP3= <user>
##$USERP4= <user>
##$USERP5= <user>
##$WDW= 1
##$XDIM= 65536
##$YMAX_p= 312636055
##$YMIN_p= -124498032
$$ End of Bruker specific parameters
$$ ---------------------------------
##NTUPLES= NMR SPECTRUM
##VAR_NAME=  FREQUENCY,     SPECTRUM/REAL,   SPECTRUM/IMAG
##SYMBOL=    X,             R,               I
##VAR_TYPE=  INDEPENDENT,   DEPENDENT,       DEPENDENT
##VAR_FORM=  AFFN,          ASDF,            ASDF
##VAR_DIM=   65536,         65536,           65536
##UNITS=     HZ,            ARBITRARY UNITS, ARBITRARY UNITS
##FACTOR=    0.620285442955139, 1,           1
##FIRST=     20137.2065510682, 0,            0
##LAST=      -20513.1999529968, 0,           0
##MIN=       -20513.1999529968, -124498032,  0
##MAX=       20137.2065510682, 312636055,    0
$$ Real data points
##PAGE= N=1
##DATA TABLE= (X++(R..R)), XYDATA
$$ [...]
12966i816948M207725M015079L639675L289458K777959K042777J318121P22418
$$ -9816948 -5609223 -1594144 2045531 5334989 8112948 10155725 11473846 12196264
12958A2196264j6343j182983k540388l403587l271968k266156r22547L06691J239389
$$ 12196264 12179921 10996938 8456550 5052963 1780995 -485161 -1407708 -1101017 138372
12949A38372J729321J487630L44449j348468k820000l524839l559956l317361
$$ 138372 1867693 3355323 3699772 2351304 -468696 -3993535 -7553491 -10870852
12941a0870852k905101k172090j195984l64388J24832N36412J173731J874059
$$ -10870852 -13775953 -15948043 -17144027 -17508415 -17383583 -16847171 -15673440 -13799381
12933a3799381K136281J661868O43216l70404p91944l75606N09045J098903R46311
$$ -13799381 -11663100 -10001232 -9358016 -9728420 -10520364 -10895970 -10386925 -9288022 -8341711
12924h341711L27095k29036o49636j255193k074184k616640k420411j530356l34824
$$ -8341711 -8014616 -8243652 -8893288 -10148481 -12222665 -14839305 -17259716 -18790072 -19124896
12915a9124896P91080J551692J756261J535297J325551J372699J396231J011151
$$ -19124896 -18333816 -16782124 -15025863 -13490566 -12165015 -10792316 -9396085 -8384934
12907h384934L48620n1395J14078P04497J533181K556713L545615L940426L320126
$$ -8384934 -8036314 -8087709 -7973631 -7269134 -5735953 -3179240 366375 4306801 7626927
12898G626927J848901P8834j498143k522736k692265k052406j319951j479823
$$ 7626927 9475828 9554662 8056519 5533783 2841518 789112 -530839 -2010662
12890b010662k852806m721787n975262n986354m839674k954178o93901J733359
$$ -2010662 -4863468 -9585255 -15560517 -21546871 -26386545 -29340723 -30034624 -28301265
12882b8301265M157876O248685P434400P158363N342265K578552j94678k224323
$$ -28301265 -24143389 -17894704 -10460304 -3301941 2040324 4618876 4424198 2199875
12874B199875l252069l507436l468667l474535l442493l024780k069419p96251
$$ 2199875 -1052194 -4559630 -8028297 -11502832 -14945325 -17970105 -20039524 -20835775
12866b0835775N13455J787750L001452L959729M472368M626273M661718M634611
$$ -20835775 -20322320 -18534570 -15533118 -11573389 -7101021 -2474748 2186970 6821581
12858F821581M370537L681291K483835Q43466q97616k196918k817133l143393
$$ 6821581 11192118 14873409 17357244 18200710 17303094 15106176 12289043 9145650
12850I145650l630872l981736l320471j334550J097176K618245K543077J230236
$$ 9145650 5514778 1533042 -1787429 -3121979 -2024803 593442 3136519 4366755
12842D366755l56266j268419j093881k45337L26797m6243j207499k495850l435777
$$ 4366755 4010489 2742070 1648189 1402852 1729649 1683406 475907 -2019943 -5455720
12833e455720l960497m141125l970633l409123k502137j464665o67787l84325
$$ -5455720 -9416217 -13557342 -17527975 -20937098 -23439235 -24903900 -25571687 -25956012
12825b5956012m62605m36226o9752M18321Q02778J217911J821132K384465K600381
$$ -25956012 -26418617 -26854843 -26924595 -26506274 -25703496 -24485585 -22664453 -20279988 -17679607
12816a7679607K577745K585888K461089J824023Q98003N30612J165436K193451
$$ -17679607 -15101862 -12515974 -10054885 -8230862 -7332859 -6802247 -5636811 -3443360
12808c443360K592090J942479O36246o11395j222611j057587o20207p86175j945800
$$ -3443360 -851270 1091209 1727455 1116060 -106551 -1164138 -1784345 -2570520 -4516320
12799d516320l426733m024833l150994j354294K16143P59882L85694o4896J83308
$$ -4516320 -7943053 -11967886 -15118880 -16473174 -16257031 -15497149 -15111455 -15176351 -14993043
12790a4993043J045946J628148J172549j48784j490353k173813k077118j452418
$$ -14993043 -13947097 -12318949 -11146400 -11295184 -12785537 -14959350 -17036468 -18488886
12782a8488886p65453n92599j157667j845075j585763K6777K236147L873504M306332
$$ -18488886 -19254339 -19846938 -21004605 -22849680 -24435443 -24408666 -22172519 -18299015 -13992683
12773a3992683L469420J412995j607580m698113o586691o595152n120105l022518
$$ -13992683 -10523263 -9110268 -10717848 -15415961 -22002652 -28597804 -33717909 -36740427
12765c6740427q18269J339773L205701M429130M991026N273313N541362N589933
$$ -36740427 -37558696 -36218923 -33013222 -28584092 -23593066 -18319753 -12778391 -7188458
12757g188458N070327L982636K630326J222770j92888j424219k061550j871748
$$ -7188458 -2118131 1864505 4494831 5717601 5524713 4100494 2038944 167196
12749A67196j136059m73753l72610q88144j638058k013871j572771l98458R71207
$$ 167196 -968863 -1442616 -1815226 -2703370 -4341428 -6355299 -7928070 -8326528 -7355321
12740g355321K039236K645465K714576K022465N76695r01760j376877n84240N52858
$$ -7355321 -5316085 -2670620 43956 2066421 2643116 1741356 364479 -219761 333097
12731C33097Q33524o183j119207j439939o03133Q61148K010499K231401J722233
$$ 333097 1166621 1160438 41231 -1398708 -2001841 -1140693 869806 3101207 4823440
12722D823440J246541J268605J397107Q87129l66969j650316k304303k444270
$$ 4823440 6069981 7338586 8735693 9622822 9255853 7605537 5301234 2856964
12714B856964k554102k621129k106818q02451O50053J299672P83629m72176j773220
$$ 2856964 302862 -2318267 -4425085 -5227536 -4577483 -3277811 -2494182 -2966358 -4739578
12705d739578k613088k685445j823227j89198J570328K630876K604309J840892
$$ -4739578 -7352666 -10038111 -11861338 -12050536 -10480208 -7849332 -5245023 -3404131
12697c404131J064317O87248N10299J17225m89016p75048k64036Q70914J922252
$$ -3404131 -2339814 -1652566 -1142267 -1025042 -1514058 -2289106 -2553142 -1682228 240024
12688B40024K286771J843952P93740n85267j946288k929487l405172l481465l093294
$$ 240024 2526795 4370747 5164487 4579220 2632932 -296555 -3701727 -7183192 -10276486
12679a0276486j821684N38272L325530N292092N592748M298112K026721n17683
$$ -10276486 -12098170 -11559898 -8234368 -2942276 2650472 6948584 8975305 8457622
12671H457622k580099l435935k884625j571974n40145m09139j012799j665926
$$ 8457622 5877523 2441588 -443037 -2015011 -2555156 -2964295 -3977094 -5643020
12663e643020j681177q23761N35609J797903K749072L610698M383102M482506
$$ -5643020 -7324197 -8147958 -7612349 -5814446 -3065374 545324 4928426 9410932
12655I410932L376024J363732o80548k228083l312154l891485l578380k239048
$$ 9410932 12786956 14150688 13470140 11242057 7929903 4038418 460038 -1779010
12647a779010m69363Q41189J210131O40694o69404k302081l461132l330222j771883
$$ -1779010 -2248373 -1407184 -197053 443641 -225763 -2527844 -5988976 -9319198 -11091081
12638a1091081N01252K530461L761314M104660L642657K540208J185860J28108
$$ -11091081 -10589829 -8059368 -4298054 -193394 3449263 5989471 7175331 7303439
12630G303439l14924l10442k40114k31227j34169P6529J96578K38287O66427J794252
$$ 7303439 6988515 6678073 6437959 6206732 6072563 6149092 6345670 6583957 7250384 9044636
12620I044636L025610L126743J443590j308731l566607m155032l095387j456334
$$ 9044636 12070246 15196989 16640579 15331848 11765241 7610209 4514822 3058488
12612C058488m59753m95580q85027o97992K41818J345109K105412K525312K662388
$$ 3058488 2598735 2103155 1218128 520136 761954 2107063 4212475 6737787 9400175
12603I400175K293394J352115L07820l27484o51089j117819j774837k157262j911938
$$ 9400175 11693569 13045684 13353504 13026020 12374931 11257112 9482275 7325013 5413075
12594E413075j194949m74025k20787p24695j843842k909278l200389k607806j625955
$$ 5413075 4218126 3744101 3523314 2798619 954777 -1954501 -5154890 -7762696 -9388651
12585i388651p20911P338N56083P89932N97011J5391q39721j672582j840139q05412
$$ -9388651 -10109562 -10102224 -9546141 -8756209 -8159198 -8143807 -8983528 -10656110 -12496249 -13301661
12575a3301661R95762K204994J902126O57939j94549j23496K61736K88816j2601
$$ -13301661 -12305899 -10100905 -8198779 -7540840 -7735389 -7858885 -7597149 -7308333 -7320934
12566g320934l62000q12924j417831j662981q56907Q74468K420383K726348J808868
$$ -7320934 -7682934 -8495858 -9913689 -11576670 -12433577 -11559109 -9138726 -6412378 -4603510
12557d603510O14895Q7208N34395J676193K922106L597694L262066K056234O58359
$$ -4603510 -3988615 -3901407 -3367012 -1690819 1231287 4828981 8091047 10147281 10805640
12548A0805640k46886m54429k30607K830q7721o03571j305299j748912j745414
$$ 10805640 10558754 10104325 9873718 9876548 9788827 9185256 7879957 6131045 4385631
12539D385631j663072k080804l086901m025522m005081k683608o35390J025185
$$ 4385631 2722559 641755 -2445146 -6470668 -10475749 -13159357 -13794747 -12769562
12531a2769562J523786J073405N96728P35641J245471J444222J066282M90439
$$ -12769562 -11245776 -10172371 -9575643 -8840002 -7594531 -6150309 -5084027 -4593588
12523d593588K97542Q41032K090786L562836M453108M179630K874412J192741
$$ -4593588 -4296046 -3455014 -1364228 2198608 6651716 10831346 13705758 14898499
12515A4898499k66142j125014j041277J15621J839195L215867L800120L954875
$$ 14898499 14632357 13507343 12466066 12581687 14420882 17636749 21436869 25391744
12507B5391744M158556M283246L762436K238858r2331k515780m055257m069667
$$ 25391744 29550300 33833546 37595982 39834840 39742509 37226729 33171472 29101805
12499B9101805k851074j389587l81199K19319N33245J96997j081020k812810m191548
$$ 29101805 26250731 24861144 24479945 24699264 25232509 25429506 24348486 21535676 17344128
12490A7344128n076659n933030o846881p171916o258409m128144j357818J319809
$$ 17344128 12267469 6334439 -512442 -7684358 -13942767 -18070911 -19428729 -18108920
12482a8108920L219332L915302L474369K304931P55927q89823k087035k160584
$$ -18108920 -14889588 -10974286 -7499917 -5194986 -4439059 -5328882 -7415917 -9576501
12474i576501r79770P61055K098702K479598J925172R11639J88433K92916R84675
$$ -9576501 -10556271 -9795216 -7696514 -5216916 -3291744 -2380105 -2191672 -1898756 -914081
12465i14081J455678J316838J037462J127553J269511P52574m24761j419946j529741
$$ -914081 541597 1858435 2895897 4023450 5292961 6045535 5620774 4200828 2671087
12456B671087r06345k34922l4705l55500q43543r52741l19346R02376K176344
$$ 2671087 1764742 1529820 1495115 1139615 296072 -656669 -976015 -73639 2102705
12447B102705L078314L479806L278286K327998Q38454m86075j076285j128946
$$ 2102705 5181019 8660825 11939111 14267109 15105563 14619488 13543203 12414257
12439A2414257j240878j456574j100146K73638K050355K956252K221789K11219
$$ 12414257 11173379 9716805 8616659 8890297 10940652 13896904 16118693 16329912
12431A6329912j988931l418163l765268l341546k696890k202138j903415j700048
$$ 16329912 14340981 10922818 7157550 3816004 1119114 -1083024 -2986439 -4686487
12423d686487j533188j320064q56499m6996P49031Q61550j7220j395764k351548
$$ -4686487 -6219675 -7539739 -8396238 -8443234 -7694203 -6832653 -6849873 -8245637 -10597185
12414a0597185k302928j375545j35044Q98178J526132J824400J868818J513077
$$ -10597185 -12900113 -14275658 -14410702 -13512524 -11986392 -10161992 -8293174 -6780097
12406f780097N25390r90179k412575k974928k304248n85815J620920L566521M500792
$$ -6780097 -6254707 -7244886 -9657461 -12632389 -14936637 -15522452 -13901532 -10335011 -5834219
12397e834219M055412K560531Q35159l87513p58847k16643J012874K236946K549820
$$ -5834219 -1778807 781724 1616883 1229370 470523 253880 1266754 3503700 6053520
12388F053520J630589J26791j062550j755631k393843l088459l299771k674370
$$ 6053520 7684109 7810900 6748350 4992719 2598876 -489583 -3789354 -6463724
12380f463724j760284j440225j809862k034565j304549M11436K545409M416254
$$ -6463724 -8224008 -9664233 -11474095 -13508660 -14813209 -14401773 -11856364 -7440110
12372g440110N392894N042612L544546J774189O07472K05726K23154N03866J131918
$$ -7440110 -2047216 2995396 6539942 8314131 8921603 9127329 9350483 9854349 10986267
12363A0986267J871304K085289J381700J2418j467500k604357l048938k629951
$$ 10986267 12857571 14942860 16324560 16336978 14869478 12265121 9216183 6586232
12355F586232j681757r14148o25361l21466N88823K001828L314917M082870M093981
$$ 6586232 4904475 3990327 3364966 3043500 3632323 5634151 8949068 13031938 17125919
12346A7125919L132857J230887r93374k766935l872723m506790m622863m038893
$$ 17125919 20258776 21489663 20496289 17729354 13856631 9349841 4726978 688085
12338F88085l117308k588471k519696k127793r34752M57768J157687J097481R11440
$$ 688085 -2429223 -5017694 -7537390 -9665183 -10599935 -10142167 -8984480 -7886999 -6975559
12329f975559J048707J485813K068533K623069K815245K336709J246495j57666
$$ -6975559 -5926852 -4441039 -2372506 250563 3065808 5402517 6649012 6491346
12321F491346j752935l570496n382463o611000o721190n550231l295592m24485
$$ 6491346 4738411 1167915 -4214548 -10825548 -17546738 -23096969 -26392561 -26817046
12313b6817046K366815M343869N092564M738539L804333K785916J759948M29554
$$ -26817046 -24450231 -20106362 -15013798 -10275259 -6470926 -3685010 -1925062 -1495508
12305a495508j305789k907839l640598l485110l201145l267356l166070k106441
$$ -1495508 -2801297 -5709136 -9349734 -12834844 -16035989 -19303345 -22469415 -24575856
12297b4575856j64718J762579K963468L370652L116629K218369Q49190n37070
$$ -24575856 -24740574 -22977995 -20014527 -16643875 -13527246 -11308877 -10459687 -10996757
12289a0996757j614414k440637l093261l284416k596986j024211Q75254K312719
$$ -10996757 -12611171 -15051808 -18145069 -21429485 -24026471 -25050682 -24175428 -21862709
12281b1862709K728711K090267Q89370j99047p67346q41549o88201n58024n64899
$$ -21862709 -19133998 -17043731 -16154361 -16353408 -17120754 -17962303 -18650504 -19208528 -19773427
12272a9773427o40549n51072n8458Q57951J926511K703308K821127K308423J721296
$$ -19773427 -20413976 -20965048 -21023506 -20165555 -18239044 -15535736 -12714609 -10406186 -8684890
12263h684890J726631K392923L106366L364539L352216L422388L348007K632914
$$ -8684890 -6958259 -4565336 -1458970 1905569 5257785 8680173 12028180 14661094
12255A4661094J381629K09157p06115j790605l124673l994991l784480k815540
$$ 14661094 16042723 16251880 15545765 13755160 10630487 6635496 2851016 35476
12247C5476j879405j315679r97468q77584j008981j206369j196521j053613j097457
$$ 35476 -1843929 -3159608 -4157076 -5034660 -6043641 -7250010 -8446531 -9500144 -10597601
12238a0597601j402596j711654j727342j186626J63349K216694M232825N393088
$$ -10597601 -12000197 -13711851 -15439193 -16625819 -16462470 -14245776 -10012951 -4619863
12230d619863N652376N623597N622108N305119M326609K823235J049688r53275
$$ -4619863 1032513 6656110 12278218 17583337 21909946 24733181 25782869 24829594
12222B4829594k957294m215569m062693k746870j271053l96447n1899K91658R09743
$$ 24829594 21872300 17656731 13594038 10847168 9576115 9179668 9127769 9419427 10329170
12213A0329170J540178J665458J035991l8309r57360j421770j631996j837823
$$ 10329170 11869348 13534806 14570797 14532488 13575128 12153358 10521362 8683539
12205H683539j911326j584839r37422l01919K74314J088287K160583K887949K642099
$$ 8683539 6772213 5187374 4249952 3948033 4222347 5310634 7471217 10359166 13001265
12196A3001265J605192O93956O08928J188894J795289K103507K284223K510650
$$ 13001265 14606457 15300413 15909341 17098235 18893524 20997031 23281254 25791904
12188B5791904K586913K156991J113868k95618j655091k603733l033057l167627
$$ 25791904 28378817 30535808 31649676 31354058 29698967 27095234 24062177 20894550
12180B0894550l307090l380146k956420j903067q34230n93386j375510k655560
$$ 20894550 17587460 14207314 11250894 9347827 8513597 7920211 6544701 3889141
12172C889141l874905m793642n197813m786287l571583k024457n72616P57173
$$ 3889141 14236 -4779406 -9977219 -14763506 -18335089 -20359546 -20932162 -20174989
12164b0174989J993812K869127L127188K903114K434457J636501L93375q74804
$$ -20174989 -18181177 -15312050 -12184862 -9281748 -6847291 -5210790 -4817415 -5692219
12156e692219j405219q85868K37827J216756J507814R88075P6867l98766J04712
$$ -5692219 -7097438 -7983306 -7745479 -6528723 -5020909 -4032834 -3955967 -4354733 -4250021
12147d250021J208182J951843J751321P07846q47712k508934l492136k955222
$$ -4250021 -3041839 -1089996 661325 1369171 521459 -1987475 -5479611 -8434833
12139h434833j002387J163843K512556L171389L749404M195825L971947L013096
$$ -8434833 -9437220 -8273377 -5760821 -2589432 1159972 5355797 9327744 12340840
12131A2340840J767732M09469j219418k801545l432478k695622j406236q91259
$$ 12340840 14108572 14518041 13298623 10497078 7064600 4368978 2962742 2071483
12123B071483j718411l315180m568869m603524l290886j374733J2902K75152j44385
$$ 2071483 353072 -2962108 -7530977 -12134501 -15425387 -16800120 -16787218 -16512066 -16656451
12114a6656451k45860O08051K276029M090776N304316N423605M402948K598027
$$ -16656451 -16902311 -16294260 -14018231 -9927455 -4623139 800466 5203414 7801441
12106G801441M89542j508144k985383l540589l070918j959368p79166J13082N46357
$$ 7801441 8290983 6782839 3797456 256867 -2814051 -4773419 -5552585 -5439503 -4893146
12097d893146L03740p12590k119792l251177l833795m145241m325559l887752
$$ -4893146 -4589406 -5301996 -7421788 -10672965 -14506760 -18652001 -22977560 -26865312
12089b6865312k300649P3747K012749K460072J323568o78943k620744l748896
$$ -26865312 -29165961 -29092214 -27079465 -24619393 -23295825 -23974768 -26595512 -30344408
12081c0344408l671350k528930r30374M81829J418706J910827K108356K266944
$$ -30344408 -34015758 -36544688 -37475062 -36993233 -35574527 -33663700 -31555344 -29288400
12073b9288400K713256L523823M294046M461554L830725K631179J249934K29919
$$ -29288400 -26575144 -23051321 -18757275 -14295721 -10464996 -7833817 -6583883 -6353964
12065f353964L35609K004521M558410O437715O554678N185013L372013J842402
$$ -6353964 -6018355 -4013834 544576 6982291 13536969 18721982 22093995 23936397
12057B3936397P92115K94039L36821N82969N67774J39996n91382j601288k835582
$$ 23936397 24728512 25022551 25359372 25942341 26510115 26650111 26058729 24457441 21621859
12048B1621859l887140m300151m187580m023231l770246k822623j057685O17171
$$ 21621859 17734719 13434568 9246988 5223757 1453511 -1369112 -2426797 -1809626
12040a809626J218534Q43875M25502N46533R31475R82886L94364p55597k143922
$$ -1809626 -591092 252783 678285 1224818 2156293 3139179 3533543 2777946 634024
12031F34024l339591m025456m158893l800487k861398j264712O42270K110507
$$ 634024 -2705567 -6731023 -10889916 -14690403 -17551801 -18816513 -18174243 -16063736
12023a6063736K571648K098909J230117M43118j33105o07203j073395j495701
$$ -16063736 -13492088 -11393179 -10163062 -9719944 -9853049 -10460252 -11533647 -13029348
12015a3029348j781376j892811j842674j623860j243208q24055n55806m91666
$$ -13029348 -14810724 -16703535 -18546209 -20170069 -21413277 -22237332 -22793138 -23284804
12007b3284804m75069k78579K83959J326551K698283L740903L585636K034721
$$ -23284804 -23759873 -24038452 -23754493 -22427942 -19729659 -15988756 -12403120 -10368399
11999a0368399K0030j162008j102230n44607m01434p51998r02001k36938J126675
$$ -10368399 -10348369 -11510377 -12612607 -13157214 -13558648 -14310646 -15212647 -15449585 -14322910
11990a4322910K440613K951251K470866J449988N65020K39942M52827Q00708P00880
$$ -14322910 -11882297 -8931046 -6460180 -5010192 -4445172 -4205230 -3752403 -2951695 -2250815
11981b250815k29999j752443l037747l348088k685280j644513p36099p3475L82595
$$ -2250815 -2480814 -4233257 -7271004 -10619092 -13304372 -14948885 -15684984 -15758459 -15375864
11972a5375864O55009R03225J385780K025767K218980J363948m24494k251353
$$ -15375864 -14720855 -13817630 -12431850 -10406083 -8187103 -6823155 -7247649 -9499002
11964i499002l057169k292452k29101K142846L634576L625607K498361J246022
$$ -9499002 -12556171 -14848623 -15077724 -12934878 -9300302 -5674695 -3176334 -1930312
11956a930312N86009M84571M93971L64570K15036K22544L56216M75239N51891
$$ -1930312 -1344303 -859732 -365761 -1191 213845 436389 792605 1267844 1819735
11947A819735O36739O12513J67386q29457j984198k613152k413806j792669j416565
$$ 1819735 2456474 3068987 3236373 2406916 422718 -2190434 -4604240 -6396909 -7813474
11938g813474j519868j800413j941986j992218k104567k096111j536957l12777
$$ -7813474 -9333342 -11133755 -13075741 -15067959 -17172526 -19268637 -20805594 -21118371
11930b1118371J100475K051398K311865K149358J888894J593557J202649P83707
$$ -21118371 -20017896 -17966498 -15654633 -13505275 -11616381 -10022824 -8820175 -8036468
11922h036468M58099J20878n47726j644766k691344k917840k003330m30992J012591
$$ -8036468 -7578369 -7457491 -8005217 -9649983 -12341327 -15259167 -17262497 -17693489 -16680898
11913a6680898J999009K726598L300711L412255K824330J898419J278860J126437
$$ -16680898 -14681889 -11955291 -8654580 -5242325 -2417995 -519576 759284 1885721
11905A885721R80903L89515o12231j676147k479833k761661k315809j222882K7651
$$ 1885721 2866624 3256139 2643908 967761 -1512072 -4273733 -6589542 -7812424 -7784773
11896g784773Q58007J023596O40461p3311r18673j656514k031837j938151j535203
$$ -7784773 -6926766 -5903170 -5262709 -5336020 -6254693 -7911207 -9943044 -11881195 -13416398
11887a3416398j180248j165893j419448j512316j127069m65406L9234L67169Q97084
$$ -13416398 -14596646 -15762539 -17181987 -18694303 -19821372 -20286778 -20247544 -19880375 -18983291
11878a8983291J667622K116790J861745J346897J240983J433971J224413M82853
$$ -18983291 -17315669 -15198879 -13337134 -11990237 -10749254 -9315283 -8090870 -7608017
11870g608017L0004O10616J889688K806043K729706J967686J209025P77245N34325
$$ -7608017 -7578013 -6967397 -5077709 -2271666 458040 2425726 3634751 4411996 4946321
11861D946321L39307L44599P19316J194528J134780J78317j315491k564188l013647
$$ 4946321 5285628 5630227 6349543 7544071 8678851 8857168 7541677 4977489 1963842
11852A963842k632353j754989q39515k76053k01114m63473q31018j153352j289870
$$ 1963842 -668511 -2423500 -3263015 -3539068 -3740182 -4203655 -5034673 -6188025 -7477895
11843g477895j107046p19667n20023p20364j037809j086883q75855n70820K4955
$$ -7477895 -8584941 -9304608 -9824631 -10544995 -11582804 -12669687 -13545542 -14116362 -14091407
11834a4091407J250407K867346M043792M171367L358351K064162O47655n96201
$$ -14091407 -12841000 -9973654 -5929862 -1758495 1599856 3664018 4311673 3715472
11826C715472j343983j441301j018390l49594J67860l2164j237843k798426l409967
$$ 3715472 2371489 930188 -88202 -437796 -269936 -302100 -1539943 -4338369 -7748336
11817g748336k426777n94319Q02910J199501Q59696J55398o91060j311741j263956
$$ -7748336 -10175113 -10769432 -9966522 -8767021 -7907325 -7751927 -8442987 -9754728 -11018684
11808a1018684n53030K66804O83308P44844R14248J533561K454479L091753K868026
$$ -11018684 -11571714 -11304910 -10621602 -9876758 -8962510 -7428949 -4974470 -1882717 985309
11799I85309J732098K29481j001532j709514j926763j589362n46769J058438K647045
$$ 985309 2717407 2946888 1945356 235842 -1690921 -3280283 -3827052 -2768614 -121569
11790a21569L536118L381925K357059R99414j58753r26385j417081j675557j506707
$$ -121569 3414549 6796474 9153533 10152947 9994194 9067809 7650728 5975171 4468464
11781D468464q07292R1555O56435P03013N27903M77098N31953L74291k12379j052809
$$ 4468464 3661172 3752727 4409162 5112175 5640078 6117176 6649129 7023420 6811041 5758232
11771E758232j707507j925093j912117k012837k167087j954881j244969m79369
$$ 5758232 4050725 2125632 213515 -1799322 -3966409 -5921290 -7166259 -7645628
11763g645628j09706l5076J02393K99944K68480l504k02386k16860k98657n63388
$$ -7645628 -7755334 -7790410 -7688017 -7388073 -7119593 -7123097 -7325483 -7542343 -7841000 -8404388
11753h404388o53490j03219J135622K662457L961098M664947M684969M250379
$$ -8404388 -9057878 -9161097 -8025475 -5363018 -1401920 3263027 7947996 12198375
11745A2198375L725465L255613K675513J871311J125771R35355J495133K466352
$$ 12198375 15923840 19179453 21854966 23726277 24852048 25787403 27282536 29748888
11737B9748888L221959L201918K068928k13484l200220n905587p249127o841298
$$ 29748888 32970847 36172765 38241693 38028209 34827989 28922402 21673275 14831977
11729A4831977n319582l755317k718459k008717j197672j85960P75442J330707
$$ 14831977 9512395 5757078 3038619 1029902 -167770 -353730 421712 1752419
11721A752419J179996K56427j069519k146350k594987k570608k332315j781420
$$ 1752419 2932415 3188842 2119323 -27027 -2622014 -5192622 -7524937 -9306357
11713i306357p16662N79994J362394J091983p4624j467496k420947k634022k202301
$$ -9306357 -10023019 -9443025 -8080631 -6988648 -7063272 -8530768 -10951715 -13585737 -15788038
11704a5788038j381810l20349R41817K256590L360803M134051M614713M660779
$$ -15788038 -17169848 -17490197 -16548380 -14291790 -10930987 -6796936 -2182223 2478556
11696B478556L931602K449256Q54513k54540r77557j698387k285575k290237j853194
$$ 2478556 6410158 8859414 9713927 9459387 8481830 6783443 4497868 2207631 354437
11687C54437j788523k628471m033390n245682n695548n104264l566437j786405
$$ 354437 -1434086 -4062557 -8095947 -13341629 -19037177 -24141441 -27707878 -29494283
11679b9494283p20845n84986n47244K16094J433385K082276J636400O30086J16692
$$ -29494283 -30215128 -30800114 -31347358 -31131264 -29697879 -27615603 -25979203 -25349117 -25232425
11670b5232425Q38983K745902M962785O315067O220493N097567L736769K409640
$$ -25232425 -24393442 -21647540 -16684755 -10369688 -4149195 948372 4685141 7094781
11662G094781Q83169q02308k009395k129567j319537m17696j33735l75052m25748
$$ 7094781 7977950 7175642 5166247 3036680 1717143 1299447 1165712 790660 364912
11653C64912J44230Q39843P80826p1289o22058J03788J712303K912374L097995
$$ 364912 509142 1348985 2129811 2058522 1436464 1540252 3252555 6164929 9262924
11644I262924K895194L061814L425679L268429K366050J137010j09787j538835
$$ 9262924 12158118 15219932 18645611 21914040 24280090 25417100 25307313 23768478
11636B3768478l238218m674867n061472m233986k923934k078383k029540k391260
$$ 23768478 20530260 15855393 10793921 6559935 3636001 1557618 -471922 -2863182
11628b863182k608850k426806j903437j251788p63136o57283p92286o30095K53480
$$ -2863182 -5472032 -7898838 -9802275 -11054063 -11817199 -12474482 -13266768 -13896863 -13643383
11619a3643383J562674K316387J604150o04548l261840m800696m132420j447927
$$ -13643383 -12080709 -9764322 -8160172 -8764720 -12026560 -16827256 -20959676 -22407603
11611b2407603J852657M172159M808940M150085L003660J971914J374107J351407
$$ -22407603 -20554946 -16382787 -11573847 -7423762 -4420102 -2448188 -1074081 277326
11603B77326J781327K257063K396865K130195J561252P22171k73401r52039p78814
$$ 277326 2058653 4315716 6712581 8842776 10404028 11126199 10852798 9900759 9121945
11594I121945J37773R73114J056170N62161M0315n19980j665167l513580n303956
$$ 9121945 9259718 10232832 11289002 11851163 11891478 11371498 9706331 6192751 888795
11585H88795o139992n858641m896490l601285k087099o22269L25662N48296L16799
$$ 888795 -5251197 -11109838 -16006328 -19607613 -21694712 -22316981 -21991319 -21443023 -21126224
11576b1126224L9860r3906q2449K1818P2062j43188o36600j062180r35305J3254
$$ -21126224 -21086364 -21180270 -21262719 -21240901 -21168839 -21312027 -21948627 -23010807 -23946112 -23932858
11566b3932858J671214L536564M806686M719442L089739N58532j765734k973864
$$ -23932858 -22261644 -18725080 -13918394 -9198952 -6109213 -5550681 -7316415 -10290279
11558a0290279k817603j745051n28536L22351Q58767J313213J531656J146672
$$ -10290279 -13107882 -14852933 -15381469 -15059118 -14200351 -12887138 -11355482 -10208810
11550a0208810L61223O2213Q09689K062997K847510K920308K727093K380191J435848
$$ -10208810 -9847587 -9785374 -8975685 -6912688 -4065178 -1144870 1582223 3962414 5398262
11541E398262j24105j361713j339728k80757P15680R56258O99606M77095L74484
$$ 5398262 5274157 3912444 2572716 2291959 3007639 3963897 4663503 5140598 5515082
11532E515082J97175J3360J63563P45622J317107J218059J63631j477658k929258
$$ 5515082 5712257 5725617 5889180 6634802 7951909 9169968 9333599 7855941 4926683
11523D926683l523637l097593k042574j030404n91812p97419j268322j530816
$$ 4926683 1403046 -1694547 -3737121 -4767525 -5359337 -6156756 -7425078 -8955894
11515h955894j408055j070893p38860m32576q0946K18677K09409k10324p80845
$$ -8955894 -10363949 -11434842 -12173702 -12606278 -12687224 -12468547 -12259138 -12469462 -13250307
11506a3250307j073135q48075j82763O59262J340725J498245R45564k3460p00235
$$ -13250307 -14323442 -15171517 -15354280 -14695018 -13354293 -11856048 -10910484 -10933944 -11634179
11497a1634179n60021K23776J017635J434807J604845J766362J903289J941956
$$ -11634179 -12194200 -11970424 -10952789 -9517982 -7913137 -6146775 -4243486 -2301530
11489b301530K049262K413526K782243K521593J265907o07612k239230k975858
$$ -2301530 -252268 2161258 4943501 7465094 8731001 8123389 5884159 2908301
11481B908301k789482k110693j342240n51959L85235J422301K248104K611488
$$ 2908301 118819 -1991874 -3334114 -3886073 -3500838 -2078537 169567 2781055
11473B781055K609259K508923K356183J943205J162787K06455o41807j244576
$$ 2781055 5390314 7899237 10255420 12198625 13361412 13567867 12926060 11681484
11465A1681484j574173j619126j466288j323811j264623j042029l90941N26566
$$ 11681484 10107311 8488185 7021897 5698086 4433463 3391434 3000493 3527059
11457C527059J240923J585208J912835K551991L268417L516176L087427K226734
$$ 3527059 4767982 6353190 8266025 10818016 14086433 17602609 20690036 22916770
11449B2916770J157289j62399j709361l110201l895349l884867l144216j737361
$$ 22916770 24074059 23911660 22202299 19092098 15196749 11311882 8167666 6430305
11441F430305J60702J935283K683061J950688K55309j305828k006589k002926
$$ 6430305 6591007 8526290 11209351 13160039 13415348 12109520 10102931 8100005
11433H100005j906841j970814j839289j130641q7339N66875L89857l97393j354005
$$ 8100005 6193164 4222350 2383061 1252420 1165081 1731956 2121813 1724420 370415
11424C70415k363950l498480m508459m803698l999112k298856l09779J374835
$$ 370415 -1993535 -5492015 -10000474 -14804172 -18803284 -21102140 -21411919 -20037084
11416b0037084K420723K814058K791182K595579K230205J518329M23699p75521
$$ -20037084 -17616361 -14802303 -12011121 -9415542 -7185337 -5667008 -5243309 -6018830
11408f018830j628344j754569j038022K37503J482896K244624K547708K605647
$$ -6018830 -7647174 -9401743 -10439765 -10202262 -8719366 -6474742 -3927034 -1321387
11400a321387K272214J164803n80649k087504k550030k010648j064152o8358R35442
$$ -1321387 950827 2115630 1534981 -552523 -3102553 -5113201 -6177353 -6245711 -5310269
11391e310269J680089J623646O45882n46287j019123n45464K23559M50280j82500
$$ -5310269 -3630180 -2006534 -1360652 -1906939 -2926062 -3471526 -3247967 -2797687 -2980187
11382b980187j392264k644568l398547l173296j762768M14199K380976L317130
$$ -2980187 -4372451 -7017019 -10415566 -13588862 -15351630 -14937431 -12556455 -9239325
11374i239325L206648K628469K028822J486739J100179J123411J542484J885143
$$ -9239325 -6032677 -3404208 -1375386 111353 1211532 2334943 3877427 5762570
11366E762570J740899J244056P92204N06456K54147L515k01995n06165j085417
$$ 5762570 7503469 8747525 9539729 10046185 10300332 10303847 10101852 9595687 8510270
11357H510270j721008j866738j259578k63467M72105N50778R599q46937j690729
$$ 8510270 6789262 4922524 3662946 3399479 3871584 4422362 4431961 3585024 1894295
11348A894295k326626k670800k606141j984943q69330L55047J260108J703231
$$ 1894295 -432331 -3103131 -5709272 -7694215 -8563545 -8208498 -6948390 -5245159
11340e245159J789292J678303J585127J732260J995822J776174O34091r87063
$$ -5245159 -3455867 -1777564 -192437 1539823 3535645 5311819 5945910 4958847
11332D958847k072482k087326j338319k84033R80954K319364L128985K838715
$$ 4958847 2886365 799039 -539280 -823313 157641 2477005 5605990 8444705
11324H444705J666346M53383k48608o14061j042858j528581j702486j377840q54168
$$ 8444705 10111051 10564434 10315826 9701765 8658907 7130326 5427840 4050000 3195832
11315C195832o12428p55118q51310m17245M84938J227583J198978L41955q11968
$$ 3195832 2583404 1828286 976976 559731 1044669 2272252 3471230 3813185 3001217
11306C001217j467597r65729Q06803L156563M861698N013235L716637J926769
$$ 3001217 1533620 567891 1374694 4531257 9392955 14406190 18122827 20049596
11298B0049596N76781j12615n39742j098992j731414k032092j681476p22808N01181
$$ 20049596 20626377 20513762 19974020 18875028 17143614 15111522 13430046 12707238 13208419
11289A3208419J571883K188044K294956K075972J707884J099566L1230j390729
$$ 13208419 14780302 16968346 19263302 21339274 23047158 24146724 24177954 22787225
11281B2787225k620912l153002k953353k318507j548833r36982p56387r16088
$$ 22787225 20166313 17013311 14059958 11741451 10192618 9255636 8499249 7583161
11273G583161r04884n51554o24982k031083m404636o155086o117341m623548k739959
$$ 7583161 6678277 6126723 5501741 3470658 -933978 -7089064 -13206405 -17829953 -20569912
11264b0569912j089943J22627N15154k62858j840529l240720l727719l201291
$$ -20569912 -21659855 -21537228 -21022074 -21284932 -23125461 -26366181 -30093900 -33295191
11256c3295191j879816p9970J691205K921788L536524L823212L810760L086120
$$ -33295191 -35175007 -35254977 -33563772 -30641984 -27105460 -23282248 -19471488 -16385368
11248a6385368J447165n37620j894893k055303j147118L28504J859964L046122
$$ -16385368 -14938203 -15475823 -17370716 -19426019 -20573137 -20244633 -18384669 -15338547
11240a5338547L648567L659749L269878K734134K281481K091482K253571K719919
$$ -15338547 -11689980 -8030231 -4760353 -2026219 255262 2346744 4600315 7320234
11232G320234L338996L937320M320412M200258L240083J325886j135657l242485
$$ 7320234 10659230 14596550 18916962 23117220 26357303 27683189 26547532 23305047
11224B3305047m039769l072473o48760K320548M776570O032959O067624N333514
$$ 23305047 19265278 16192805 15544045 17864593 22641163 28674122 34741746 40075260
11216D0075260M230468K797558R36105j236011l391872n184671o212392o007096
$$ 40075260 44305728 47103286 48039391 46803380 43411508 38226837 32014445 26007349
11208B6007349m498593k466311j043233o03042n31855k78058j41295o34823j492101
$$ 26007349 21508756 19042445 17999212 17396170 16864315 16586257 16444962 15810139 14318038
11199A4318038j927702j743255j566792j918597k507898k605065j780923k01286
$$ 14318038 12390336 10647081 9080289 7161692 4653794 2048729 267806 66520
11191F6520J438708K175427J456191r1503q75307K37442K752648N052860N974172
$$ 66520 1505228 3680655 5136846 5045343 4170036 4407478 7160126 12212986 18187158
11182A8187158N634883M828980M030325L157108K041480Q24745j36587o39568
$$ 18187158 23822041 28651021 32681346 35838454 37879934 38704679 38568092 37928524
11174C7928524q72288j296130k235132l491042m367624m206140l039984j727286
$$ 37928524 37056236 35760106 33524974 30033932 25666308 21460168 18420184 16692898
11166A6692898j296018k026194l181732l707090l171279j999707q97520k25854
$$ 16692898 15396880 13370686 10188954 6481864 3310585 1310878 413358 187504
11158A87504Q3168K54494M79486Q67183J372352J747509J683528J051814j0917
$$ 187504 270672 525166 1004652 1871835 3244187 4991696 6675224 7727038 7716121
11149G716121j212200k206883k629195k227051j141428j4036L89346j72894j147991
$$ 7716121 6503921 4297038 1667843 -559208 -1700636 -1714672 -1325326 -1498220 -2646211
11140b646211j654632j250363k13211Q81761J710913K278510K638333K775925
$$ -2646211 -4300843 -5551206 -5764417 -4882656 -3171743 -893233 1745100 4521025
11132D521025K747479K694130K603662K219514J352528J92792q71461j700070
$$ 4521025 7268504 9962634 12566296 14785810 16138338 16331130 15459669 13759599
11124A3759599k448849l149206l502076l272165k707878k279183k017578j406369
$$ 13759599 11310750 8161544 4659468 1387303 -1320575 -3599758 -5617336 -7023705
11116g023705o4130J629332K748763K600923J225006p09216k299883k814159k025786
$$ -7023705 -7087835 -5458503 -2709740 -108817 1116189 406973 -1892910 -4707069 -6732855
11107f732855l56034J357472K332118K195323J093533l44217j253766j120756
$$ -6732855 -7088889 -5731417 -3399299 -1203976 -110443 -454660 -1708426 -2829182
11099b829182l32161L0815p76278k310259l265845k696917q37224J284158K866954
$$ -2829182 -3161343 -3130528 -3906806 -6217065 -9482910 -12179827 -13017051 -11732893 -8865939
11090h865939L829060M382249M460302L820132K585196J334851N41509J73092
$$ -8865939 -5036879 -654630 3805672 7625804 10211000 11545851 12087360 12260452
11082A2260452J1748Q5197M58231P83062N27185k81926r01167o24825N19101J893821
$$ 12260452 12272200 12357397 12815628 13598690 14125875 13843949 12942782 12317957 12837058 14730879
11072A4730879K794770K760034J706100Q5956j248507j670962j300992p93742
$$ 14730879 17525649 20285683 21991783 22077739 20829232 19158270 17857278 17063536
11064A7063536o82360j010616j459675j678606j597158j524589j780759k124218
$$ 17063536 16381176 15370560 13910885 12232279 10635121 9110532 7329773 5205555
11056E205555j826273n79524R05776J589445J258853O11822K63268J14113k68844
$$ 5205555 3379282 2799758 3705534 5294979 6553832 7165654 7428922 7543035 7274191
11047G274191j119216k472412m245525n999951o961171o706661n707637m803365
$$ 7274191 6154975 3682563 -562962 -6562913 -13524084 -20230745 -25938382 -30741747
11039c0741747m155959l072310r46832J895861M453396N948212O290948N792595
$$ -30741747 -34897706 -37970016 -38916848 -37020987 -32567591 -26619379 -20328431 -14535836
11031a4535836M735818L341848J966766J076404R41505J405413J983766K200116
$$ -14535836 -9800018 -6458170 -4491404 -3415000 -2473495 -1068082 915684 3115800
11023C115800J905909J399178J243837J840460L048089M199972M512681L559466
$$ 3115800 5021709 6420887 7664724 9505184 12553273 16753245 21265926 24825392
11015B4825392J542579p26104k237535k515043k052224j822355k245337k837715
$$ 24825392 26367971 25641867 23404332 20889289 18837065 17014710 14769373 11931658
11007A1931658k986022k776308k782834l219958l648822l497034k605650j264230
$$ 11931658 8945636 6169328 3386494 166536 -3482286 -6979320 -9584970 -10849200
10999a0849200O4142J029426J600399K019130K423856K563910K072971R91627
$$ -10849200 -10785058 -9755632 -8155233 -6136103 -3712247 -1148337 924634 1916261
10991A916261j84714r55812j104305n88544N10658J812462K676681K670928J950236
$$ 1916261 1731547 775735 -328570 -917114 -406456 1406006 4082687 6753615 8703851
10982H703851J063590M18721k8971o27699j604342k747884l540373l636029l092222
$$ 8703851 9767441 10186162 10157191 9529492 7925150 5177266 1636893 -1999136 -5091358
10973e091358k043018l97923J804893L886202M843231M300527K823575J190511
$$ -5091358 -7134376 -7532299 -5727406 -1841204 3002027 7302554 10126129 11316640
10965A1316640k99996j654923k741155l380523l680197l896740l992638l538052
$$ 11316640 11016644 9361721 6620566 3240043 -440154 -4336894 -8329532 -11867584
10957a1867584k052088N80283L804686O385803P049450N560605L102311J280797
$$ -11867584 -13919672 -13339389 -9534703 -3148900 3900550 9461155 12563466 13844263
10949A3844263P67434J081715J474632J592363J356890P62832L2234l86281k63503
$$ 13844263 14611697 15693412 17168044 18760407 20117297 20880129 20912363 20526082 20262579
10940B0262579J49266M86342O62273O73544K76785p13853j889173k472712k236921
$$ 20262579 20411845 20898187 21560460 22234004 22510789 21796936 19907763 17435051 15198130
10931A5198130j847552k036466k651941k847125k121399q57509J78108N47414
$$ 15198130 13350578 11314112 8662171 5815046 3693647 2836138 3014246 3561660
10923C561660K62468m43507j147767j229188k60678J471607L059817L705316L262140
$$ 3561660 3824128 3380621 2232854 1003666 742988 2214595 5274412 8979728 12241868
10914A2241868K077020N64933q86416j798154j720905n77235J185962K788517
$$ 12241868 14318888 14883821 13997405 12199251 10478346 9901111 11087073 13875590
10906A3875590L449314K722392Q07396j404631k834375k991258k239983j234592
$$ 13875590 17324904 20047296 20854692 19450061 16615686 13624428 11384445 10149853
10898A0149853k21168R25794K104983K792589K574581J603988L03446j174050
$$ 10149853 9928685 10854479 12959462 15752051 18326632 19930620 20234066 19060016
10890A9060016k853234m404846n125279m588540l088135j345994j1531N07043
$$ 19060016 16206782 11801936 6676657 2088117 -1000018 -2346012 -2357543 -1850500
10882a850500R4389r05268j786026k044686j784056j414107j122615q17138l76646
$$ -1850500 -1756111 -2661379 -4447405 -6492091 -8276147 -9690254 -10812869 -11630007 -12006653
10873a2006653K89879J241190K274473K885419K794280K362080K134503K135814
$$ -12006653 -11716774 -10475584 -8201111 -5315692 -2521412 -159332 1975171 4110985
10865D110985K029767J812550J784733J868397J571378P76111J3846k79744l02363
$$ 4110985 6140752 7953302 9738035 11606432 13177810 13953921 13967767 13688023 13385660
10856A3385660m08972n48373n18205m10886m30622n46419o60945q49777j096436
$$ 13385660 12976688 12428315 11910110 11499224 11068602 10522183 9861238 9011461 7915025
10847G915025j077146o08007o7442O4400p6526R3857Q45804J951900L138424M246708
$$ 7915025 6837879 6229872 6162430 6226830 6150304 6244161 7089965 9041865 12180289 16426997
10837A6426997M982938M995221M292595L220115J957412M04641j376929l019188
$$ 16426997 21409935 26405156 30697751 33917866 35875278 36279919 34902990 31883802
10829C1883802m281126n251708n937641o031993n397003m487574l908344l676767
$$ 31883802 27602676 22350968 16413327 10381334 4984331 496757 -3411587 -7088354
10821g088354l279522k432912j467061q75722p20811o36064l08489K01039O21477
$$ -7088354 -10367876 -12800788 -14267849 -15143571 -15864382 -16500446 -16808935 -16607896 -15986419
10812a5986419Q63830J172984J844419K784127L416355L147636J999056P37835
$$ -15986419 -15122589 -13949605 -12105186 -9321059 -5904704 -2757068 -758012 -20177
10804b0177K72832Q63184J939614K668929K581670J683638K66126j144675j874208
$$ -20177 252655 1115839 3055453 5724382 8306052 9989690 10255816 9111141 7236933
10795G236933j586996p32678j30919J3315L23789J281529K400224K732341J978097
$$ 7236933 5649937 4917259 4786340 4799655 5123444 6404973 8805197 11537538 13515635
10786A3515635P03038m14481j132735j479682j491979j290097j126656j156617
$$ 13515635 14218673 13804192 12671457 11191775 9699796 8409699 7283043 6126426
10778F126426j294107j408267j525919j726043j930010j909029j481174o76793
$$ 6126426 4832319 3424052 1898133 172090 -1757920 -3666949 -5148123 -5824916
10770e824916K58603J048393J638325K240056L055341M004455M789643N112994
$$ -5824916 -5566313 -4517920 -2879595 -639539 2415802 6420257 11209900 16322894
10762A6322894M710124L345975J091819j396278l180551l766183l388052k548224
$$ 16322894 21033018 24378993 25470812 24074534 20893983 17127800 13739748 11191524
10754A1191524j503614l37649O96701J209986J076845O48765M90641R03752J657875
$$ 11191524 9687910 9350261 10046962 11256948 12333793 12982558 13473199 14376951 16034826
10745A6034826K136781J800045O29689q06311j769892j930400j604333j420677
$$ 16034826 18171607 19971652 20601341 19795030 18025138 16094738 14490405 13069728
10737A3069728j707229k204966k403719k101796j547514j065837o76804j02971
$$ 13069728 11362499 9157533 6753814 4652018 3104504 2038667 1361863 1258892
10729A258892R39214K432947L902674M591193M033569K557073J068385K82757
$$ 1258892 2198106 4631053 8533727 13124920 17158489 19715562 20783947 21066704
10721B1066704K72271O90812J123230J192564P48456J41508p3827M1522k97729
$$ 21066704 21338975 22029787 23153017 24345581 25094037 25235545 25161718 25203240 24905511
10712B4905511j519728k901244l377944k860759k137480j655453j126752l53007
$$ 24905511 23385783 20484539 17106595 14245836 12108356 10452903 9326151 8973144
10704H973144L13070O10524Q98603J637269K668529L344897L162240K062762L66500
$$ 8973144 9286214 9896738 10795341 12432610 15101139 18446036 21608276 23671038 24037538
10695B4037538j367550k614761l229084l393287l177441k411522j089752M13509
$$ 24037538 22669988 20055227 16826143 13432856 10255415 7843893 6754141 7167650
10687G167650J681625K504096K663531J914452M85166p87975j284775j344877
$$ 7167650 8849275 11353371 14016902 15931354 16416520 15628545 14343770 12998893
10679A2998893j757305k652248l323341l064737j775724J88371K263768L698656
$$ 12998893 11241588 8589340 5265999 2201262 425538 613909 2877677 6576333
10671F576333L844260K787778J498488J042953J650900K627250L074988K609415
$$ 6576333 10420593 13208371 14706859 15749812 17400712 20027962 23102950 25712365
10663B5712365J508179L79552k98999m88013n91139j154724k420987m036588n225202
$$ 25712365 27220544 27600096 27301097 26813084 26221945 25067221 22646234 18609646 13384444
10654A3384444n415393m782484m065597l756407l556940k743556r91255J266031
$$ 13384444 7969051 3186567 -879030 -4635437 -8192377 -10935933 -11927188 -10661157
10646a0661157L191390M101200L775608K527980J093682K55857L33297R68924
$$ -10661157 -7469767 -3368567 407041 2935021 4028703 4284560 4617857 5586781
10638E586781J458328J290401L89811j028630k664501m160605n078282n011619
$$ 5586781 7045109 8335510 8725321 7696691 5032190 871585 -4206697 -9218316
10630i218316l784758j560389J143998L477892M489067L719906J751453o4847
$$ -9218316 -13003074 -14563463 -13419465 -9941573 -5452506 -1732600 18853 -45994
10622d5994p00440k75771L13403M71397L87051N37332J048856J652468J997867
$$ -45994 -746434 -1022205 -708802 -237405 149646 686978 1735834 3388302 5386169
10613E386169J806504Q88695o90843k419069l494325l349906k079965l62153J042842
$$ 5386169 7192673 8081368 7390525 4971456 1477131 -1872775 -3952740 -4314893 -3272051
10604c272051J760783J877309J673249J364814J049445P67932N65002N43879Q49566
$$ -3272051 -1511268 366041 2039290 3404104 4453549 5221481 5786483 6330362 7179928
10595G179928J480821K111604K263563J729645P16591m23457j370999j717723
$$ 7179928 8660749 10772353 13035916 14765561 15482152 15058695 13687696 11969973
10587A1969973j050514N48766K305317L365672L491794K916482J738484j24187
$$ 11969973 10919459 11468225 13773542 17139214 20631008 23547490 25285974 25161787
10579B5161787k431651m451389n371739m743410k679775M1201K187458K858398
$$ 25161787 22730136 18278747 12907008 8163598 5483823 5525024 7712482 10570880
10571A0570880K209099J178870N14375L06304L66508N93643Q75947J036772J073894
$$ 10570880 12779979 13958849 14473224 14779528 15146036 15739679 16615626 17652398 18726292
10562A8726292J200830J508114J775363J684759J028472k74964k054576l699647
$$ 18726292 19927122 21435236 23210599 24895358 25923830 25648866 23594290 19894643
10554A9894643m400373l775573k197274n03153N31039O29070K19930R8761N96769
$$ 19894643 15494270 11718697 9521423 9018270 9549309 10178379 10398309 10497070 11093839
10545A1093839J227403J446974J485008J914690K631891K947624K644370K231568
$$ 11093839 12321242 13768216 15253224 17167914 19799805 22747429 25391799 27623367
10537B7623367K070183J928998J588514J245146J056995Q32920M35094L4217k20786
$$ 27623367 29693550 31622548 33211062 34456208 35513203 36346123 36781217 36815434 36594648
10528C6594648l45397k54477J10326L49467k4900o85485p15127P0142Q22419R61936
$$ 36594648 36249251 35994774 36105100 36454567 36429667 35744182 35029055 35099197 35921616 36883552
10518C6883552R40323J324871J960202K544750L267585M291710N259676N848724
$$ 36883552 37823875 39148746 41108948 43653698 46921283 51212993 56472669 62321393
10510F2321393O211031O432550O249183N712591N342326N177853M579647L487281
$$ 62321393 68532424 74964974 81214157 86926748 92269074 97446927 102026574 105513855
10502A05513855K914685L613942N217757P209468R558804J1875942J3437615J4749908
$$ 105513855 108428540 112042482 117260239 124469707 134028511 145904453 159342068 174091976
10494A74091976J7305215K0936504K3627192K4869740K5564705K1956006M284717
$$ 174091976 191397191 212333695 235960887 260830627 286395332 308351338 312636055
10487C12636055l1768992p3307011r7153171r1366169o5770640l9361313k2058554
$$ 312636055 280867063 207560052 110406881 19040712 -46729928 -86091241 -108149795
10480a08149795j1843881m504356N52550L015567M225990N359464O095043O271397
$$ -108149795 -119993676 -124498032 -123945482 -120929915 -116703925 -111344461 -105249418 -98978021
10472i8978021O764297P900902Q726728Q542766P791673O946323N818221M412191
$$ -98978021 -92213724 -84312822 -75586094 -67043328 -59251655 -52305332 -46487111 -42074920
10464d2074920L274185K513917J489874q1729j502654j900638j037068P32738
$$ -42074920 -38800735 -36286818 -34796944 -34878673 -36381327 -38281965 -39319033 -38586295
10456c8586295K574903L316616K357982M89011r88910j854178k789204l828693
$$ -38586295 -36011392 -32694776 -30336794 -29847783 -30836693 -32690871 -35480075 -39308768
10448c9308768m190316l679776k975214k248263p77812J567116L632263M464055
$$ -39308768 -43499084 -47178860 -50154074 -52402337 -53180149 -51613033 -47980770 -43516715
10440d3516715M535613M724558M853421M087511K260533O0116j744338k690934
$$ -43516715 -38981102 -34256544 -29403123 -25315612 -23055079 -22994963 -24739301 -27430235
10432b7430235k637678j960675j446713j504279j717703j508292q74595j32593
$$ -27430235 -30067913 -32028588 -33475301 -34979580 -36697283 -38205575 -39080170 -39212763
10424c9212763O34227J387555J753017J352073L26177q51373j867401k540594
$$ -39212763 -38578536 -37190981 -35437964 -34085891 -33759714 -34611087 -36478488 -39019082
10416c9019082k589845j851811n54452R57653K563846M112908N084435M953555
$$ -39019082 -41608927 -43460738 -44015190 -43057537 -40493691 -36380783 -31296348 -26342793
10408b6342793L837523K480473J632773J583103K096081K574086K442493J606586
$$ -26342793 -22505270 -20024797 -18392024 -16808921 -14712840 -12138754 -9696261 -8089675
10400h089675M54834o12715j392352j618456j021183J21875J017416J335595J685647
$$ -8089675 -7634841 -8247556 -9639908 -11258364 -12279547 -12157672 -11140256 -9804661 -8119014
10391h119014K617573L599067L662060K776845J813257J220071N10940q14084
$$ -8119014 -5501441 -1902374 1759686 4536531 6349788 7569859 8080799 7266715
10383G266715k495726l907720m694893m725467l848161k106656m778J737315K619269
$$ 7266715 4770989 863269 -3831624 -8557091 -12405252 -14511908 -14516686 -12779371 -10160102
10374a0160102K469356J363221l40914k021072l080299l263655k711815j834102
$$ -10160102 -7690746 -6327525 -6668439 -8689511 -11769810 -15033465 -17745280 -19579382
10366a9579382j138797r77004j317795j858953k391038k919261l419532l682725
$$ -19579382 -20718179 -21695183 -23012978 -24871931 -27262969 -30182230 -33601762 -37284487
10358c7284487l466592k612608r98583J283551L539261M653333M100530K647438
$$ -37284487 -40751079 -43363687 -44362270 -43078719 -39539458 -34886125 -30785595 -28138157
10350b8138157J645411J635879J981276J840241J090026K03069l42076k83531
$$ -28138157 -26492746 -24856867 -22875591 -21035350 -19945324 -19742255 -20084331 -20367862
10342b0367862M02866J333663J837105J673332J461865J893554K578630K274519
$$ -20367862 -19964996 -18631333 -16794228 -15120896 -13659031 -11765477 -9186847 -6912328
10334f912328M62935j775588k810331k102827m95604Q75490J558881J816252K112271
$$ -6912328 -6449393 -8224981 -11035312 -13138139 -13633743 -12758253 -11199372 -9383120 -7270849
10325g270849K647319L144294L053106K151492R34469K04514K79578Q06565J319157
$$ -7270849 -4623530 -1479236 1573870 3725362 4659831 4864345 5143923 5950488 7269645
10316G269645J678166J888863J806935J291441N24957p9671l39938n44990j146525
$$ 7269645 8947811 10836674 12643609 13935050 14460007 14380336 14040398 13495408 12348883
10307A2348883k213403l254615l656551l293618k612828k088620j719919j143029
$$ 12348883 10135480 6880865 3224314 -69304 -2682132 -4770752 -6490671 -7633700
10299g633700j19901J181873K257454K504746J618697K5221j189959j131306M4281
$$ -7633700 -7753601 -6571728 -4314274 -1809528 -190831 -165610 -1355569 -2486875 -2442594
10290b442594J281396J646928J046846J2649r09027j456073j584144j328200p59538
$$ -2442594 -1161198 485730 1532576 1545225 636198 -819875 -2404019 -3732219 -4491757
10281d491757n9339M22376L75739p3285l62513j04768M62524Q86063J129038J375620
$$ -4491757 -4551096 -4128720 -3752981 -3826266 -4188779 -4293547 -3831023 -2944960 -1815922 -440302
10271d40302J363725N24266j093380k571603l077052k673045j900936r36527M05189
$$ -440302 923423 1447689 354309 -2217294 -5294346 -7967391 -9868327 -10804854 -10399665
10262a0399665K021311L316894L673892K910387J331431m56561j817048k399745
$$ -10399665 -8378354 -5061460 -1387568 1522819 2854250 2397689 580641 -1819104
10254a819104k283776j784530j156731n06714J11437N93619P37062L18868o40680
$$ -1819104 -4102880 -5887410 -7044141 -7550855 -7439418 -6845799 -6108737 -5789869 -6430549
10245f430549j714277k374522k501938k393524k258494j971405j369585m76005
$$ -6430549 -8144826 -10519348 -13021286 -15414810 -17673304 -19644709 -21014294 -21490299
10237b1490299O71590K037926L234418L538052K637337J128691p1870o14349o87071
$$ -21490299 -20818709 -18780783 -15546365 -12008313 -9370976 -8242285 -8314155 -8928504 -9615575
10228i615575l73200M19930J411605J848548J184235l53361j967813k917099k969672
$$ -9615575 -9988775 -9568845 -8157240 -6308692 -5124457 -5477818 -7445631 -10362730 -13332402
10219a3332402k507369k211615k403930k644363k207864r99524K59713Q36877
$$ -13332402 -15839771 -18051386 -20455316 -23099679 -25307543 -26307067 -26047354 -25210477
10211b5210477P10292L71286K04246L14709P34579J396443J916749J770018Q54324
$$ -25210477 -24500185 -24128899 -23924653 -23609944 -22875365 -21478922 -19562173 -17792155 -16937831
10202a6937831l03792j076471j343238j410109j456848j356729j049872p52621
$$ -16937831 -17241623 -18318094 -19661332 -21071441 -22528289 -23885018 -24934890 -25687511
10194b5687511n82265k08632P80439K209104L319927L545397L095301K697151
$$ -25687511 -26269776 -26478408 -25697969 -23488865 -20168938 -16623541 -13528240 -10831089
10186a0831089K869638L468288L800142L180338J578037k08968j177352j011318
$$ -10831089 -7961451 -4493163 -693021 2487317 4065354 3856386 2679034 1667716
10178A667716k88925J56943r3509r44523j985472k649651k465758j420121J3166
$$ 1667716 1378791 1535734 1442225 497702 -1487770 -4137421 -6603179 -8023300 -8010134
10169h010134J319974K318434L049757L514497L623660L231231K179182O04815
$$ -8010134 -6690160 -4371726 -1321969 2192528 5816188 9047419 11226601 11831416
10161A1831416p30412q78260K05864J351664J371729L66724n41299n49487K27654
$$ 11831416 11101004 10222744 10428608 11780272 13152001 13518725 12977426 12427939 12655593
10152A2655593J315055K370009L004639K710002J357444m61772j897335k556293
$$ 12655593 13970648 16340657 19345296 22055298 23412742 22950970 21053635 18497342
10144A8497342k638644k531252k444180k325026j926337r87174M75025J989498
$$ 18497342 15858698 13327446 10883266 8558240 6631903 5644729 6119754 8109252
10136H109252K838428K563737J348080j11364j170240j707220k017144k311635
$$ 8109252 10947680 13511417 14859497 14748133 13577893 11870673 9853529 7541894
10128G541894k483673k377067k080561j810046j599224j236412m90757N88936
$$ 7541894 5058221 2681154 600593 -1209453 -2808677 -4045089 -4535846 -3946910
10120c946910J488006J407693n0877k268490l955166m301223l563494k402390
$$ -3946910 -2458904 -1051211 -1102088 -3370578 -7325744 -11626967 -15190461 -17592851
10112a7592851j066485L95215J494663J546708N71553n49450r89197p49655m15866
$$ -17592851 -18659336 -18264121 -16769458 -15222750 -14651197 -15200647 -16189844 -16939499 -17355365
10103a7355365m05124o03029n74166j1384R60940J919421K612353L168448L714687
$$ -17355365 -17760489 -18363518 -18937684 -18949068 -17988128 -16068707 -13456354 -10287906 -6573219
10094f573219L995629L663159K827667J987244J434239J021315M88888k75974
$$ -6573219 -2577590 1085569 3913236 5900480 7334719 8356034 8844922 8568948
10086H568948j289407k438908l336428l495582k774830j487484p8238J121563
$$ 8568948 7279541 4840633 1504205 -1991377 -4766207 -6253691 -6331929 -5210366
10078e210366J905780K272417K471113K665079K572921J796481M88999p18667
$$ -5210366 -3304586 -1032169 1438944 4104023 6676944 8473425 8962424 8243757
10070H243757j500929k090935k641732k852530k522501k043573j925375k083560
$$ 8243757 6742828 4651893 2010161 -842369 -3364870 -5408443 -7333818 -9417378
10062i417378j990769j383499m85358L53562R14764J078383Q64867N71846O60155
$$ -9417378 -11408147 -12791646 -13277004 -12923442 -12008678 -10930295 -10065428 -9493582 -8833427
10053h833427J392880K609372L817211M470011M261753L266786J784970O9461
$$ -8833427 -7440547 -4831175 -1013964 3456047 7717800 10984586 12769556 12839017
10045A2839017j667739k997332l288144k194585q4407K099062L365220L158655
$$ 12839017 11171278 8173946 4885802 2691217 2606810 4705872 8071092 11229747
10037A1229747J643611k91054j505827j412422m27265L75013N6827j598698l991956
$$ 11229747 12873358 12582304 11076477 9664055 9236790 9611803 9668630 8069932 4077976
10028D077976o036600o779212n992930m286361k609751j574883j099849n94842
$$ 4077976 -1958624 -8737836 -14730766 -19017127 -21626878 -23201761 -24301610 -24896452
10020b4896452M21283J753275K668583K749082K423628K364375K522117K223342
$$ -24896452 -24475169 -22721894 -20053311 -17304229 -14880601 -12516226 -9994109 -7770767
10012g770767J220389J36718l19750j91487q6491m68846j352801k401962l062693
$$ -7770767 -6550378 -6413660 -6733410 -6924897 -7011388 -7480234 -8833035 -11234997 -14297690
10003a4297690k838103j740389l90787M84388N64572m3507r60970j579735j323966
$$ -14297690 -17135793 -18876182 -19266969 -18782581 -18218009 -18261516 -19222486 -20802221 -22126187
9994b2126187j79281J227783K281041K892958L225335L235142K802887K066191
$$ -22126187 -22305468 -21077685 -18796644 -15903686 -12678351 -9443209 -6640322 -4574131
9986d574131J319067P69901O34146J177847K316122L387822L700909L146869J972155
$$ -4574131 -3255064 -2485163 -1851017 -673170 1642952 5030774 8731683 11878552 13850707
9977A3850707K12685k150471m590136o118355o087754m647929k458043k72337
$$ 13850707 14063392 11912921 7322785 1204430 -4883324 -9531253 -11989296 -12261633
9969a2261633J253212J787310J526812R82227N30068L42748O28338J532126K718422
$$ -12261633 -11008421 -9221111 -7694299 -6712072 -6182004 -5839256 -5210918 -3678792 -960370
9960i60370L412129L110067K121961J226362Q31969O13202K6069q95882j466801
$$ -960370 2451759 5561826 7683787 8910149 9742118 10355320 10381389 9485507 8018706
9951H018706j216435o33143o53513j424520k031018j612909l33082R87333J754742
$$ 8018706 6802271 6169128 5515615 4091095 2060077 447168 114086 1101419 2856161
9942B856161J802976J161280J16912p77125j230713j541102k001634k308442k071186
$$ 2856161 4659137 5820417 5937329 5160204 3929491 2388389 386755 -1921687 -3992873
9933c992873j620377j656383k220198k624590k365843j572048o17787J55670M00730
$$ -3992873 -5613250 -7269633 -9489831 -12114421 -14480264 -16052312 -16670099 -16514429 -16113699
9924a6113699L8270m11653l05123L20517R21959J349108J945894K766139L361688
$$ -16113699 -16075429 -16487082 -16792205 -16471688 -15549729 -14200621 -12254727 -9488588 -6126900
9915f126900L449377L179352K647054J758355P06962j6107k43004k40070j66292
$$ -6126900 -2677523 501829 3148883 4907238 5614200 5598093 5355089 5115019 4948727
9906D948727j2022m8108o12806j447901k032396k556283l682605n459966p583499
$$ 4948727 4936705 4888597 4275791 2827890 795494 -1760789 -5443394 -10903360 -18486859
9897a8486859j0418386j3842051j4879334r218670L084260J5301508J9925770
$$ -18486859 -28905245 -42747296 -57626630 -66845300 -63761040 -48459532 -28533762
9890b8533762J6139149R428257M696139K385743J072057N63100J069655J601609
$$ -28533762 -12394613 -2966356 1729783 4115526 5187583 5750683 6820338 8421947
9882H421947J136796K68011J37880M90570J53813j047144k111022k329157j877369
$$ 8421947 9558743 9826754 9964634 10455204 10609017 9561873 7450851 5121694 3244325
9873C244325j121206l06147J21582j97785p99656o61553N86673K199420L151251
$$ 3244325 2123119 1816972 1938554 1740769 941113 279560 866233 3065653 6216904
9864F216904K997302J886170K64583j223802j948722j706321q29184J43078P54851
$$ 6216904 9214206 11100376 11364959 10141157 8192435 6486114 5656930 5800008 6554859
9855F554859P18670Q1254o48230q79427n85512l08056l91881m83675j3795R94487
$$ 6554859 7273529 7354783 6706553 5827126 5241614 4933558 4541677 4058002 4044207 5038694
9845E038694J856683J936400J239055K94401l76125n81156l73169J50560Q83552
$$ 5038694 6895377 8831777 10070832 10365233 9989108 9407952 9034783 9185343 10068895
9836A0068895J650291K220237K349026J760802K33930k081661m449523n866645
$$ 10068895 11719186 13939423 16288449 18049251 18283181 16201520 11751997 5885352
9828E885352n713414m082145j601648Q50237K378834K451591J261326m51118k024762
$$ 5885352 171938 -3910207 -5511855 -4661618 -2282784 168807 1430133 979015 -1045747
9819a045747l177170l744940l558073k754535j832075j067224j61191J184478
$$ -1045747 -4222917 -7967857 -11525930 -14280465 -16112540 -17179764 -17340955 -16156477
9811a6156477K568151L189881K770795J809129R56728M56887J65501j98361q45626
$$ -16156477 -13588326 -10398445 -7627650 -5818521 -4861793 -4404906 -4239405 -4437766 -5283392
9802e283392j684861k275680k251102j762661j244400p92886j41245P39516J435291
$$ -5283392 -6968253 -9243933 -11495035 -13257696 -14502096 -15294982 -15436227 -14696711 -13261420
9793a3261420J637054J523870J352551R61082K3242j325047k421549k662312k003757
$$ -13261420 -11624366 -10100496 -8747945 -7786863 -7763621 -9088668 -11510217 -14172529 -16176286
9784a6176286r04784R4581P28082J047885J214957J313823J360780J322843J001022
$$ -16176286 -17081070 -16986489 -16258407 -15210522 -13995565 -12681742 -11320962 -9998119 -8997097
9775h997097J02267j258432k247369j963763m93794J094898J961851K250388K380257
$$ -8997097 -8894830 -10153262 -12400631 -14364394 -14858188 -13763290 -11801439 -9551051 -7170794
9766g170794K129894J051185m64664j316379j042070m65382o71632j690774k538218
$$ -7170794 -5040900 -3989715 -4454379 -5770758 -6812828 -7278210 -7949842 -9640616 -12178834
9757a2178834k354821j181414K77257J308312J578143J159708L79656m14082j060883
$$ -12178834 -14533655 -15715069 -15437812 -14129500 -12551357 -11391649 -11011993 -11426075 -12486958
9748a2486958j619177k200438k780004l164701l125329k559546j564605m12920
$$ -12486958 -14106135 -16306573 -19086577 -22251278 -25376607 -27936153 -29500758 -29913678
9740b9913678N25234R27163P38896K99908J34560N01206J159614J631197J647304
$$ -29913678 -29388444 -28461281 -27722385 -27422477 -27287917 -26786711 -25627097 -23995900 -22348596
9731b2348596J310286R26822Q08511J157322J943240K832659L350198L204232
$$ -22348596 -21038310 -20111488 -19302977 -18145655 -16202415 -13369756 -10019558 -6815326
9723f815326K469017J487387O31937P5568l22602q57615j574306k066390j847550
$$ -6815326 -4346309 -2858922 -2226985 -2151417 -2474019 -3331634 -4905940 -6972330 -8819880
9714h819880r04234L16130J462017K546805L559979M127931L896716L147459K660021
$$ -8819880 -9724114 -9407984 -7945967 -5399162 -1839183 2288748 6185464 9332923 11992944
9705A1992944K827837L107865K559825R29245r33113j826353j388245m88226m00023
$$ 11992944 14820781 17928646 20488471 21417716 20484603 18658250 17270005 16781779 16381756
9696A6381756j609613l453336m802628m950684l944809k411405j204401r26563
$$ 16381756 14772143 11318807 6516179 1565495 -2379314 -4790719 -5995120 -6921683
9688f921683j444167j903834j468744q2028J578790K776247L130139K505307R28366
$$ -6921683 -8365850 -10269684 -11738428 -11820456 -10241666 -7465419 -4335280 -1829973 -901607
9679i01607j193208l042156l891442l633976k708623j563888l09106J152779K770289
$$ -901607 -2094815 -5136971 -9028413 -12662389 -15371012 -16934900 -17244006 -16091227 -13320938
9670a3320938M148002M716058M201794K990891J887012J371328J170599O88953
$$ -13320938 -9172936 -4456878 -255084 2735807 4622819 5994147 7164746 7853699
9662G853699k19381j097784j453541j213567n51673M61947J792641L132863L936504
$$ 7853699 7634318 6536534 5082993 3869426 3317753 3779700 5572341 8705204 12641708
9653A2641708L827761K842937J248109o96318k678626m216978m855434m506643
$$ 12641708 16469469 19312406 20560515 19864197 17185571 12968593 8113159 3606516
9645C606516l433675j859682J89124K496001M298681M681819L456703J486549
$$ 3606516 172841 -1686841 -1497717 998284 5296965 9978784 13435487 14922036
9637A4922036k0191n16740m07761m90694j232733k460278l503782l614454k466393
$$ 14922036 14901845 14385105 13977344 13486650 12253917 9793639 6289857 2675403 209010
9628B09010m47041J556250K757521K932112K367785J489402N80757k24863q15144
$$ 209010 -238031 1318219 4075740 7007852 9375637 10865039 11445796 11220933 10405789
9619A0405789j016098o68150J51944R79301J155201L06932j353679l234424m793841
$$ 10405789 9389691 8721541 8873485 9852786 11007987 11314919 9961240 6726816 1932975
9610A932975n705365n729238m690622k714444l87005J459050K204361J793025
$$ 1932975 -3772390 -9501628 -14192250 -16906694 -17293699 -15834649 -13630288 -11837263
9602a1837263P51947j56461m97296n25778r22787k037334l384184l957811l057684
$$ -11837263 -11085316 -11241777 -11739073 -12264851 -13187638 -15224972 -18609156 -22566967 -25624651
9593b5624651q24784J920228M276377N784456O518578O726421O396197N274771
$$ -25624651 -26449435 -24529207 -20252830 -14468374 -7949796 -1223375 5172822 10447593
9585A0447593L373611J303845j06670n20517k68398J24835L64935L50420M0497
$$ 10447593 13821204 15125049 15018379 14497862 14229464 14354299 14719234 15069654 15110151
9576A5110151m44347p96880q36777p34848p02617n70393J8722R91856J740204
$$ 15110151 14665804 13868924 13032147 12297299 11594682 11024289 11043011 12034867 13775071
9567A3775071J764678J196087N00014j20041p38120j239937j247472o77940j27088
$$ 13775071 15539749 16735836 17235850 17115809 16377689 15137752 13890280 13212340 13085252
9558A3085252l95067j631577l130517m004355l925726l165322k079263p60368
$$ 13085252 12690185 11058608 7928091 3923736 -1990 -3167312 -5246575 -6006943
9550f006943P98808K346964L311989L161930J858643n6416j866811l162112l868755
$$ -6006943 -5208135 -2861171 450818 3612748 5471391 5414975 3548164 386052 -3482703
9541c482703l883203k932643r74158J410041L280513M049575L815632L064030
$$ -3482703 -7365906 -10298549 -11272707 -9862666 -6582153 -2532578 1283054 4347084
9533D347084K262655J737432J606776J623050J277695L48911o88230j015216k72741
$$ 4347084 6609739 8347171 9953947 11576997 12854692 13203603 12515373 11500157 11227416
9524A1227416J103582K327440K877018K646061J709160J88456j603709l061988
$$ 11227416 12330998 14658438 17535456 20181517 21890677 22079133 20475424 17413436
9516A7413436l556503k917148j591854k29128Q50875J662544K120993J873869
$$ 17413436 13856933 10939785 9347931 9118803 9969678 11632222 13753215 15627084
9508A5627084O88820j149305k964593m118156m249293l322801j707882j39832
$$ 15627084 16315904 15166599 12202006 8083850 3834557 511756 -1196126 -1335958
9500a335958O92613O57091K24593J3897L34841J062743J769637K001246J624502
$$ -1335958 -643345 13746 238339 252236 587077 1649820 3419457 5420703 7045205
9491G045205R62668M71370K55739K1167m87093j132681j521909j383242p66917
$$ 7045205 8007873 8479243 8734982 8756149 8269056 7136375 5614466 4231224 3464307
9482C464307N4042Q38808J559172K281863K819927K647650J403282n28299k176224
$$ 3464307 3518349 4357157 5916329 8198192 11018119 13665769 15069051 14540752 12364528
9473A2364528k831329k612140k162736j967443k017140j934958j291396K6307
$$ 12364528 9533199 6921059 4758323 2790880 773740 -1161218 -2452614 -2426307
9465b426307J555360K461214K220799J142623J12992k06204P4204K64320j86199
$$ -2426307 -870947 1590267 3811066 4953689 5066681 4860477 4934681 5199001 5012802
9456E012802j098494j700842j465051p70737n06282r68936j483172j318994o74192
$$ 5012802 3914308 2213466 748415 -22322 -528604 -1497540 -2980712 -4299706 -4973898
9447d973898l33871n12734n69813K1483Q95335J292703J024642N35371J63878
$$ -4973898 -5307769 -5820503 -6390316 -6368833 -5473498 -4180795 -3156153 -2620782 -2456904
9438b456904j85521n98537q58500q82152j095990j891874k795699k714358j228176
$$ -2456904 -2642425 -3240962 -4099462 -4981614 -6077604 -7969478 -10765177 -13479535 -14707711
9429a4707711P17262J725009J361682L86029k22942n9438P75323J982263L118041
$$ -14707711 -13990449 -12265440 -10903758 -10517729 -10740671 -10800109 -10024786 -8042523 -4924482
9420d924482L747659L869481L978523M420602M831669M517443L329657J881110
$$ -4924482 -1176823 2692658 6671181 11091783 15923452 20440895 23770552 25651662
9412B5651662Q48050K59952m19587j579796k897700l535041k992735j756995r03369
$$ 25651662 26499712 26759664 26340077 24760281 21862581 18327540 15334805 13577810 12674441
9403A2674441r78762j496324j696844j553944j691210k421016l256301l453727
$$ 12674441 11695679 10199355 8502511 6948567 5257357 2836341 -419960 -3873687
9395c873687k790768j704627p94644k10931N50032K118112M309310N874892N584230
$$ -3873687 -6664455 -8369082 -9163726 -9374657 -8824625 -6706513 -2397203 3477689 9061919
9386I061919L545551J055832q61923k247689l411365m054637l750116k855549
$$ 9061919 12607470 13663302 12801379 10553690 7142325 3087688 -662428 -3517977
9378c517977k183782j831777j028339O98795K752241M119217M382725L807456
$$ -3517977 -5701759 -7533536 -8561875 -7863080 -5110839 -991622 3391103 7198559
9370G198559K814712J781055J101021R64124J114987J211502J388763K047098
$$ 7198559 10013271 11794326 12895347 13859471 14974458 16185960 17574723 19621821
9362A9621821L000833L287656K145408m9459k141238l380753l941554m307404
$$ 19621821 22622654 25910310 28055718 28006259 25865021 22484268 18542714 14235310
9354A4235310m556342m472466m117687l910067m058987m146415l460367j728013
$$ 14235310 9678968 5206502 1088815 -2821252 -6880239 -11026654 -14487021 -16215034
9346a6215034N55805K471580L236490K511757M67519k216077m515315n548761
$$ -16215034 -15659229 -13187649 -9951159 -7439402 -6971883 -9187960 -13703275 -19252036
9338a9252036n089990l586030j663290L06644K183604L818371M993209N539408
$$ -19252036 -24342026 -27928056 -29591346 -29284702 -27101098 -23282727 -18289518 -12750110
9330a2750110N414189M710966L658201K516673J378809J61676j079855j952223
$$ -12750110 -7335921 -2624955 1033246 3549919 4928728 5090404 4010549 2058326
9322B058326k068375j597366j257210j665910k804141m147972n161416n540720
$$ 2058326 -10049 -1607415 -2864625 -4530535 -7334676 -11482648 -16644064 -22184784
9314b2184784n122928l830744j847788K27974J603780J839481J202166L77729
$$ -22184784 -27307712 -31138456 -32986244 -32758270 -31154490 -29315009 -28112843 -27735114
9306b7735114j94038n75865r06215r70601m43508N58031J463055J833253J770860
$$ -27735114 -27929152 -28505017 -29411232 -30381833 -30825341 -30267310 -28804255 -26971002 -25200142
9297b5200142J705619J928538K343005K512467J958267O08363j018494k251611
$$ -25200142 -23494523 -21565985 -19222980 -16710513 -14752246 -14143883 -15162377 -17413988
9289a7413988k904329l293234l660118l845359l537937k525580o70262J913852
$$ -17413988 -20318317 -23611551 -27271669 -31117028 -34654965 -37180545 -37850807 -35936955
9281c5936955M461563N810226N498057M369321L665133L666344L638734K982951
$$ -35936955 -31475392 -25665166 -20167109 -15797788 -12132655 -8466311 -4827577 -1844626
9273a844626J947704J194493J124528J767715K925605M163411M921422M932443
$$ -1844626 103078 1297571 2422099 4189814 7115419 11278830 16200252 21132695
9265B1132695M453156L907080L356959K465398R49900j013177k830094l904182
$$ 21132695 25585851 29492931 32849890 35315288 36265188 35252011 32421917 28517735
9257B8517735m049077l544327k829113k213780j878644j940963k313328k592019
$$ 28517735 24468658 20924331 18095218 15881438 14002794 12061831 9748503 7156484
9249G156484k358847j647678r29595n74096m71562k41973L40262J228384K279300
$$ 7156484 4797637 3149959 2220364 1646268 1174706 932733 1272995 2501379 4780679
9240D780679L368094M284693M602175L827759J901776m18992j944527k090599
$$ 4780679 8148773 12433466 17035641 20863400 22765176 22346184 20401657 18311058
9232A8311058j469547j236059j903219k995255l722491l637137k676969j064053
$$ 18311058 16841511 15605452 13702233 10706978 6984487 3347350 670381 -393672
9224c93672O27192J695521J963981K010529K436417L046880L083805K190657P94995
$$ -393672 233520 1929041 3893022 5903551 8339968 11386848 14470653 16661310 17456305
9215A7456305m78989j417680k094935k451144k306432j720902j092933q39753
$$ 17456305 16977316 15559636 13464701 11013557 8707125 6986223 5893290 5053537
9207E053537j069844j548555j871053j708408j075637l98079j19275j56991L1725
$$ 5053537 3983693 2435138 564085 -1144323 -2219960 -2618039 -2737314 -2894305 -2862580
9198b862580O85713J296571J240574O51381K02167Q5335k22478j037718j883417
$$ -2862580 -2176867 -880296 360278 1011659 1213826 1299161 1076683 38965 -1844452
9189a844452k174548k031165j947689k003297j937640j761938j692661j598323
$$ -1844452 -4019000 -6050165 -7997854 -10001151 -11938791 -13700729 -15393390 -16991713
9181a6991713j125987l60236K55177P11542J509519K748227L759587L981807L651907
$$ -16991713 -18117700 -18477936 -18222759 -17511217 -16001698 -13253471 -9493884 -5512077 -1860170
9172a860170L192737K392518Q11445j231151k714400l013659k532952k152483
$$ -1860170 1332567 3725085 4536530 3305379 590979 -2422680 -4955632 -7108115
9164g108115k304640k655112k516049j539416j05679J005202J387417J320970
$$ -7108115 -9412755 -12067867 -14583916 -16123332 -16229011 -15223809 -13836392 -12515422
9156a2515422J233427J116626P44346K61603J44026N65032J145624J450630J514997
$$ -12515422 -11281995 -10165369 -9421023 -9159420 -9015394 -8450362 -7304738 -5854108 -4339111
9147d339111J744372K405940L302782L886929L663363K562878R81283n38180j652080
$$ -4339111 -2594739 -188799 3113983 7000912 10664275 13227153 14208436 13670256 12018176
9138A2018176k298745k576844k615378k472121k081963j371273m69530K82487
$$ 12018176 9719431 7142587 4527209 2055088 -26875 -1398148 -1867678 -1585191
9130a585191N88923L98119j30741p13946j033531r98808r58381j351384k031924
$$ -1585191 -996268 -598149 -728890 -1442836 -2476367 -3475175 -4433556 -5784940 -7816864
9121g816864k263451j586730l84760O76569J452549K194274K888547L225582L146054
$$ -7816864 -10080315 -11667045 -12051805 -11375236 -9922687 -7728413 -4839866 -1614284 1531770
9112A531770K958753K882640K843581K764171K696754K577747K152875J262323
$$ 1531770 4490523 7373163 10216744 12980915 15677669 18255416 20408291 21670614
9104B1670614j0597j493037k950104l943635m043206l359453k584793k281360
$$ 21670614 21660017 20166980 17216876 13273241 9230035 5870582 3285789 1004429
9096A004429k323167k236282j873424j448959j012768k81487Q35407J759865J617163
$$ 1004429 -1318738 -3555020 -5428444 -6877403 -7890171 -8171658 -7336251 -5576386 -3959223
9087c959223J75945j763418l088858l366809k900130j974821n58808J144019K417947
$$ -3959223 -3783278 -5546696 -8635554 -12002363 -14902493 -16877314 -17436122 -16292103 -13874156
9078a3874156K756633K499067K251799J985692J343274O43206P35566J699559
$$ -13874156 -11117523 -8618456 -6366657 -4380965 -3037691 -2394485 -1658919 40640
9070D0640K432680J937791N13076p36846j143723p94822m865R39142J651301J801683
$$ 40640 2473320 4411111 4924187 4187341 3043618 2248796 2243931 3183073 4834374 6636057
9060F636057J446178Q87836K43658n53542j404346k076288k583774l117054l477864
$$ 6636057 8082235 8970071 9213729 8660187 7255841 5179553 2595779 -521275 -3999139
9051c999139l009678j414941N94169J850280J911409J383641J032406R10667N80836
$$ -3999139 -7008817 -8423758 -7829589 -5979309 -4067900 -2684259 -1651853 -741186 -160350
9042a60350q0087p18129j082178j279163j273183n84202J076595L088929M312155
$$ -160350 -240437 -958566 -2040744 -3319907 -4593090 -5177292 -4100697 -1011768 3300387
9033C300387M159047K929544J181963p15301k354332l190029l019347k249215
$$ 3300387 7459434 10388978 11570941 10855640 8501308 5311279 2291932 42717
9025D2717j392091n27574M74101J421207J824487J388714K92977r39550j752412
$$ 42717 -1349374 -1876948 -1402847 18360 1842847 3231561 3524538 2584988 832576
9016H32576j913726j702846j573195j548820j237988n80415j78264n29414j220943
$$ 832576 -1081150 -2783996 -4357191 -5906011 -7143999 -7724414 -7902678 -8432092 -9653035
9007i653035j321304m28582J045002K465764L412050L628624L089108K211001
$$ -9653035 -10974339 -11402921 -10357919 -7892155 -4480105 -851481 2237627 4448628
8999D448628J603872J436890J313151Q48474J01390o36227j156226j298356q92108
$$ 4448628 6052500 7489390 8802541 9651015 9752405 9116178 7959952 6661596 5769488
8990E769488J4653R99819J542224J439300R01633L06441j04459l48437n43204
$$ 5769488 5784141 6783960 8326184 9765484 10667117 10973558 10869099 10520662 9977458
8981I977458o17299l20442L34822P98679M28659q27766k423341l802678m701542
$$ 9977458 9360159 9039717 9374539 10173218 10601877 9774111 7350770 3548092 -1153450
8972a153450m924211m265829k814592j035287O06662J897548K713082K955514
$$ -1153450 -6077661 -10343490 -13158082 -14193369 -13586707 -11689159 -8976077 -6020563
8964f020563K828451K860282L376627M103751M464256M091890K943540J197730
$$ -6020563 -3192112 -331830 3044797 7148548 11612804 15704694 18648234 19845964
8956A9845964p19923k265284l230749l888971m393034m243848k792973k65497
$$ 19845964 19126041 16860757 13630008 9741037 5348003 1104155 -1688818 -1954315
8948a954315K094235L026800K238937L91353j626667l278933m382253m726524
$$ -1954315 139920 3166720 5405657 5797010 4170343 891410 -3490843 -8217367
8940h217367l883333j613467J490085M067609N019711M421039L229802K217607
$$ -8217367 -12100700 -13714167 -12224082 -8156473 -3136762 1284277 4514079 6731686
8932F731686J435465N95489m25004j521950k494604l121771l327126l348659l527581
$$ 6731686 8167151 8762640 8337636 6815686 4321082 1199311 -2127815 -5476474 -9004055
8923i004055l835911l808431l039349j584188J67966J776870K818903K990189
$$ -9004055 -12839966 -16648397 -19687746 -21271934 -21103968 -19327098 -16508195 -13518006
8915a3518006K425629J770731J651188K067514K464411K364590J793978J114054
$$ -13518006 -11092377 -9321646 -7670458 -5602944 -3138533 -773943 1020035 2134089
8907B134089N95396K13247j87103n65277o08988j44441L38047j93915k374732
$$ 2134089 2729485 2942732 2755629 2190352 1581364 1436923 1774970 1581055 -793677
8898g93677n569382q081751q361567o122477k451832J047824L311273M261749
$$ -793677 -6363059 -14444810 -22806377 -28928854 -31380686 -30332862 -27021589 -22759840
8890b2759840M447619M377086M243858M125935M122069M150928L837210K867864
$$ -22759840 -18312221 -13935135 -9691277 -5565342 -1443273 2707655 6544865 9412729
8882I412729J433523J27247o05567p78629o32418k71848L39270J063387J406551
$$ 9412729 10846252 10973499 10367932 9589303 8956885 8685037 9024307 10087694 11494245
8873A1494245Q31720o02445j991326k257104j229904R1306M99728l28583j796090
$$ 11494245 12325965 11723520 9732194 7475090 6245186 6336492 6836220 6507637 4711547
8864D711547l139342l897471l839046k950689j615025m45405K33058N38555O33390
$$ 4711547 1572205 -2325266 -6164312 -9115001 -10730026 -11175431 -10942373 -10403818 -9770428
8855i770428M98450K42060K77196Q82750J771051K354209K311448J700948P26932
$$ -9770428 -9271978 -9029918 -8752722 -7869972 -6098921 -3744712 -1433264 267684 994616
8846I94616k94874q98678p89432k14067K53611K68172j90158j115479k389786
$$ 994616 699742 -198936 -988368 -1202435 -948824 -680652 -870810 -1986289 -4376075
8837d376075l375691l182694j682434J14904J096274J223082J295996J769005
$$ -4376075 -7751766 -10934460 -12616894 -12501990 -11405716 -10182634 -8886638 -7117633
8829g117633K297060K381606J905283R15680n84230k323247l651292m168446m222647
$$ -7117633 -4820573 -2438967 -533684 381996 -202234 -2525481 -6176773 -10345219 -14567866
8820a4567866m348341m389861l709665k226895o40329N66965J738953L190976
$$ -14567866 -18916207 -23306068 -27015733 -29242628 -29882957 -29315992 -27577039 -24386063
8812b4386063M189806L554720J293721j021423j836716j190827l66141k44701
$$ -24386063 -20196257 -16641537 -15347816 -16369239 -18205955 -19396782 -19762923 -20007624
8804b0007624m64715j55454R33811K215374K914825K722053J925051J122379P73365
$$ -20007624 -20472339 -20627793 -19693982 -17478608 -14563783 -11841730 -9916679 -8794300 -8020935
8795h020935Q24361P17054p5759j396372k363627k128855o64576J266854K817936
$$ -8020935 -7196574 -6479520 -6555279 -7951651 -10315278 -12444133 -13108709 -11841855 -9023919
8786i023919L520918L143922J560283q92297l145058l982518l058025j156330
$$ -9023919 -5503001 -2359079 -798796 -1691093 -4836151 -8818669 -11876694 -13033024
8778a3033024N84370J524245J647116J242158P03354L97739L96931L68797o4850
$$ -13033024 -12448654 -10924409 -9277293 -8035135 -7331781 -6934042 -6537111 -6168314 -6233164
8769f233164q87131j730964k271118k396646k101724j485783q72997o56236q89372
$$ -6233164 -7120295 -8851259 -11122377 -13519023 -15620747 -17106530 -17979527 -18635763 -19525135
8760a9525135j185707j124692o40758N8489P80413J384968J662871J444006Q87125
$$ -19525135 -20710842 -21835534 -22476292 -22417803 -21637390 -20252422 -18589551 -17145545 -16258420
8751a6258420M85031O38709J260424J870592K046330J698722R74978P7588p47141
$$ -16258420 -15773389 -15134680 -13874256 -12003664 -9957334 -8258612 -7283634 -7206046 -7953187
8742g953187j217563j234149j074841j171539j588606j819000j215621L50260
$$ -7953187 -9170750 -10404899 -11479740 -12651279 -14239885 -16058885 -17274506 -16924246
8734a6924246K246530L474228L394091K228384Q80586J58540J48002L93911N66038
$$ -16924246 -14677716 -11203488 -7809397 -5581013 -4700427 -4541887 -4393885 -3999974 -3433936
8725c433936P00717Q49596Q99194R19539J342624K424849L653550M018528K916137
$$ -3433936 -2733219 -1883623 -984429 -64890 1277734 3702583 7356133 11374661 14290798
8716A4290798O80013j659262k983644k687413j074632P97363J930839K137775
$$ 14290798 14970811 13311549 10327905 7640492 6565860 7363223 9294062 11431837
8708A1431837J915256J726336J661572J696158J867860K080986K021617J456678
$$ 11431837 13347093 15073429 16735001 18431159 20299019 22380005 24401622 25858300
8700B5858300N07908m37523r92627r79194n45594o0894K64813N60350Q74347P71807
$$ 25858300 26366208 25928685 24936058 23956864 23411270 23350376 23615189 24175539 25049886 25821693
8690B5821693j74100j512849k129191j568450o84696o25520j522371k541459k897954
$$ 25821693 25647593 24134744 22005553 20437103 19752407 19126887 17604516 15063057 12165103
8681A2165103k376851j131591M33661J620400J833050J190472M05901m8561l30186
$$ 12165103 9788252 8656661 9090322 10710722 12543772 13734244 14140145 14091584 13761398
8672A3761398o64124p91157l19142N59948J088949P37322k47691j169725j595183
$$ 13761398 13097274 12306117 11986975 12546923 13635872 14373194 14125503 12955778 11360595
8663A1360595j582686j309133p49964J28421J028664J435681J103654K86830n34879
$$ 11360595 9777909 8468776 7718812 7847233 8875897 10311578 11415232 11702062 11167183
8654A1167183j042553j218152j276369j460908j725889j642181q84070J80700
$$ 11167183 10124630 8906478 7630109 6169201 4443312 2801131 1917061 2097761
8646B097761P46259N47458K17547M28913J020855J321635J035931L62750n55238
$$ 2097761 2844020 3391478 3609025 4037938 5058793 6380428 7416359 7779109 7223871
8637G223871j728824k861897l321118k789377j688604q18872p38172j458425k443321
$$ 7223871 5495047 2633150 -687968 -3477345 -5165949 -5984821 -6722993 -8181418 -10624739
8628a0624739k879256k303194j108640j85048L6539o8004M3558M52447R26927
$$ -10624739 -13503995 -15807189 -16915829 -17100877 -17064338 -17132342 -17088784 -16636337 -15709410
8619a5709410J305723J462051J211207O23115K20274M64147J114713J444230J092908
$$ -15709410 -14403687 -12941636 -11730429 -11107314 -10887040 -10422893 -9308180 -7863950 -6771042
8610f771042M55461K16941P20954J770665K816607L338089L261368L010781K941729
$$ -6771042 -6315581 -6098640 -5377686 -3607021 -790414 2547675 5809043 8819824 11761553
8601A1761553K765446J853400J76926j388746j894700j242973j34690O50449P17666
$$ 11761553 14526999 16380399 16557325 15168579 13273879 12030906 11896216 12546665 13264331
8592A3264331J12220o70615q77931k05464O15706L75006j261084l242199m174502
$$ 13264331 13376551 12705936 11828005 11622541 12238247 12613253 11352169 8109970 3935468
8583C935468l583890j967654m0554J574181K203493J449824j45234j278613j056019
$$ 3935468 351578 -1616076 -1656630 -82449 2121044 3570868 3425634 2147021 1091002
8574A091002K56811J783194K935852L488445L171983J791335k89318k226837l393096
$$ 1091002 1347813 3131007 6066859 9555304 12727287 14518622 14229304 12002467 8609371
8565H609371l778792l707470l412480k961324k379387j721131j070979m44820
$$ 8609371 4830579 1123109 -2289371 -5250695 -7630082 -9351213 -10422192 -10867012
8557a0867012L77600J741420L563308M982604M941287L209693O04110j823688
$$ -10867012 -10489412 -8747992 -5184684 -202080 4739207 7948900 8553010 6729322
8549F729322l504353m263417m051257l118868k128830j599997j304370n98769
$$ 6729322 3224969 -1038448 -5089705 -8208573 -10337403 -11937400 -13241770 -13840539
8541a3840539O38930J767403K186031K076289K110943K588142L129332L248146
$$ -13840539 -13201609 -11434206 -9248175 -7171886 -5060943 -2472801 656531 3904677
8533C904677L001600K911684L263465L612241L101932J316571j190420l233546
$$ 3904677 6906277 9817961 13081426 16693667 19795599 21112170 19921750 16688204
8525A6688204l898779l191892j884265p83894j87859k107j92951q46406j745039
$$ 16688204 12789425 9597533 7713268 6929374 6741515 6739408 6546457 5700051 3955012
8516C955012k212513j719441n93447J83838j4827q49521j496646j547414j253181
$$ 3955012 1742499 23058 -570389 -386551 -401378 -1250899 -2747545 -4294959 -5548140
8507e548140j002574q11734m37389Q2643J64878q43018k797688m504928m627391
$$ -5548140 -6550714 -7362448 -7799837 -7717194 -7552316 -8395334 -11193022 -15697950 -20325341
8498b0325341k958905o29755J044308J724841J943563K130650K167920J882132
$$ -20325341 -23284246 -23914001 -22869693 -21144852 -19201289 -17070639 -14902719 -13020587
8490a3020587J511114J365172J242272N93163o67459j823647k044089j253417
$$ -13020587 -11509473 -10144301 -8902029 -8308866 -8976325 -10799972 -12844061 -14097478
8482a4097478j00484Q39005J545898K257010L012015L640029L939577L683213
$$ -14097478 -14197962 -13358957 -11813059 -9556049 -6544034 -2904005 1035572 4718785
8474D718785K677419J081625m94659j489197j860182j819504j328035l19540O76303
$$ 4718785 7396204 8477829 7983170 6493973 4633791 2814287 1486252 1166712 1843015
8465A843015P50778l23478j671313k223761j750737p79896J49588Q05878J111374
$$ 1843015 2593793 2270315 599002 -1624759 -3375496 -4155392 -4005804 -3199926 -2088552
8456b088552J108971J015249J009572J044959J107705J489975K413348L435497
$$ -2088552 -979581 35668 1045240 2090199 3197904 4687879 7101227 10536724
8448A0536724L664350K695595J057463l98556j314685j910856k474645k958012
$$ 10536724 14201074 16896669 17954132 17555576 16240891 14330035 11855390 8897378
8440H897378k984550k162162n40598J103943J622191M54676j671982l201532l084442
$$ 8897378 5912828 3750666 3210068 4314011 5936202 6390878 4718896 1517364 -1567078
8431a567078j665263j88531N07407O68986J045712J896028K743146K939918K209925
$$ -1567078 -3232341 -3420872 -2913465 -2244479 -1198767 697261 3440407 6380325 8590250
8422H590250P32907r34909j968026j686780j43191J848488L414971M215339M301856
$$ 8590250 9323157 8388248 6420222 4733442 4590251 6438739 9853710 14069049 18370905
8413A8370905L775832K863055K011418J471979R14364j50999j676730l209345
$$ 18370905 22146737 25009792 27021210 28493189 29407553 29256554 27579824 24370479
8405B4370479m596594o023586p319968p841429p301236o224885n208775m123891
$$ 24370479 19773885 13750299 6430331 -1411098 -8712334 -14937219 -20145994 -24269885
8397b4269885k526214n93181R05123J532234J617309J691429J874162J963159
$$ -24269885 -26796099 -27389280 -26484157 -24951923 -23334614 -21643185 -19769023 -17805864
8389a7805864J832429J536251J191318R29893Q63396R67381J090030J150496J193098
$$ -17805864 -15973435 -14437184 -13245866 -12315973 -11452577 -10485196 -9395166 -8244670 -7051572
8380g051572J144802P12142k28475j202472j389554m28763J143510K330128K471052
$$ -7051572 -5906770 -5194628 -5423103 -6625575 -8015129 -8443892 -7300382 -4970254 -2499202
8371b499202J618736L30554p60701j298134j352226j262870j230864j063775m24832
$$ -2499202 -880466 -549912 -1310613 -2608747 -3960973 -5223843 -6454707 -7518482 -7943314
8362g943314O61607J657300J911173J193584j19680j300596j740035j327056m54189
$$ -7943314 -7281707 -5624407 -3713234 -2519650 -2639330 -3939926 -5679961 -7007017 -7461206
8353g461206L69767R19067J288018J672958K219930K915189L393647L011889J522352
$$ -7461206 -7091439 -6172372 -4884354 -3211396 -991466 1923723 5317370 8329259 9851611
8344I851611l00367j150843n33279O94141J323931J024901K99950l89417r41676
$$ 9851611 9551244 8400401 7867122 8561263 9885194 10910095 11210045 10820628 9878952
8335I878952j245911j094658n68437q9912P1603R4050L14691Q78664J701941K505835
$$ 9878952 8633041 7538383 6969946 6880034 6951637 7045687 7360378 8239042 9940983 12446818
8325A2446818K848454K443364J553504P78954L46969q4197q10099j654593k372807
$$ 12446818 15295272 17738636 19292140 20071094 20418063 20333866 19523767 17869174 15496367
8316A5496367l075698l873812m389156m088460k981904j595730l67072N07562
$$ 15496367 12420669 8546857 4157701 69241 -2912663 -4508393 -4875465 -4367903
8308d367903P44851J15071r50727j486794j118836o61417j091669k159934k607105
$$ -4367903 -3623052 -3507981 -4458708 -5945502 -7064338 -7725755 -8817424 -10977358 -13584463
8299a3584463j756622l10761O42566Q89868R16661Q39422K04062j095276k280109
$$ -13584463 -15341085 -15651846 -15009280 -14119412 -13202751 -12363329 -12159267 -13254543 -15534652
8290a5534652k392920j239845O06045K402168L495302L348746J961641K55505
$$ -15534652 -17927572 -19167417 -18561372 -16159204 -12663902 -9315156 -7353515 -7098010
8282g098010n51568j85063M48118M28097j91593q02394j143867j273892r70462
$$ -7098010 -7649578 -7834641 -7386523 -6958426 -7150019 -7952413 -9096280 -10370172 -11340634
8273a1340634J07356J601691K410960J790026K00878j192397j678941j450127
$$ -11340634 -11233278 -9631587 -7220627 -5430601 -5229723 -6422120 -8101061 -9551188
8265i551188j116443j096369j432257j909674k221038k106792j453569l23172
$$ -9551188 -10667631 -11764000 -13196257 -15105931 -17326969 -19433761 -20887330 -21210502
8257b1210502J048096K283516L042823L296065L358877L494299L467109K662512
$$ -21210502 -20162406 -17878890 -14836067 -11540002 -8181125 -4686826 -1219717 1442795
8249A442795P85250j598346l346413l646658k638547j138339J96137J354793K642628
$$ 1442795 2228045 629699 -2716714 -6363372 -9001919 -10140258 -9944121 -8589328 -5946700
8240e946700L991396M778966M420084L071333J610971Q52138Q30228R25308O05490
$$ -5946700 -1955304 2823662 7243746 10315079 11926050 12778188 13608416 14533724 15139214
8231A5139214j00484q27319j292184j333559p83292L24158J451092J889248J588346
$$ 15139214 15038730 14211411 12919227 11585668 10802376 11126534 12577626 14466874 16055220
8222A6055220J336821J796116K533018K393451Q34468j418080l072075l353773
$$ 16055220 17392041 19188157 21721175 24114626 24949094 23531014 20458939 17105166
8214A7105166k374464q25610M24966P19494L1113r72101j535228j528786j376682
$$ 17105166 14730702 13905092 14330058 15049552 15080665 14108564 12573336 11044550 9667868
8205I667868j311094j030945k70062N76678P75491J92214m32761l27577M07338
$$ 9667868 8356774 7325829 7055767 7632445 8407936 8600150 8167389 7839812 8247150
8196H247150J015068J120756J200232J865517K951054L617998L290722K193767
$$ 8247150 9262218 10382974 11583206 13448723 16399777 20017775 23308497 25502264
8188B5502264R47928m8309p01665r98915j010617r89502j146333j327018j154245
$$ 25502264 26450192 26401883 25700218 24701303 23690686 22701184 21554851 20227833 19073588
8179A9073588n02976L84383J238404J907304K101068J395937j87721j834536k547175
$$ 19073588 18570612 18954995 20193399 22100703 24201771 25597708 25409987 23575451 21028276
8170B1028276k110567j233241p99333j209569k327608l640988m376122l869833
$$ 21028276 18917709 17684468 16885135 15675566 13347958 9706970 5330848 1461015
8162A461015k185556k69068P44503M26102p11010j680919j670939n10923J189611
$$ 1461015 -724541 -993609 -249106 176996 -534014 -2214933 -3885872 -4396795 -3207184
8153c207184K425178K557493J765523P04512j62677p68294j129988j105218m61575
$$ -3207184 -782006 1775487 3541010 4245522 4082845 3314551 2184563 1079345 617770
8144F17770R64618L115859N492530P125554P112671N379166K770702K57706j852262
$$ 617770 1582388 4698247 10190777 17316331 24429002 29808168 32578870 32836576 30984314
8135C0984314l811588n687447o960838o966300n666913l863987k520159j868143
$$ 30984314 27172726 21485279 14524441 7558141 1891228 -1972759 -4492918 -6361061
8127f361061j318610l08324R41446J689504J547574Q08354m2174q06680j499952
$$ -6361061 -7679671 -7987995 -7046549 -5357045 -3809471 -3001117 -3043291 -3849971 -5349923
8118e349923k097766k549574k866040l037836k988209k697113k220399j515130
$$ -5349923 -7447689 -9997263 -12863303 -15901139 -18889348 -21586461 -23806860 -25321990
8110b5321990m62784Q14177J913542K644324L333384M348884N452058N925249
$$ -25321990 -25784774 -24970597 -23057055 -20412731 -17079347 -12730463 -7278405 -1353156
8102a353156N283222L610207J313101j081315k883516l444486k699700j380727
$$ -1353156 3930066 7540273 8853374 7772059 4888543 1444057 -1255643 -2636370
8094b636370m80384m70922r98935j217965m59825J176131K782023L332780K552788
$$ -2636370 -3116754 -3587676 -4586611 -5804576 -6264401 -5088270 -2306247 1026533 3579321
8085C579321J083362j50986n85191j21017R84824K093910K327898J188484q56226
$$ 3579321 4662683 4511697 3926506 3805489 4790313 6884223 9212121 10400605 9544379
8076I544379k608393l123892k486829j628359j400472j793739k043549j520167
$$ 9544379 6935986 3812094 1325265 -303094 -1703566 -3497305 -5540854 -7061021
8068g061021m30991N16285J082723J780756L015459M277369M604824L727843K285321
$$ -7061021 -7492012 -6975727 -5893004 -4112248 -1096789 3180580 7785404 11513247 13798568
8059A3798568Q58330p02413k669974m534024n245537m383912k701059j382468
$$ 13798568 14656898 13954485 11284511 6750487 1504950 -2878962 -5580021 -6962489
8051f962489j023976j439761k147682k714385k770062k102940q83776M09087J426190
$$ -6962489 -7986465 -9426226 -11573908 -14288293 -17058355 -19161295 -20045071 -19635984 -18209794
8042a8209794K194656K864023L386209L595205L439136K908327J857487K32794
$$ -18209794 -16015138 -13151115 -9764906 -6169701 -2730565 177762 2035249 2268043
8034B268043j501079k516916k434132j786860j451348j704501k062237j961910
$$ 2268043 766964 -1749952 -4184084 -5970944 -7422292 -9126793 -11189030 -13150940
8026a3150940j317422l74463O70776J685899K383445K372805J522916J75468j087903
$$ -13150940 -14468362 -14842825 -14172049 -12486150 -10102705 -7729900 -6206984 -6031516 -7119419
8017g119419j887924k244403k366185k313518j929923j109603n7197P93598J122039
$$ -7119419 -9007343 -11251746 -13617931 -15931449 -17861372 -18970975 -19028172 -18234574 -17112535
8008a7112535R70819P20601Q64480J683808K944977L919431L935304L046673K031527
$$ -17112535 -16141716 -15421115 -14556635 -12872827 -9927850 -6008419 -2073115 973558 3005085
7999C005085J599587J701253J730338J260071L76700n91169j356513j661114j286746
$$ 3005085 4604672 6305925 8036263 9296334 9673034 9081865 7725352 6064238 4777492
7990D777492k63572J053891K214196K873820K799340J956603P37337j98688o05703
$$ 4777492 4513920 5567811 7782007 10655827 13455167 15411770 16149107 15950419 15344716
7981A5344716j005849k033834l516296m545465m457641l413998k000916o40383
$$ 15344716 14338867 12305033 8788737 4243272 -214369 -3628367 -5629283 -6269666
7973f269666M75804J251792J780865K349314L061729L591568L532218K868165
$$ -6269666 -5793862 -4542070 -2761205 -411891 2649838 6241406 9773624 12641789
$$ [...]
##END NTUPLES=NMR SPECTRUM
##END=
