##TITLE=31Pdec_LR-0169-C1-EtOAc
 CD3CN, 64 sc
 20.2.2023
##JCAMPDX= 6.0         $$ Bruker NMR JCAMP-DX V2.0
##DATA TYPE= NMR SPECTRUM
##DATA CLASS= NTUPLES
##ORIGIN= UXNMR, Bruker Analytische Messtechnik GmbH
##OWNER= root
$$ XWIN-NMR		Version 3.5
$$ Mon Feb 20 14:54:57 2023 Russian Standard Time (UT+4h)  she@DPX200
##.OBSERVE FREQUENCY= 81.013821
##.OBSERVE NUCLEUS= ^31P
##.ACQUISITION MODE= SIMULTANEOUS
##.ACQUISITION SCHEME= undefined
##.AVERAGES= 64
##.DIGITISER RES= 16
##SPECTROMETER/DATA SYSTEM= spect
##.PULSE SEQUENCE= zgpg30
##.SOLVENT NAME= DMSO
##.SHIFT REFERENCE= (INTERNAL, DMSO, 0, 248.564)
##AUDIT TRAIL= $$ (NUMBER, WHEN, WHO, WHERE, WHAT)
$$ ##TITLE= Audit trail, XWIN-NMR		Version 3.5
$$ ##JCAMPDX= 5.01
$$ ##ORIGIN= Bruker BioSpin GmbH
$$ ##OWNER= she
$$ F:/spectra/data/she/nmr/P31/1/pdata/1/auditp.txt
$$ ##AUDIT TRAIL=  $$ (NUMBER, WHEN, WHO, WHERE, WHAT)
(   1,<2023-02-20 14:45:25.75 +0400>,<she>,<DPX200>,
      <continue with go, POWCHK disabled, PULCHK disabled
       configuration hash MD5:
       00 E9 B6 7A A2 85 ED C7 34 08 36 98 17 FE 4E 26
       data hash MD5: 32K
       02 D3 0E 4C 81 CA 39 AE 3C 45 BE 1F 1D C8 A5 B6>)
(   2,<2023-02-20 14:53:41.64 +0400>,<she>,<DPX200>,
      <Start of raw data processing
       efp BC_mod = 2 LB = 1 FT_mod = 6 PKNL = 1 PHC0 = -11149.25 PHC1 = 473.6127 SI = 64K 
       data hash MD5: 64K
       51 2B 32 FE 68 E5 AA 67 CB 6E 3B 08 77 3C 5B 46>)
(   3,<2023-02-20 14:53:58.10 +0400>,<she>,<DPX200>,
      <pk PHC0 = 40.87064 PHC1 = -99.99999 
       data hash MD5: 64K
       78 04 A7 D3 CB 9E 6D 26 B7 32 48 A9 4C 69 EE AB>)
(   4,<2023-02-20 14:54:04.10 +0400>,<she>,<DPX200>,
      <abs ABSG = 5 
       data hash MD5: 64K
       95 D1 98 B7 C0 0B 25 4E 15 9D E2 56 1F 72 D3 D0>)
$$ ##END=
$$ 
$$ hash MD5
$$ 33 1F 69 E1 F6 77 52 8A B8 E6 04 FB 05 D1 22 A7
##$RELAX= 
##$RELAX= 
##$RELAX= 
##$RELAX= 
##$RELAX= 
##$RELAX= 
##$RELAX= 
##$RELAX= 
##$RELAX= 
$$ Bruker specific parameters
$$ --------------------------
##$DU= <F:/spectra>
##$EXPNO= 1
##$NAME= <P31>
##$PROCNO= 1
##$TYPE= <nmr>
##$USER= <she>
##$AMP= (0..31)
100 100 100 100 100 100 100 100 100 100 100 100 100 100 100 100 100 100 
100 100 100 100 100 100 100 100 100 100 100 100 100 100 
##$AQSEQ= 0
##$AQ_mod= 1
##$AUNM= <au_zg>
##$AUTOPOS= <>
##$BF1= 81.014009
##$BF2= 200.13
##$BF3= 200.13
##$BF4= 200.13
##$BF5= 200.13
##$BF6= 200.13
##$BF7= 200.13
##$BF8= 200.13
##$BYTORDA= 1
##$CFDGTYP= 0
##$CFRGTYP= 5
##$CHEMSTR= <none>
##$CNST= (0..31)
1 1 145 1 1 1 1 1 1 1 1 1 1 1 1 1 1 1 1 1 1 1 1 1 1 1 1 1 1 1 1 1 
##$CPDPRG= <waltz16>
##$CPDPRG1= <>
##$CPDPRG2= <waltz16>
##$CPDPRG3= <>
##$CPDPRG4= <mlev>
##$CPDPRG5= <mlev>
##$CPDPRG6= <mlev>
##$CPDPRG7= <mlev>
##$CPDPRG8= <mlev>
##$CPDPRGB= <>
##$CPDPRGT= <>
##$D= (0..31)
0 1 0 0 0 0 0 0 0 0 0 0.03 2e-05 3e-06 0 0 0 0 0 0 0 0 0 0 0 0 0 0 0 0 
0 0 
##$DATE= 1676889814
##$DBL= (0..7)
120 120 120 11 120 120 24 19 
##$DBP= (0..7)
150 150 150 150 150 150 150 150 
##$DBP07= 0
##$DBPNAM0= <>
$$ [...]
##$SUBNAM3= <"">
##$SUBNAM4= <"">
##$SUBNAM5= <"">
##$SUBNAM6= <"">
##$SUBNAM7= <"">
##$SUBNAM8= <"">
##$SUBNAM9= <"">
##$SW= 501.771253377433
##$SWIBOX= (0..15)
0 1 3 0 0 0 0 0 0 0 0 0 0 0 0 0 
##$SW_h= 40650.406504065
##$TD= 32768
##$TD0= 1
##$TE= 0
##$TE2= 300
##$TE3= 300
##$TEG= 300
##$TL= (0..7)
0 120 53 12 22 120 120 120 
##$TP= (0..7)
150 150 150 150 150 150 150 150 
##$TP07= 0
##$TPNAME0= <>
##$TPNAME1= <>
##$TPNAME2= <>
##$TPNAME3= <>
##$TPNAME4= <>
##$TPNAME5= <>
##$TPNAME6= <>
##$TPNAME7= <>
##$TPOAL= (0..7)
0.5 0.5 0.5 0.5 0.5 0.5 0.5 0.5 
##$TPOFFS= (0..7)
0 0 0 0 0 0 0 0 
##$TUNHIN= 0
##$TUNHOUT= 0
##$TUNXOUT= 0
##$USERA1= <user>
##$USERA2= <user>
##$USERA3= <user>
##$USERA4= <user>
##$USERA5= <user>
##$V9= 5
##$VALIST= <valist>
##$VCLIST= <CCCCCCCCCCCCCCC>
##$VD= 0
##$VDLIST= <DDDDDDDDDDDDDDD>
##$VPLIST= <PPPPPPPPPPPPPPP>
##$VTLIST= <TTTTTTTTTTTTTTT>
##$WBST= 1024
##$WBSW= 4
##$XGAIN= (0..3)
0 0 0 0 
##$XL= 0
##$YL= 0
##$YMAX_a= 5403
##$YMIN_a= -6921
##$ZGOPTNS= <>
##$ZL1= 120
##$ZL2= 120
##$ZL3= 120
##$ZL4= 120
##$ABSF1= 248.5645
##$ABSF2= -253.2056
##$ABSG= 5
##$ABSL= 3
##$ALPHA= 0
##$AQORDER= 0
##$ASSFAC= 0
##$ASSFACI= 0
##$ASSFACX= 0
##$ASSWID= 0
##$AUNMP= <proc_1d>
##$AZFE= 0.1
##$AZFW= 0.5
##$BCFW= 0
##$BC_mod= 2
##$BYTORDP= 0
##$COROFFS= 0
##$CY= -3
##$DATMOD= 1
##$DC= 0
##$DFILT= <>
##$DTYPP= 0
##$F1P= 0
##$F2P= 0
##$FCOR= 1
##$FTSIZE= 65536
##$FT_mod= 6
##$GAMMA= 0
##$GB= 0
##$INTBC= 1
##$INTSCL= 6.047779e-11
##$ISEN= 30
##$LB= 1
##$LEV0= 0
##$LPBIN= 0
##$MAXI= 10000
##$MC2= 0
##$MEAN= 0
##$ME_mod= 0
##$MI= 50
##$NCOEF= 0
##$NC_proc= -7
##$NLEV= 6
##$NOISF1= 182.463
##$NOISF2= 159.3651
##$NSP= 0
##$NTH_PI= 0
##$NZP= 0
##$OFFSET= 248.5645
##$PC= 4
##$PHC0= -11108.38
##$PHC1= 373.6127
##$PH_mod= 1
##$PKNL= yes
##$PPARMOD= 0
##$PSCAL= 0
##$PSIGN= 0
##$REVERSE= no
##$SF= 81.0140089999694
##$SI= 65536
##$SIGF1= 159.3651
##$SIGF2= -187.1042
##$SINO= 113.3802
##$SIOLD= 16384
##$SREGLST= <1H.CDCl3>
##$SSB= 0
##$STSI= 65536
##$STSR= 0
##$SW_p= 40650.406504065
##$SYMM= 0
##$S_DEV= 0
##$TDeff= 32768
##$TDoff= 0
##$TI= <>
##$TILT= no
##$TM1= 0
##$TM2= 0
##$TOPLEV= 0
##$USERP1= <user>
##$USERP2= <user>
##$USERP3= <user>
##$USERP4= <user>
##$USERP5= <user>
##$WDW= 1
##$XDIM= 65536
##$YMAX_p= 281009980
##$YMIN_p= -27174930
$$ End of Bruker specific parameters
$$ ---------------------------------
##NTUPLES= NMR SPECTRUM
##VAR_NAME=  FREQUENCY,     SPECTRUM/REAL,   SPECTRUM/IMAG
##SYMBOL=    X,             R,               I
##VAR_TYPE=  INDEPENDENT,   DEPENDENT,       DEPENDENT
##VAR_FORM=  AFFN,          ASDF,            ASDF
##VAR_DIM=   65536,         65536,           65536
##UNITS=     HZ,            ARBITRARY UNITS, ARBITRARY UNITS
##FACTOR=    0.620285442955139, 1,           1
##FIRST=     20137.2065510682, 0,            0
##LAST=      -20513.1999529968, 0,           0
##MIN=       -20513.1999529968, -27174930,   0
##MAX=       20137.2065510682, 281009980,    0
$$ Real data points
##PAGE= N=1
##DATA TABLE= (X++(R..R)), XYDATA
$$ [...]
$$ plain form
39865 12148131 12096119 8792128 6815368 7612094 7586469 4503628 1693822 2726367 5394293
39856 5394293 5354227 3289025 3329783 5620005 5990715 3146325 774075 1167914 1585374
39847 1585374 -787024 -4152221 -5039554 -3073144 -564302 262970 -1918612 -6677741
39839 -6677741 -10278137 -8320442 -1770485 3237218 3657495 3295022 5497446 7253247
39831 7253247 5367461 3677168 7177760 12168488 10486319 2573485 -2096008 1441661
39823 1441661 7761484 11106690 13298535 17001214 18172210 12326043 4008369 2160547
39815 2160547 7491268 11573547 8814793 3011375 288045 1024794 2057271 2877602
39807 2877602 5215059 8185692 8181267 3959268 -1090719 -2845564 -833610 2331766 4504985
$$ packed form
39865A2148131n2012l303991j976760P96726k5625l082841k809806J032545K667926
39856E394293m0066k065202M0758K290222L70710k844390k372250L93839M17460
39847A585374k372398l365197q87333J966410K508842Q27272k181582m759129
39839f677741l600396J957695O549957N007703M20277l62473K202424J755801
39831G253247j885786j690293L500592M990728j682169p912834m669493L537669
39823A441661O319823L345206K191845L702679J170996n846167q317674j847822
39815B160547N330721M082279k758754n803418k723330P36749J032477Q20331
39807B877602K337457K970633m425m221999n049987j754845K011954L165376K173219
$$ plain form
39798 4504985 5534921 5943223 5776079 5133694 4774353 5423690 6748147 7429785 6265897
39789 6265897 3287109 67052 -1290489 -68408 2216292 3481793 3392420 3136220 3230512
39780 3230512 3060123 2699311 3302234 4916395 5767577 5009061 4521358 6298957 9373653
39771 9373653 11122562 10489421 8124390 4619769 800048 -1356429 -616899 1356895
39763 1356895 2024904 1230969 120312 -1639625 -4150297 -4292280 743867 7240956 7672086
39754 7672086 733413 -6484924 -8138930 -6173956 -4611661 -2976061 80156 1443230
39746 1443230 -2064382 -6919068 -6864826 -2141172 1304523 1138760 1053439 3397822 5301285
39737 5301285 4090981 1961935 2690141 6661207 11041630 12707944 10202743 5161084
$$ packed form
39798D504985J029936M08302j67144o42385l59341O49337J324457O81638j163888
39789F265897k978788l220057j357541J222081K284700J265501q9373k56200R4292
39780C230512j70389l60812O02923J614161Q51182p58516m87703J777599L074696
39771I373653J748909o33141k365031l504621l819721k156477P39530J973794
39763A356895O68009p93935j110657j759937k510672j41983N036147O497089M31130
39754G672086o938673p218337j654006J964974J562295J635600L056217J363074
39746A443230l507612m854686N4242M723654L445695j65763q5321K344383J903463
39737E301285j210304k129046P28206L971066M380423J666314k505201n041659
$$ plain form
39729 5161084 1949379 3052032 5228852 4055922 1602552 4011363 10952101 14308688
39721 14308688 10035423 4656166 5428829 9828789 10707946 7297594 4226045 2862435
39713 2862435 1100457 -35664 2724303 7558387 8284575 3485423 -1372172 -2345356
39705 -2345356 -1577460 -1593706 -973059 1408021 3077593 2490370 2534426 5823003 10141179
39696 10141179 12203956 12506344 12619779 11051340 6399687 2032961 2540847 6890834
39688 6890834 9784867 9046979 7316134 6849155 6979388 6948083 7298025 7779857 7311310
39679 7311310 6786113 8677643 12772315 15220472 13241938 8456269 4222324 1742865
39671 1742865 231390 -802033 -1109835 -655582 198818 1041653 1455208 1181266 415436
$$ packed form
39729E161084l211705J102653K176820j172930k453370K408811O940738L356587
39721A4308688m273265n379257P72663M399960Q79157l410352l071549j363610
39713B862435j761978j136121K759967M834084P26188m799152m857595r73184
39705b345356P67896j6246O20647K381080J669572n87223M4056L288577M318176
39696A0141179K062777L02388J13435j568439m651653m366726N07886M349987
39688F890834K894033p37888j730845m66979J30233l1305L49942M81832m68547
39679G311310n25197J891530M094672K448157j978534m785669m233945k479459
39671A742865j511475j033423l07802M54253Q54400Q42835M13555k73942p65830
$$ plain form
39662 415436 -372989 -531643 1105331 5261165 9914936 10831482 6547625 1300012 242171
39653 242171 3000431 5225758 5434126 6090399 8071229 8751985 6738528 4248062 3024858
39644 3024858 1812604 74162 337409 3746290 6535136 4713748 87647 -2135517
39636 -2135517 -295739 2734037 4537641 5519584 6416727 6677219 6072064 5829660 7341605
39627 7341605 10652530 14232591 15754675 14093509 11396297 11647892 15826442 20155207
39619 20155207 20808293 18319921 15091051 10996602 5208508 710947 2115974 8774566
39611 8774566 14435220 14908552 12319486 10249051 8476467 5264253 1879747 1098445
39603 1098445 2452679 2512124 -16747 -2304647 -1422625 1669377 3635871 3190390 2253828
$$ packed form
39662D15436p88425j58654J636974M155834M653771R16546m283857n247613j057841
39653B42171K758260K225327K08368O56273J980830O80756k013457k490466j223204
39644C024858j212254j738442K63247L408881K788846j821388m626101k223164
39636b135517J839778L029776J803604R81943Q97143K60492o05155k42404J511945
39627G341605L310925L580061J522084j661166k697212K51595M178550M328765
39619B0155207O53086k488372l228870m094449n788094m497561J405027O658592
39611H774566N660654M73332k589066k070435j772584l212214l384506p81302
39603A098445J354234N9445k528871k287900Q82022L092002J966494m45481r36562
$$ plain form
39594 2253828 2719070 3719343 3209434 1343659 579011 2333365 5102678 6537608 6096765
39585 6096765 4779568 3405241 2272240 1644364 1546914 1844151 3149131 6257209 9753231
39576 9753231 10155499 6280409 1688143 390663 1665111 1987512 729415 306153 1425036
39567 1425036 2380933 3195420 5929996 9677187 9807296 4773492 -184882 351461 4500251
39558 4500251 6179433 3803401 1458408 1944689 2985981 1339775 -2572908 -5744354
39550 -5744354 -6246928 -4482100 -2280325 -1855092 -4275418 -7786316 -8767232 -5667689 -1243722
39541 -1243722 411962 -1359221 -3254449 -2241335 813656 2289554 123775 -3579887
39533 -3579887 -4493252 -644686 5284573 8800169 8523440 7184976 7440015 8300094 7108591
$$ packed form
39594B253828M65242J000273n09909j865775p64648J754354K769313J434930m40843
39585F096765j317197j374327j133001o27876r7450K97237J304980L108078L496022
39576I753231M02268l875090m592266j297480J274448L22401j258097m23262J118883
39567A425036R55897Q14487K734576L747191J30109n033804m958374N36343M148790
39558D500251J679182k376032k344993M86281J041292j646206l912683l171446
39550e744354n02574J764828K201775M25233k420326l510898r80916L099543M423967
39541a243722J655684j771183j895228J013114L054991J475898k165779l703662
39533c579887r13365L848566N929259L515596k76729j338464K55039Q60079j191503
$$ plain form
39524 7108591 3805572 959435 -66028 -451883 -1114534 -1207248 -439373 -215954 -761858
39515 -761858 229769 3578034 5783661 3735922 244545 358682 3196614 2736741 -2810139
39506 -2810139 -7783199 -7052213 -2419334 1573478 3781870 4875059 3553098 -973420
39498 -973420 -5196753 -4820147 -940066 1327814 -320904 -3423425 -4855331 -3517462
39490 -3517462 319508 4920218 6897181 4487912 640430 -254461 1943854 3853101
39482 3853101 3902097 3062200 1191571 -2642215 -6258212 -5649030 -933505 3435399 5273716
39473 5273716 6865256 9376573 10108453 7626876 5112772 5597629 7520665 7980481 7102170
39464 7102170 6226273 4915304 2847900 1679195 1773898 93455 -4945485 -9261253 -8069414
$$ packed form
39524G108591l303019k846137j025463l85855o62651r2714P67875K23419n45904
39515g61858R91627L348265K205627k047739l491377J14137K837932m59873n546880
39506b810139m973060P30986M632879L992812K208392J093189j321961m526518
39498i73420m223333L76606L880081K267880j648718l102521j431906J337869
39490c517462L836970M600710J976963k409269l847482q94891K198315J909247
39482C853101M8996q39897j870629l833786l615997O09182M715525M368904J838317
39473E273716J591540K511317P31880k481577k514104M84857J923036M59816q78311
39464G102170q75897j310969k067404j168705R4703j680443n038940m315768J191839
$$ plain form
39455 -8069414 -3035288 14007 -855820 -2463156 -2510134 -2040948 -1769477 -525006 1449497
39446 1449497 1466876 -1505807 -4565416 -4658463 -2575175 -1247738 -1602063 -2088373 -1465010
39437 -1465010 -148901 987000 1514236 880080 -1508104 -4576059 -5126862 -1080250 4960887
39428 4960887 7717713 5678773 3141104 4097125 6650692 6517587 3844958 2170380
39420 2170380 1798882 -419661 -4370631 -5328334 -1283510 3301388 3929519 2142449 1923238
39411 1923238 3616123 4990238 5362293 5053565 3383287 801123 498531 4088534 7952058
39402 7952058 7847626 5098050 4013703 4982466 4685759 2038336 -597628 -1590947 -1406790
39393 -1406790 -221954 2083784 3941709 3582328 2043413 1506152 1579032 666650 -207608
$$ packed form
39455h069414N034126L049295q69827j607336m6978M69186K71471J244471J974503
39446A449497J7379k972683l059609r3047K083288J327437l54325m86310O23363
39437a465010J316109J135901N27236o34156k388184l067955n50803M046612O041137
39428D960887K756826k038940k537669R56021K553567j33105k672629j674578
39420B170380l71498k218543l950970r57703M044824M584898O28131j787070k19211
39411A923238J692885J374115L72055l08728j670278k582164l02592L590003L863524
39402G952058j04432k749576j084347R68763k96707k647423k635964r93319J84157
39393a406790J184836K305738J857925l59381j538915n37261P2880r12382q74258
$$ plain form
39384 -207608 1082939 3496138 4218769 3324300 2782440 2164562 245943 -569713 2577805
39375 2577805 6356810 4752617 -731388 -2112694 2426032 5095695 921068 -4257234
39367 -4257234 -3295680 1380091 2809247 472352 -643098 1253887 3586464 4994558
39359 4994558 6130703 6147019 3806880 1183397 1207505 2390508 1117609 -1501859 -797786
39350 -797786 3225651 4833693 1442059 -1970736 -394636 3734325 4659298 1852727
39342 1852727 -253780 229587 179356 -2858926 -6378461 -6495539 -3634988 -1970303 -3845921
39333 -3845921 -7136082 -8396147 -6562396 -2689247 1994210 6082719 7572468 5812462
39325 5812462 3264578 2987809 4555087 4790170 2575357 291972 -113766 206905 -405355
$$ packed form
39384b07608J290547K413199P22631q94469n41860o17878j918619q15656L147518
39375B577805L779005j604193n484005j381306M538726K669663m174627n178302
39367d257234R61554M675771J429156k336895j115450J896985K332577J408094
39359D994558J136145J6316k340139k623483K4108J183003j272899k619468P04073
39350g97786M023437J608042l391634l412795J576100M128961R24973k806571
39342A852727k106507M83367n0231l038282l519535j17078K860551J664685j875618
39333c845921l290161j260065J833751L873149M683457M088509J489749j760006
39325E812462k547884k76769J567278K35083k214813k283385m05738L20671o12260
$$ plain form
39316 -405355 -1216888 -686219 662428 922503 -537705 -2662792 -4302156 -4978034 -4590139
39307 -4590139 -3307764 -1410593 1097204 4006782 6046822 5872191 4225234 3622264
39299 3622264 5343204 8038529 9632418 9142480 6527584 2643443 -428383 -1107329
39291 -1107329 -550991 -811991 -899406 1923982 6531168 7909388 4348892 314483 -360630
39282 -360630 228383 -907413 -1605295 1413956 5630351 5802424 2321500 439059 1604074
39273 1604074 1654116 -1426840 -3651684 -1395917 2732971 3632108 628708 -2405398 -2457983
39264 -2457983 -358882 1220583 1031470 163981 123588 458160 -599380 -2667407 -2393925
39255 -2393925 1896292 6485517 6418359 2570513 836973 4034280 8369326 9177699 6753554
$$ packed form
39316d05355q11533N30669J348647K60075j460208k125087j639364o75878L87895
39307d590139J282375J897171K507797K909578K040040j74631j646957o02970
39299C622264J720940K695325J593889m89938k614896l884141l071826o78946
39291a107329N56338k61000q7415K823388M607186J378220l560496m034409o75113
39282c60630N89013j135796o97882L019251M216395J72073l480924j882441J165015
39273A604074N0042l080956k224844K255767M128888Q99137l003400l034106n2585
39264b457983K099101J579465j89113q67489m0393L34572j057540k068027K73482
39255b393925M290217M589225o7158l847846j733540L197307M335046Q08373k424145
$$ plain form
39246 6753554 4392448 3345953 2464680 1314474 843740 1224429 1127676 -357154 -2182561
39237 -2182561 -2424396 -728232 920167 539246 -928207 -387815 3269661 7546802 9910625
39228 9910625 10823615 11269262 9751578 5241518 1272226 2320632 6455131 6739327 1115298
39219 1115298 -4015846 -2560312 3047793 5833424 3521350 -73819 -1172546 207765
39211 207765 1990166 2368370 347231 -3584138 -6891188 -6795056 -3163583 1190386 3108477
39202 3108477 1575468 -1766497 -3979242 -3371284 -1141024 322875 789691 2126302
39194 2126302 4499458 5084135 2098626 -1994501 -3518479 -2318088 -1131835 -1316448
39186 -1316448 -1686209 -1146727 -243033 -92759 -1354726 -3975015 -6595550 -6934626 -4431739
$$ packed form
39246F753554k361106j046495q81273j150206m70734L80689r6753j484830j825407
39237b182561k41835J696164J648399l80921j467453N40392L657476M277141K363823
39228I910625R12990M45647j517684m510060l969292J048406M134499K84196n624029
39219A115298n131144J455534N608105K785631k312074l595169j098727J380311
39211B07765J782401L78204k021139l931369l307050R6132L631473M353969J918091
39202C108477j533009l341965k212745O07958K230260J463899M66816J336611
39194B126302K373156N84677k985509m093127j523978J200391J186253j84613
39186a316448l69761N39482R03694J50274j261967k620289k620535l39076K502887
$$ plain form
39177 -4431739 -1744317 -1645207 -3137611 -2980552 -624740 1071177 174864 -2014408 -3696412
39168 -3696412 -4987822 -6302942 -6607482 -5243459 -3974322 -4998511 -7565857 -8625810
39160 -8625810 -6936632 -4850273 -5283923 -7955878 -9772349 -8814417 -6814491 -6824856 -8879109
39151 -8879109 -9363407 -5349630 1419619 6041989 5661401 2144439 -401461 204745 2843936
39142 2843936 5096501 5738960 5017486 3016389 -921932 -6259817 -9903110 -8952308 -4729742
39133 -4729742 -1588374 -1136337 -549474 1930447 3225836 295569 -3967822 -4228037 -794285
39124 -794285 728376 -2098776 -5371790 -5324229 -3374027 -2470984 -2341160 -1296851 268998
39115 268998 1263719 2295798 3687814 3381332 85216 -3451822 -3780520 -1737048 -536774
$$ packed form
39177d431739K687422R9110j492404J57059K355812J695917q96313k189272j682004
39168c696412j291410j315120l04540J364023J269137j024189k567346j059953
39160h625810J689178K086359m33650k671955j816471R57932J999926j0365k054253
39151h879109m84298M013777O769249M622370l80588l516962k545900O06206K639191
39142B843936K252565O42459p21474k001097l938321n337885l643293R50802M222566
39133d729742L141368M52037N86863K479921J295389k930267m263391k60215L433752
39124g94285J522661k827152l273014M7561J950202R03043J29824J044309J565849
39115B68998R94721J032079J392016l06482l296116l537038l28698K043472J200274
$$ plain form
39106 -536774 -440346 596293 2052426 1248553 -1556029 -3071322 -2540675 -3008426 -5936246
39097 -5936246 -8719636 -9089526 -8054795 -6736128 -4312755 -1327148 -881478 -3564862
39089 -3564862 -5127236 -2807366 -127717 -895911 -2149540 872252 5305820 3634501
39081 3634501 -4233932 -9325928 -5900537 1045643 3733444 1702074 -246371 -225272
39073 -225272 -524346 -2748975 -5888302 -8264692 -8388646 -5028769 832386 5395494 6102804
39064 6102804 4944017 5005185 5521592 3925636 1268060 1050049 3079498 3249742 111253
39055 111253 -2832245 -2838183 -1758964 -2032113 -2653442 -2023426 -1576814 -3024573 -4333885
39046 -4333885 -2398417 1570617 3143507 732536 -2804932 -4539729 -4275961 -2752040
$$ packed form
39106e36774R6428J036639J456133q03873k804582j515293N30647m67751k927820
39097e936246k783390l69890J034731J318667K423373K985607M45670k683384
39089c564862j562374K319870K679649p68194j253629L021792M433568j671319
39081C634501p868433n091996L425391O946180K687801k031370j948445K1099
39073b25272k99074k224629l139327k376390j23954L359877N861155M563108P07310
39064F102804j158787O1168N16407j595956k657576k18011K029449J70244l138489
39055A11253k943498n938J079219k73149o21329O30016M46612j447759j309312
39046d333885J935468L969034J572890k410971l537468j734797K63768J523921
$$ plain form
39038 -2752040 -238898 2157855 2636560 1548350 1774077 4588238 7084377 5720618
39030 5720618 1082181 -2985157 -4168639 -3478907 -2543639 -1372387 449679 2000993
39022 2000993 1952794 763353 475244 1843938 2767126 924002 -2350580 -2839177 905564
39013 905564 4565620 3095064 -2107081 -4169415 506690 7330490 9027982 3961996
39005 3961996 -3167833 -7414773 -7824941 -6229982 -4390331 -2895322 -1501940 -73552
38997 -73552 471514 -1069582 -3692486 -4073783 -971542 1639737 -1043476 -7488113 -10561702
38988 -10561702 -6262889 1429876 5855427 4869735 730216 -4342718 -9187694 -11875969
38980 -11875969 -10574542 -6336906 -2433898 -606963 16191 332578 28481 -544228 289515
$$ packed form
39038b752040K513142K396753M78705j088210K25727K814161K496139j363759
39030E720618m638437m067338j183482O89732R35268J171252J822066J551314
39022B000993m8199j189441k88109J368694R23188j843124l274582m88597L744741
39013I05564L660056j470556n202145k062334M676105O823800J697492n065986
39005C961996p129829m246940m10168J594959J839651J495009J393382J428388
38997g3552N45066j541096k622904l81297L102241K611279k683213o444637l073589
38988a0561702M298813P692765M425551r85692m139519n072934m844976k688275
38980a1875969J301427M237636L903008J826935O23154L16387l04097n72709Q33743
$$ plain form
38971 289515 2896984 4778378 3406303 -290151 -2948188 -2882816 -1596798 -1091626 -1227345
38962 -1227345 -700195 307794 42483 -2069412 -4019280 -3729172 -2216954 -2631780 -6053556
38953 -6053556 -9812611 -10656252 -8315844 -4991701 -2406782 -675667 598879 1562166
38945 1562166 2324471 2883647 2857300 2025782 918151 140281 -539364 -1620256 -2714569
38936 -2714569 -2860732 -1837914 -440143 387925 170365 -874184 -1602170 -584992 2160807
38927 2160807 4646737 5001403 3538017 1941376 1199685 1342753 2261156 3356271 3108878
38918 3108878 573075 -3085908 -5774688 -6578877 -5590624 -2844857 856964 3284846
38910 3284846 3184667 2408070 3250459 4668554 4062653 1971677 1347948 2328610 1819308
$$ packed form
38971B89515K607469J881394j372075l696454k658037O5372J286018N05172j35719
38962a227345N27150J007989k65311k111895j949868K90108J512218m14826l421776
38953f053556l759055q43641K340408L324143K584919J731115J274546R63287
38945A562166P62305N59176k6347q31518j107631p77870o79645j080892j094313
38936b714569j46163J022818J397771Q28068k17560j044549p27986J017178K745799
38927B160807K485930L54666j463386j596641p41691J43068R18403J095115k47393
38918C108878k535803l658983k688780q04189R88253K745767L701821K427882
38910C284846j00179p76597Q42389J418095o05901k090976o23729R80662n09302
$$ plain form
38901 1819308 -908527 -2298172 -66620 2753327 1909748 -2257667 -5523484 -4759529
38893 -4759529 -505519 3920995 4651915 471881 -5025993 -6519474 -3153212 875147
38885 875147 2750561 4308366 6928481 7532748 3535538 -1669047 -3091908 -1805774
38877 -1805774 -2916610 -7033508 -9356647 -7488782 -4820337 -4582985 -4980469 -2704319
38869 -2704319 1811377 5247272 5683628 4074300 2653115 3073924 5028763 6138957
38861 6138957 4565148 1812767 948563 1995298 1964569 141017 -147268 3062181 6510698
38852 6510698 6378565 4216881 4191377 5936281 4991232 513272 -2372949 -787 4049596
38843 4049596 4009834 113838 -2548438 -2206614 -2593347 -6115697 -9317299 -7914717 -3364791
$$ packed form
38901A819308k727835j389645K231552K819947q43579m167415l265817P63955
38893d759529M254010M426514P30920m180034n497874j493481L366262M028359
38885H75147J875414J557805K620115O04267l997210n204585j422861J286134
38877a805774j110836m116898k323139J867865K668445K37352l97484K276150
38869b704319M515696L435895M36356j609328j421185M20809J954839J110194
38861F138957j573809k752381q64204J046735l0729j823552k88285L209449L448517
38852F510698j32133k161684k5504J744904r45049m477960k886221K372162M050383
38843D049596l9762l895996k662276L41824l86733l522350l201602J402582M549926
$$ plain form
38834 -3364791 -815033 -1950622 -3478748 -2441831 237260 2088566 2310469 1591493
38826 1591493 596045 -302648 -898670 -1221649 -830441 1517359 5865742 9308353 8540665
38817 8540665 3960853 -1103435 -4762530 -7207416 -7627482 -4702124 -547899 449440
38809 449440 -1947285 -3179340 -1384883 -440245 -2845061 -4972355 -3456390 -1275147
38801 -1275147 -2298427 -4196617 -2842528 -45424 -11804 -1004495 1789667 6853303 8000548
38792 8000548 4944019 3804318 6252459 6519048 1501052 -3970194 -5343366 -4815763
38784 -4815763 -5552949 -5879265 -4007432 -2828031 -4587880 -5771852 -3148698 -520679
38776 -520679 -2808141 -6820902 -5326206 1476184 5935482 4086245 -106629 -2431256
$$ packed form
38834c364791K549758j135589j528126J036917K679091J851306K21903p18976
38826A591493r95448q98693n96022l22979L91208K347800M348383L442611p67688
38817H540665m579812n064288l659095k444886m20066K925358M154225R97339
38809D49440k396725j232055J794457R44638k404816k127294J515965K181243
38801a275147j023280j898190J354089K797104L3620r92691K794162N063636J147245
38792H000548l056529j139701K448141K66589n017996n471246j373172N27603
38784d815763p37186l26316J871833J179401j759849j183972K623154K628019
38776e20679k287462m012761J494696O802390M459298j849237m192874k324627
$$ plain form
38768 -2431256 -3882361 -6369179 -8526220 -8882121 -8985852 -9981707 -9280369 -4321196 2445444
38759 2445444 5997958 5119296 3027816 2070985 1124118 -1116331 -3283462 -3626015 -3200599
38750 -3200599 -4378902 -6972220 -8313970 -7275662 -5746735 -5179218 -3952971 -140300
38742 -140300 4616138 6486485 4310853 953019 -279756 1033545 2722594 2346336
38734 2346336 -609403 -3733528 -3541687 366333 4122923 4358776 2659148 2659432 4304248
38725 4304248 4744272 3853324 4107743 5062946 3318078 -773452 -1785556 2761187 7822839
38716 7822839 7748276 3802031 897271 242904 -330451 -1288716 -1311700 -793852 -1299836
38707 -1299836 -2590579 -3656839 -5242128 -7672955 -7860593 -2906755 4288639 7621231
$$ packed form
38768b431256j451105k486818k157041l55901j03731r95855P01338M959173O766640
38759B445444L552514q78662k091480r56831r46867k240449k167131l42553M25416
38750c200599j178303k593318j341750J038308J528927N67517J226247L812671
38742a40300M756438J870347k175632l357834j232775J313301J689049l76258
38734B346336k955739l124125J91841L908020L756590K35853j699628K84J644816
38725D304248M40024q90948K54419R55203j744868m091530j012104M546743N061652
38716G822839p4563l946245k904760o54367n73355r58265k2984N17848n05984
38707a299836j290743j066260j585289k430827j87638M953838P195394L332592
$$ plain form
38699 7621231 5663236 2593598 1411534 867502 -314926 -818446 202790 1335295
38691 1335295 1829719 2927823 4704470 4865631 2434061 -433236 -2045850 -3438314
38683 -3438314 -5038614 -4452710 -436862 3744183 4263219 1905590 -44852 -1131928
38675 -1131928 -3012193 -4750531 -3431635 421981 2387598 450224 -1703701 250201
38667 250201 5345742 8626991 6852086 1169739 -4563217 -6588074 -3810755 585848
38659 585848 1291728 -3384680 -8954710 -10030705 -7016206 -4776180 -5549836 -6899626 -6838220
38650 -6838220 -6755130 -7606247 -7101740 -3594219 202955 827933 -791564 -1476520 -1268876
38641 -1268876 -2528357 -4671207 -4620802 -2569338 -2468926 -5604350 -8083733 -6722086 -3575422
$$ packed form
38699G621231j957995l069638j182064n44032j182428n03520J021236J132505
38691A335295M94424J098104J776647J61161k431570k867297j612614j392464
38683c438314j600300N85904M015848M181045N19036k357629j950442j087076
38675a131928j880265j738338J318896L853616J965617j937374k153925J953902
38667B50201N095541L281249j774905n682347n732956k024857K777319M396603
38659E85848P05880m676408n570030j075995L014499K240026p73656j349790O1406
38650f838220Q3090q51117N04507L507521L797174O24978j619497o84956K07644
38641a268876j259481k142850N0405K051464J00412l135424k479383J361647L146664
$$ plain form
38632 -3575422 -2064422 -1915474 -1097509 -199846 -1248154 -3559243 -4207925 -2307770 -277015
38623 -277015 -767666 -3900348 -7305626 -7900353 -4502414 255640 1902369 -645059 -3295301
38614 -3295301 -1911971 2303808 4781661 3704653 1465336 505399 492144 102382 -598541
38605 -598541 -699673 -243106 -390761 -1884659 -3778861 -4178841 -2621469 -1082859 -1459913
38596 -1459913 -2613042 -1886787 540056 1431158 -658819 -2949837 -2232543 1182212 4770331
38587 4770331 6762751 6256050 2936784 -1207705 -2351295 566480 3935850 4570796
38579 4570796 4033514 4833054 5258913 2412008 -1711481 -2394209 337624 1673232 -319685
38570 -319685 -2043809 -536416 2428953 4458855 6575282 10067745 12391078 9996756
$$ packed form
38632c575422J511000J48948Q17965Q97663j048308k311089o48682J900155K030755
38623b77015m90651l132682l405278n94727L397939M758054J646729k547428k650242
38614c295301J383330M215779K477853j077008k239317r59937j3255l89762p00923
38605e98541j01132M56567j47655j493898j894202l99980J557372J538610l77054
38596a459913j153129P26255K426843Q91102k089977k291018P17294L414755L588119
38587D770331J992420n06701l319266m144489j143590K917775L369370O34946
38579D570796n37282P99540M25859k846905m123489o82728K731833J335608j992917
38570c19685j724124J507393K965369K029902K116427L492463K323333k394322
$$ plain form
38562 9996756 3950224 -643519 -774388 1404325 2176290 969478 50608 459997 389501
38553 389501 -1603853 -3618579 -2931059 -651283 -655630 -3459154 -4765699 -1929122 1580618
38544 1580618 1253434 -1544710 -1566061 2914268 8472816 11490736 11198610 8324999 4227716
38535 4227716 1277956 918274 1271246 -543660 -3995692 -5923588 -5215872 -3497912 -1731048
38526 -1731048 136272 552628 -2146907 -5363976 -4182345 1147180 4559557 3035420
38518 3035420 1152763 3461747 6808225 5204129 -499509 -3560946 -1299437 1324145
38510 1324145 -608974 -4950165 -5873314 -1778730 3571870 7146536 10396164 15484066
38502 15484066 20171976 19452658 12030531 2614976 -2915774 -2727638 1035237 5025226
$$ packed form
38562I996756o046532m593743j30869K178713P71965j206812r18870M09389p0496
38553C89501j993354k014726O87520K279776m347k803524j306545K836577L509740
38544A580618l27184k798144k1351M480329N558548L017920k92126k873611m097283
38535D227716k949760l59682L52972j814906l452032j927896P07716J717960J766864
38526a731048J867320M16356k699535l217069J181631N329525L412377j524137
38518C035420j882657K308984L346478j604096n703638l061437K261509K623582
38510A324145j933119m341191r23149M094584N350600L574666L249628N087902
38502A5484066M687910p19318p422127r415555n530750J88136L762875L989989
$$ plain form
38494 5025226 6216697 3253061 -1659056 -4096303 -2561271 -319112 -277280 -706405 1165741
38485 1165741 3939146 4192067 1998938 301178 -42293 -782865 -2802286 -5529491 -8564976
38476 -8564976 -10501991 -8149653 -1163214 4794768 4726305 1907292 2474521 4511323 925437
38467 925437 -7200995 -9925761 -3525629 3135554 2029573 -2495006 -2086515 2312804
38459 2312804 3430920 -249113 -3399907 -2975665 -1302926 -399619 837495 3036562
38451 3036562 4370283 3307520 613908 -1931693 -3104781 -2906251 -3008478 -5275858
38443 -5275858 -8466054 -8507843 -4084718 454973 568408 -2203785 -2764694 219642 3099881
38434 3099881 2801976 503753 -440730 1711969 5437769 7133984 4760951 830395
$$ packed form
38494E025226J191471k963636m912117k437247J535032K242159M1832m29125J872146
38485A165741K773405K52921k193129j697760l43471p40572k019421k727205l035485
38476h564976j937015K352338O986439N957982o8463k819013N67229K036802l585886
38467I25437q126432k724766O400132O661183j105981m524579M08491M399319
38459B312804J118116l680033l150794M24242J672739R03307J237114K199067
38451C036562J333721j062763k693612k545601j173088J98530j02227k267380
38443e275858l190196m1789M423125M539691J13435k772193n60909K984336K880239
38434C099881k97905k298223r44483K152699L725800J696215k373033l930556
$$ plain form
38426 830395 -76522 2495198 3924631 1243181 -2444651 -2845199 -767707 -107788 -1822693
38417 -1822693 -3644247 -4269906 -4209606 -3396176 -1244695 1412267 3072485 3621110 3522126
38408 3522126 2117162 -1002622 -4189312 -5594395 -5553892 -5079955 -3756330 -1456599 -95215
38399 -95215 -873209 -1744003 -605536 1004207 691800 -350544 534189 2608760 3030514
38390 3030514 1673293 587853 -237747 -2326208 -4647283 -4358370 -1349667 1746481
38382 1746481 3661629 4860747 4523382 1432775 -2435834 -3596546 -2345680 -2115093
38374 -2115093 -3575727 -4048990 -3133957 -3857272 -6993197 -9054611 -7785852 -5313973 -3772187
38365 -3772187 -1991084 912948 2566345 1135156 -984053 -546349 1847682 3548939
$$ packed form
38426H30395r06917K571720J429433k681450l687832m00548K077492O59919j714905
38417a822693j821554o25659O0300Q13430K151481K656962J660218N48625r8984
38408C522126j404964l119784l186690j405083M0503M73937J323625K299731J361384
38399i5215p77994q70794J138467J609743l12407j042344Q84733K074571M21754
38390C030514j357221j085440q25600k088461k321075K88913L008703L096148
38382A746481J915148J199118l37365l090607l868609j160712J250866K30587
38374b115093j460634m73263R15033p23315l135925k061414J268759K471879J541786
38365c772187J781103K904032J653397j431189k119209M37704K394031J701257
$$ plain form
38357 3548939 4263148 5290062 5752720 3152799 -2346645 -6857730 -6700119 -2173650 2864435
38348 2864435 4552321 2266518 -1251434 -3034937 -2798068 -2091704 -1455062 -201589 1311118
38339 1311118 1559046 533231 456039 2829870 6300134 8339502 7847806 5533680 2984060
38330 2984060 1765365 2149870 2490761 1233735 -509455 -217305 2222941 4244321 4553331
38321 4553331 4882032 6886139 9670289 11705499 13057225 14120556 14030139 12155271 9676277
38312 9676277 7854149 6076485 3584344 1890259 2929317 5272827 4985404 1027736
38304 1027736 -2423039 -792896 4834587 8539313 6500159 1217554 -2116259 -1755819
38296 -1755819 -355 1166509 2120589 3222068 3464147 2591434 1878280 1365695 -907937
$$ packed form
38357C548939P14209J026914M62658k599921n499444m511085J57611M526469N038085
38348B864435J687886k285803l517952j783503K36869P06364O36642J253473J512707
38339A311118K47928j025815p7192K373831L470264K039368m91696k314126k549620
38330B984060j218695L84505L40891j257026j743190K92150K440246K021380L09010
38321D553331L28701K004107K784150K035210J351726J063331r0417j874868k478994
38312I676277j822128j777664k492141j694085J039058K343510k87423l957668
38304A027736l450775J630143N627483L704726k039154n282605l333813L60440
38296a755819J755464J166864R54080J101479K42079q72713p13154n12585k273632
$$ plain form
38287 -907937 -4989527 -7246485 -5246770 -1705872 -248089 162101 2404279 5141746
38279 5141746 4839719 2543602 2779656 5848015 7339445 6254534 7164739 11759397 14318365
38270 14318365 9834742 1925139 -2379546 -2283290 -2218707 -3541574 -3297897 -753851 751764
38261 751764 -164923 95092 4413098 9546584 9808963 4563724 -1147140 -3039857 -1741440
38252 -1741440 47689 1881389 5206099 10204477 15258197 18963015 20540606 18710801
38244 18710801 12980020 6406529 3833342 5751159 6767382 2571675 -3930606 -6384329
38236 -6384329 -3147876 1518969 3297916 1587640 -1917005 -5170578 -6296337 -4834881
38228 -4834881 -2611919 -1436879 -549137 1608926 4300956 5827544 6608772 7761539
$$ packed form
38287i07937m081590k256958J999715L540898J457783M10190K242178K737467
38279E141746l02027k296117K36054L068359J491430j084911R10205M594658K558968
38270A4318365m483623p909603m304685R6256O4583j322867K43677K544046J505615
38261G51764r16687K60015M318006N133486K62379n245239n710864j892717J298417
38252a741440J789129J833700L324710M998378N053720L704818J577591j829805
38244A8710801n730781o573491k573187J917817J016223m195707o502281k453723
38236f384329L236453M666845J778947j710276l504645l253573j125759J461456
38228d834881K222962J175040Q87742K158063K692030J526588P81228J152767
$$ plain form
38220 7761539 7917264 5199368 1291448 -597154 -884836 -2146742 -3391066 -1375618
38212 -1375618 2494331 2894427 -690681 -2412296 469795 2829765 -49057 -4996998
38204 -4996998 -6268813 -3860782 -1635530 -675532 395960 1019908 -320280 -2239962
38196 -2239962 -2003852 29810 1223465 978883 887313 1451825 1715344 1286036 38790
38187 38790 -2975952 -7496411 -10299843 -8739999 -5093811 -4150919 -7036470 -10412494 -11351034
38178 -11351034 -10047313 -7879219 -5603886 -3776155 -2760549 -2008828 -864524 64100
38170 64100 -268894 -1573554 -2616138 -2856722 -2602169 -2325395 -2685896 -3938819 -4549268
38161 -4549268 -2383220 1609618 3459921 1671978 -185381 1113039 3320703 2426472
$$ packed form
38220G761539J55725k717896l907920j888602k87682j261906j244324K015448
38212a375618L869949M00096l585108j721615K882091K359970k878822m947941
38204d996998j271815K408031K225252R59998J071492O23948j340188j919682
38196b239962K36110K033662J193655k44582r1570N64512K63519m29308j247246
38187C8790l014742m520459k803432J559844L646188R42892k885551l376024r38540
38178a1351034J303721K168094K275333J827731J015606P51721J144304R28624
38170F4100l32994j304660j042584k40584K54553K76774l60501j252923o10449
38161d549268K166048L992838J850303j787943j857359J298420K207664q94231
$$ plain form
38153 2426472 -892113 -2652818 -1959034 -1787868 -3940616 -6934732 -8773171 -8675410 -6359002
38144 -6359002 -2570506 56838 -451138 -2464027 -3015994 -2103356 -1713990 -1727896 -494108
38135 -494108 1238771 953678 -1306611 -3062178 -3642794 -4353997 -4580862 -2192609 1764141
38126 1764141 3386999 1969251 1309253 3528305 5838666 5342897 3111242 1389129
38118 1389129 398877 32928 1116424 2786589 2350257 177165 717838 5602386 9857065
38109 9857065 8965451 5848006 5859535 8033361 7237165 3100203 413150 1140828 2197480
38100 2197480 1702522 1548921 2313305 1322236 -1657843 -2030818 2568999 7011318 5101954
38091 5101954 -1495400 -5675367 -4750126 -3033464 -4785800 -8980862 -11957297 -11791314
$$ packed form
38153B426472l318585j760705O93784J71166k152748k994116j838439R7761K316408
38144f359002L788496K627344n07976k012889n51967R12638L89366j3906J233788
38135d94108J732879k85093k260289j755567n80616p11203k26865K388253L956750
38126A764141J622858j417748o59998K219052K310361m95769k231655j722113
38118A389129r90252l65949J083496J670165m36332k173092N40673M884548M254679
38109I857065q91614l117445J1529K173826p96196m136962k687053P27678J056652
38100B197480m94958j53601P64384r91069k980079l72975M599817M442319j909364
38091E101954o597354m179967R25241J716662j752336m195062k976435J65983
$$ plain form
38083 -11791314 -8794058 -4451005 -1205401 -966328 -2476128 -2179081 1030713 3979852
38075 3979852 3582080 977814 -559580 -31022 1227656 2437726 3727504 4434517 3704188
38066 3704188 2522413 2725335 3913808 3605933 832719 -2445073 -4114343 -4321809 -4244513
38057 -4244513 -3839847 -1985940 1579695 5129720 6022002 3432198 -9066 -701508 1266658
38048 1266658 1990434 -436908 -2661828 -1263476 1446873 966996 -1840683 -1895845 1896082
38039 1896082 5032507 4569875 2460402 448351 -2696793 -6496187 -6952592 -3014522
38031 -3014522 201348 -945658 -2340111 1140348 6445261 6462629 1077014 -2734330
38023 -2734330 -1322880 1493365 1437090 -661219 -1929900 -1619771 -295116 1660588 3063662
$$ packed form
38083a1791314K997256M343053L245604K39073j509800K97047L209794K949139
38075C979852l97772k604266j537394N28558J258678J210070J289778P07013p30329
38066C704188j181775K02922J188473l07875k773214l277792j669270k07466P7296
38057d244513M04666J853907L565635L550025Q92282k589804l441264o92442J968166
38048A266658P23776k427342k224920J398352K710349m79877k807679n5162L791927
38039A896082L136425m62632k109473k012051l145144l799394m56405L938070
38031c014522L215870j147006j394453L480459N304913J7368n385615l811344
38023b734330J411450K816245n6275k098309j268681L10129J324655J955704J403074
$$ plain form
38014 3063662 2428015 780138 1014537 3107307 3140428 -965351 -5643775 -6231556 -3227259
38005 -3227259 -1042640 -1648736 -2567678 -1299506 955897 1372800 -276104 -1521882 -1100594
37996 -1100594 -761335 -2105950 -3570451 -2855176 -1086934 -1332049 -3358160 -3755571 -1859149
37987 -1859149 -1202123 -3331580 -4679695 -2572417 -71591 -722027 -2291548 -912248
37979 -912248 1608564 708014 -2648108 -3160955 74794 2627577 2647063 3034729 4544979
37970 4544979 3405054 -1659908 -5971670 -5868849 -4159663 -4843104 -6611108 -5753058 -2281413
37961 -2281413 869622 2247688 1947811 -255408 -3299377 -3751143 -217243 3060553
37953 3060553 1000633 -5276145 -10006428 -10264180 -8026350 -5674364 -3717930 -2941800
$$ packed form
38014C063662o35647j647877K34399K092770L3121m105779m678424n87781L004297
38005c227259K184619o06096r18942J268172K255403M16903j648904j245778M21288
37996a100594L39259j344615j464501P15275J768242k45115k026111l97411J896422
37987a859149O57026k129457j348115K107278K500826o50436j569521J379300
37979i12248K520812r00550l356122n12847L235749K552783J9486L87666J510250
37970D544979j139925n064962m311762J02821J709186o83441j768004Q58050L471645
37961b281413L151035J378066k99877k203219l043969m51766L533900L277796
37953C060553k059920o276778m730283k57752K237830K351986J956434P76130
$$ plain form
37945 -2941800 -4500519 -6823747 -6054757 -1259673 3549538 4386692 2070681 73381
37937 73381 -647168 -2209160 -5827337 -9519959 -10302959 -7477908 -3109352 181453 1305749
37928 1305749 859157 -5051 -332972 606148 2985635 5545457 5789645 2283335 -3090094
37919 -3090094 -6251568 -5059193 -1576754 850061 2005769 4143315 6844458 5835688
37911 5835688 -726978 -7587900 -8289547 -4443108 -3679455 -7921319 -10013430 -4991537
37903 -4991537 1339893 686978 -5128310 -6970497 -1888335 3635392 4124943 1818609
37895 1818609 1065920 2024779 2979226 4244295 6212377 6852099 4538734 1094623 -652170
37886 -652170 -396774 529920 1398902 1670577 760906 -32484 1975984 6553745 9577702
$$ packed form
37945b941800j558719k323228P68990M795084M809211Q37154k316011j997300
37937G3381p20549j561992l618177l692622p83000K825051M368556L290805J124296
37928A305749m46592q64208l27921R39120K379487K559822K44188l506310n373429
37919c090094l161474J192375L482439K426815J155708K137546K701143j008770
37911E835688o562666o860922p01647L846439P63653m241864k092111N021893
37903d991537O331430o52915n815288j842187N082162N523727M89551k306334
37895A818609p52689R58859R54447J265069J968082O39722k313365l444111j746793
37886f52170K55396R26694Q68982K71675r09671p93390K008468M577761L023957
$$ plain form
37877 9577702 8452128 5453514 3354369 1296702 -1689883 -2687974 919541 5786719
37869 5786719 6282679 2412003 -967898 -1906084 -2958519 -5087346 -5577389 -3379583 -1518471
37860 -1518471 -1933513 -2217216 -309952 1344341 -24216 -2097561 -647889 3409788
37852 3409788 4799998 1633834 -2060133 -2750786 -2295516 -3776612 -5605489 -3842767
37844 -3842767 940332 3586527 1582744 -1667934 -2375712 -1479937 -1550592 -1756138 125115
37835 125115 2633566 2139153 -1186600 -3405219 -3109209 -3268304 -5619986 -7436631 -6024291
37826 -6024291 -2921415 -978457 -84730 1353047 2967969 3500529 3630289 4675231 5460030
37817 5460030 3366525 -1729278 -6723815 -8498821 -6575631 -2952529 -285326 392210
$$ packed form
37877I577702j125574k998614k099145k057667k986585r98091L607515M867178
37869E786719M95960l870676l379901r38186j052435k128827m90043K197806J861112
37860a518471m15042k83703J907264J654293j368557k073345J449672M057677
37852C409788J390210l166164l693967o90653M55270j481096j828877J762722
37844c842767M783099K646195k003783l250678p07778Q95775p0655k05546J881253
37835A25115K508451m94413l325753k218619K96010j59095k351682j816645J412340
37826f024291L102876J942958Q93727J437777J614922N32560J29760J044942P84799
37817E460030k093505n095803m994537j775006J923190L623102K667203O77536
$$ plain form
37809 392210 765970 3034397 6321368 7220798 4591271 1302898 -153901 -1112447 -3655784
37800 -3655784 -6522146 -6852811 -4436631 -1658661 -409266 -1059106 -3031777 -4495710
37792 -4495710 -3321667 -347198 566565 -1889156 -3474486 -175550 5461086 7611406
37784 7611406 4881898 728958 -2094861 -3123751 -1661216 2374853 5740597 4898265
37776 4898265 1622268 874342 3136795 3886105 1140835 -1732548 -1969548 -1061176 -552527
37767 -552527 1075098 4745775 7945877 8241902 6517028 4567589 2641758 1288841
37759 1288841 2188133 4967194 6630077 6327745 7005654 9951298 11926649 10883896 10136165
37750 10136165 12568738 14747416 12213205 7556864 6986856 10534597 12071150 8811363
$$ packed form
37809C92210L73760K268427L286971Q99430k629527l288373j456799r58546k543337
37800c655784k866362l30665K416180K777970J249395o49840j972671j463933
37792d495710J174043K974469R13763k455721j585330L298936N636636K150320
37784G611406k729508m152940k823819j028890J462535M036069L365744q42332
37776D898265l275997p47926K262453P49310k745270k873383k37000R08372N08649
37767e52527J627625L670677L200102K96025j724874j949439j925831j352917
37759A288841Q99292K779061J662883l02332O77909K945644J975351j042753p47731
37750A0136165K432573K178678k534211m656341n70008L547741J536553l259787
$$ plain form
37742 8811363 4811928 4101809 5486056 5850385 4591608 2936915 1814165 1706400 2249670
37733 2249670 1553760 -1451096 -4121149 -2864808 1318579 3975701 3924268 4202335 5757677
37724 5757677 5659371 3261186 2310736 3982867 3655034 -1136477 -5151422 -3514918 -272832
37715 -272832 -1710981 -5175853 -3279819 3115031 6007800 4110559 5013954 11157208
37707 11157208 14174427 8506972 1332131 1275090 4660683 2397618 -4619754 -7527767
37699 -7527767 -4335264 -1952177 -3438591 -3627925 282635 3177796 1150849 -1703592
37691 -1703592 -777726 1296972 282609 -1580345 260219 4185123 4950452 2489762
37683 2489762 1602860 3878935 5961418 5674990 4438330 3268152 1398394 -403139
$$ packed form
37742H811363l999435p10119J384247L64329j258777j654693j122750j07765N43270
37733B249670o95910l004856k670053J256341M183387K657122n1433K78067J555342
37724E757677r8306k398185r50450J672131l27833m791511m014945J636504L242086
37715b72832j438149l464872J896034O394850K892769j897241R03395O143254
37707A1157208L017219n667455p174841n7041L385593k263065p017372k908013
37699g527767L192503K383087j486414j89334L910560K895161k026947k854441
37691a703592R25866K074698j014363j862954J840564L924904P65329k460690
37683B489762q86902K276075K082483k86428j236660j170178j869758j801533
$$ plain form
37675 -403139 189704 2672935 3600381 2226542 2147896 5448633 8959847 8783024 5540207
37666 5540207 2536846 1040161 -9720 -1250427 -2288549 -2920535 -3260694 -3349763 -3516308
37657 -3516308 -4016846 -3828358 -1531124 2050892 4310049 4728845 5535032 7123098 6042652
37648 6042652 195753 -6618862 -8835552 -6188317 -3143656 -2271229 -1835696 169871
37640 169871 3095534 5468587 7015969 7835844 7592587 6530874 5842443 6351626 7891268
37631 7891268 9942991 11473536 10507141 6079023 789911 -1005220 1651054 5084826
37623 5084826 5770505 4139361 2428985 1112925 -431746 -1403006 -268321 2620812
37615 2620812 5075508 5446065 3612580 326828 -2852831 -3657939 -1013238 3335649
$$ packed form
37675d03139N92843K483231R27446j373839p8646L300737L511214j76823l242817
37666E540207l003361j496685j049881j240707j038122o31986l40159q9069j66545
37657c516308n00538J88488K297234L582016K259157M18796Q06187J588066j080446
37648F042652n846899o814615k216690K647235L044661Q72427M35533K005567
37640A69871K925663K373053J547382Q19875k43257j061713o88431N09183J539642
37631G891268K051723J530545r66395m428118n289112j795131K656274L433772
37623E084826O85679j631144j710376j316060j544671r71260J134685K889133
37615B620812K454696L70557j833485l285752l179659q05108K644701M348887
$$ plain form
37607 3335649 6522182 7481926 6878492 5160391 2857733 1970034 4075514 7048574 6828842
37598 6828842 3224896 829453 2736964 6404045 7949934 7772894 8744674 10803086
37590 10803086 11147981 9130830 7319258 7437178 8353171 8816977 9398875 10454993 10462873
37581 10462873 8152061 4962282 3766862 5678259 9026681 11059949 10188962 7124745
37573 7124745 4147440 2869189 2892958 3226609 4192172 6517920 9275709 10822551 11483082
37564 11483082 12829375 14236682 13101946 9309829 6416874 6702190 7801039 6624801
37556 6624801 4323787 4349144 7055117 9487736 10015048 10092823 11139690 12270697 12144351
37547 12144351 11380249 11942612 14690909 18078717 19162376 16204588 10731989 6532115
$$ packed form
37607C335649L186533R59744o03434j718101k302658q87699K105480K973060k19732
37598F828842l603946k395443J907511L667081J545889j77040R71780K058412
37590A0803086L44895k017151j811572J17920R15993M63806N81898J056118P880
37581A0462873k310812l189779j195420J911397L348422K033268q70987l064217
37573G124745k977305j278251K3769L33651R65563K325748K757789J546842O60531
37564A1483082J346293J407307j134736l792117k892955K85316J098849j176238
37556F624801k301014K5357K705973K432619N27312P7775J046867J131007j26346
37547A2144351p64102N62363K748297L387808J083659k957788n472599m199874
$$ plain form
37539 6532115 5984297 7829368 9067828 8368882 6961469 6842486 8735862 11252636 11887632
37530 11887632 9829856 7668069 8526058 11467317 12414417 10368813 9420839 12723767
37522 12723767 17789285 20646646 21652889 23365478 25059854 23954325 20571317 18328095
37514 18328095 18437385 19411892 20828951 22883485 22830087 17543389 10126030 7972003 12410225
37505 12410225 15956646 12743317 6461478 4102399 6338931 8845274 9658426 9886241
37497 9886241 9266440 6442636 2903542 1896898 3379418 4021633 2556448 1556395
37489 1556395 3159168 6062178 7870542 8167551 8105642 8440524 8886910 8692937 7591442
37480 7591442 6448101 6260441 6187785 4282457 1163760 618814 4537390 9587297 11708960
$$ packed form
37539F532115n47818J845071J238460o98946j407413j18983J893376K516774O34996
37530A1887632k057776k161787Q57989K941259R47100k045604r47974L302928
37522A2723767N065518K857361J006243J712589J694376j105529l383008k243222
37514A8328095J09290R74507J417059K054534n3398n286698p417359k154027M438222
37505A2410225L546421l213329o281839k359079K236532K506343Q13152K27815
37497I886241o19801k823804l539094j006644J482520O42215j465185j000053
37489A556395J602773K903010J808364K97009o1909L34882M46386j93973j101495
37480G591442j143341j87660p2656j905328l118697n44946L918576N049907K121663
$$ plain form
37471 11708960 11716892 13001400 15800005 18130655 20781221 26322759 34530317 44974711
37463 44974711 63133250 94847969 131790419 151400388 138744612 103952344 71156749
37456 71156749 53405364 45388757 37832095 29171279 21460888 13564938 4031874 -3684053
37448 -3684053 -4485556 1172431 7242167 9016156 7433755 6302667 7318117 8828446
37440 8828446 8628672 6632124 4209387 1808750 -964959 -2924450 -1703213 1970649
37432 1970649 3361398 17042 -3636235 -2225762 2009633 2170102 -2489264 -5221798
37424 -5221798 -2325115 1771664 2756931 3158749 6177428 8584741 6069214 1428631
37416 1428631 307476 1534970 -669426 -6166726 -8455616 -5092590 -1051902 -58822
$$ packed form
37471A1708960P932J284508K798605K330650K650566N541538Q207558J0444394
37463D4974711J8158539L1714719L6942450J9609969j2655776l4792268l2795595
37456G1156749j7751385q016607p556662q660816p710391p895950r533064p715927
37448c684053q01503N657987O069736J773989j582401j131088J015450J510329
37440H828446j99774j996548k422737k400637k773709j959491J221237L673862
37432A970649J390749l344356l653277J410473M235395J60469m659366k732534
37424e221798K896683M096779R85267M01818L018679K407313k515527m640583
37416A428631j121155J227494k204396n497300k288890L363026M040688R93080
$$ plain form
37408 -58822 433561 2883700 4706645 3601136 2516940 4659317 7596760 7209881 4501763
37399 4501763 3612132 5174369 6409117 6463614 6961907 7708485 6295678 2624554 240606
37390 240606 1799249 5480704 7256299 5493218 2363446 1172757 2790127 4963996
37382 4963996 5423139 4802540 4998914 5448550 3864737 681534 -740905 775608 2700782
37373 2700782 3852255 6585744 11242210 12950262 8262277 1387930 -1167983 610203
37365 610203 2118820 2318780 3835547 6225325 5803664 2370372 41957 512822 1001441
37356 1001441 -8269 -377978 899956 1781446 1756261 3140067 5788711 5946201 2969499
37347 2969499 1669284 4563616 7336509 6341676 5109913 7547508 9482193 4597548
$$ packed form
37408e8822M92383K450139J822945j105509j084196K142377K937443l86879k708118
37399D501763q89631J562237J234748N4497M98293P46578j412807l671124k383948
37390B40606J558643L681455J775595j763081l129772j190689J617370K173869
37382D963996M59143o20599J96374M49636j583813l183203j422439J516513J925174
37373B700782J151473K733489M656466J708052m687985o874347k555913J778186
37365F10203J508617J99960J516767K389778m21661l433292k328415M70865M88619
37356A001441j009710l69709J277934Q81490k5185J383806K648644J57490k976702
37347B969499j300215K894332K772893r94833j231763K437595J934685m884645
$$ plain form
37339 4597548 -4026858 -6634744 -599924 6267166 7391552 5247028 4762066 5192459
37331 5192459 3146589 -377201 -1137459 1891100 5515502 7318245 8205042 9642294
37323 9642294 11067685 11154481 10066732 9146471 8890027 8348058 6836787 5480370 5875531
37314 5875531 7116370 5856180 818008 -4083584 -3768472 1118935 4522992 3169251
37306 3169251 1120291 3577468 8823540 10508034 7058477 4108649 6395855 11373392
37298 11373392 13653143 12856513 13205648 16615084 20366885 22212013 24363715 30560380
37290 30560380 41139648 53362046 66652279 86471387 121671039 175353454 235842560
37283 235842560 278342129 281009980 242969565 185429469 133638130 98855328 77591554
$$ packed form
37339D597548q624406k607886O034820O867090J124386k144524m84962M30393
37331E192459k045870l523790p60258L028559L624402J802743Q86797J437252
37323I642294J425391Q6796j087749r20261k56444n41969j511271j356417L95161
37314E875531J240839j260190n038172m901592L15112M887407L404057j353741
37306C169251k048960K457177N246072J684494l449557k949828K287206M977537
37298A1373392K279751p96630L49135L409436L751801J845128K151702O196665
37290C0560380J0579268J2222398J3290233J9819108L5199652N3682415O0489106
37283B35842560M2499569K667851l8040415n7540096n1791339l4782802k1263774
$$ plain form
37276 77591554 63163091 52934450 46165693 40970171 35779484 31067426 27637775 24647970
37268 24647970 20748206 16266576 13078017 12478531 13577784 13743815 10954850 6065086
37260 6065086 2109685 795882 680300 -155693 -864829 852821 4857313 8211820 8903634
37251 8903634 8063316 7840776 8450224 8298336 6523152 4607736 5022818 8023830 10426448
37242 10426448 8896176 4340545 1166136 1838141 4496944 6773840 9024268 11884651
37234 11884651 13500031 12052175 8846257 5884741 2531492 -1936247 -4565341 -1931356
37226 -1931356 4057484 8055700 8399377 7865644 7662486 5658058 1362812 -2007670 -2103551
37217 -2103551 -410420 863804 1653720 2494261 3150125 3891012 5197463 5481086 2520062
$$ packed form
37276G7591554j4428463j0228641o768757n195522n190687m712058l429651k989805
37268B4647970l899764m481630l188559n99486J099253J66031k788965m889764
37260F065086l955401j313803j15582q35993p09136J717650M004492L354507O91814
37251H903634q40318k22540O09448j51888j775184j915416M15082L001012K402618
37242A0426448j530272m555631l174409O72005K658803K276896K250428K860383
37234A1884651J615380j447856l205918k961516l353249m467739k629094K633985
37226a931356N988840L998216L43677n33733k03158k004428m295246l370482r5881
37217b103551J693131J274224P89916Q40541O55864P40887J306451K83623k961024
$$ plain form
37208 2520062 -1938934 -2809834 1604108 7020321 8909083 7371623 4655195 1504923
37200 1504923 -1719687 -3579389 -3779554 -4236232 -5768333 -6347704 -4625623 -2414265 -1575994
37191 -1575994 -1259121 -417433 -249788 -1741505 -3391878 -3693280 -3299484 -2649442 -484731
37182 -484731 2768713 3366124 -773775 -6097164 -7782547 -5901093 -4017438 -3704064 -3791293
37173 -3791293 -3464927 -2906647 -1941415 -550987 433072 988408 2453427 4739608 5500985
37164 5500985 4078002 3269122 4611663 5105739 1917984 -2593750 -4253543 -2946136
37156 -2946136 -1414955 -583087 95323 -101827 -1535660 -1864206 718450 3817664 4189335
37147 4189335 2624018 1720217 1404024 907268 2215681 6391968 9337952 7285109 4090369
$$ packed form
37208B520062m458996q70900M413942N416213J888762j537460k716428l150272
37200A504923l224610j859702k00165m56678j532101n79371J722081K211358Q38271
37191a575994L16873Q41688J67645j491717j650373l01402L93796O50042K164711
37182d84731L253444N97411m139899n323389j685383J881454J883655L13374q7229
37173c791293L26366N58280R65232J390428R84059N55336J465019K286181P61377
37164E500985j422983q08880J342541M94076l187755m511734j659793J307407
37156b946136J531181Q31868O78410j97150j433833l28546K582656L099214L71671
37147D189335j565317r03801l16193m96756J308413M176287K945984k052843l194740
$$ plain form
37138 4090369 6172891 11876089 13501190 9330214 5586617 5786546 6316580 4738740
37130 4738740 4697008 8826998 13234951 13484480 11081508 9678404 9051851 7235389 5215575
37121 5215575 5148469 6383330 7089496 7826933 10164099 13588968 16808786 20266192 24353507
37112 24353507 26924234 25959923 23597661 24170477 28583867 33629860 37328284 42501898
37104 42501898 53350050 68790133 80486107 79233275 64360741 45477728 32901475
37097 32901475 27448102 22465659 14731042 8474748 7702706 9731650 9708729 7858945
37089 7858945 7777232 9499518 9163359 5589593 2901022 4821195 9172459 10678595 8070597
37080 8070597 5491329 6351713 8585652 8364904 6619202 7702427 11524699 12093575 6495075
$$ packed form
37138D090369K082522N703198J625101m170976l743597J99929N30034j577840
37130D738740m1732M129990M407953K49529k402972j403104o26553j816462k019814
37121E215575o7106J234861P06166P37437K337166L424869L219818L457406M087315
37112B4353507K570727r64311k362262N72816M413390N045993L698424N173614
37104D2501898J0848152J5440083J1695974j252832j4872534j8883013j2576253
37097C2901475n453373m982443p734617o256294p72042K028944k2921j849784
37089G858945q1713J722286l36159l573766k688571J920173M351264J506136k607998
37080H070597k579268Q60384K233939k20748j745702J083225L822272N68876n598500
$$ plain form
37071 6495075 710782 1748340 7268789 9183594 5875871 3722711 6118213 8386215
37063 8386215 6322809 3280130 4135898 6984142 6371971 1968672 -1534299 -1833733 -1124611
37054 -1124611 -958217 188448 3044338 5174374 4662042 3531060 4860991 7868778
37046 7868778 8619649 5492851 1417319 -247709 43569 -267580 -1433227 -1451252 33037
37037 33037 1090454 1156433 1938864 3571815 3507755 1242029 323454 2574882 4030697
37028 4030697 920571 -3498654 -3479248 95910 1252516 -1471544 -3386987 -1807911
37020 -1807911 350003 273423 -1067699 -2434167 -4140841 -4658705 -933383 5502439 8178157
37011 8178157 4648349 802966 2434799 7137822 9189509 8491838 9010802 10749722
$$ packed form
37071F495075n784293J037558N520449J914805l307723k153160K395502K268002
37063H386215k063406l042679Q55768K848244o12171m403299l502971k99434P09122
37054a124611J66394J146665K855890K130036n12332j130982J329931L007787
37046G868778P50871l126798m075532j665028K91278l11149j165647j8025J484289
37037C3037J057417O5979P82431J632951o4060k265726r18575K251428J455815
37028D030697l110126m419225J9406L575158J156606k724060j915443J579076
37020a807911K157914p6580j341122j366468j706674n17864L725322O435822K675718
37011H178157l529808l845383J631833M703023K051687o97671N18964J738920
$$ plain form
37003 10749722 9280749 3059425 -3532092 -5487780 -2719399 599696 719259 -2068086
36995 -2068086 -3924779 -1913175 2154294 3725911 1310254 -1969459 -2886134 -1390394
36987 -1390394 1312387 4742115 7730732 8056753 5444811 2508911 1098573 182164
36979 182164 -1267146 -2201740 -1949564 -1694693 -1682805 -78139 3365262 5718596 5259402
36970 5259402 4251136 4899388 5758672 4841734 3127568 2181824 1493908 996163 2657133
36961 2657133 6346116 7979102 5693009 3916887 6486563 9459153 6790612 426038
36953 426038 -2008426 1726695 6405811 8161972 8905500 10766826 11851867 9929731
36945 9929731 6288490 3479907 1970935 944643 351443 553736 1169051 1182119 -354405
$$ packed form
37003A0749722j468973o221324o591517j955688K768381L319095J19563k787345
36995b068086j856693K011604M067469J571617k415657l279713r16675J495740
36987a390394K702781L429728K988617L26021k611942k935900j410338r16409
36979A82164j449310r34594K52176K54871J1888J604666L443401K353334m59194
36970E259402j008266O48252Q59284r16938j714166r45744o87916m97745J660970
36961B657133L688983J632986k286093j776122K569676K972590k668541o364574
36953D26038k434464L735121M679116J756161P43528J861326J085041j922136
36945I929731l641241k808583j508972j026292n93200K02293O15315J3068j536524
$$ plain form
36936 -354405 -3395599 -5906401 -5052779 -859315 2887131 3388878 2750705 4519646 7957703
36927 7957703 9089866 6533068 2907969 763022 137759 207148 751299 1725524 3120344
36918 3120344 5016377 6507652 5703527 2424340 -495496 -390671 2158733 4849832
36910 4849832 6169898 5052954 1195785 -2294197 -559538 5667710 8830593 4854340
36902 4854340 -46935 1376068 5940352 5582715 1073568 782654 6656383 11068638
36894 11068638 9036626 4733451 2886090 1522090 -2394391 -6308416 -6080710 -2577609
36886 -2577609 32670 -246589 -2580365 -5504854 -7273142 -6333739 -3355173 -732572
36878 -732572 704151 1965896 2971595 2889360 3083533 5119300 6082094 1759852 -5028450
$$ packed form
36936c54405l041194k510802Q53622M193464L746446N01747o38173J768941L438057
36927G957703J132163k556798l625099k144947o25263O9389N44151R74225J394820
36918C120344J896033J491275q04125l279187k919836J04825K549404K691099
36910D849832J320066j116944l857169l489982J734659O227248L162883l976253
36902D854340m901275J423003M564284l57637m509147k90914N873729M412255
36894A1068638k032012m303175j847361j364000l916481l914025K27706L503101
36886b577609K610279k79259k333776k924489j768288R39403K978566K622601
36878g32572J436723J261745J005699q2235J94173K035767R62794m322242o788302
$$ plain form
36869 -5028450 -6215423 -380438 4493657 3216350 630499 1854630 2858722 -2025025
36861 -2025025 -8979131 -9663505 -4036835 132278 -896002 -3159196 -2946908 -1509563
36853 -1509563 -906087 -860857 -1168296 -2722226 -4839022 -5218843 -3505076 -1659878 -376009
36844 -376009 1462263 3299219 2563418 -1135466 -4648752 -5372101 -4028577 -2351645 -665224
36835 -665224 960205 1586699 1014075 633128 1251077 1697761 1019449 591623 2306488
36826 2306488 5467280 7221283 6115344 4033407 4050334 6809741 9747501 10170661 8437541
36817 8437541 7096004 7169835 6883858 4546169 1123449 -1098245 -1187606 284673 2688922
36808 2688922 5484736 7539288 7574451 5131141 667351 -4504607 -8080265 -8117419 -5489217
$$ packed form
36869e028450j186973N834985M874095j277307k585851J224131J004092m883747
36861b025025o954106o84374N626670M169113j028280k263194K12288J437345
36853a509563O03476M5230l07439j553930k116796l79821J713767J845198J283869
36844c76009J838272J836956p35801l698884l513286p23349J343524J676932J686421
36835f65224J625429O26494n72624l80947O17949M46684o78312m27826J714865
36826B306488L160792J754003j105939k081937J6927K759407K937760M23160j733120
36817H437541j341537P3831k85977k337689l422720k221694q9361J472279K404249
36808B688922K795814K054552L5163k443310m463790n171958l575658l7154K628202
$$ plain form
36799 -5489217 -3517983 -3991132 -4995442 -3997203 -1437107 424730 708728 25645 -1164399
36790 -1164399 -2128578 -1218131 1709073 3339687 501251 -4706347 -6584295 -2979955
36782 -2979955 2121594 3922895 2126283 -310133 -1498029 -1816415 -1918176 -1373887 512229
36773 512229 3110697 4095883 1496528 -3290570 -5762464 -3239740 1368607 3013482
36765 3013482 1156891 -48769 1583029 3176779 2071690 577877 2007872 4401158
36757 4401158 2903954 -2084059 -4062748 683455 7350593 8712250 4295356 -52411
36749 -52411 -234680 2303697 4447152 5146002 4531862 2818910 1620578 3346410 7303863
36740 7303863 9047026 5930082 925548 -1678462 -1991434 -2722611 -3927635 -3766071 -3171854
$$ packed form
36799e489217J971234m73149j004310R98239K560096J861837K83998o83083j190044
36790a164399r64179R10447K927204J630614k838436n207598j877948L604340
36782b979955N101549J801301j796612k436416j187896l18386j01761N44289J886116
36773E12229K598468R85186k599355m787098k471894K522724M608347J644875
36765C013482j856591j205660J631798J593750j105089j493813J429995K393286
36757D401158j497204m988013j978689M746203O667138J361657m416894m347767
36749e2411j82269K538377K143455O98850o14140j712952j198332J725832L957453
36740G303863J743163l116944n004534k604010l12972p31177j205024J61564N94217
$$ plain form
36731 -3171854 -5052332 -8962199 -11002819 -9557788 -7123468 -5792842 -4984532 -4530019
36723 -4530019 -5639396 -7280011 -6018922 -1704288 939764 -741184 -2809922 -816391
36715 -816391 3050927 3284605 -855497 -5102295 -6614812 -6346509 -5633186 -4376491 -2786636
36706 -2786636 -1853715 -1700026 -1592069 -1512232 -1946545 -2589655 -2871709 -2944796 -2688006 -1137825
36696 -1137825 1412037 2619042 1536212 694787 1997132 2768662 -482512 -6068774
36688 -6068774 -8930436 -7446279 -4504738 -2483669 -1135705 -116529 249237 600113
36680 600113 1387913 598036 -3491304 -7937191 -8165489 -5123804 -4150269 -6310071 -6798229
36671 -6798229 -3657857 -1927310 -5535048 -10144738 -8929539 -2300027 2976957 2745752
$$ packed form
36731c171854j880478l909867k040620J445031K434320J330626Q08310M54513
36723d530019j109377j640615J261089M314634K644052j680948k068738J993531
36715h16391L867318K33678m140102m246798j512517K68303P13323J256695J589855
36706b786636R32921J53689J07957P9837m34313o43110k82054p3087K56790J550181
36696a137825K549862J207005j082830q41425J302345P71530l251174n586262
36688f068774k861662J484157K941541K021069J347964J019176L65766L50876
36680F00113P87800p89877m089340m445887k28298L041685R73535k159802m88158
36671f798229L140372J730547l607738m609690J215199O629512N276984k31205
$$ plain form
36663 2745752 -638192 -2790057 -2369561 -1386741 -2187720 -4342443 -4451305 -298877 5085292
36654 5085292 6242328 2512556 -1037201 -958305 397614 77406 -447551 1195531 3474348
36645 3474348 3672132 2310903 746116 -2447460 -7761866 -10458537 -6200526 886412
36637 886412 2645691 -1261601 -3201167 106679 2847036 407330 -2871746 -1162826
36629 -1162826 3193952 3703819 6814 -2241952 -333329 2534784 3165551 2063744
36621 2063744 415671 -2030184 -4328673 -3454484 1291228 5632748 5049570 681400
36613 681400 -2298615 -1425205 828644 1637980 1697685 3043377 5089398 5274272 3061630
36604 3061630 980675 1256401 3209576 4853965 5514920 5546759 4727052 2843348 1348819
$$ packed form
36663B745752l383944k151865M20496R82820q00979k154723j08862M152428N384169
36654E085292J157036l729772l549757P8896J355919l20208n24957J643082K278817
36645C474348J97784j361229j564787l193576n314406k696671M258011P086938
36637H86412J759279l907292j939566L307846K740357k439706l279076J708920
36629a162826M356778N09867l697005k248766J908623K868113O30767j101807
36621B063744j648073k445855k298489Q74189M745712M341520n83178m368170
36613F81400k980015Q73410K253849Q09336N9705J345692K046021J84874k212642
36604C061630k080955K75726J953175J644389O60955L1839q19707j883704j494529
$$ plain form
36595 1348819 2378173 5771398 8583925 8177203 4928828 1627466 952659 3402002
36587 3402002 6599314 6866737 2956660 -1856560 -3134273 -755828 1040425 -634473
36579 -634473 -4116321 -6476747 -7079646 -6219313 -3204857 1520534 4747590 4127980 1565578
36570 1565578 -145508 -1857629 -5169945 -7184842 -3928993 1759330 2424262 -2899881
36562 -2899881 -6553701 -3878734 -293536 -2216068 -6882089 -7645192 -5040805 -4853107
36554 -4853107 -7518462 -7720423 -4361296 -2927062 -6124892 -9221463 -7927965 -5152567
36546 -5152567 -5771472 -8953036 -10076678 -7495798 -3545260 -793968 -353374 -2052743
36538 -2052743 -3771703 -2682229 637811 1997138 -167825 -1783727 400578 3141598
$$ packed form
36595A348819J029354L393225K812527m06722l248375l301362o74807K449343
36587C402002L197312K67423l910077m813220j277713K378445J796253j674898
36579f34473l481848k360426o02899Q60333L014456M725391L227056o19610k562402
36570A565578j711086j712121l312316k014897L255849N688323O64932n324143
36562b899881l653820K674967L585198j922532m666021p63103K604387J87698
36554d853107k665355k01961L359127J434234l197830l096571J293498K775398
36546e152567o18905l181564j123642K580880L950538K751292M40594j699369
36538b052743j718960J089474L320040J359327k164963j615902K184305K741020
$$ plain form
36530 3141598 2059789 -757548 -356959 2390615 2539645 285942 935653 5234811 7248760
36521 7248760 3943683 -64656 -526874 26185 -1902835 -4199427 -3584385 -1985452 -2559176
36512 -2559176 -3011270 556569 5589849 5842966 1147478 -2431846 -2178038 -1553870 -2315958
36503 -2315958 -863504 4413541 8211561 5478011 -652169 -3185293 -909091 1331674
36495 1331674 549336 -1162815 -1254847 -320132 -130960 -1065449 -2424344 -3138063 -1770233
36486 -1770233 1951217 5399980 5409149 2746174 1327759 2239873 2066301 -989948 -3029658
36477 -3029658 -11311 5352746 6938776 4247177 2917531 5752179 8367781 6090683
36469 6090683 976093 -1646166 -854077 -234073 -1656872 -3069377 -2471354 -608987 1031323
$$ packed form
36530C141598j081809k817337M00589K747574J49030k253703O49711M299158K013949
36521G248760l305077m008339m62218N53059j929020k296592O15042J598933n73724
36512b559176m52094L567839N033280K53117m695488l579324K53808O24168p62088
36503b315958J452454N277045L798020k733550o130180k533124K276202K240765
36495A331674p82338j712151r2032R34715J89172r34489j358895p13719J367830
36486a770233L721450L448763R169k662975j418415R12114j73572l056249k039710
36477c029658L018347N364057J586030k691599j329646K834648K615602k277098
36469F090683n114590k622259P92089O20004j422799j412505N98023J862367J640310
$$ plain form
36460 1031323 2227995 3096922 3263662 2849836 2634402 2678344 2382591 2115758 2816027
36451 2816027 3756173 3074441 1021238 45964 856715 1307181 418658 279153 2026170
36442 2026170 3250496 2103400 857230 1972769 3507742 2581687 872441 1654953
36434 1654953 3260032 1360491 -3034347 -4280727 -1264678 694994 -1124966 -2411241
36426 -2411241 351303 3518062 2462300 -473973 311648 4998746 8656534 8300436
36418 8300436 4896071 14273 -4772890 -6535817 -3950613 -808586 -1739626 -4988359
36410 -4988359 -4563226 445336 4245865 3198134 968116 2428132 6749146 9695845
36402 9695845 9701755 8402756 7002324 5021547 2017305 -1170759 -2715258 -1265615 1892244
$$ packed form
36460A031323J196672Q68927J66740m13826k15434M3942k95753k66833P00269
36451B816027R40146o81732k053203r75274Q10751M50466q88523j39505J747017
36442B026170J224326j147096j246170J115539J534973r26055j709246P82512
36434A654953J605079j899541m394838j246380L016049J959672j819960j286275
36426b411241K762544L166759j055762k936273P85621M687098L657788l56098
36418H300436l404365m881798m787163j762927K585204L142027r31040l248733
36410d988359M25133N008562L800529j047731k230018J460016M321014K946699
36402I695845N910j298999j400432j980777l004242l188064j544499J449643L157859
$$ plain form
36393 1892244 2950069 119500 -2787716 -729157 5033426 8164992 6486584 4868999
36385 4868999 7109454 10118935 9478873 6318071 4462325 4213050 3509944 2675869 3382892
36376 3382892 4726930 4656398 3780243 3612487 2620281 -1367405 -5882856 -5881141 -1027722
36367 -1027722 3438030 3450513 -64137 -4283588 -7544054 -8814282 -7756308 -6110088
36359 -6110088 -6021946 -6665044 -5565550 -3245069 -2914461 -5234387 -7148843 -6590042 -4682021
36350 -4682021 -2568565 125920 2774512 3630206 3338368 4523714 6656053 5858020 1672060
36341 1672060 -808510 1589236 5008239 4449719 731966 -2399754 -4297908 -5822882
36333 -5822882 -5020716 -26580 5687027 6648223 3096451 177582 35984 44885 -1111196
$$ packed form
36393A892244J057825k830569k907216K058559N762583L131566j678408j617585
36385D868999K240455L009481o40062l160802j855746k49275p03106q34075P07023
36376C382892J344038p0532q76155j67756r92206l987686m515451J715M853419
36367a027722M465752J2483l514650m219451l260466j270228J057974J646220
36359f110088Q8142o43098J099494K320481L30608k319926j914456N58801J908021
36350d682021K113456K694485K648592Q55694k91838J185346K132339p98033m185960
36341A672060k480570K397746L419003n58520l717753l131720j898154j524974
36333e822882Q02166M994136N713607R61196l551772k918869j41598Q901j156081
$$ plain form
36324 -1111196 -1304291 -111341 -652366 -3849037 -5482564 -2332813 2315271 3192437 604742
36315 604742 -771452 593345 1227647 -1279043 -4293911 -4210297 -1981480 -1810204 -5166930
36306 -5166930 -8819179 -9280161 -6979821 -4602953 -2975308 -943339 1342685 1863536
36298 1863536 34179 -1984556 -2694224 -3788087 -7091599 -10549258 -10169514 -5663344
36290 -5663344 -1395371 -995356 -3130745 -3987855 -2602210 -1824055 -4000827 -7330765 -7801902
36281 -7801902 -4311425 -131048 1427362 1038758 1192371 1483698 -593415 -4258548 -4779346
36272 -4779346 142852 6554827 9262777 8040858 6022816 4341215 2057544 -191336
36264 -191336 -646026 47757 -299752 -1180452 -46250 2422023 2029509 -2529630 -6985269
$$ packed form
36324a111196j93095J192950n41025l196671j633527L149751M648084Q77166k587695
36315F04742j376194J364797O34302k506690l014868Q3614K228817J71276l356726
36306e166930l652249m60982K300340K376868J627645K031969K286024N20851
36298A863536j829357k018735p09668j093863l303512l457659L79744M506170
36290e663344M267973M00015k135389q57110J385645P78155k176772l329938m71137
36281g801902L490477M180377J558410l88604J53613K91327k077113l665133n20798
36272d779346M922198O411975K707950j221919k018042j681601k283671k248880
36264a91336m54690O93783l47509q80700J134202K468273l92514m559139m455639
$$ plain form
36255 -6985269 -7453845 -5616477 -5058142 -5356248 -3465559 814754 4538415 5954082 5712223
36246 5712223 4174152 1076540 -1902777 -1906937 584714 1302190 -1839865 -5279546 -5069931
36237 -5069931 -3087162 -4084001 -7919948 -9510940 -6884532 -4302095 -5070536 -5727665 -1640807
36228 -1640807 4607057 6029295 1578459 -2187439 -972392 1156822 -1374425 -6890887
36220 -6890887 -9004977 -5655736 -1073618 544392 -746659 -2930889 -4899316 -5898293
36212 -5898293 -4878944 -2066859 364150 487541 -1378986 -3495531 -4588433 -4470129
36204 -4470129 -3655395 -2732008 -1561250 641465 3616392 5217171 3859118 1203397
36196 1203397 229830 888127 327525 -2234860 -3954391 -2919551 -1253777 -1401182 -1778817
$$ packed form
36255f985269m68576J837368N58335k98106J890689M280313L723661J415667k41859
36246E712223j538071l097612k979317m160K491651P17476l142055l439681K09615
36237e069931J982769r96839l835947j590992K626408K582437p68441o57129M086858
36228a640807O247864J422238m450836l765898J215047K129214k531247n516462
36220f890887k114090L349241M582118J618010j291051k184230j968427r98977
36212e898293J019349K812085K431009J23391j866527k116545j092902J18304
36204d470129Q14734R23387J170758K202715K974927J600779j358053k655721
36196A203397r73567O58297n60602k562385j719531J034840J665774j47405l77635
$$ plain form
36187 -1778817 811896 5895686 9628167 9753183 7385920 4333820 1756555 1404441
36179 1404441 4614220 9105813 10051774 5971394 753506 -1938784 -3175872 -5099660
36171 -5099660 -5938815 -2792856 2575662 5411744 4619306 3126146 2031009 -344192
36163 -344192 -3109890 -2526543 906149 1172726 -3765314 -6968109 -2478924 4492407 4430286
36154 4430286 -2516658 -7406027 -6079935 -3401733 -3166092 -2291042 1683363 4530188
36146 4530188 1780894 -3774382 -6184287 -4387949 -1341432 1930758 6132826 9267176
36138 9267176 7786734 2319528 -1807025 -725365 3702093 6395806 4294901 -1174836
36130 -1174836 -5903199 -7293794 -6651210 -6593847 -6851211 -5100415 -1737063 -159982 -1387703
$$ packed form
36187a778817K590713N083790L732481J25016k367263l052100k577265l52114
36179A404441L209779M491593R45961m080380n217888k692290j237088j923788
36171e099660q39155L145959N368518K836082p92438j493160j095137k375201
36163c44192k765698N83347L432692K66577m938040l202795M489185O971331o2121
36154D430286o946944m889369J326092K678202K35641Q75050L974405K846825
36146D530188k749294n555276k409905J796338L046517L272190M202068L134350
36138I267176j480442n467206m126553J081660M427458K693713k100905n469737
36130a174836m728363j390595O42584N7363k57364J750796L363352J577081j227721
$$ plain form
36121 -1387703 -2291658 -915386 439944 -163639 -666702 818399 2058307 747816 -964084
36112 -964084 -198958 1619108 1958399 2212240 4427393 6005815 3598104 -94726 57351
36103 57351 2772009 2068200 -2811289 -6250072 -5373327 -3441534 -3003207 -2271804 -239186
36094 -239186 751416 35508 656002 3558181 4892319 2252374 -1044805 -1326033 -98512
36085 -98512 -649466 -2630091 -3643916 -3403253 -3022339 -2596742 -2258288 -3142744 -4762129
36076 -4762129 -4144920 -299901 3189019 2925687 511139 -364183 809322 2079554 2701821
36067 2701821 2791167 1339859 -1958990 -4510391 -3853549 -1664293 -1475392 -3436640 -4589931
36058 -4589931 -3670703 -2436236 -2347342 -2684189 -2200857 -620984 1620134 3586476 4006839
$$ packed form
36121a387703r03955J376272J355330o03583n03063J485101J239908j310491j711900
36112i64084P65126J818066L39291K53841K215153J578422k407711l692830J52077
36103E7351K714658p03809m879489l438783Q76745J931793M38327P31403K032618
36094b39186R90602p15908O20494K902179J334138k639945l297179k81228J227521
36085i8512n50954j980625j013825K40663L80914M25597L38454q84456j619385
36076d762129O17209L845019L488920k63332k414548q75322J173505J270232O22267
36067B701821Q9346j451308l298849k551401O56842K189256J88901j961248j153291
36058d589931R19228J234467Q8894l36847M83332J579873K241118J966342M20363
$$ plain form
36049 4006839 2542969 450892 -1071582 -2284823 -3553817 -3990116 -3079525 -2346453 -3382626
36040 -3382626 -5190499 -5584716 -4559600 -4125878 -5058287 -5795528 -4816938 -2658239 -1087941
36031 -1087941 -1020149 -1569641 -1055340 965849 2925338 3085309 1729018 538898 417502
36022 417502 1374741 3744241 7271024 9554693 8192740 4387976 1574239 605720 -342626
36013 -342626 -1234673 102698 2968215 3276424 -119525 -3126066 -2757487 -1256589 -1004788
36004 -1004788 -60075 3231047 5484215 3187033 -863613 -1392531 1346644 2710057
35996 2710057 1241252 -176544 36589 360654 -2295 205504 1501939 2947267 4215109
35987 4215109 5402285 5272179 2764471 -353430 -1389541 -521887 274942 900106 2351101
$$ packed form
36049D006839j463870k092077j522474j213241j268994m36299R10591P33072j036173
36040c382626j807873l94217J025116M33722r32409p37241R78590K158699J570298
36031a087941O7792n49492N14301K021189J959489J59971j356291j190120j21396
36022D17502R57239K369500L526783K283669j361953l804764k813737r68519r48346
36013c42626q92047J337371K865517L08209l395949l006541L68579J500898K51801
36004a004788R44713L291122K253168k297182m050646n28918K739175J363413
35996B710057j468805j417796K13133L24065l62949K07799J296435J445328J267842
35987D215109J187176j30106k507708l117901j036111Q67654P96829O25164J450995
$$ plain form
35978 2351101 3583182 2997866 1968161 2758534 3902703 2184022 -1385422 -2413715
35970 -2413715 46970 2275905 1841289 138276 -1608870 -4161013 -7010539 -7769911
35962 -7769911 -6166584 -4628094 -3819511 -1898404 643066 301722 -3198724 -4767760
35954 -4767760 -1089421 4038907 4915429 1413666 -2070014 -2731414 -1322191 160527
35946 160527 126043 -1789505 -3685182 -2872565 271278 2213137 1269727 -257522 -543638
35937 -543638 -1286370 -3820847 -5704532 -4474780 -1813173 -362936 835767 3688346
35929 3688346 6354106 5983613 4377473 5674598 9207664 10138416 7485292 5975964
35921 5975964 8209842 10013884 6807354 929864 -1477563 937434 3424910 2350981
$$ packed form
35978B351101J232081n85316j029705P90373J144169j718681l569444j028293
35970b413715K460685K228935m34616j703013j747146k552143k849526p59372
35962g769911J603327J538490Q08583J921107K541470l41344l500446j569036
35954d767760L678339N128328Q76522l501763l483680o61400J409223J482718
35946A60527l4484j915548j895677Q12617L143843J941859r43410j527249k86116
35937e43638p42732k534477j883685J229752K661607J450237J198703K852579
35929C688346K665760l70493j606140J297125L533066R30752k653124j509328
35921E975964K233878J804042l206530n877490k407427K414997K487476j073929
$$ plain form
35913 2350981 192269 1732620 7301040 12157430 12344750 8981048 5676116 3371265
35905 3371265 73900 -4770337 -8547207 -9079666 -7499923 -5854932 -4016445 -1299428
35897 -1299428 691714 26305 -1652651 -730622 2719997 4286906 1292969 -3430106
35889 -3430106 -5565014 -4700734 -3493710 -3246132 -2996867 -2131886 -1163771 86467 2608737
35880 2608737 5800273 6984094 4614061 596010 -2020142 -2688271 -3024157 -3377613 -1918375
35871 -1918375 2280316 7030243 9244909 8364437 6119614 3564194 258589 -3436035
35863 -3436035 -5249870 -3535445 67325 2012347 776766 -1687466 -2512695 -943976
35855 -943976 1517340 3091027 3085939 1769205 -221758 -2261465 -4102936 -5965271 -7782240
$$ packed form
35913B350981k158712J540351N568420M856390J87320l363702l304932k304851
35905C371265l297365m844237l776870n32459J579743J644991J838487K717017
35897a299428J991142o65409j678956R22029L450619J566909k993937m723075
35889c430106k134908Q64280J207024K47578K49265Q64981R68115J250238K522270
35880B608737L191536J183821k370033m018051k616152o68129l35886l53456J459238
35871a918375M198691M749927K214666q80472k244823k555420l305605l694624
35863c436035j813835J714425L602770J945022j235581k464232q25229J568719
35855i43976K461316J573687n088j316734j990963k039707j841471j862335j816969
$$ plain form
35846 -7782240 -8374389 -6218846 -1591831 2698079 3689643 1387371 -1205595 -1356700 618544
35837 618544 2136508 1522895 -129286 -494499 874751 1782540 369549 -1858677 -1575609
35828 -1575609 1704138 4488724 3871151 1355029 331003 1311410 2167224 2111040 2482283
35819 2482283 3721774 4399251 3577524 1649279 -1326022 -5255365 -7673716 -5239309
35811 -5239309 1253007 6666071 7900956 7157085 6970122 5927782 2534459 -276708
35803 -276708 879764 3621378 2636660 -2166748 -5283342 -3557801 -62745 965054
35795 965054 -675139 -2492286 -2933007 -2080829 -822147 -492359 -1619469 -2379440 -267892
35786 -267892 4117821 7138251 6691735 4524281 3095637 2553742 2211320 2667401 4273664
$$ packed form
35846g782240n92149K155543M627015M289910R91564k302272k592966j51105J975244
35837F18544J517964o13613j652181l65213J369250R07789j412991k228226K83068
35828a575609L279747K784586o17573k516122j024026R80407Q55814n6184L71243
35819B482283J239491O77477q21727j928245k975301l929343k418351K434407
35811e239309O492316N413064J234885p43871j86963j042340l393323k811167
35803b76708J156472K741614r84718m803408l116594J725541L495056J027799
35795I65054j640193j817147m40721Q52178J258682L29788j127110p59971K111548
35786b67892M385713L020430m46516k167454j428644n41895l42422M56081J606263
$$ plain form
35777 4273664 5107284 3052355 -617883 -2010311 708336 4956848 6744688 5093181
35769 5093181 2596976 2014819 3466934 5403428 7115644 8723238 9147830 6402164
35761 6402164 759145 -4220853 -5279256 -2917750 -119450 1114789 802696 90029
35753 90029 759767 4018771 8130181 9050751 5438102 1104109 32514 1041276 628717
35744 628717 -828960 -18266 3145112 4956425 3697301 1668314 732210 -111772 -1487182
35735 -1487182 -1755837 -124812 1506274 1632278 1398354 2061924 2710704 2320918 1939750
35726 1939750 3070629 5579714 8380930 10330233 9658144 5102777 -1102688 -4058531
35718 -4058531 -1794644 2311151 4418623 4889261 5807880 6516411 4970228 1977391 471423
$$ packed form
35777D273664Q33620k054929l670238j392428K718647M248512J787840j651507
35769E093181k496205n82157J452115J936494J712216J607594M24592k745666
35761F402164n643019m979998j058403K361506K798300J234239l12093p12667
35753I0029O69738L259004M111410R20570l612649m333993j071595J008762m12559
35744F28717j457677Q10694L163378J811313j259124k028987r36104q43982j375410
35735a487182k68655J631025J631086J26004k33924O63570O48780l89786l81168
35726A939750J130879K509085K801216J949303o72089m555367o205465k955843
35718d058531K263887M105795K107472M70638R18619P08531j546183k992837j505968
$$ plain form
35709 471423 873496 291474 -3126294 -7364294 -9065224 -7465925 -4727253 -2972672 -2089909
35700 -2089909 -796885 800939 970291 -960653 -3073993 -3337113 -2553869 -3023903 -4914068
35691 -4914068 -6067826 -5221103 -3338670 -1691769 -507612 349649 1053151 2126770 3548669
35682 3548669 4056027 3085555 2417779 3584807 4890407 4076086 2680760 3693795 5659085
35673 5659085 4090232 -943343 -3926945 -2062802 685042 81982 -2328673 -2787636
35665 -2787636 -1298857 -535688 -1226185 -1776939 -992235 924308 2710193 2431868 -362765
35656 -362765 -2448990 36787 5821066 9500985 8958894 7157679 5547018 1542369
35648 1542369 -4894957 -8225745 -5020703 424148 2693853 2735384 3779247 4457545 2011331
$$ packed form
35709D71423M02073n82022l417768m238000j700930J599299K738672J754581Q82763
35700b089909J293024J597824J69352j930944k113340k63120P83244m70034j890165
35691d914068j153758Q46723J882433J646901J184157Q57261P03502J073619J421899
35682C548669N07358r70472o67776J167028J305600q14321j395326J013035J965290
35673E659085j568853n033575k983602J864143K747844o03060k410655m58963
35665b787636J488779P63169o90497n50754P84704J916543J785885k78325k794633
35656c62765k086225K485777N784279L679919n42091j801215j610661m004649
35648A542369o437326l330788L205042N444851K269705M1531J043863O78298k446214
$$ plain form
35639 2011331 -1336793 -1643406 -227809 -1244324 -4453416 -6370264 -6655499 -7411878 -7917240
35630 -7917240 -6093929 -3538771 -2884356 -1890029 2957476 8317898 7208883 157558
35622 157558 -4667072 -3288279 -289146 171981 72707 1573620 2477449 1358006 1140964
35613 1140964 3473390 4860904 2839671 1297246 4653670 10261330 11670335 7302274
35605 7302274 1513226 -1565624 -1655414 -801038 -1033728 -2876207 -4527180 -3722500 -1266513
35596 -1266513 -418842 -1784410 -2019009 612723 2888644 1522250 -1735123 -3124327
35588 -3124327 -2380158 -1657443 -1092782 693801 2959805 3406576 1830055 126403 -936849
35579 -936849 -2180178 -3504966 -3530453 -1939314 -287071 -238949 -2061295 -4445893 -5018721
$$ packed form
35639B011331l348124l06613J415597j016515l209092j916848k85235p56379n05362
35630g917240J823311K555158O54415R94327M847505N360422j109015p051325
35622A57558m824630J378793K999133M61127r9274J500913R03829j119443k17042
35613A140964K332426J387514k021233j542425L356424N607660J409005m368061
35605G302274n789048l078850q9790Q54376k32690j842479j650973Q04680K455987
35596a266513Q47671j365568k34599K631732K275921j366394l257373j389204
35588c124327P44169P22715N64661J786583K266004M46771j576521j703652j063252
35579i36849j243329j324788k5487J591139J652243M8122j822346k384598n72828
$$ plain form
35570 -5018721 -2158404 2582693 5290397 4253515 2066710 1579687 1717350 -342628
35562 -342628 -4469101 -7761372 -8369461 -6677755 -3739353 -966778 -173330 -1214297 -836429
35553 -836429 2989250 6776132 5403927 -303557 -4200974 -3280856 -1010904 -1009927 -1892921
35544 -1892921 -921468 954590 1115468 -199705 -938688 -1219384 -2766523 -5121946 -5654765
35535 -5654765 -3360339 -106789 2013444 2444829 1402152 -340104 -826476 1421843
35527 1421843 4641150 5180223 2491352 311419 1450141 3716072 3190423 -117592
35519 -117592 -2493453 -1660783 767170 2006604 1309309 35112 -160656 1155056 2697230
35510 2697230 2545157 375081 -1904600 -2534255 -1972283 -1408327 -505563 1408436 3016328
$$ packed form
35570e018721K860317M741097K707704j036882k186805m87023J37663k059978
35562c42628m126473l292271o08089J691706K938402K772575P93448j040967L77868
35553h36429L825679L786882j372205n707484l897417R20118K269952R77q82994
35544a892921R71453J876058J60878j315173p38983k80696j547139k355423n32819
35535e654765K294426L253550K120233M31385j042677j742256m86372K248319
35527A421843L219307N39073k688871k179933J138722K265931n25649l308015
35519a17592k375861Q32670K427953J239434o97295j274197j95768J315712J542174
35510B697230j52073k170076k279681o29655N61972N63956R02764J913999J607892
$$ plain form
35501 3016328 2508422 799581 340626 1012575 561302 -700710 400191 4226133 6360006
35492 6360006 3778128 -354221 -1211498 1027215 2671482 2687706 3156163 4312248 3331018
35483 3331018 -1239926 -6923381 -10308148 -10558271 -9075274 -7325171 -5932689 -4918569
35475 -4918569 -4099203 -3483703 -3071205 -1991766 1121546 5920619 9498845 9121723 5165394
35466 5165394 302085 -3211341 -4236952 -2237376 1864474 5145325 5136144 2592553 346005
35457 346005 -100142 444773 411515 -1283805 -4373231 -6327466 -4160109 941687 3002605
35448 3002605 -1764587 -9165561 -11783616 -8285597 -4057193 -3322472 -4980817 -6365619
35440 -6365619 -6746939 -6058161 -3932845 -1432867 -606818 -1115239 -325322 2138382 3255260
$$ packed form
35501C016328n07906j708841m58955O71949m51273j262012J100901L825942K133873
35492F360006k581878m132349q57277K238713J644267J6224M68457J156085r81230
35483C331018m570944n683455l384767k50123J482997J750103J392482J014120
35475d918569Q19366O15500M12498J079439L113312M799073L578226l77122l956329
35466E165394m863309l513426j025611J999576M101850L280851r181k543591k246548
35457C46005m46147N44915l3258j695320l089426j954235K167357N101796K060918
35448C002605m767192p400974k618055L498019M228404P34721j658345j384802
35440f365619l81320O88778K125316K499978Q26049n08421P89917K463704J116878
$$ plain form
35431 3255260 1500919 -478151 -102998 1357484 1756274 2002900 3868526 5874860 4920328
35422 4920328 1220957 -1512239 -912876 1435737 2762448 2711190 3134749 4889177 5833129
35413 5833129 2864121 -3766992 -9331604 -9403176 -5231454 -2184041 -2751594 -3722266 -1393771
35404 -1393771 2952716 5085613 3893346 2647618 4068305 6287672 5101771 -400251
35396 -400251 -5950431 -6630705 -2514000 1750108 2899679 2377086 2644689 2710409 40877
35387 40877 -4475263 -6828062 -5138562 -1830685 -94731 -507436 -1846909 -3270473 -4642626
35378 -4642626 -5807656 -6222542 -5023380 -1997040 967230 865677 -2566886 -5591779
35370 -5591779 -4961129 -1933272 511759 2286303 4678366 6220576 4482612 942609
$$ packed form
35431C255260j754341j979070L75153J460482L98790K46626J865626K006334r54532
35422D920328l699371k733196N99363K348613J326711n1258M23559J754428R43952
35413E833129k969008o631113n564612p1572M171722L047413n67553r70672K328495
35404a393771M346487K132897j192267j245728J420687K219367j185901n502022
35396d00251n550180o80274M116705M264108J149571n22593K67603O5720k669532
35387D0877m516140k352799J689500L307877J735954m12705j339473j423564j372153
35378d642626j165030m14886J199162L026340K964270j01553l432563l024893
35370e591779O30650L027857K445031J774544K392063J542210j737964l540003
$$ plain form
35362 942609 -538788 300980 228895 -1552745 -2311416 -882725 834338 1917536 3195541
35353 3195541 3556378 740371 -3336436 -3658906 119034 2773744 2086811 1918137 4076604
35344 4076604 4017060 -1009847 -5804918 -4910616 -1465657 -2151337 -7043138 -10763875 -10953729
35335 -10953729 -9429938 -6919985 -2707737 1467839 2525539 626585 -1629512 -3681664
35327 -3681664 -6530744 -8948979 -8634584 -6438002 -5217916 -5046150 -3559010 -571047
35319 -571047 1566519 1837545 1149734 -467952 -3600215 -6693978 -7071681 -4656465 -1909100
35310 -1909100 -605838 -1145734 -3612283 -6566319 -6681470 -3166716 -446051 -2163576
35302 -2163576 -4794422 -2639224 2602080 3752923 -910616 -5548252 -6284282 -5972206
$$ packed form
35362I42609j481397Q39768p2085j781640p58671J428691J717063J083198J278005
35353C195541L60837k816007m076807l22470L777940K654710o86933j68674K158467
35344D076604n9544n026907m795071Q94302L444959o85680m891801l720737j89854
35335a0953729J523791K509953M212248M175576J057700j898954k256097k052152
35327c681664k849080k418235L14395K196582J220086J71766J487140K987963
35319e71047K137566K71026o87811j617686l132263l093763l77703K415216K747365
35310a909100J303262n39896k466549k954036j15151L514754K720665j717525
35302b163576k630846K155198N241304J150843m663539m637636p36030L12076
$$ plain form
35294 -5972206 -7424117 -8327534 -6253938 -3438789 -2578044 -1930675 1232620 5260098 6241684
35285 6241684 3655812 513726 -879179 -589999 436359 1142160 340036 -2086739 -4201815
35276 -4201815 -3380768 1411632 8608541 14334214 14283261 7521901 -1369691 -6157600 -5406278
35267 -5406278 -3044105 -2450780 -2814153 -2054328 -350594 795050 714720 -668077 -3213073
35258 -3213073 -5374853 -4680277 -925910 2750238 3348470 1150138 -1569560 -3307143
35250 -3307143 -3760152 -3115484 -2091162 -1513433 -1166521 -240339 981240 1564498 1906204
35241 1906204 2927931 3383373 1093044 -2634532 -3423200 -73561 3176460 2813698 1145137
35232 1145137 2234703 5439765 6653712 4413026 1154737 -925143 -2000946 -2658739
$$ packed form
35294e972206j451911r03417K073596K815149Q60745O47369L163295M027478R81586
35285F241684k585872l142086j392905K89180J026358P05801q02124k426775k115076
35276d201815Q21047M792400P196909N725673n0953o761360q891592m787909P51322
35267e406278K362173N93325l63373P59825J703734J145644q0330j382797k544996
35258c213073k161780O94576L754367L676148N98232k198332k719698j737583
35250c307143m53009O44668J024322N77729L46912R26182J221579N83258L41706
35241A906204J021727M55442k290329l727576p88668L349639L250021l62762j668561
35232A145137J089566L205062J213947k240686l258289k079880j075803o57793
$$ plain form
35224 -2658739 -2636153 -2037317 -1708219 -1758647 -1266347 -73787 406602 -902454 -2672713
35215 -2672713 -2038346 2106916 7093649 8624059 5320522 348732 -2196104 -1628510
35207 -1628510 -366380 -398050 -1733317 -3460962 -4263708 -2587774 1319049 4115972 2864925
35198 2864925 -520473 -1359632 1408128 4327453 4980441 4411430 3297803 220238 -4412194
35189 -4412194 -7008244 -5994311 -4531070 -5090490 -5211036 -2438077 221703 -1171390
35181 -1171390 -4198341 -3283132 896016 1463042 -4302470 -10257929 -9646265 -3970495 -29169
35172 -29169 -350176 -631003 3219897 8800684 10140730 5676082 416512 -729019 910499
35163 910499 1021552 -273144 1196078 5923523 8706069 6429395 3008796 2911046 3886744
$$ packed form
35224b658739K2586N98836L29098n0428M92300J192560M80389j309056j770259
35215b672713O34367M145262M986733J530410l303537m971790k544836N67594
35207a628510J262130l1670j335267j727645q02746J675934L906823K796923j251047
35198B864925l385398q39159K767760K919325O52988n69011j113627l077565m632432
35189d412194k596050J013933J463241n59420j20546K772959K659780j393093
35181a171390l026951R15209M179148N67026n765512n955459O11664N675770L941326
35172b9169l21007k80827L850900N580787J340046m464648n259570j145531J639518
35163I10499J11053j294696J469222M727445K782546k276674l420599r7750R75698
$$ plain form
35154 3886744 1249803 -3388567 -3722296 1693438 7237675 8303289 6708020 6427863
35146 6427863 7849322 8487823 6837477 3528333 257791 -1243355 -549987 576159
35138 576159 61638 -1644359 -2322532 -1351581 -157320 477840 988603 1029200 -128222
35129 -128222 -1073258 471816 3266931 3149575 -715341 -3969298 -3441670 -1700484 -2378792
35120 -2378792 -4215413 -3425407 291845 3968737 6037893 6993721 6511924 3885730 897533
35111 897533 336678 1521890 1132337 -905144 -425475 4365618 8925315 7877658 2117858
35102 2117858 -2670175 -3211724 -1275818 305403 1087332 1798923 2122772 1286773 -223602
35093 -223602 -1025064 -739865 -601508 -1967486 -4750135 -7692738 -9939264 -11623117 -12576871
$$ packed form
35154C886744k636941m638370l33729N415734N544237J065614j595269k80157
35146F427863J421459O38501j650346l309144l270542j501146O93368J126146
35138E76159n14521j705997o78173R70951J194261O35160N10763M0597j157422
35129a28222r45036J545074K795115j17356l864916l253957N27628J741186o78308
35120b378792j836621P90006L717252L676892K069156R55828m81797k626194k988197
35111H97533n60855J185212l89553k037481M79669M791093M559697j047657n759800
35102B117858m788033n41549J935906J581221P81929P11591L23849q35999j510375
35093b23602q01462K85199J38357j365978k782649k942603k246526j683853r53754
$$ plain form
35084 -12576871 -11311000 -6632084 -287071 3636004 2966361 43295 -1183812 239312
35076 239312 2153542 3046960 3609073 4322435 3979672 1926930 -68454 -50621 1206223
35067 1206223 1541908 940203 1375953 3156678 3885812 2061202 -291807 -344599 1303423
35058 1303423 1233168 -2013710 -5705166 -6380240 -4206490 -2260117 -1901775 -1006334 2181289
35049 2181289 5179077 3647030 -2663337 -8844529 -10470861 -8105639 -4973015 -2555923
35041 -2555923 -845968 -901744 -3494194 -5862082 -3841041 1943088 5544312 3109247
35033 3109247 -2052784 -4107815 -2116316 18580 -415846 -2069632 -2420465 -942463
35025 -942463 1057723 2062390 1342800 -623286 -2626775 -4232487 -6173837 -8377243
$$ packed form
35084a2576871J265871M678916O345013L923075o69643k923066j227107J423124
35076B39312J914230Q93418N62113P13362l42763k052742j995384J7833J256844
35067A206223L35685o01705M35750J780725P29134j824610k353009n2792J648022
35058A303423p0255l246878l691456o75074K173750J946373L58342Q95441L187623
35049B181289K997788j532047o310367o181192j626332K365222L132624K417092
35041b555923J709955n5776k592450k367888K021041N784129L601224k435065
35033C109247n162031k055031J991499K134896m34426j653786l50833J478002
35025i42463K000186J004667p19590j966086k003489j605712j941350k203406
$$ plain form
35017 -8377243 -8792734 -5915531 -1567086 942386 845595 -115515 -1140884 -2874199 -4473244
35008 -4473244 -3594525 -389167 1629644 498326 -1217586 -662619 706372 -30336 -1711621
34999 -1711621 -476842 3734212 6079513 3211910 -2298277 -5483319 -4657935 -1864458
34991 -1864458 626806 2183724 2885138 2498243 643447 -2516688 -5670949 -6713216
34983 -6713216 -4801324 -2112120 -1964870 -4629575 -6678681 -5451354 -2359642 -275608
34975 -275608 556676 1718430 3043036 2796615 1147736 458670 1350514 963816 -3336347
34966 -3336347 -10041584 -14859438 -15267792 -12522372 -9551915 -7937253 -7095243 -5808988
34958 -5808988 -3901065 -1934301 404930 4238651 9072446 11834548 10030507 5181844
$$ packed form
35017h377243m15491K877203M348445K509472r6791r61110j025369j733315j599045
35008d473244Q78719L205358K018811j131318j715912N54967J368991p36708j681285
34999a711621J234779M211054K345301k867603n510187l185042Q25384K793477
34991a864458K491264J556918P01414l86895j854796l160135l154261j042267
34983f713216J911892K689204J47250k664705k049106J227327L091712K084034
34975b75608Q32284J161754J324606k46421j648879o89066Q91844l86698m300163
34966c336347o705237m817854m08354K745420K970457J614662Q42010J286255
34958e808988J907923J966764K339231L833721M833795K762102j804041m848663
$$ plain form
34950 5181844 1366509 697480 1918646 3012829 3123483 2008580 -236558 -2634135
34942 -2634135 -4273765 -5721391 -7585715 -8281912 -6034805 -2757056 -2292338 -4379888
34934 -4379888 -4397069 -380587 3781873 4182027 1947724 -100862 -1865322 -3654372 -3250886
34925 -3250886 299173 2920958 419234 -4906292 -7366951 -5880755 -3869220 -2688440
34917 -2688440 -846667 886900 -330675 -3545984 -4052355 -747927 1707933 60497
34909 60497 -2872270 -3113651 -1101119 290265 35772 -1103203 -2078642 -1140686 2955192
34900 2955192 7563054 7562034 2397986 -2023863 -1316270 1248770 239042 -3610860 -5164640
34891 -5164640 -2846721 -25946 749560 647999 1653196 4125199 7530294 11027153
$$ packed form
34950E181844l815335o69029J221166J094183J10654j114903k245138k397577
34942b634135j639630j447626j864324o96197K247107L277749M64718k087550
34934d379888j7181M016482M162460M00154k234303k048586j764460j789050M03486
34925c250886L550059K621785k501724n325526k460659J486196K011535J180780
34917b688440J841773J733567j217575l215309n06371L304428K455860j647436
34909F0497k932767k41381K012532J391384k54493j138975r75439R37956M095878
34900B955192M607862j020n164048m421849P07593K565040j009728l849902j553780
34891e164640K317919K820775P75506j01561J005197K472003L405095L496859
$$ plain form
34883 11027153 13149223 12875097 10879805 8278609 5088980 1600709 -318482 300285
34875 300285 1302334 589294 8168 2357110 5568460 4498845 -1182684 -5511537 -4199513
34866 -4199513 -124870 1478787 -24582 -1592131 -1839138 -1707827 -1098539 1139371 3704276
34857 3704276 3105848 -1007934 -3764049 -999641 4471550 5872354 1336982 -3810075
34849 -3810075 -4598509 -2664163 -2425096 -3937226 -3652495 -981281 575124 -738060 -2199993
34840 -2199993 -1159330 1365568 3603662 6124547 9296115 10564750 7712196 2885604
34832 2885604 -107348 -1168242 -3034360 -5957125 -7134289 -5525054 -3564633 -3114154
34824 -3114154 -2795250 -973398 951245 371996 -2556698 -4721849 -3676754 -233181
$$ packed form
34883A1027153K122070k74126j995292k601196l189629l488271j919191O18767
34875C00285J002049p13040n81126K348942L211350j069615n681529m328853J312024
34866d199513M074643J603657j503369j567549k47007J31311O09288K237910K564905
34857C704276n98428m113782k756115K764408N471191J400804m535372n147057
34849c810075p88434J934346K39067j512130K84731K671214J556405j313184j461933
34840b199993J040663K524898K238094K520885L171568J268635k852554m826592
34832B885604k992952j060894j866118k922765j177164J609235J960421M50479
34824c114154L18904J821852J924643n79249k928694k165151J045095L443573
$$ plain form
34816 -233181 2831141 3998599 4400376 5998162 8990972 11681627 12576649 11586617 9234158
34807 9234158 6048171 3090952 1647054 1590460 1115786 -1190652 -4795227 -7927294 -8790342
34798 -8790342 -6292521 -1342962 2703746 3190535 1756395 1999663 3558170 2433258
34790 2433258 -2011536 -5175250 -4435826 -3191006 -4332600 -4860732 -1948747 460389
34782 460389 -2109559 -5456207 -1967281 6550427 10192914 5619755 705079 2093749
34774 2093749 6105744 6288300 3403304 2377623 4004182 5373167 5457169 5047941 3387526
34765 3387526 -280473 -3467578 -3334193 -1600426 -2124250 -4422999 -4198976 -256310 3609240
34756 3609240 4502050 4174175 5127494 6187305 4477270 -10750 -4211862 -5637928 -4507421
$$ packed form
34816b33181L064322J167458M01777J597786K992810K690655Q95022r90032k352459
34807I234158l185987k957219j443898n6594m74674k306438l604575l132067q63048
34798h790342K497821M949559M046708M86789j434140K43268J558507j124912
34790B433258m444794l163714P39424J244820j141594n28132K911985K409136
34782D60389k569948l346648L488926Q517708L642487m573159m914676J388670
34774B093749M011995J82556k884996j025681J626559J368985Q4002m09228j660415
34765C387526l667999l187105J33385J733767n23824k298749K24023L942666L865550
34756C609240Q92810l27875R53319J059811j710035m488020m201112j426066J130507
$$ plain form
34747 -4507421 -2588953 -1373957 -1453630 -2489423 -3204885 -2124244 761942 3254371 2976114
34738 2976114 493840 -823365 999755 3780830 4294097 3010341 3111727 5208047
34730 5208047 6305830 4677686 2373246 1311521 235544 -1847726 -2326258 1062879
34722 1062879 5182210 5232376 2597090 3481047 9003832 12322486 8429000 1907382 238434
34713 238434 2712911 2111337 -3607208 -7885339 -5464236 -6706 1800043 -409660
34705 -409660 -2058261 -1749527 -2291045 -4181470 -3882579 -39428 3447965 3137849 923281
34696 923281 80952 -165161 -2148297 -4321866 -3052111 1182704 3971036 3353988 1884352
34687 1884352 1742767 1783478 760627 -83655 315696 360254 -1771844 -5114759 -7262473
$$ packed form
34747d507421J918468J214996p9673j035793p15462J080641K886186K492429k78257
34738B976114k482274j317205J823120K781075N13267j283756J01386K096320
34730E208047J097783j628144k304440j061725j075977k083270m78532L389137
34722A062879M119331N0166k635286Q83957N522785L318654l893486o521618j668948
34713B38434K474477o01574n718545m278131K421103N457530J806749k209703
34705d09660j648601L08734n41518j890425K98891L843151L487393l10116k214568
34696I23281q42329k46113j983136k173569J269755M234815K788332o17048j469636
34687A884352j41585M0711j022851q44282L99351M4558k132098l342915k147714
$$ [...]
##END NTUPLES=NMR SPECTRUM
##END=
