##TITLE=31Pdec_LR-0169-C1-CH2Cl2
 CCl4, 128 sc
 20.2.2023
##JCAMPDX= 6.0         $$ Bruker NMR JCAMP-DX V2.0
##DATA TYPE= NMR SPECTRUM
##DATA CLASS= NTUPLES
##ORIGIN= UXNMR, Bruker Analytische Messtechnik GmbH
##OWNER= root
$$ XWIN-NMR		Version 3.5
$$ Mon Feb 20 15:47:14 2023 Russian Standard Time (UT+4h)  she@DPX200
##.OBSERVE FREQUENCY= 81.013821
##.OBSERVE NUCLEUS= ^31P
##.ACQUISITION MODE= SIMULTANEOUS
##.ACQUISITION SCHEME= undefined
##.AVERAGES= 128
##.DIGITISER RES= 16
##SPECTROMETER/DATA SYSTEM= spect
##.PULSE SEQUENCE= zgpg30
##.SOLVENT NAME= DMSO
##.SHIFT REFERENCE= (INTERNAL, DMSO, 0, 248.564)
##AUDIT TRAIL= $$ (NUMBER, WHEN, WHO, WHERE, WHAT)
$$ ##TITLE= Audit trail, XWIN-NMR		Version 3.5
$$ ##JCAMPDX= 5.01
$$ ##ORIGIN= Bruker BioSpin GmbH
$$ ##OWNER= she
$$ F:/spectra/data/she/nmr/P31/1/pdata/1/auditp.txt
$$ ##AUDIT TRAIL=  $$ (NUMBER, WHEN, WHO, WHERE, WHAT)
(   1,<2023-02-20 15:46:25.68 +0400>,<she>,<DPX200>,
      <continue with go, POWCHK disabled, PULCHK disabled
       configuration hash MD5:
       00 E9 B6 7A A2 85 ED C7 34 08 36 98 17 FE 4E 26
       data hash MD5: 32K
       67 1B 8C E1 6F 9D C3 D6 44 6D E0 3A 69 A5 85 75>)
(   2,<2023-02-20 15:46:28.31 +0400>,<she>,<DPX200>,
      <Start of raw data processing
       efp BC_mod = 2 LB = 1 FT_mod = 6 PKNL = 1 PHC0 = -11076.92 PHC1 = 373.6127 SI = 64K 
       data hash MD5: 64K
       09 49 A6 B1 87 CE 49 6F B8 CF 33 DF 44 21 FA 65>)
(   3,<2023-02-20 15:46:37.73 +0400>,<she>,<DPX200>,
      <pk PHC0 = 6.721851 PHC1 = 0 
       data hash MD5: 64K
       25 6D 65 05 5C 2B 1E FB CF B6 9C 0F 64 CC 57 D7>)
(   4,<2023-02-20 15:46:43.54 +0400>,<she>,<DPX200>,
      <abs ABSG = 5 
       data hash MD5: 64K
       1F E0 52 39 C0 FE 6E CA 6D 2A 26 6E AD 8E 44 95>)
$$ ##END=
$$ 
$$ hash MD5
$$ 11 40 2D 94 23 34 75 2A 7F 4F 98 D1 62 66 5A 64
##$RELAX= 
##$RELAX= 
##$RELAX= 
##$RELAX= 
##$RELAX= 
##$RELAX= 
##$RELAX= 
##$RELAX= 
##$RELAX= 
$$ Bruker specific parameters
$$ --------------------------
##$DU= <F:/spectra>
##$EXPNO= 1
##$NAME= <P31>
##$PROCNO= 1
##$TYPE= <nmr>
##$USER= <she>
##$AMP= (0..31)
100 100 100 100 100 100 100 100 100 100 100 100 100 100 100 100 100 100 
100 100 100 100 100 100 100 100 100 100 100 100 100 100 
##$AQSEQ= 0
##$AQ_mod= 1
##$AUNM= <au_zg>
##$AUTOPOS= <>
##$BF1= 81.014009
##$BF2= 200.13
##$BF3= 200.13
##$BF4= 200.13
##$BF5= 200.13
##$BF6= 200.13
##$BF7= 200.13
##$BF8= 200.13
##$BYTORDA= 1
##$CFDGTYP= 0
##$CFRGTYP= 5
##$CHEMSTR= <none>
##$CNST= (0..31)
1 1 145 1 1 1 1 1 1 1 1 1 1 1 1 1 1 1 1 1 1 1 1 1 1 1 1 1 1 1 1 1 
##$CPDPRG= <waltz16>
##$CPDPRG1= <>
##$CPDPRG2= <waltz16>
##$CPDPRG3= <>
##$CPDPRG4= <mlev>
##$CPDPRG5= <mlev>
##$CPDPRG6= <mlev>
##$CPDPRG7= <mlev>
##$CPDPRG8= <mlev>
##$CPDPRGB= <>
##$CPDPRGT= <>
##$D= (0..31)
0 1 0 0 0 0 0 0 0 0 0 0.03 2e-05 3e-06 0 0 0 0 0 0 0 0 0 0 0 0 0 0 0 0 
0 0 
##$DATE= 1676890995
##$DBL= (0..7)
120 120 120 11 120 120 24 19 
##$DBP= (0..7)
150 150 150 150 150 150 150 150 
##$DBP07= 0
##$DBPNAM0= <>
##$DBPNAM1= <>
$$ [...]
##$SUBNAM3= <"">
##$SUBNAM4= <"">
##$SUBNAM5= <"">
##$SUBNAM6= <"">
##$SUBNAM7= <"">
##$SUBNAM8= <"">
##$SUBNAM9= <"">
##$SW= 501.771253377433
##$SWIBOX= (0..15)
0 1 3 0 0 0 0 0 0 0 0 0 0 0 0 0 
##$SW_h= 40650.406504065
##$TD= 32768
##$TD0= 1
##$TE= 0
##$TE2= 300
##$TE3= 300
##$TEG= 300
##$TL= (0..7)
0 120 53 12 22 120 120 120 
##$TP= (0..7)
150 150 150 150 150 150 150 150 
##$TP07= 0
##$TPNAME0= <>
##$TPNAME1= <>
##$TPNAME2= <>
##$TPNAME3= <>
##$TPNAME4= <>
##$TPNAME5= <>
##$TPNAME6= <>
##$TPNAME7= <>
##$TPOAL= (0..7)
0.5 0.5 0.5 0.5 0.5 0.5 0.5 0.5 
##$TPOFFS= (0..7)
0 0 0 0 0 0 0 0 
##$TUNHIN= 0
##$TUNHOUT= 0
##$TUNXOUT= 0
##$USERA1= <user>
##$USERA2= <user>
##$USERA3= <user>
##$USERA4= <user>
##$USERA5= <user>
##$V9= 5
##$VALIST= <valist>
##$VCLIST= <CCCCCCCCCCCCCCC>
##$VD= 0
##$VDLIST= <DDDDDDDDDDDDDDD>
##$VPLIST= <PPPPPPPPPPPPPPP>
##$VTLIST= <TTTTTTTTTTTTTTT>
##$WBST= 1024
##$WBSW= 4
##$XGAIN= (0..3)
0 0 0 0 
##$XL= 0
##$YL= 0
##$YMAX_a= 10840
##$YMIN_a= -5397
##$ZGOPTNS= <>
##$ZL1= 120
##$ZL2= 120
##$ZL3= 120
##$ZL4= 120
##$ABSF1= 248.5645
##$ABSF2= -253.2056
##$ABSG= 5
##$ABSL= 3
##$ALPHA= 0
##$AQORDER= 0
##$ASSFAC= 0
##$ASSFACI= 0
##$ASSFACX= 0
##$ASSWID= 0
##$AUNMP= <proc_1d>
##$AZFE= 0.1
##$AZFW= 0.5
##$BCFW= 0
##$BC_mod= 2
##$BYTORDP= 0
##$COROFFS= 0
##$CY= -3
##$DATMOD= 1
##$DC= 0
##$DFILT= <>
##$DTYPP= 0
##$F1P= 0
##$F2P= 0
##$FCOR= 1
##$FTSIZE= 65536
##$FT_mod= 6
##$GAMMA= 0
##$GB= 0
##$INTBC= 1
##$INTSCL= 6.047779e-11
##$ISEN= 30
##$LB= 1
##$LEV0= 0
##$LPBIN= 0
##$MAXI= 10000
##$MC2= 0
##$MEAN= 0
##$ME_mod= 0
##$MI= 50
##$NCOEF= 0
##$NC_proc= -9
##$NLEV= 6
##$NOISF1= 182.463
##$NOISF2= 159.3651
##$NSP= 0
##$NTH_PI= 0
##$NZP= 0
##$OFFSET= 248.5645
##$PC= 4
##$PHC0= -11070.2
##$PHC1= 373.6127
##$PH_mod= 1
##$PKNL= yes
##$PPARMOD= 0
##$PSCAL= 0
##$PSIGN= 0
##$REVERSE= no
##$SF= 81.0140089999694
##$SI= 65536
##$SIGF1= 159.3651
##$SIGF2= -187.1042
##$SINO= 113.3802
##$SIOLD= 16384
##$SREGLST= <1H.CDCl3>
##$SSB= 0
##$STSI= 65536
##$STSR= 0
##$SW_p= 40650.406504065
##$SYMM= 0
##$S_DEV= 0
##$TDeff= 32768
##$TDoff= 0
##$TI= <>
##$TILT= no
##$TM1= 0
##$TM2= 0
##$TOPLEV= 0
##$USERP1= <user>
##$USERP2= <user>
##$USERP3= <user>
##$USERP4= <user>
##$USERP5= <user>
##$WDW= 1
##$XDIM= 65536
##$YMAX_p= 482187609
##$YMIN_p= -102802244
$$ End of Bruker specific parameters
$$ ---------------------------------
##NTUPLES= NMR SPECTRUM
##VAR_NAME=  FREQUENCY,     SPECTRUM/REAL,   SPECTRUM/IMAG
##SYMBOL=    X,             R,               I
##VAR_TYPE=  INDEPENDENT,   DEPENDENT,       DEPENDENT
##VAR_FORM=  AFFN,          ASDF,            ASDF
##VAR_DIM=   65536,         65536,           65536
##UNITS=     HZ,            ARBITRARY UNITS, ARBITRARY UNITS
##FACTOR=    0.620285442955139, 1,           1
##FIRST=     20137.2065510682, 0,            0
##LAST=      -20513.1999529968, 0,           0
##MIN=       -20513.1999529968, -102802244,  0
##MAX=       20137.2065510682, 482187609,    0
$$ Real data points
##PAGE= N=1
##DATA TABLE= (X++(R..R)), XYDATA
$$ [...]
42129A2291788J4009718j3979685l8352803k8676443O403754K8395316J5712698
42122d195657j0657283j5649245M539859J9861455Q410095j4753642j9405493
42115c1849911k72352J8477052J6370176N55577p900737j510498Q983637J2673007
42107A5525951R901583M282163n599485j8622616k3022467q971237J2318066J7066840
42099B878798R80999j2061211l244408J3540655J3701204K53018l160232P064184
42091A9953007Q558089p564669j9280222r601932M456125M8107j3147121r398313
42083b5976929R225264J4646144l313592k1659936j8251718K94356J3334980J2876693
42075a8824738O057518J692052K363892L894710n81965j0941758j6212346q142506
$$ plain form
42129 12291788 26301506 12321821 -26030982 -54707425 -48303671 -19908355 -4195657
42122 -4195657 -14852940 -30502185 -25962326 -6100871 2309224 -12444418 -31849911
42115 -31849911 -32122263 -13645211 2724965 3280542 -4620195 -6130693 2852944 15525951
42107 15525951 25427534 29709697 24110212 5487596 -17534871 -26506108 -14188042 2878798
42099 2878798 3859797 -8201414 -11445822 2094833 15796037 16049055 12888823 19953007
42091 19953007 28511096 20946427 1666205 -7935727 -3479602 -3431495 -16578616 -25976929
42083 -25976929 -16751665 -2105521 -5419113 -27079049 -45330767 -45036411 -31701431 -18824738
42075 -18824738 -12767220 -11075168 -8711276 -4816566 -5398531 -16340289 -32552635 -40695141
42067d0695141N439423J1455498J0381104J0508082R861677K161679m565829J903969
42059F450462J2048616N161642j3443737j5617971L470910J4354889N46034j5175792
42051b204947j0289163J533243j698516j2222506j0513963q79390K18388m625745
42043d0682599k551158L536616M909512Q561512K0619722K3639133K449869k1471422
42035i88815j7478664L643320O023402j1844428j7085735l71040J1065790M160406
42027b2875764J06671J1410248J8890479Q226273n762004q936085r596193j3231368
42019b1767743p893223O524622P244262j1322586j8965667K926042K6396593K0086894
42011C229194m01108q31682J5108517J6683830k76761r621321J06023J0721332
$$ plain form
42067 -40695141 -35255718 -23800220 -13419116 -2911034 6950643 9112322 4546493 6450462
42059 6450462 18499078 23660720 10216983 -5400988 -1930078 12424811 12970845 -2204947
42051 -2204947 -12494110 -10960867 -12659383 -24881889 -35395852 -36275242 -36056854 -40682599
42043 -40682599 -43233757 -39697141 -34787629 -26226117 -5606395 18032738 20482607 -988815
42035 -988815 -18467479 -14824159 -8800757 -20645185 -37730920 -38101960 -27036170 -22875764
42027 -22875764 -22769093 -11358845 7531634 15757907 9995903 1059818 -8536375 -21767743
42019 -21767743 -29660966 -23136344 -15892082 -27214668 -46180335 -43254293 -16857700 3229194
42011 3229194 2828086 1996404 17104921 33788751 33511990 23890669 23996692 34718024
42003C4718024N488042j0558378k3004993k2443595q276067Q008041J0334344
41996e734582O76042N75091J6589973K4437185P081835j4739031j6578770j0731604
41988A576139j8567138k5413125o151038K1504017J9289685n364521r204108J2048469
41980a0281620J5998627j0141140k3524088K235707L1589993K5286215j04038
41973C1059656p920382n76424k366393j0838465p551913J654243k202276j2594547
41965a1336501q235598N864660M783541j2551582k0316666p261831R139511J3071779
41957b6842687Q242599J663592o026926r620385j277454J1587905J1174916l092826
41949a4191266j1953705o025925K712235M969397P328523J2143681O939654j1411498
$$ plain form
42003 34718024 40206066 29647688 6642695 -15800900 -24076967 -16068926 -5734582
41996 -5734582 -5058540 -4483449 12106524 36543709 43625544 28886513 12307743 1576139
41988 1576139 -16990999 -42404124 -48555162 -27051145 -7761460 -13125981 -22330089 -10281620
41980 -10281620 5717007 -4424133 -27948221 -25712514 5877479 31163694 31059656
41973 31059656 23139274 22562850 20196457 9357992 1806079 3460322 1258046 -11336501
41965 -11336501 -19572099 -13707439 -8923898 -21475480 -41792146 -49053977 -39914466 -26842687
41957 -26842687 -18600088 -16936496 -22963422 -32583807 -33861261 -22273356 -11098440 -14191266
41949 -14191266 -26144971 -32170896 -29458661 -24489264 -17160741 -5017060 1922594 -9488904
41941i488904k1655532o597929J7601881K1747230M671224p394139M98438J4151829
41933A3534098J3739221r94971j4999481j6255829m103920J2390118J9302527
41926B2611763Q378550j1982943k2361617j4057113P63557O132913K339010K36560
41918g939320J926961K73621m381320k323972P397011J1650730L503862n525903
41910D581670m043065R36634j530916n033624J904841J0745618M100315j1319707
41902C41766j0422886Q166462J5073472l428655k0816211j1752252P610866Q239219
41894f988219l247636M96954J5839765J1746325j4088455k3088592N730668L8371563
41886B4772373L0838026j0489846m0064948l2753270o710972R146073P747633
$$ plain form
41941 -9488904 -31144436 -37742365 -20140484 1606746 6277970 -1116169 -617731 13534098
41933 13534098 27273319 26278348 11278867 -4976962 -9080882 3309236 22611763
41926 22611763 30990313 19007370 -3354247 -17411360 -16647803 -10514890 -8175880 -7939320
41918 -7939320 -6012359 -5738738 -10120058 -12444030 -5047019 6603711 10107573 4581670
41910 4581670 538605 1475239 -55677 -5089301 -3184460 7561158 11661473 341766
41902 341766 -10081120 -1914658 13158814 9730159 -11086052 -22838304 -15227438 -6988219
41894 -6988219 -10235855 -9738901 6100864 17847189 3758734 -19329858 -13599190 24772373
41886 24772373 55610399 45120553 5055605 -27697665 -34408637 -25262564 -17514931
41879a7514931P70301p24747M208048Q461638M905755l908079o028094M248666
41871e581443J4992923J0129101p752900j8744474j0693161O928375J6961674
41864F240095J3577440L172213o186349j0341391q703679l544756K564665J0247227
41856G025465J9726324K3215973J0400326j3228484k4397091j0237719R442934
41849B1947728M977068k0752096l3281960j4847076R928016J0726307m674453
41842b5976466o387970Q952144J4969801R97444r610490J799506J7951157J3200372
41834A5895498o115845j3742593n303686p74275p426129p612310R298778K5320555
41826I539993J8149259o786222k3153266j5794708N212807J8530925J1477576
$$ plain form
41879 -17514931 -16744630 -17469377 -13261329 -4799691 106064 -3802015 -9830109 -5581443
41871 -5581443 9411480 19540581 11787681 -6956793 -17649954 -10721579 6240095
41864 6240095 19817535 22989748 16803399 6462008 -2241671 -5786427 -3221762 7025465
41856 7025465 26751789 49967762 60368088 47139604 22742513 12504794 21947728
41849 21947728 26924796 6172700 -27109260 -41956336 -32028320 -21302013 -25976466
41842 -25976466 -32364436 -23412292 -8442491 -7445047 -17055537 -15256031 2695126 15895498
41834 15895498 9779653 -3962940 -9266626 -10040901 -17467030 -25079340 -15780562 9539993
41826 9539993 27689252 20903030 -2250236 -18044944 -12832137 5698788 17176364
41819A7176364j0257460k6230268j8736687P039542K4915955J6670248n526150
41812E051544j4510312k814083R612767M221745j0947446j3427807K287754J7733870
41804b791968J6744050O872980M684547P699838j460379k2202594k8151560m559788
41796b3164874K3574002K1579883o331566k3112835j1153807P220744O655179
41789d733274p670874j4724674p217316O716069J7533425J8434277P710277m022435
41781A2025475k484059P252428M571756j1368227j4416143N363393J8854140L010427
41773B2809190j7597596q837868J4865311J3622638r691650j3531523J1686301
41766A3324803K7758203J2887370o683320p161798l975849j2402995j3165759
$$ plain form
41819 17176364 6918904 -19311364 -38048051 -31008509 -6092554 10577694 5051544
41812 5051544 -9458768 -12272851 -2660084 1561661 -9385785 -22813592 -20525838 -2791968
41804 -2791968 13952082 20825062 25509609 33209447 31749068 9546474 -18605086 -23164874
41796 -23164874 409128 21989011 15657445 -7455390 -18609197 -11388453 -4733274
41789 -4733274 -12404148 -27128822 -34346138 -27630069 -10096644 8337633 16047910 12025475
41781 12025475 9541416 16793844 21365600 9997373 -4418770 944623 19798763 22809190
41773 22809190 5211594 -3626274 11239037 24861675 15170025 1638502 13324803
41766 13324803 41083006 53970376 47287056 40125258 36149409 23746414 10580655
41759A0580655Q715894K5974305J0154047j6970302j7135068o9836n403908l1292480
41751a5446693l3562162J276643L1612588K4048785m46297o338836L315889K218646
41743F678563j2021147j6688444j647179J6991724K0915420J0250313k414898
41736B2064352p677524n581980j939015j239020k345713j361513K224841M924803
41728I069231L951417k81011m485203k744024Q766844K2522965K1849144Q18534
41720E9467897k3960533l1659832k1792447q959490K84158R326765J4463246N695161
41712B864925j3189009k2815824j2276396P718845J9759811J6732466K594803
41705A389621j1350881j0605882P861867K4899513J9124799k379273j2244423
$$ plain form
41759 10580655 19296549 45270854 55424901 38454599 21319531 21249695 15845787 -15446693
41751 -15446693 -49008855 -47732212 -16119624 7929161 7482864 1144028 4459917 6678563
41743 6678563 -5342584 -22031028 -23678207 -6686483 14228937 24479250 22064352
41736 22064352 14386828 8804848 6865833 5626813 3281100 1919587 4144428 9069231
41728 9069231 13020648 12739637 8254434 5510410 14277254 36800219 58649363 59467897
41720 59467897 35507364 3847532 -17944915 -26904405 -26620247 -17293482 -2830236 2864925
41712 2864925 -10324084 -33139908 -45416304 -37697459 -17937648 -1205182 1389621
41705 1389621 -9961260 -20567142 -12705275 12194238 31319037 28939764 16695341
41698A6695341k603495O288447J899939k064271N833105J2807162N416557n978624
41690C8294161o047575m98754k510971p687490m384656K340993q27628j1232950
41682G445130j5151231j0534798n571049n75537R253137J7629523J2943177j954294
41674A3484058j1989333r478868J749425J5744886K3863115J3981813j2082093
41667C5273003k9757647k0810418k040665j217931j3225280r475758J3350185
41660b7904511K6978242J6675676O71875l402077j588458j729652L481882J6239442
41652B9422419K0384481N609454j4122856k1272586j6157995n576793R335494
41645G621618K0398406J0811177j6036248k9358020j3825998L604869m267686
$$ plain form
41698 16695341 14091846 20380293 22280232 20215961 26049066 38856228 44272785 38294161
41690 38294161 32246586 31747832 29236861 21549371 17164715 19505708 18678080 7445130
41682 7445130 -7706101 -18240899 -23811948 -24387485 -15134348 2495175 15438352 13484058
41674 13484058 1494725 -7984143 -6234718 9510168 33373283 47355096 35273003
41667 35273003 5515356 -15295062 -17335727 -18553658 -31778938 -41254696 -27904511
41660 -27904511 -926269 15749407 16421282 13019205 11430747 9701095 13182977 29422419
41652 29422419 49806900 55416354 41293498 20020912 3862917 -1713876 7621618
41645 7621618 28020024 38831201 22794953 -6563067 -20389065 -16784196 -21051882
41638b1051882j9059417p200426K1617535K8031249P585803k583640J3956782
41631B1296004K6073273O474601k4247067k8655167m891335J6314901J4091167
41624B6456377m000213j8937308j9594261q370930K242334J814033m697319l066775
41616b8154062P807012J2370272L371010n023755j71178P755383L179306q012896
41608f878908q309320J671578L736736q856736k1241672j8264870j801627J5569854
41600d4374965K2290680J2660385p348101j8822536q592533R992898J1241762
41593b2952410n584788j3026222K975248J9939201J3279185m707694m192904J4426480
41585A56096K0343569J75133k0848290j5814720O073939J4865289J050876j6499050
$$ plain form
41638 -21051882 -40111299 -47311725 -25694190 2337059 9922862 7339222 21296004
41631 21296004 47369277 53843878 29596811 941644 -3949691 12365210 26456377
41624 26456377 22456164 3518856 -16075405 -24446335 -22204001 -20389968 -25087287 -28154062
41616 -28154062 -20347050 -7976778 -4605768 -9629523 -9800701 -2045318 1133988 -6878908
41608 -6878908 -15188228 -13516650 -9779914 -18636650 -39878322 -58143192 -59944819 -44374965
41600 -44374965 -22084285 -9423900 -16772001 -35594537 -44187070 -34194172 -22952410
41593 -22952410 -28537198 -41563420 -38588172 -18648971 -5369786 -10077480 -14270384 156096
41585 156096 20499665 20674798 -173492 -15988212 -9914273 4951016 6001892 -10497158
41577a0497158j9471319r896776J510125J2335535K4446432L0954461K0242010
41570D9623310n650033k6499854k4250457l405028J5134445J7606378P904338
41563C0463099l046779r218159j0078892q205466q737680j3413915j3731486j31482
41555c6100760J9533601K3722285N828277j3942249j4787251j173116Q828218
41548h090995Q735184L321060m899042j2256354q255444P781914J5522218J053727
41540B912268j5896442r296274R080045P205986j1550599j1919702J1568089K2261460
41532D364831L907702j1210975l51813Q968279q582672k4207016k476118L1098875
41524A511093K5782551j0591434k3683198j520612J0700803q707092k2795822
$$ plain form
41577 -10497158 -29968477 -39865253 -38355128 -26019593 -1573161 29381300 49623310
41570 49623310 43973277 17473423 -6777034 -10182062 4952383 22558761 30463099
41563 30463099 27416320 18198161 8119269 -86197 -8823877 -22237792 -35969278 -36100760
41555 -36100760 -16567159 7155126 12983403 -958846 -15746097 -16919213 -8090995
41548 -8090995 644189 3965249 -933793 -13190147 -21445591 -13663677 1858541 2912268
41540 2912268 -12984174 -22280448 -13200403 -5994417 -17545016 -29464718 -17896629 4364831
41532 4364831 8272533 -2938442 -3290255 5678024 -2904648 -27111664 -29587782 1511093
41524 1511093 27293644 16702210 -6980988 -8501600 2199203 -6507889 -29303711
41517b9303711k480512K4434121K2013253K092851m653225p98449o328681j4993990
41509a0018343p242257Q591448P856752o023455p009616O592834Q586630p557965
41501f223972j4166059M674453K3794315J3827003j4909464k8487134j5800092
41494c7290950L357053R749719M051361l464227n389620K203757J7586397K8531911
41486A9335401K1299413j155322j9502850k0937837j2540021o715547l516461
41479b3733224L735393J3307774J7031994J3378268P982241L682260j37331j093383
41471C4153992K391939L393093m799360j4014419j0162497L054230O713261l682102
41463A7048137r960016l66675J1724552J0083023j79456n497697o255416r220971
$$ plain form
41517 -29303711 -31784223 -7350102 14663151 16756002 12102777 11304328 4975647 -10018343
41509 -10018343 -17260600 -8669152 -812400 -6835855 -13845471 -7252637 1333993 -6223972
41501 -6223972 -20390031 -15715578 8078737 21905740 6996276 -21490858 -37290950
41494 -37290950 -33933897 -24184178 -20132817 -23597044 -28986664 -26782907 -9196510 19335401
41486 19335401 40634814 39479492 19976642 -961195 -13501216 -20216763 -23733224
41479 -23733224 -19997831 -6690057 10341937 23720205 31702446 35384706 35247375 34153992
41471 34153992 36545931 39939024 35139664 21125245 10962748 14016978 20730239 17048137
41463 17048137 7088121 6721446 18445998 28529021 28349565 22851868 16596452 7375481
41455G375481j0013537k139299N824872J468551r941657j3695580q902943m809305
41447c4833417p02865R411005J7410966R790461o326404r948458L25018M062230
41439a0811464o009684j1532532L08212J5210786J3928360o71350j1586371j0765014
41431b1929057l187243L577501N735746M977674O873083J1755554J0130753k628503
41423A5305508j2997071o897172N140918K017756j2221028j3094268L042998J1926591
41415g775768K169175o811452M46146J1138631J0357433N276338M964826P05812
41407B0471141j2709554j8682247m861957J2333372J2735834L346917K27155j303692
41399A1556969j1013429j6528869l455276J2048784N596985j1479270q412167
$$ plain form
41455 7375481 -2638056 -4777355 1047517 2516068 -7425589 -21121169 -30024112 -34833417
41447 -34833417 -35536282 -26125277 -8714311 1076150 -5250254 -15198712 -14873694 -10811464
41439 -10811464 -16821148 -28353680 -28045468 -12834682 1093678 422328 -11164043 -21929057
41431 -21929057 -25116300 -21538799 -15803053 -10825379 -3952296 7803258 17934011 15305508
41423 15305508 2308437 -4588735 552183 2569939 -9651089 -22745357 -19702359 -7775768
41415 -7775768 -5606593 -12418045 -11971899 -833268 9524165 14800503 19765329 20471141
41407 20471141 7761587 -10920660 -15782617 -3449245 9286589 12633506 12860661 11556969
41399 11556969 543540 -15985329 -19440605 -7391821 -1794836 -13274106 -21686273
41392b1686273J0949321J2086849j0097502j8379883O198348L0081224J7498712
41385B6650796j4918856k4233472l753159J2676691L056219j5359238j6224643
41378c2105662J40905J3635488J4579766J1098199R077562J452407j4756911k3674739
41370b0552985r368457J5713341K1622039K832555j2453601m455407Q808956K221892
41362D368333j5097412j4963551M079484J5204203N911695n494366j674836R312221
41354A645771J2066278P667361N583541M599902k853811j3575511j5096023m365237
41346d327729N738364L055527o790777p460393M932919J5260216J1232634J792368
41338B3433129J297590L647899p452294k4872722k1140826P544577K7190042J2220374
$$ plain form
41392 -21686273 -10736952 1349897 -8747605 -27127488 -20929140 9152084 26650796
41385 26650796 11731940 -12501532 -16254691 -3578000 -521781 -15881019 -32105662
41378 -32105662 -31964757 -18329269 -3749503 7348696 16426258 17878665 3121754 -20552985
41370 -20552985 -29921442 -14208101 7413938 10246493 -2207108 -6662515 2146441 4368333
41362 4368333 -10729079 -25692630 -21613146 -6408943 -497248 -5991614 -7666450 1645771
41354 1645771 13712049 21379410 26962951 31562853 28709042 15133531 37508 -4327729
41346 -4327729 1410635 4466162 -2324615 -9785008 -4852089 10408127 21640761 23433129
41338 23433129 24730719 28378618 20926324 -3946398 -25087224 -17542647 9647395 21867769
41330B1867769j6848041k3288864l608269J6718892K2497578J8142058Q226200
41323D3707323n361416j3425565r979347o259197j2668956j6649721l479737J2068750
41315a2047866N607618j3776890j5327798K650471J1769604L772281J237689J1397679
41307d717212J1157030p235788j5886777J391495J7460908N238496j7685301j9083848
41299b9360997k256032P168870N517249P231808J0044242M1776j4623640r989490
41291b6226214J2869134K4421387J0346099p757593n596706J0398265J5856126
41284C4310498J934208j5832345j6850824K269231K2231912J8920741q117044
41277C8866377l0137748k2222981L767202J4831038K620461p305435L180038J6467927
$$ plain form
41330 21867769 5019728 -18269136 -21877405 -5158513 17339065 35481123 43707323
41323 43707323 38345907 24920342 14940995 8681798 -3987158 -20636879 -24116616 -12047866
41315 -12047866 -6440248 -20217138 -35544936 -32894465 -21124861 -17352580 -16114891 -4717212
41307 -4717212 6439818 -795970 -16682747 -15291252 2169656 7408152 -10277149 -29360997
41299 -29360997 -31617029 -24448159 -18930910 -11699102 -1654860 -1613084 -16236724 -26226214
41291 -26226214 -13357080 11064307 21410406 13652813 8056107 18454372 34310498
41284 34310498 36244706 20412361 3561537 5830768 28062680 46983421 38866377
41277 38866377 8728629 -13494352 -9727150 5103888 7724349 418914 3598952 20066879
41269B0066879P436811j6544100k5984311j2400710K950194M644100L342449J0516458
41261e972230J4645917J947784j4149776r828908R246034J3243311m778021j6579310
41253a2225199m125205J1058144L689045j3502396j0721756J1559651K5589667
41246A1321951J8576044L535242q134613j6924912j8590428n332358J2526592
41239c022482J2340406o384758j7157964m639864J4722494K0138893J3345958
41232B9342683N946637r94779j0326095j6364240j2609381j822187R879049J8115706
41224B1167393J5272509l942206k6683823k9752347j0499045Q325241J1731422
41217a4380856R407931J0478855N900453q911582j7229021o504205Q732972J0075139
$$ plain form
41269 20066879 27503690 10959590 -15024721 -27425431 -24475237 -19831137 -16488688 -5972230
41261 -5972230 8673687 10621471 -3528305 -13357213 -4111179 9132132 4354111 -12225199
41253 -12225199 -16350404 -5292260 -1603215 -15105611 -25827367 -14267716 11321951
41246 11321951 29897995 33433237 25298624 8373712 -10216716 -15549074 -3022482
41239 -3022482 9317924 2933166 -14224798 -18864662 -4142168 15996725 29342683
41232 29342683 35289320 34294541 23968446 7604206 -5005175 -6827362 3051687 21167393
41224 21167393 36439902 32497696 5813873 -23938474 -34437519 -26112278 -14380856
41217 -14380856 -4972925 5505930 11406383 2494801 -14734220 -21238425 -12505453 -2430314
41209b430314L727642M339120P289439J213790o290928j539408P695408L910453
41201A7915202r026401j2748940o308865m498762p703405j125350J4515497J8118894
41193I137870J142494j6161843j1612848J0573147K7543011K4347907O198360
41186E1168098r805871j1697914m016780n74332m702633n252034L268124R316448
41178B7703106K733178q382231j1885177j0181966j0499867r784088n046750m077655
41170b9421450p789850N98041K5363317L6366475R258530k8253928k9823622o20575
41162b4323062J1084441q738768k0567492l61311K0765392R930815j4969266j7753394
41154d4932645J081050J5036597J5032635R840501M72902j3754587j6792222L974533
$$ plain form
41209 -2430314 1297328 5636448 12925887 14139677 7848749 6309341 14004749 17915202
41201 17915202 8888801 -3860139 -10169004 -14667766 -22371171 -23496521 -8981024 9137870
41193 9137870 10280364 -5881479 -17494327 -6921180 20621831 44969738 51168098
41186 51168098 41362227 29664313 25647533 25073201 20370568 15118534 18386658 27703106
41178 27703106 30436284 22054053 10168876 -13090 -10512957 -20297045 -25343795 -29421450
41170 -29421450 -37211300 -36613259 -11249942 25116533 34375063 6121135 -23702487 -24323062
41162 -24323062 -13238621 -21977389 -42544881 -42906192 -22140800 -12209985 -27179251 -44932645
41154 -44932645 -43851595 -28814998 -13782363 -3941862 -3468960 -17223547 -34015769 -30041236
41146c0041236K7624916K2143806o740822k0976859n763044J1519403O140090
41139C906254q506576o612808Q865497J1967446o947668k5994110j8646975J3132814
41131b8836126L8460321L0768885j252345k2219959j1775620J1474215J6259839
41124C2879210l06827j3773003r898288k71714L004969N898411J2892580Q472232
41116C8897570j9234243m7318652l9105499K730393L2172976K0150470o489627
41109a8196612o924059J3426775J6298510n242041j4697335Q658286L4608052
41102B7931576K6964532l760698k1124758j7360187j3876285j6994286r755509
41095b7975615J0556503K1144903J0527452k253037l07199M347896l805350j3008416
$$ plain form
41146 -30041236 -2416320 19727486 12986664 -7990195 -13753239 -2233836 3906254
41139 3906254 -4600322 -11213130 -2347633 9619813 2672145 -23321965 -41968940 -28836126
41131 -28836126 9624195 40393080 39140735 16920776 5145156 16619371 32879210
41124 32879210 32572383 18799380 8901092 8629378 11634347 17532758 30425338 38897570
41116 38897570 19663327 -27655325 -66760824 -64030431 -31857455 -11706985 -18196612
41109 -18196612 -25120671 -11693896 4604614 -637427 -15334762 -6676476 27931576
41102 27931576 54896108 51135410 30010652 12650465 -1225820 -18220106 -27975615
41095 -27975615 -17419112 3725791 14253243 12000206 11693007 16040903 12235553 -772863
41087g72863l888684J4383523J5536528k034050j2313679k228396R612433L412932
41079B1707744j2228810j5191025k281633Q546268M092018r044304j6208744j2169422
41071c2777908l060204L733229O609586Q097800J0165777J2156494J1568788O314674
41063B2808236k175934q048511o193165N89691L308286j927622q353256p829685
41055g821960j134411O010463J1744579J5048595R314254q860440k6445237k4145562
41047b6289719k735080J4419517J1000551k801312q692227n673054m282161m563995
41039b9617480L526380J9396024K6662308J3573192j0039653k2020449j1531517
41032a0051195R384128J8345399P396074p136330n048087R721570J3292704l475839
$$ plain form
41087 -772863 -4661547 9721976 25258504 23224454 10910775 8682379 18294812 21707744
41079 21707744 9478934 -5712091 -7993724 552544 4644562 -4399742 -20608486 -32777908
41071 -32777908 -35838112 -32104883 -25495297 -17397497 -7231720 4924774 16493562 22808236
41063 22808236 20632302 12583791 6390626 6980317 10288603 8360981 7725 -7821960
41055 -7821960 -8956371 -2945908 8798671 23847266 33161520 24301080 -2144157 -26289719
41047 -26289719 -29024799 -14605282 -3604731 -6406043 -15098270 -20771324 -25053485 -29617480
41039 -29617480 -26091100 -6695076 19967232 33540424 23500771 1480322 -10051195
41032 -10051195 -667067 17678332 25074406 17938076 12889989 22611559 35904263 32428424
41024C2428424k0180833j6616121j960456K677269j373035L303673J5588183J5035714
41016B8902818j530180r773384M718273K1815601J6425255m742543j5831949r887820
41008C0096071l427705q001756j6129245j6081987p016116K727315M829453n87925
41000a3591895k085722J0182871K4513498J5653585j6191732l3285368q814896
40993b3619659K8846576L0600985m486177l0630870k3193245m953371K162107
40986b5273654R001526K3909501K4896858k698463l0741164k5283412K258983
40979b3929825J5660700Q683248L136154M963612Q83806p542995m760885N144151
40971B237966K275907r838367n316417J7991088K9058734J0521777j7497327l1831585
$$ plain form
41024 32428424 12247591 -4368530 -6328986 -3651717 -5024752 -1721079 13867104 28902818
41016 28902818 27372638 17599254 22317527 44133128 60558383 55815840 39983891 30096071
41008 30096071 26668366 18666610 2537365 -13544622 -20560738 -17833423 -13003970 -13591895
41000 -13591895 -15677617 -5494746 19018752 34672337 18480605 -14804763 -23619659
40993 -23619659 5226917 35827902 31341725 710855 -22482390 -27435761 -25273654
40986 -25273654 -16272128 7637373 32534231 29835768 -905396 -26188808 -23929825
40979 -23929825 -8269125 414123 3550277 8513889 9397695 1854700 -2906185 2237966
40971 2237966 4513873 -5324494 -10640911 7350177 36408911 46930688 29433361 -2398224
40963b398224l2997636k4850078p93265L1353893M1703671J8668610q568801j0954502
40955A1163668J075717L200052j940474J368494P061369r28568j4929693j3782888
40947g712323M15756N561565l987580j1112482n230740N893113J4244986K0607962
40939A8680257K3887307J8912281O705146o158058j6952538k4075838k0695930
40932C02627n235156P888526L785426j1002129j6626695n803324J0895643J9901299
40924D106217J4101848l774365j7364794r685005R229913P330915k0905167l5662404
40916e2622842p017717L5161155M1136443J1805890j1159058j1750609j0664309
40909e111047j6121436j1490604M858464J1808515N506744O510625J7976473J6656519
$$ plain form
40963 -2398224 -35395860 -60245938 -61039203 -29685310 12018361 30686971 22118170 11163668
40955 11163668 12239385 15439437 13498963 14867457 21928826 21000258 6070565 -7712323
40947 -7712323 -7296567 -1735002 -5722582 -16835064 -22065804 -16172691 -1927705 18680257
40939 18680257 42567564 61479845 68184991 62026933 45074395 20998557 302627
40932 302627 -4932529 2955997 6741423 -4260706 -20887401 -26690725 -15795082 4106217
40924 4106217 18208065 14433700 -2931094 -12616099 -3386186 3944729 -16960438 -52622842
40916 -52622842 -59640559 -24479404 16657039 28462929 17303871 5553262 -5111047
40909 -5111047 -21232483 -32723087 -27864623 -16056108 -10549364 -4038739 13937734 30594253
40901C0594253l311686j7046333j2253972o666163p968100K094132K4723399K7793359
40893C7958889j655412k7939426j9763171L073406Q547041L834089J0519328J8577060
40885C3151804P044173j2373805j4404794m819624n184555r393293K124756J8044565
40877A4189227J0834784j2119802j7211176j358616M849975p663909j3082263
40870b1561780Q6287R851312M093814K203751J4351321J6652132p116247k9797882
40862a1237292j7845956J6991892L4192652K0034744k216649j1060373r020701
40855A9838317o512117n718250n032463m099478j07775R230783J6173070Q455116
40847C2227203j0719100j9601228m035484K0680064K5733268M434353j9897279
$$ plain form
40901 30594253 27282567 10236234 -2017738 -8683901 -16652001 -14557869 10165530 37958889
40893 37958889 36303477 8364051 -11399120 -8325714 221327 4055416 14574744 33151804
40885 33151804 40195977 27822172 13417378 8597754 3413199 -5980094 -3855338 14189227
40877 14189227 25024011 12904209 -4306967 -5665583 -815608 -8479517 -21561780
40870 -21561780 -21475493 -11624181 -7530367 -5326616 9024705 25676837 18560590 -11237292
40862 -11237292 -29083248 -12091356 22101296 42136040 39919391 28859018 19838317
40855 19838317 13326200 7607950 2575487 -1523991 -1631766 7599017 23772087 32227203
40847 32227203 21508103 1906875 -2128609 18551455 44284723 48719076 28821797
40840B8821797k3844446j0265583J826440L714350J934890K546455L575948K065829
40832A0375680k250503r604301j6903264j4760759M88780J5768895J6751616R701158
40824I567302R492706J1134951j512262k0791621k0914245k768969L317185q680461
40816b1155414m675746K8331109M6307258J1422843m1385046m8696688q826765
40809c8678449K3013708J8992566N225890L924612J533166j1983791j7126000
40802a5098298n41603J6534894R528768j2777571k3415057j2427164Q553970K2708167
40794f933894J8295717l016315k0711606j4169470Q385873J8559837Q740465K1100
40786I171707L044142K80946j8413022l1074454j6503148J0296267K0409098J2747416
$$ plain form
40840 28821797 4977351 -5288232 -3461792 252558 2187448 4733903 8309851 10375680
40832 10375680 8125177 -1479124 -18382388 -33143147 -32654367 -16885472 -133856 9567302
40824 9567302 19060008 30194959 28682697 7891076 -13023169 -15792138 -12474953 -21155414
40816 -21155414 -25831160 2499949 48807207 60230050 18845004 -29851684 -38678449
40809 -38678449 -15664741 3327825 8553715 12478327 14011493 2027702 -15098298
40802 -15098298 -15639901 894993 10423761 -2353810 -25768867 -38196031 -29642061 -6933894
40794 -6933894 11361823 8345508 -12366098 -26535568 -18149695 410142 9150607 9171707
40786 9171707 12215849 12496795 -5916227 -36990681 -53493829 -43197562 -22788464 -10041048
40778a0041048Q245935J3098522J3054239O67971j3055319j5755968q343479l91619
40770a2520766J092614k281078k431624M610468J1211414Q098881j133473o674529
40762b8093r042002j2562921q260519J2148505K8483934J1331136k6925148l8185766
40754d3040874q451875J8694361J0227210o275738N416709K6439657J7704903
40747B0714353r528326j2571774Q305232J1457135j2909559k6944962j1090685
40740c2568586N832718K31285q135069L139518J8119713J2882771j705628l54431
40732b557709J2971308J4018787l66041r623240m175651K572692j565304j0348373
40724I26469j0621045L27667J2298093J1818793m434966k2184612k0947651J764980
$$ plain form
40778 -10041048 -1795113 11303409 24357648 25025619 11970300 -3785668 -12129147 -12520766
40770 -12520766 -11428152 -13709230 -16140854 -11530386 -318972 7779909 6646436 -28093
40762 -28093 -9070095 -21633016 -29893535 -17745030 10738904 22070040 -4855108 -43040874
40754 -43040874 -51492749 -32798388 -22571178 -28846916 -23430207 3009450 20714353
40747 20714353 11186027 -1385747 6919485 18376620 5467061 -21477901 -32568586
40740 -32568586 -26735868 -26504583 -34639652 -31500134 -13380421 -497650 -2203278 -2557709
40732 -2557709 10413599 24432386 24066345 14443105 10267454 12840146 11274842 926469
40724 926469 -9694576 -9366909 2931184 14749977 10315011 -11869601 -32817252 -31052272
40716c1052272K4247379K5363077Q866247n011177o044432j965218k835719p347343
40708D220542o530472L562835J5231936J6173438M488722o894108o281975O38381
40700B4609299M39621o228192p194284k094296m055300j3531103j1627703Q471926
40692a1210032K2922319R203130j7038243k0514494M070072K4416035J4862530
40685B6711317j1298968k1656244m402343K0872645K6823190O843505j8959974
40678B4933128k5238329q914909Q785022R776705K74769k912473J395072P266
40670H106251j0654195j7596122j1047907J724975Q141814O336471L075446K771627
40662i141640N207163R195851J2077104Q943933j326210j1097323j1345064m142760
$$ plain form
40716 -31052272 -6804893 18558184 27424431 22413254 16368822 14403604 11567885 4220542
40708 4220542 -2309930 1252905 16484841 32658279 37147001 30252893 23970918 24609299
40700 24609299 25048920 18820728 11626444 9532148 5476848 -8054255 -19681958 -11210032
40692 -11210032 11712287 20915417 3877174 -16637320 -12567248 11848787 26711317
40685 26711317 15412349 -6243895 -10646238 10226407 37049597 43893102 24933128
40678 24933128 -305201 -9220110 -435088 9341617 9616386 6703913 8098985 8106251
40670 8106251 -2547944 -20144066 -31191973 -29466998 -21325184 -14988713 -11913267 -9141640
40662 -9141640 -3934477 5261374 17338478 26282411 24956201 13858878 2513814 -1628946
40654a628946j546379r102449j5966367q399086Q982493J5491825J840378j4339233
40646b4667764j0072917J2212456K8380665K4213236Q664749m905551j4318913
40639A9505961k0490748j9788974j3282508r995539j1210734m663399J4841934
40632d5084007L2618268L4528688K6297471J7939331M759104j6575764k8685877
40625B5797214j6407367K435326m48530j7630828j6613726M941976J3272769m372397
40617i025563j5862362L610647K9417631K5095386k730316j7985364q240291O154647
40609A0434415Q088778J433805n111553r444051j0229718n931385j39147L225718
40601g673138O371529R722422O085398n371044j0627149j875132N324562m124807
$$ plain form
40654 -1628946 -3175325 -12277774 -28244141 -36643227 -27660734 -12168909 -10328531 -24667764
40646 -24667764 -34740681 -22528225 5852440 30065676 38730425 33824874 19505961
40639 19505961 -984787 -20773761 -34056269 -44051808 -55262542 -59925941 -45084007
40632 -45084007 -12465739 22062949 48360420 66299751 71058855 54483091 25797214
40625 25797214 9389847 11825173 11376643 -6254185 -22867911 -17925935 -4653166 -9025563
40617 -9025563 -24887925 -21277278 8140353 33235739 30505423 12520059 4279768 10434415
40609 10434415 18523193 19956998 14845445 5401394 -4828324 -10759709 -10898856 -7673138
40601 -7673138 -1301609 8420813 14506211 9135167 -1491982 -3367114 1957448 -2167359
40593b167359j5984332p011740J4764139J9926754M230995o754801j494633K274414
40585G783437n570333q292522M658005J4926082O468914n513194j449053P602149
40577B0613485L02492j4916509j2097498P366304J4578468j166051j6174535r576406
40569a1070250P972881J4919123Q940233J941663j380036m612419p415478o175608
40561C120109k759869j429213K64469P586316J7008343J7560516M651301j3530011
40553C2471961k3836413j8545746m35129J7054600J8200422J697696j3384257
40546A3223134q379848R384140J4570367p20856j4972262q691678O914443P056246
40538A8383686j0830881k5702903k2784367p968458O188878J2803318Q896696
$$ plain form
40593 -2167359 -18151691 -25163431 -10399292 9527462 13758457 7003656 5509023 7783437
40585 7783437 2213104 -6079418 -1421413 13504669 19973583 14460389 13011336 20613485
40577 20613485 20915977 5999468 -6098030 1268274 15846742 14680691 -1493844 -11070250
40569 -11070250 -3097369 11821754 20761987 22703650 21323614 16711195 9295717 3120109
40561 3120109 360240 -1068973 -804504 6781812 23790155 41350671 46001972 32471961
40553 32471961 8635548 -9910198 -10345327 6709273 24909695 26607391 13223134
40546 13223134 4843286 14227426 28797793 28076937 13104675 4412997 11327440 18383686
40538 18383686 7552805 -18150098 -40934465 -48902923 -42714045 -29910727 -21014031
40531b1014031k731342q654160J797439J6594447J2985748p000529j4691623L043121
40523a9670930K2264254J7190550l368188j3887424r542024l669568q78285L479911
40515h081704N848778J46396n132821J734400J2255518Q716301n487509j0906395
40507i07036m932119l522227r727263q028810N111993J1735993K229789r021835
40499a7061515q285382j590502J643165M191410Q564317P269893k204069q693549
40491a6166232m694998K479940N506423O558851M614970o901410k0590965j5476668
40483d4670089J0246333K8993719K1565750L438396l369980j907153l817092m192532
40475F287352K952373N087940o088023j2093067K170459J4753024j117686k6409786
$$ plain form
40531 -21014031 -23745373 -32399533 -30602094 -14007647 -1021899 -8022428 -22714051 -19670930
40523 -19670930 2593324 19783874 16415686 2528262 -7013762 -10683330 -11561615 -8081704
40515 -8081704 -2232926 -2086530 -7219351 -5484951 6770567 15486868 9999359 -907036
40507 -907036 -5839155 -9361382 -19088645 -27117455 -22005462 -10269469 -8039680 -17061515
40499 -17061515 -25346897 -26937399 -25294234 -21102824 -12538507 -5268614 -7472683 -16166232
40491 -16166232 -20861230 -18381290 -12874867 -6316016 -1701046 -8602456 -29193421 -44670089
40483 -44670089 -34423756 -5430037 16135713 19574109 16204129 14296976 10479884 6287352
40475 6287352 9239725 14327665 8239642 -3853425 -1682966 13070058 11952372 -14457414
40467a4457414j9646451J6118481L3709357J1936503j6317514j6816228J636849
40460c836417J1679330O713712k703371r410953r514500Q33018J4652884J5734979
40452B4148682K069919q236458m249705K024321j849471q276660n333255K631375
40444B928748M854130K058931O25531k27853k607508j443378N827929J0343878
40436B2360408M441832m983082o592253n95680M790773N334242J209861o098102
40428A9867999j0217170l323896R650565J2156269l15463j0990357o349861M314191
40420A4792277O515958L314251M555472O408065L85544p307430n336482J303118
40412B4630773o61648r056909j0909811o430150p037198j1765023p932515M098346
$$ plain form
40467 -14457414 -34103865 -17985384 15723973 27660476 11342962 -5473266 -3836417
40460 -3836417 7842913 14556625 11853254 2442301 -7072199 -6239181 8413703 24148682
40452 24148682 26218601 17982143 13732438 15756759 13907288 5630628 297373 2928748
40444 2928748 7782878 9841809 10467340 10239487 7631979 6188601 12016530 22360408
40436 22360408 26802240 21819158 15226905 14631225 19421998 24756240 25966101 19867999
40428 19867999 9650829 6326933 15977498 28133767 27818304 16827947 10478086 14792277
40420 14792277 21308235 24622486 29177958 35586023 35971567 28664137 23327655 24630773
40412 24630773 23969125 14912216 4002405 -2427745 -9464943 -21229966 -29162481 -25064135
40404b5064135R301119M416450L587487J1340225J2554999J54964q435002J597883
40396I453990J6108165J2478318n162372j2787960l002400P089780N216643N56076
40388B9950240L706712P048840j425813j5143397j6674550n414388K06735p569167
40380e314788j1274076M025238K2354655J7089914o765355j6406763k30661J4460575
40372A7938739N040980j1629991r605852L486691L907132m496476j65456J1496422
40364A5972189M547844j6093055j4279447J4806702K6731803l250781l4075963
40357e640708j8187339K4207190L5026616L903979k3856536j9000607j935012
40350e482417P60928o525918p781894j052510R099772K0580597K4308175Q970518
$$ plain form
40404 -25064135 -15763016 -11346566 -7759079 3581146 16136145 16291109 7856107 9453990
40396 9453990 25562155 38040473 32878101 20090141 17087741 24177521 29394164 29950240
40388 29950240 33656952 40705792 39279979 24136582 7462032 2047644 2254379 -5314788
40380 -5314788 -16588864 -12563626 9791029 26880943 20115588 3708825 3478164 17938739
40372 17938739 22979719 11349728 1743876 5230567 9137699 4641223 4475767 15972189
40364 15972189 20520033 4426978 -9852469 4954233 31686036 28435255 -5640708
40357 -5640708 -23828047 379143 35405759 39309738 15453202 -3547405 -5482417
40350 -5482417 -4721489 -11247407 -19029301 -20081811 -10982039 9598558 33906733 42877251
40342D2877251j5115627k1210316n827669K719515j0835047k2591643q296266
40335c8279802J6200493J9355506J431593r959969j686212J2697046J7384561
40328A7143216J0082546l620927j5274267j6224276p458964q31138j110044J760716
40320a5533138J1800584J4674586J925950r808734m086841P397283N763630k223621
40312I909699O8341N252549l635055j5768109o009307J9419432K8007268J1571947
40304D8816765m539374n787942n558847j1344355r849915K845282R009596K89277
40296B3880487q380664p833469q266276j2321193n933008J0550917J4757739J548222
40288H002755m131016P623173J0100399j1661801k7758909j1610949J1994866
$$ plain form
40342 42877251 27761624 6551308 723639 3443154 -7391893 -29983536 -38279802
40335 -38279802 -22079309 -2723803 -1292210 -11252179 -12938391 -241345 17143216
40328 17143216 27225762 23604835 8330568 -7893708 -15352672 -16183810 -17293854 -15533138
40320 -15533138 -3732554 10942032 12867982 3059248 -1027593 6369690 12133320 9909699
40312 9909699 9978040 15230589 11595534 -4172575 -10181882 9237550 37244818 48816765
40304 48816765 44277391 38489449 32930602 21586247 11736332 14581614 23591210 23880487
40296 23880487 15499823 7666354 -599922 -12921115 -18854123 -8303206 6454533 8002755
40288 8002755 3871739 11494912 21595311 9933510 -17825399 -29436348 -17441482
40281a7441482P261698j1346649m675120K2034283K5740816l662996k6513601
40274h603051j3906148J3673607K1500691O131551r346478p826483O523041J6484861
40266B4631591R534657q171778j7457210r714397L418077R278890R419826P335471
40258B8275127j111506j2209731r463643Q575744J6657870N93343j5124563m353489
40250A1839152J6933024J6624186j255058p627227M76125p7958j3105738j7529158
40242F277348p112117J494498L417454J2736159K8726860K8220080K400147k5483045
40234E0677384k9814861j0276103J4976533K5549071R173531k3537178l8487413
40227a739036j5336024K0640686K9736635J2011460j261388j021213n823203j7808320
$$ plain form
40281 -17441482 -10179784 -21526433 -26201553 -4167270 21573546 17910550 -8603051
40274 -8603051 -22509199 -8835592 12665099 18796650 9450172 1623689 8146730 24631591
40266 24631591 34166248 25994470 8537260 -1177137 2240940 11519830 20939656 28275127
40258 28275127 27163621 14953890 5490247 14065991 30723861 31317204 16192641 11839152
40250 11839152 28772176 45396362 44141304 36514077 36990202 36912244 23806506 6277348
40242 6277348 -834769 659729 4077183 16813342 45540202 73760282 76160429 50677384
40234 50677384 20862523 10586420 25562953 51112024 60285555 36748377 -1739036
40227 -1739036 -17075060 3565626 33302261 45313721 44052333 43031120 37207917 19399597
40219A9399597j6834237j852144M081811l457727l606932O826497O679634m632427
40211F604072j380076J6976095J7198229p163670j7296574L998656J7894649m639481
40203C2191900l0733077k0929630N841372J0529353J457657R982949K5558508
40196C3899032J2917784k0357679k9719912l907325K0349708J7050973J333223
40189C1565804n599530m522352j406165O266062J5359562J3783992P60734r468702
40181D6739405j0416624j0995530j5247874j3294408J0382J2866996J1672109
40174B1334456j512071j2902761j2149383m80418J1835853J5160308R542166K374175
40166C3202325k039042m077538k000714M917665P941120o08659r361828j523374
$$ plain form
40219 19399597 2565360 713216 4795027 1337300 -2269632 4556865 11236499 6604072
40211 6604072 5223996 22200091 39398320 32234650 14938076 18936732 36831381 32191900
40203 32191900 1458823 -19470807 -13629435 -3100082 -1642425 8340524 33899032
40196 33899032 46816816 26459137 -3260775 -7168100 13181608 30232581 31565804
40189 31565804 25966274 21443922 20037757 26303819 41663381 55447373 56208107 46739405
40181 46739405 36322781 25327251 10079377 -3215031 -3204649 9662347 21334456
40174 21334456 19822385 6919624 -5229759 -5710177 6125676 21285984 30828150 33202325
40166 33202325 31163283 27085745 25085031 30002696 37943816 37335157 27973329 26449955
40158B6449955J2812388N756008k0715423k8822877j528368K7897211K5242750
40151D7091644L692358n345368k120665n636234j3257235j0109180k866134p614301
40143C834885j5659037o762437J2501818J7738304O743351k191783m519316q627389
40135C058396q200121Q634300K7198710K0672507m646012j5712892n174720J259003
40127B7089171n712556l024928J8726965L1311117J1560443k0862673l0941959
40120B8145580j3636523P836342J4690861P469428k103162l371151K770158L233363
40112D5034896q697379j8541684j0027898O574892Q049770l571231m303137R302628
40104B3820857J2255264o068245k1570957j2793251O799631J1924567J244985
$$ plain form
40158 26449955 39262343 45018351 24302928 -4519949 -6048317 21848894 47091644
40151 47091644 50784002 45438634 43317969 37681735 24424500 14315320 11449186 3834885
40143 3834885 -11824152 -18586589 -6084771 11653533 18396884 16205101 11685785 3058396
40135 3058396 -5141725 3492575 30691285 51363792 46717780 31004888 25830168 27089171
40127 27089171 21376615 18351687 37078652 68389769 79950212 59087539 28145580
40120 28145580 14509057 22345399 37036260 44505688 42402526 39031375 41801533 45034896
40112 45034896 36337517 17795833 7767935 14342827 22392597 18821366 14518229 23820857
40104 23820857 36076121 30007876 8436919 -4356332 2443299 14367866 15612851
40097A5612851p873677n457410N842001J9250025K4848023J4116323n439436j2896278
40089D8002422j868374P626514k601611k1611574k4632589o544731J3878059J7879934
40081C0128050M029684j4387885k1190858j0242488P453153J3330863K005567
40074A1126086j1787651j0097652Q237214K6371965K5659285M047763j9483509
40067C4073501k3322622q499590L552191K522113K671128J4007255J9806020M054785
40059D8864781j5873193j2992706M521752N861639j1177603j8278474o293008
40052e366812J738121m851377m680513J4885740L0645087J9079072o740007j8516011
40044B6193300j1771228k737455j350994n623248j1166428j2286365m220583P069495
$$ plain form
40097 15612851 7739174 2281764 8123765 27373790 52221813 66338136 60898700 48002422
40089 48002422 46134048 53760562 51158951 29547377 4914788 -1629943 12248116 30128050
40081 30128050 34157734 19769849 -1421009 -11663497 -4210344 9120519 11126086
40074 11126086 -661565 -10759217 -2522003 23849962 49509247 53557010 34073501
40067 34073501 10750879 2251289 5803480 8325593 10996721 25003976 44809996 48864781
40059 48864781 32991588 19998882 24520634 30382273 19204670 926196 -5366812
40052 -5366812 -3628691 -8480068 -13160581 1725159 32370246 51449318 44709311 26193300
40044 26193300 14422072 11684617 10333623 4710375 -6456053 -18742418 -22963001 -15893506
40036a5893506J0609138J0460626K0776045L6302135L3670931J0960211l723475
40029A03162105K532622N687616j0685929k1901763l771692K0670502J4347098
40022A10040559j4038942k5026919j1333687k730439j1419497j5091281q68991
40015B9530803J1332351L056064j4103944j9683271j1901460N22454J5153169
40008A3906166K9051695L0267906J2522732j0637200j9945840j3020212l015554
40001C9129693l36672m559334r592006q391624L469800K0624620K7225554J2386071
39993G9956102j3899227k8293777j9636154m43490J0252081Q879704N413838M677957
39985D6907034J433050m870095l918614Q261656J6404191M521389j7401411k1786745
$$ plain form
40036 -15893506 -5284368 5176258 25952303 62254438 95925369 106885580 103162105
40029 103162105 105694727 111382343 100696414 78794651 75022959 95693461 110040559
40022 110040559 96001617 70974698 59641011 56910572 45491075 30399794 29530803
40015 29530803 40863154 43919218 29815274 10132003 -1769457 -1247003 13906166
40008 13906166 42957861 73225767 85748499 75111299 55165459 42145247 39129693
40001 39129693 38793021 34233687 24641681 16250057 19719857 40344477 67570031 79956102
39993 79956102 66056875 37763098 18126944 17683454 27935535 36815239 42229077 46907034
39985 46907034 48340084 43469989 39551375 47813031 64217222 68738611 51337200 29550455
39977B9550455l55613K2797245K2203379K892781r875425n228315L174283J626259
39969F6785049k982929L172191J3754259O058245k2370484l8051446j2056058
39962A4308827L2554062M2114247M745138k9578520j7396764J8492975K5414547
39955I0654512m173363k9737042k5007591o253772K645849O41322k591773l791473
39947B2386669k381453J983902L744056q03200j887959Q790915J7312634O284475
39939E5430039j1917060j1052932M353600O143303o931961o968837J0191118J4530972
39931E3778242l822364j5265622l939933M855629n601958j1344533M123620J3489056
39923C6272137m452777j9340217P04509K8919253K1734768p348771j2244171P166621
$$ plain form
39977 29550455 29194842 51992087 74195466 77088247 67212822 61984507 65158790 66785049
39969 66785049 63802120 66974311 80728570 86786815 64416331 26364885 14308827
39962 14308827 46862889 88977136 93722274 64143754 46746990 65239965 90654512
39955 90654512 86481149 56744107 31736516 25482744 28128593 28769915 26178142 22386669
39947 22386669 20005216 21989118 25733174 24929974 23042015 31832930 49145564 55430039
39939 55430039 43512979 32460047 36813647 42956950 36024989 29056152 39247270 53778242
39931 53778242 49955878 34690256 30750323 35605952 30003994 18659461 22783081 36272137
39923 36272137 31819360 12479143 13183652 42102905 63837673 56488902 44244731 51411352
39915E1411352J0375559j0046535j9315047m144207R870393R633315J1620784
39908E9405614J8948272J1253960r502538j1163782J2770758K4815763L894139
39901A10422186j8215662r233349J2346335J2149405m367502q680845p2768j270458
39893I3077342j5313043k2252810j4439657n367216m177114n792970o425185p556608
39885A1752739m346638R683516K5124506K3715817O643432l346239M665092J2095100
39877H5987325r82287k3499030k6524696l553986J9948323K0055183K848114r128524
39869F5150422q167245n420743q086914r108113l158503J910597j093199m492410
39861B7533892K120651J2685184J2022481k85032p774407m91382J1868652J4674906
$$ plain form
39915 51411352 61786911 51740376 32425329 28281122 38151515 47784830 59405614
39908 59405614 78353886 89607846 80105308 68941526 81712284 106528047 110422186
39901 110422186 92206524 82973175 95319510 107468915 103101413 94420568 94347800 93077342
39893 93077342 77764299 55511489 41071832 35704616 31527502 25734532 19309347 11752739
39885 11752739 7406101 17089617 42214123 65929940 72573372 69227133 73892225 85987325
39877 85987325 85005038 61506008 34981312 31427326 51375649 71430832 74278946 65150422
39869 65150422 56983177 51562434 43475520 34367407 31208904 33119501 32026302 27533892
39861 27533892 29654543 42339727 54362208 54077176 46302769 45811387 57680039 72354945
39853G2354945O729781j998400m652134l159569k423786l767518m369266j704905
39845E7009148K001436J205555n872832j3593362j4620378p826101J496933P649553
39837B7449952Q999427Q117355Q581995J0154427Q062879M50738n569441j698672
39829F4548660Q801925J4145989R640433J293828n962101j2161908j3145422j468346
39821F5693058J8528781K9960160K5093265J6243915J7586500K7265789L5116085
39814B35487553L7156271L5158248L2613757L6096846M6703806M6277774J2693354
39807D82187609m2543457p6072748o7025087m4896210m2742509m8791562l4621875
39800A25494161q608090j446039j1637130r470734P644712Q790027j4297205k7459066
$$ plain form
39853 72354945 79084726 77086326 72434192 69274623 66850837 63083319 58714053 57009148
39845 57009148 59010584 60216139 54343307 40749945 26129567 18303466 19800399 27449952
39837 27449952 36449379 44566734 53148729 63303156 71366035 71816773 66247332 64548660
39829 64548660 73350585 87496574 97137007 98430835 92468734 80306826 67161404 65693058
39821 65693058 84221839 114181999 139275264 155519179 173105679 200371468 235487553
39814 235487553 272643824 307802072 340415829 376512675 423216481 469494255 482187609
39807 482187609 439644152 363571404 296546317 251650107 208907598 160116036 125494161
39800 125494161 116886071 115440032 103802902 94332168 101976880 110766907 96469702 69010636
39792F9010636q141410J7036815J3739062q522233j5433545p59409J0148321K540063
39784G9618300r145676o906133O069162J2834766M374875j1835964k0524539j3207906
39776D1276885M220431J7964935J9791021J1647879j454214j6340912k7523651
39769D9582374k5645556p127231J6465335K5152837J0235152j3903444k2020596
39762C2738871n258454J7136360J9612048J575478j3038085q044030N772404R049440
39754E9544032q18251j1921331j5524916j0828363K22257J1838341J4116355M544088
39746E1172212m852563j383898J1434389J9086401J3783376J19847j1739531j2674625
39738F4945608j093245J1663540J0135700o007125k0168783j9764031q064546
$$ plain form
39792 69010636 60869226 77906041 91645103 83122870 67689325 66929916 77078237 79618300
39784 79618300 70472624 63566491 69635653 82470419 86845294 75009330 54484791 41276885
39776 41276885 45497316 63462251 83253272 94901151 93446937 77106025 49582374
39769 49582374 23936818 16809587 33274922 58427759 68662911 54759467 32738871
39762 32738871 27480417 44616777 64228825 65804303 52766218 44722188 50494592 59544032
39754 59544032 58725781 46804450 31279534 20451171 20673428 32511769 46628124 51172212
39746 51172212 46319649 44935751 56370140 75456541 89239917 89359764 77620233 64945608
39738 64945608 63852363 75515903 85651603 79644478 59475695 39711664 31647118
39731C1647118O713489J8932623K0002979N047075j0981671p076919R079557Q740691
39723H2104942q821104j1666517P036416J1163757j3344580k4176338O494137
39716D8790713L3785822Q724257l3976029k6286524K0879287L4296901k360167
39709H3854260k7808726r001878J1898099k09775j5669426n09744K4166077K4520421
39701I1239308R697536M804268N652917j776833q640424m426417j861519r848713
39693H4840123j1001799M220436J2510708j263588j0387001R736101L3897312
39686A22552292K4713361o106187j6963488O82301J9418132K2700624J6909421
39679A83906456P723395j033579M271668K8265225M8677864M6960638L8855817
$$ plain form
39731 31647118 38360607 57293230 77296209 82343284 71361613 64284694 73364251 82104942
39723 82104942 73283838 61617321 68653737 79817494 66472914 42296576 48790713
39716 48790713 82576535 91300792 57324763 31038239 51917526 86214427 83854260
39709 83854260 56045534 47043656 58941755 58731980 43062554 42552810 66718887 91239308
39701 91239308 100936844 105741112 111394029 109617196 100976772 96550355 94688836 84840123
39693 84840123 73838324 78058760 90569468 89305880 78918879 88654980 122552292
39686 122552292 147265653 141159466 124195978 124878279 144296411 166997035 183906456
39679 183906456 191629851 190596272 194867940 223133165 271811029 318771667 357627484
39672C57627484M1340888L2296182j2731892o3452167o8605642l6612798k4115953
39665B25746102m4614934n0412940j7898865J1031812R07874j7655482j172625
39658A05930942L3811953L9203851J2836511j702048J5476287L5527173K9317096
39651B70401765M822913j5682611k7793960l6754839l6981110k2457280q018843
39644A27536035j5650901l8377448m1184643r056064K5582242K3318656p871371
39637F4296506k5454705j3462689J681154K43697j664754J1331873K1077649P774414
39629F5823145j0254813l476871J8063739J8954243l521783j5019457r51759J0010704
39621G9627148o861166l2089597l0659636k348665J9624384J3507599n765546
$$ plain form
39672 357627484 398968372 431264554 418532662 355080495 286474853 249862055 225746102
39665 225746102 181131168 130718228 112819363 123851175 124759049 107103567 105930942
39658 105930942 139742895 178946746 191783257 190081209 205557496 241084669 270401765
39651 270401765 275224678 259542067 231748107 194993268 158012158 135554878 127536035
39644 127536035 111885134 73507686 32323043 23266979 48849221 72167877 64296506
39637 64296506 38841801 25379112 27060266 27303963 25639209 36971082 58048731 65823145
39629 65823145 55568332 52091461 70155200 89109443 85587660 70568203 69616444 79627148
39621 79627148 72765982 40676385 10016749 7668084 27292468 40800067 35034521
39614C5034521q337113J3112307L3683476K5245725q209505l3040564k6649035
39607C0839812l666566P654317K536030k631661k00029J627168j309168j729195
39599C3120708M647651J2376350J6034975J5118313R998909M107576O677823K0853308
39591A22935613L3948204L3335438K5348222K2131043J8245791J706909j8963915
39584B38687305k4597711j8453921k1091451l2955087l3171609j9077455j3365986
39577G5974085k2463425k2098789n63983J6516715P614588p698610j995310J3631896
39569E8917167J0207840q753290j4343148j777697M333853m698644o089895J3867152
39561E1663338L1849711J8314230k0142058m7243391l9305589q257833J5565667
$$ plain form
39614 35034521 26697408 39809715 73493191 98738916 90529411 57488847 30839812
39607 30839812 27173246 34827563 37363593 34731932 34531903 36159071 34849903 33120708
39599 33120708 37768359 50144709 66179684 81297997 91296906 95404482 102082305 122935613
39591 122935613 156883817 190219255 215567477 237698520 255944311 257651220 238687305
39584 238687305 214089594 195635673 174544222 141589135 108417526 89340071 75974085
39577 75974085 53510660 31411871 30847888 47364603 54979191 47280581 45285271 58917167
39569 58917167 69125007 60371717 46028569 44250872 48584725 43886081 37796186 51663338
39561 51663338 83513049 101827279 81685221 34441830 -4863759 -13121592 2444075
39554B444075J5224441K37071r180088o967150m337894p721509n944280J0417613
39546e827721K7546310K3924520L071245r371331k707729N436095j01398q202738
39538C3767253k477532J0177319J1212159O87904n253286k960471n057393j3553321
39530B6542632j1225635J0170175L0546577K5606170J2856j9236157j7139224
39523D5277394l435133O601213R041390P027813K572173k023146l055486n64703
39515F1441515J145619L77174r23082m016254j2663238k2992812k3511709j0294607
39507a1437394N707149J1933369P851114O79862m408222m009804M813806J7375149
39499B8505029K0432025Q069126p126704q606094K822383J2152238J1198064N781621
$$ plain form
39554 2444075 17668516 17905587 8725499 1758349 -2579545 -10301054 -16245334 -5827721
39546 -5827721 21718589 45643109 48714354 39343023 36635294 42071389 41969991 33767253
39538 33767253 31289721 41467040 52679199 53367103 48113817 45153346 40095953 26542632
39530 26542632 15316997 25487172 56033749 81639919 81652775 62416618 45277394
39523 45277394 41842261 48443474 57484864 64512677 67084850 65061704 62006218 61441515
39515 61441515 62587134 62964308 62041226 58024972 45361734 22368922 -1142787 -11437394
39507 -11437394 -5730245 6203124 14054238 14734100 10325878 6316074 11129880 28505029
39499 28505029 48937054 57006180 49879476 41273382 44095765 56248003 67446067 73227688
39491G3227688L129970K335877q66664o802918j1535312j0560356l065758N697010
39483E1559537R068978P281405N637458L298687o395438k0439559k3692375j0798603
39475A5520090K050661J92283o463493m35988J3128010J4633716L068290k974505
39467C8719064K460717L478849q564003j8505409j0944865O292041J4709660R341470
39459C6987524o48364o229190l927002N014278J3068936J1430896K305562k381105
39451E5621535R97765K454194l238355o576236o59799N330958J854201m708042
39443E1076221n458859o107675j3458422j6243124j398536J7786231J5184370
39436D1380206p419307j9110982m839895J3256440J1447023m16060K136837J8723551
$$ plain form
39491 73227688 76357658 78693535 77826871 71023953 59488641 48928285 45862527 51559537
39483 51559537 60628515 67909920 73547378 76846065 70450627 50011068 26318693 15520090
39475 15520090 17570751 17763034 11299541 10863553 23991563 38625279 41693569 38719064
39467 38719064 41179781 44658630 36094627 17589218 6644353 12936394 27646054 36987524
39459 36987524 36339160 30109970 26182968 31197246 44266182 55697078 58002640 55621535
39451 55621535 56619300 59073494 55835139 49258903 48599104 53930062 55784263 51076221
39443 51076221 45617362 39509687 26051265 9808141 8409605 26195836 41380206
39436 41380206 33960899 14849917 10010022 23266462 34713485 34297425 36434262 55157813
39428E5157813K5509799J0727087j0567938j8248525r501438L761087J0243688
39421F7081573Q340920M851381N915598P603288Q9928j5213463k1795901j0739904
39413D6133420K082966l048941j8064454j6671138N752757K4666414K3184462
39406F4035486J2747101P102392o9511j4330018j9759904m328526J0640838k622869
39398E3414989l0644061l1854552K203834L2359100K7372891L796791n515284
39391E1133708K412023P398902J703915m295921l267861J812297P215212J0617959
39383G4730234P985197J42043l396663J536903L744959o099817j6745568j1724275
39375E0173013L135651P605707o0123k31885J4749836K6146915J7996577K719087
$$ plain form
39428 55157813 80667612 91394699 80826761 62578236 53076798 56837885 67081573
39421 67081573 75422493 80273874 86189472 93792760 93882688 78669225 56873324 46133420
39413 46133420 48216386 45167445 27102991 10431853 16184610 40851024 64035486
39406 64035486 76782587 83884979 83815468 69485450 49725546 45397020 56037858 53414989
39398 53414989 22770928 -9083624 -6879790 25479310 52852201 56648992 51133708
39391 51133708 53545731 60944633 62648548 58352627 55084766 56897063 64112275 74730234
39383 74730234 82715431 82857474 79460811 80997714 84742673 78642856 61897288 50173013
39375 50173013 53308664 60914371 60854248 60622363 75372199 101519114 119515691 122234778
39367A22234778J721688J2015305J1503834n472681j7142407n165752J7517805
39360A37212570K2388013K918956j7952395j9243903p287529k012280q095961
39353A07927471j2002072l286358J3022167K4044176J9886608J358k1298613k1322358
39345A06972379M460767K7552161J7531611j4710118k8978357j2277872N727320
39338A06277891K117580o615272R50Q787546k75199j3161399l410719J9739034
39330A13460412K2831148K026180j2029897m399599N080493N52640n568721j076904
39322A20875752K121168q373575k0123345j5178993Q41487R160711O208771K614050
39314I8146026J786201j792816o615248l791183O466113J1517597L143038j1101744
$$ plain form
39367 122234778 123956466 135971771 147475605 142002924 124860517 119694765 137212570
39360 137212570 159600583 162519539 144567144 125323241 118035712 116023432 107927471
39353 107927471 95925399 92639041 105661208 129705384 149591992 149593350 128294737 106972379
39345 106972379 111433146 138985307 156516918 141806800 112828443 100550571 106277891
39338 106277891 108395471 101780199 101781149 110568695 110293496 97132097 93721378 113460412
39330 113460412 136291560 138317740 126287843 121888244 126968737 127521377 121952656 120875752
39322 120875752 122996920 114623345 94500000 79321007 80162494 89323205 95531976 98146026
39314 98146026 99932227 98139411 91524163 87732980 94199093 105716690 108859728 97757984
39306I7757984j7487857j2085659l477199j231786m500962m196065L247634Q744684
39298F6770774K228413j1734639j8090042j0612558J650156Q500697R704009Q490754
39290E6907564L669405m733896r217206l348789O772162Q280875j668073j2177351
39282D4484691j3063562o824517k694849l429675l887535j162137Q76896r56013
39274A3343299l552052l387422k034254l54808N681104J4668323J3132350o459503
39266C1037037k6244163k0470411P538866K6368960J8734759J584077m097577
39259C4451548j481640k419503m433895j502069r04102q899998j3443958k573788
39251a207405J1557832R244202n460289j2028341m331086O992208J5030844J7908746
$$ plain form
39306 97757984 80270127 68184468 64707269 63475483 58974521 54778456 58026090 66770774
39298 66770774 68999187 57264548 39174506 28561948 30212104 38712801 48416810 56907564
39290 56907564 60576969 55843073 46625867 43277078 50049240 58330115 56662042 44484691
39282 44484691 31421129 24596612 21901763 18472088 14584553 13422416 14299312 13343299
39274 13343299 9791247 6403825 4369571 4014763 9695867 24364190 37496540 31037037
39266 31037037 4792874 -15677537 -8138671 18230289 36965048 38549125 34451548
39259 34451548 32969908 30550405 26116510 24614441 23710339 14810341 1366383 -1207405
39251 -1207405 10350427 19594629 14134340 2105999 -2225087 4767121 19797965 37706711
39243C7706711Q620183j2563158k4334722r656009J2738124J1383441r390531
39236A4504039j6653639j873114R003638J379152p942294m796453J633838L162272
39228a582561O649885J1940313O105183p792951p406908R235277J3703683n366074
39220B5485847j9035268n938168J0088147P96385j7528971j2328601J0729827
39213g730802K0670874J2949941Q781023J2430802Q052939m884844r854947o876391
39205C3538595j2789814k4654843j7554291J1776994L0613818J4754532j6991635
39198A8693356k9706923j5717162N254341J5793603J4549376Q005449J961422
39191A8833462j062494k694996m924762m420150L212657J3325836J5602457R276976
$$ plain form
39243 37706711 46326894 33763736 9429014 -226995 12511129 23894570 14504039
39236 14504039 -2149600 -4022714 4980924 6360076 -1582218 -6378671 -4744833 -1582561
39228 -1582561 5067324 17007637 23112820 15319869 7912961 17148238 30851921 25485847
39220 25485847 6450579 512411 10600558 11396943 -6132028 -18460629 -7730802
39213 -7730802 12940072 25890013 34671036 47101838 55154777 50269933 40414986 33538595
39205 33538595 20748781 -3906062 -21460353 -9683359 20930459 35684991 18693356
39198 18693356 -11013567 -26730729 -21476388 -5682785 8866591 16872040 18833462
39191 18833462 17770968 15075972 10151210 5731060 8943717 22269553 37872010 47148986
39183D7148986M921462P749771R385068J727376r880474j4553478j0712868n420220
39175C0365623k243388K628176J1371479J6897743R263498r471848k2291857j6286203
39167B0233223k008935j765917j6512543k0158268L360799L2552396L5333673
39160E1034428J3183912l677760j083177L670177n088765j6327228j2343140K613353
39152C1981800Q820357k153532j9134672k5342136j3299649R401846K4419979
39145A4693993J9351521L829598l70644J0622353J6103915K596419j3369241j0183247
39137D3274667M119416M438395j0828358j7794225o668467L380902j887420p620773
39129A0414137L415114J9051525J5225871n773398j8258311j0251080M261587
$$ plain form
39183 47148986 52070448 59820219 69205287 70932663 61052189 46498711 35785843 30365623
39175 30365623 28122235 30750411 42121890 59019633 68283131 58811283 36519426 20233223
39167 20233223 18224288 16458371 -54172 -20212440 -16851641 15700755 51034428
39160 51034428 64218340 60540580 59457403 63127580 58038815 41711587 29368447 31981800
39152 31981800 40802157 38648625 19513953 -5828183 -19127832 -9725986 14693993
39145 14693993 34045514 37875112 37504468 48126821 64230736 66827155 53457914 43274667
39137 43274667 47394083 51832478 41004120 23209895 16541428 19922330 18034910 10414137
39129 10414137 13829251 32880776 48106647 42333249 24074938 13823858 18085445
39122A8085445J0208584Q142652K686456o761576j6894783j7965288q697315q02294
39114a1998119j170660k363524J472459L154018k690075o563102P14045J0448278
39106h996680Q879272Q006m16631R804906J5208866M704977j3439147k1590580
39098e837011j2130314M758596J1748704M504499j882023N979429J7430223J2297617
39090C6869720n275919j1158096k035159k205418j8562360k2211200K764805K4462509
39082B648882J0127931j8504782j7696984R010642J9624898K198126j2759405
39075e350692p590285N44718m23636K332553J4494746J9151435P156516p542564
39067B2772791j3546537j3932646o180017J6471024L6776304K4690146j1968919
$$ plain form
39122 18085445 28294029 36436681 39123137 32361561 15466778 -2498510 -11195825 -11998119
39114 -11998119 -13168779 -15532303 -14059844 -10905826 -13595901 -20159003 -19444958 -8996680
39106 -8996680 -117408 -109402 -526033 9278873 24487739 29192716 15753569 -5837011
39098 -5837011 -17967325 -13208729 -1460025 3044474 1162451 7141880 24572103 36869720
39090 36869720 31593801 20435705 18400546 16195128 -2367232 -24578432 -21813627 2648882
39082 2648882 12776813 -5727969 -23424953 -14414311 5210587 7408713 -5350692
39075 -5350692 -12940977 -12396259 -12819895 -10487342 4007404 23158839 30315355 22772791
39067 22772791 9226254 -4706392 -10886409 5584615 42360919 67051065 55082146
39060E5082146k7728413n584161J7701510J1658276m533178m158450K509557k298570
39052D2648717o576216L663919J1528477P49439r909865j376931O354560r216732
39044C7865368k5753478j1646679J5922068J8746803K601603M34919P272671q380936
39036C7062339l6791337l4107708O10114J8012562l18272j3321876O325300K6706581
39028D177703J4734739q563158q272784O822312P283028m436880n413022K629919
39020H961857q27378j4152601j4199822M588669K0907152J8047359K551689j0445933
39012A5430992j3019947m515157R066939J4737761M847161r337000q908264N996758
39004A4299243J3429482r06488k1720616k2001634R07564J9472580J1332981r629056
$$ plain form
39060 55082146 27353733 21769572 39471082 51129358 46596180 42437730 44947287 42648717
39052 42648717 36072501 39736420 51264897 52014336 42104471 40727540 47082100 37865368
39044 37865368 12111890 465211 16387279 35134082 37735685 38170604 45443275 37062339
39036 37062339 271002 -33836706 -33226592 -15214030 -15532302 -28854178 -22528878 4177703
39028 4177703 18912442 10349284 2076500 8898812 16181840 11744960 6331938 8961857
39020 8961857 8134479 -6018122 -20217944 -15629275 5277877 23325236 25876925 15430992
39012 15430992 2411045 -2104112 6962827 21700588 26547749 17210749 8302485 14299243
39004 14299243 27728725 26822237 5101621 -16900013 -15992449 3480131 14813112 5184056
38996E184056j1533870R470941K1781233M666692j9066241j6269088O153352J2056474
38988A2443549q570686k6272134j8581837j51223O429381M605665R358059J7584815
38980c154411J6030185P468716N415515P814088p55255j9472735k5716714p347712
38972a9718323J6390571J9246538K312980j1242819r855124m012373k405240K610619
38964f673171J5793768K2405973R098907r409686p851054R135866J0259618j4507813
38956B8252408l5642196k5911251K362299J9118130J6828832Q635728J356846
38949A5000796o475345r463580j632717P104657J790377j2831902j6981393l863430
38941b7352537J2873033J8124410Q673696q423117j8733105r223200J2642846
$$ plain form
38996 5184056 -6349814 3121127 24902360 29569052 10502811 -5766277 387075 12443549
38988 12443549 3872863 -22399271 -40981108 -41132331 -34702950 -30097285 -20739226 -3154411
38980 -3154411 12875774 20344490 25760005 33574093 32818838 13346103 -12370611 -19718323
38972 -19718323 -3327752 15918786 18231766 6988947 -2866177 -6878550 -9283790 -6673171
38964 -6673171 9120597 31526570 40625477 31215791 23364737 32500603 42760221 28252408
38956 28252408 -7389788 -33301039 -30938740 -11820610 5008222 13643950 15000796
38949 15000796 8525451 -938129 -2570846 4533811 6324188 -6507714 -23489107 -27352537
38941 -27352537 -14479504 3644906 12318602 3895485 -14837620 -24060820 -11417974
38934a1417974J9309066j148242k2910953j7175302M922077J1716985J740107
38927a4964236Q33449J3673024J5916492j410411j5521407j0110286J383931L714376
38919f485068K873786O144072M331931q665554j9103614j3403513J377324J1400055
38911b1530581J4917580J4649179P292114n793923j1659939k856834J0122843
38904E140439J3877949Q154139o41954q524098r891987J52578J2583936J0210861
38896C1061863o340391j6348528r672877L38042K209742J683915J867980o222144
38888a422398j9100393j3627856J5854251L8066388K6211078k947816j7108756
38881B5924498j5074383j5887288j8764349q097171J1251429J7456079P558356
$$ plain form
38934 -11417974 7891092 6742850 -16168103 -33343405 -28421328 -16704343 -14964236
38927 -14964236 -14130787 -457763 15458729 14048318 -1473089 -11583375 -10199444 -6485068
38919 -6485068 -3611282 2532790 6864721 -1800833 -20904447 -34307960 -32930636 -21530581
38911 -21530581 -6613001 8036178 15328292 9534369 -2125570 -4982404 5140439
38904 5140439 19018388 27172527 26530573 18006475 8114488 8267066 20851002 31061863
38896 31061863 24721472 8372944 -1299933 -961891 1247851 2931766 4799746 -1422398
38888 -1422398 -20522791 -34150647 -18296396 19769992 45981070 43033254 25924498
38881 25924498 10850115 -5037173 -23801522 -31898693 -20647264 -3191185 4367171
38874D367171K14315L135431M488248k006217p612848o819245m133689p84925
38866i151759O307161J1758081O857694k589466k829117L849714K188674q663775
38858G727207j2937755o023872j692238n674063m262696J0737328K4681620K0335193
38850C2890724J803111j3251900j5264645p729067J001581M026350Q39466r46529
38842C369091L884542P356599j71334j0484319p107935N959194P047554p557252
38834B296140j5226891l849070Q048321L715423l297959M845643J6229441R002907
38826B1763955r107137j2002126J819774R093242K397503q17335O828468R768498
38818B9744842N61002n104007J977863O367805l152521j0758005j180570J1133774
$$ plain form
38874 4367171 4581486 7716917 12205165 10198948 2586100 -4233145 -8366834 -9151759
38866 -9151759 -2844598 8913483 15771177 13181711 10352594 14202308 16390982 7727207
38858 7727207 -5210548 -11234420 -12926658 -18600721 -22863417 -12126089 12555531 32890724
38850 32890724 34693835 21441935 6177290 -1551777 -550196 3476154 4315620 3369091
38842 3369091 7253633 14610232 14438898 3954579 -3153356 2805838 9853392 2296140
38834 2296140 -12930751 -16779821 -8731500 -5016077 -8314036 -3468393 12761048 21763955
38826 21763955 12656818 654692 2474466 11567708 13965211 13147876 19976344 29744842
38818 29744842 30305844 25201837 27179700 33547505 30394984 19636979 18456409 29590183
38810B9590183O154828n980240k966773Q866522N311299j0679751j0902047R476959
38802B8870980K1061116P537282r206939p147531J895474k432383j3821088j4449193
38794A2307718p178131n893885o669962L570901J7245833J3287378p124856j8102973
38786A442023o340746J1192846J3986288M370189k335138q33102J725912n92612
38778B2615660n041023m861228J798318P850048M528836o083082j1764102o753489
38770B289938P67555L280143M912296Q558596M674200j2104729k5599135j6517820
38762b9738956P337280J8762323P153133j0935511j6692012p976236O738063J7598320
38754g753596J5834927J603861r889503l560318J4199244K1954033R943895j1586749
$$ plain form
38810 29590183 35745011 29764771 26797998 35664520 40975819 30296068 19394021 28870980
38802 28870980 49932096 57469378 48262439 41114908 43010382 40577999 26756911 12307718
38794 12307718 5129587 -764298 -7434260 -3863359 13382474 26669852 19544996 1442023
38786 1442023 -4898723 6294123 20280411 24650600 22315462 21482360 23208272 22615660
38778 22615660 17574637 12713409 14511727 22361775 26890611 20807529 9043427 2289938
38770 2289938 3057493 6337636 11249932 19808528 24482728 12377999 -13221136 -29738956
38762 -29738956 -22401676 -3639353 3513780 -7421731 -24113743 -32089979 -25351916 -7753596
38754 -7753596 8081331 9685192 -204311 -3764629 10434615 32388648 42332543 30745794
38746C0745794k7513841k8596854j2442773J1481471K3320803J4470006N89458
38739A2054064k096468q54631o443012n840200J4386620L1898873J5781836j7559925
38731D1327157k1553754O631090J8653311p933000l4903020k6496537j315700
38724b5590453P733530N050453R426580J3289800K876980p332164J138016J2995178
38716A9587920L609246j5843457j5796045J934747R581235L73464o204117j885256
38708d642263J305365j656743k441111l27758k897953o521501j204727O951434
38700a1435257L446555o386844l095581J3245415K1311908J2259795K96982l516989
38692B6125984m595637p875556q935537o346537m339516j414664N597947P765812
$$ plain form
38746 30745794 3231953 -25364901 -37807674 -26326203 -3005400 11464606 12054064
38739 12054064 9957596 9102965 2659953 -3180247 11206373 43105246 58887082 41327157
38731 41327157 19773403 26404493 45057804 37124804 2221784 -24274753 -25590453
38724 -25590453 -17856923 -12806470 -3379890 9909910 12786890 5454726 6592742 19587920
38716 19587920 23197166 7353709 -8442336 -6507589 3073646 3447110 -2757007 -4642263
38708 -4642263 -3336898 -4993641 -7434752 -7762510 -10660463 -17181964 -18386691 -11435257
38700 -11435257 -7988702 -14375546 -17471127 -4225712 17086196 29345991 29642973 26125984
38692 26125984 21530347 13654791 4719254 -1627283 -5966799 -7381463 -1783516 5982296
38684E982296m422391j8213244j2488866O183247J0025652m646010r977802O915068
38676b0642050K1435111J1000385j0213771j5588380l706409P946273R557384
38669b11457J413224j3966053k5255946j5045712J2744874K6200033P492355j6473763
38661b3102445j1962514R436914J0314381j0912749j7966292K214888J7622284
38654b4355533M671381j3139394m963754J7476436K1828418Q022535K558904Q616517
38646B0715510J388620k3202888l3338274j0735677J6325780J3860304p121142
38639b2107767j0502013Q686643K0876980J0703488l192301k632718L556561K9657
38631E418530q626279p701683L790596J3184188J1254477m56266j3886622j9348978
$$ plain form
38684 5982296 1559905 -16653339 -29142205 -22958958 -12933306 -17579316 -27557118 -20642050
38676 -20642050 793061 11793446 1579675 -14008705 -17715114 -9768841 -211457
38669 -211457 1201767 -12764286 -38020232 -53065944 -40321070 -14121037 -6628682 -23102445
38661 -23102445 -35064959 -25628045 -15313664 -26226413 -44192705 -41977817 -24355533
38654 -24355533 -19684152 -32823546 -37787300 -20310864 1517554 9540089 12098993 20715510
38646 20715510 22104130 -1098758 -34437032 -45172709 -28846929 -14986625 -22107767
38639 -22107767 -32609780 -23923137 -3046157 7657331 4465030 1832312 5388873 5418530
38631 5418530 -3207749 -10909432 -7118836 6065352 17319829 16863563 2976941 -16372037
38623a6372037j1822048K596788J1786123J1619792Q477249P442178P196660O976040
38615B7900745P490725M413585o149066j5039567q494899Q343592J3738053Q8198
38607C2291366j5450617j7514592j0769337l061471R009226K4251570K5833423
38600D4589568M358113k1581353k6213810r010751Q740032J1653613J508419j1147815
38592B896016j4954088m911161R374985J1674031J764379l083406M159983Q767013
38584A5687752N94188p649659k924222N761106M179499m434733j0024183j2544257
38576a1354509j2304837k046679J4436565J6775670K69661j0020745l0942N808015
38568A532199j2003275k5602078k167802L3809846L0870300q494237l0350627
$$ plain form
38623 -16372037 -28194085 -25597297 -13811174 -2191382 6285867 13728045 20924705 27900745
38615 27900745 35391470 39805055 33655989 18616422 10121523 18465115 32203168 32291366
38607 32291366 16840749 -673843 -11443180 -14504651 -5495425 18756145 44589568
38600 44589568 48947681 27366328 1152518 -7858233 881799 12535412 14043831 2896016
38592 2896016 -12058072 -16969233 -7594248 4079783 5844162 2760756 6920739 15687752
38584 15687752 16281940 8632281 5708059 11469165 15648664 11213931 1189748 -11354509
38576 -11354509 -23659346 -25706025 -11269460 5506210 5775871 -4244874 -4275816 1532199
38568 1532199 -10471076 -36073154 -38240956 -4431110 26439190 17944953 -12405674
38561a2405674j1846988J1072441P450451o007168m417827M369337K829283l417633
38553a2373778j173128M162929P00364p355049p669466R67454J0339937J4273253
38545A872516J0946176L580778J219340O823394P047129q856168k4670121j6295452
38537a8332408P392407J3257286m147680j3702574J12908J2133322J093714j4172860
38529a6365885q174729Q878716J1277102M0565n266902k492734m396380r288251
38521b5788498l783450Q836080J0703010L94608l704190M682987Q898158r6132
38513A42573n111937Q039953K0164615L360956l0177333l4714232M679955M2909725
38505I294275L3579758m247282j4228493J1546616K1367161j2268104m5630786
$$ plain form
38561 -12405674 -24252662 -13180221 -5729770 -11736938 -16154765 -11785428 -8956145 -12373778
38553 -12373778 -13546906 -9383977 -8683613 -16038662 -23708128 -22740674 -12400737 1872516
38545 1872516 12818692 16399470 17618810 24442204 31489333 22633165 -2036956 -18332408
38537 -18332408 -10940001 2317285 -1830395 -15532969 -15420061 -3286739 -2193025 -16365885
38529 -16365885 -24540614 -15661898 -4384796 -4344231 -9611133 -12103867 -16500247 -25788498
38521 -25788498 -29571948 -20735868 -10032858 -9638250 -13342440 -8659453 238705 142573
38513 142573 -4969364 3070589 23235204 26596160 -3581173 -38295405 -33615450 9294275
38505 9294275 42874033 38626751 24398258 35944874 57312035 45043931 -586855
38498e86855l0107481J3037030K6915521L166750j5974359p644591P469093R382924
38490E658032L322399m762573j7828450k5502352r010215K1995625L2020221J0263926
38482A6156613j3867051j6752817q969069n208349k10550Q615451P742834l253458
38474a5746396k45951K4937643M1906642K5824908j536008l614293J8495384L4093169
38466A24115098K7505926P638736j4443559l2259965l7468093k7936823j4729700
38459C2421620o230655K598297J2376121R509520q558310j9091782p258655O352166
38451B2118322k351135j9769070j6198337N181717J4670956L694661p569086p529517
38443g751489n440872m486547N616003K1437879J9999378o129788l0089467k4122857
$$ plain form
38498 -586855 -30694336 -17657306 9258215 12424965 -3549394 -11193985 -3724892 5658032
38490 5658032 8980431 4217858 -13610592 -39112944 -48123159 -26127534 5892687 16156613
38482 16156613 2289562 -14463255 -23432324 -28640673 -28851223 -20235772 -12492938 -15746396
38474 -15746396 -15992347 8945296 50851938 76676846 75140838 71526545 90021929 124115098
38466 124115098 151621024 159259760 144816201 112556236 75088143 47151320 32421620
38459 32421620 26190965 28789262 41165383 50674903 42116593 23024811 15766156 22118322
38451 22118322 19767187 -1883 -16200220 -11018503 3652453 7347114 -221972 -7751489
38443 -7751489 -13192361 -17678908 -12062905 9374974 29374352 23244564 -6844903 -30967760
38435c0967760K740346J7469681N779931j3733181j7032437l279398R235338Q711424
38427b1076056K144316J577920P248309J0944837R509246N543245m77560p700655
38419G713602q762866Q74283J1209909R922075K262685J819533O260049L495009
38411C4794279k127104L817819J4377547O851889j6240831k4659108p786539Q768625
38403A7796577O498933j85699K004925N74054j1448165j4042583K742391J2792147
38395A6732580l445537k0739145r688949J1764398Q527844j2001720j4817810
38388b3668339L440721J4495110Q128223k78391n102507j2697888j3888420M577996
38380b4993495K4779388J6127106j1775189j8313706L388137J6060297J191305
$$ plain form
38435 -30967760 -28227414 -10757733 -4977802 -18710983 -35743420 -39022818 -29787480 -21076056
38427 -21076056 -18931740 -17353820 -10105511 839326 10348572 15891817 15414257 7713602
38419 7713602 -1049264 -174981 11034928 20957003 23219688 25039221 31299270 34794279
38411 34794279 32667175 36484994 50862541 57714430 41473599 16814491 9027952 17796577
38403 17796577 24295510 24109811 26114736 26688790 15240625 1198042 3940433 16732580
38395 16732580 13287043 -7452102 -17141051 -5376653 3151191 -8850529 -23668339
38388 -23668339 -20227618 -5732508 2395715 2117324 -2985183 -15683071 -29571491 -24993495
38380 -24993495 -214107 15912999 4137810 -14175896 -10787759 5272538 6463843
38373F463843j2820578j723139J6561863J7460934Q598081P296573P289806m281275
38365D4846108j6998968j1685636P391242J7710557R067321p768276j7952855
38358B4609493j6254610p560956k84720M033428J3677234L1465173M2092367L0083903
38350A21861312N511626q237096q466764j0684170j5381341q600744K340428r207067
38342F9136184l9880278m6736959r221076L2520197L1140455k201567j9997423
38335A4759533p519358P809707O676021k96548j714885l490586r769664j1076393
38327d622173k161547O529993N134992j612508m790874m024656k415435Q95032
38319g067176N548918O003128J97939m955396m004352k479986p912726j6277316
$$ plain form
38373 6463843 -6356735 -8079874 8481989 25942923 34541004 41837577 49127383 44846108
38365 44846108 27847140 16161504 23552746 41263303 50330624 42562348 24609493
38358 24609493 8354883 793927 509207 4542635 18219869 49685042 91777409 121861312
38350 121861312 127372938 119135842 110669078 99984908 84603567 76002823 78343251 69136184
38342 69136184 29255906 -17481053 -26702129 5818068 36958523 34756956 14759533
38335 14759533 7240175 15049882 21725903 21429355 19714470 16223884 6454220 -4622173
38327 -4622173 -6783720 -253727 4881265 3268757 -1522117 -5546773 -7962208 -7067176
38319 -7067176 -1518258 4484870 4682809 -272587 -4276939 -6756925 -14669651 -30946967
38311c0946967j6576492o551057N200944J2111345J5373394J5757649J0191603
38304D560419J260124L8419J0767005K0721371J6566683M222135j827682l747233
38296E2561241j5246389l1546528k8527711p36292K2917122J8163874O02989o59930
38288A7528376J0791118Q311592r091756j1703711J1567694K9964825J4015395
38281G1383533k0226300l2759717j3619948Q499700R141156k853569o199584M44111
38273A3809382K271708l910205m972274L644216P102370l975205j3682520m227899
38265c940427J2238295J0381719m767134k316249K1844565L1242429M457621k6951577
38257D2189242k3483235L784762J3758593j607042j2708766m142524P098301P662094
$$ plain form
38311 -30946967 -47523459 -54074516 -48873572 -36762227 -21388833 -5631184 4560419
38304 4560419 5820543 5858962 16625967 37347338 53914021 58136156 56308474 52561241
38296 52561241 37314852 5768324 -22759387 -23495679 -578557 17585317 18188306 17528376
38288 17528376 28319494 36631086 27539330 15835619 27403313 57368138 71383533
38281 71383533 51157233 18397516 4777568 13277268 22418424 19564855 13365271 13809382
38273 13809382 16081090 12170885 7198611 10842827 17945197 13969992 287472 -3940427
38265 -3940427 8297868 18679587 13912453 11596204 33440769 64683198 69140819 42189242
38257 42189242 18706007 22490769 36249362 34642320 21933554 17791030 24889331 32551425
38249C2551425P163130J3160601J7780172K1217674L9899332P3990165R0797495
38242B96559994O2468062M515428m3606395o4136956o6813600n9332645l7925451
38235I1728437q393766O935791m288136k3400608k1305491L041594J9503610O658044
38227G0479475j8743132k5290092j0667736r00140o991734q707237P622954K0902263
38219B7704621P451933j7214580j8440955M621268J7490700J959041k0169335
38212C402693k2325753p307852N868188R992167J0080539Q704415N119150K201823
38204A5735370L265758N211848K056089o014843j0651167k809243J5868358K8569390
38196E1231560J7687791j1133178k9105127j8662238J872450K645364j6429360
$$ plain form
38249 32551425 39714555 52875156 70655328 91873002 131772334 205762499 296559994
38242 296559994 359028056 363543484 319937089 255800133 188986533 129653888 91728437
38235 91728437 83334671 90270462 85982326 62581718 41276227 44317821 63821431 70479475
38227 70479475 51736343 26446251 15778515 14878375 7886641 -820596 6802358 27704621
38219 27704621 35156554 17941974 -498981 4122287 21612987 23572028 3402693
38212 3402693 -18923060 -26230912 -20362724 -10370557 -290018 8414397 13533547 15735370
38204 15735370 19001128 24212976 26269065 20254222 9603055 6793812 22662170 51231560
38196 51231560 68919351 57786173 28681046 10018808 11891258 14536622 -1892738
38189a892738k7267606j3293556J1542537K4332812J6906750m392038k7042324
38182b1106163l6291812k3807928K105758K2648176K6592273J6764800K475906
38175a0618990o276753k941847O912013P706819m573902j2501036k507544J1785979
38167a3015261J0235362j048380j068371R755486J0778228m420663j9739822k2364394
38159c0887815j4889532k968317Q363059R613261m55039l369561J3642604K9581226
38151H629886J6720188j2509400k1126266m875946O105810J608623K681822J3480349
38143A0715066R072900j5089998k7267630j2468283K109958j690243K42199K5113605
38135i262426M1344790J6490135k3605419k8151324N082866L1792446K5871775
$$ plain form
38189 -1892738 -29160344 -42453900 -30911363 -6578551 10328199 5936161 -21106163
38182 -21106163 -57397975 -81205903 -79100145 -56451969 -29859696 -13094896 -10618990
38175 -10618990 -16895743 -19837590 -12925577 -5218758 -9792660 -22293696 -24801240 -13015261
38167 -13015261 -2779899 -3828279 -4896650 4858836 15637064 11216401 -8523421 -30887815
38159 -30887815 -45777347 -48745664 -40382605 -30769344 -31224383 -34593944 -20951340 8629886
38151 8629886 25350074 12840674 -8285592 -13161538 -7055728 -5447105 -2765283 10715066
38143 10715066 19787966 4697968 -22569662 -35037945 -32927987 -34618230 -34376031 -9262426
38135 -9262426 32082364 48572499 24967080 -3184244 1898622 33691068 59562843
38128E9562843M008471r680082r859284O24285K1275033M7934023P0149552P6485310
38120B60500151N8113623J6090536k9991874n5326143n8262479n7691858n7585527
38113G5846429m0727566p712386J0513183r38579j3209346P57838K1127503J4173084
38105E9830160j2235954k2083333n412781J4689870J9566994J0226220o035309
38098E8545867j8660163j3748415N567634J2048969q112825k7017091j2599008
38091c975032K1212723L3768483J4983697r045037j8544813j6828090j1441011
38084A0130920p017014j0042498j6326185n991968K3669206L8743681J4236393
38077D7402535k0568755k1814979J481780O181917j1809214j6210288K034351
$$ plain form
38128 59562843 63571314 53891232 44031948 44656233 65931266 113865289 184014841 260500151
38120 260500151 318613774 334704310 304712436 249386293 191123814 133431956 75846429
38113 75846429 35118863 27406477 37919660 36981081 23771735 24529573 45657076 59830160
38105 59830160 47594206 25510873 20098092 34787962 54354956 64581176 58545867
38098 58545867 39885704 26137289 31704923 43753892 35641067 8623976 -3975032
38091 -3975032 17237691 51006174 65989871 56944834 38400021 21571931 10130920
38084 10130920 3113906 -6928592 -23254777 -29246745 -5577539 33166142 47402535
38077 47402535 26833780 5018801 6500581 12682498 873284 -15337004 -13302653
38070a3302653J1448471J90005l800889J3184959K4650727J1099943q631229j3977872
38062B0861462j3439569j7766170j6432144k721889Q042766O121338M821888J1242712
38054G30394R136073p905372j5803058K045422K2148023J4534003j1276633k2264324
38046h655472r251287P995277J3080586P721293M06767k220212K744323R971873
38038B1793148R438694N02646p440903j1086080j4921127j4948074j354357J8405423
38030C89370K3148467J1235264M189086Q653102M625999j5156656k5982588j1079460
38022B2584Q892472J0089539K294169N111893J2063419P379257k946057o721554
38014C6185722j2120465k7112829l1185793l341520L5162120M2829979J5153803
$$ plain form
38070 -13302653 -1854182 -1664177 -5465066 7719893 32370620 43470563 34839334 20861462
38062 20861462 7421893 -10344277 -26776421 -29498310 -21455544 -15334206 -10512318 730394
38054 730394 9866467 1961095 -13841963 -11796541 10351482 24885485 13608852 -8655472
38046 -8655472 -17906759 -9911482 3169104 10890397 11297164 9076952 11821275 21793148
38038 21793148 31231842 31734488 24293585 13207505 -1713622 -16661696 -18016053 389370
38030 389370 23537837 34773101 38962187 47615289 52241288 37084632 11102044 22584
38022 22584 8915056 19004595 21298764 26410657 38474076 45853333 42907276 36185722
38014 36185722 24065257 -3047572 -34233365 -37574885 -2412765 40417214 55571017
38007E5571017j3856502k1460964j4913282n010494O001425J0950946K562156
38000A9844302p808166l444726P709772M506023r361169j0858626J21942l50596
37992C58756j5558550j9523137k716877R805617J358697q641941L8647J4867594
37984b0011194J5812924R069194R207901Q351686p376240k4726699j7328164J2774226
37976a4226366L4462442K8210793O027080j0288277j2426852m667428M625254
37969C1716646O440525k460354j3213701j3363984k687221P342908R104592M875365
37961B7754776j747651r892821j5571858j2075059j64038R661318R359139K669552
37953I993358r72535K238604P688733P862347k28554j0282676j0746304J335378
$$ plain form
38007 55571017 41714515 20253551 5340269 329775 6331200 17282146 19844302
38000 19844302 12036136 8591410 16301182 20807205 11446036 587410 709352 358756
37992 358756 -15199794 -34722931 -37439808 -27634191 -26275494 -34917435 -34878788 -20011194
37984 -20011194 -4198270 4870924 14078825 22430511 15054271 -9672428 -27000592 -14226366
37976 -14226366 20236076 48446869 54473949 44185672 31758820 27091392 31716646
37969 31716646 38157171 35696817 22483116 9119132 6431911 13774819 22879411 27754776
37961 27754776 26007125 16114304 542446 -11532613 -11696651 -2035333 7323806 9993358
37953 9993358 9020823 11259427 18948160 26810507 26581953 16299277 5552973 6888351
37945F888351J2448803O902882j0956128j9463887q235290P465617R164631J244301
37937E459280R04609R114791R969436j072044p801615Q82223J3158738J4378148
37929D4993566R752102R963100O697983j3880708l9115795l9054781j1139031
37922c1783564J1344375O404673o193049M28130J7136970J6347270j361176q544460
37914C779169N083934J8812752J4656386L17975q514828p810403P48227J5351310
37906D2424522K4245014J0471886k0415409l6012691j7362090J1903237J6014912
37899C1269381n760679k3729748k0340921m718678J0508358K2107093K4954647
37892C4289453J1423588j1200119k1567324j1234877L733615N727218l290450
$$ plain form
37945 6888351 19337154 26240036 15283908 -4179979 -12415269 -4949652 4214979 5459280
37937 5459280 6363889 15478680 25448116 24376072 16574457 17456680 30615418 44993566
37929 44993566 54745668 64708768 71406751 57526043 18410248 -20644533 -31783564
37922 -31783564 -20439189 -14034516 -20227565 -19799435 -2662465 13684805 12323629 3779169
37914 3779169 8863103 27675855 42332241 42650216 34135388 26324985 27073212 42424522
37906 42424522 66669536 77141422 56726013 20713322 3351232 15254469 31269381
37899 31269381 25508702 1778954 -18561967 -23280645 -12772287 9334806 34289453
37892 34289453 45713041 34512922 12945598 1710721 5444336 11171554 7881104
37885G881104j1281226j3629407j1798606n642181K853014O727329M023865L151175
37877a7714933J0228453J8236057J6494775M702586q587452j4842501q806037
37870b89052P661404K0545657J4446414n546006j6289778q251265J551019j404627
37862A2423766o397353l76478N341467n128013k0256101j6410930L869080J6798105
37854a0136457J4517314R036336L768579p771864j6620415n884994J3249851Q954405
37846I112755j8870032k9979462l229136K9502289L0191385N427738j4137353
37839H018184j8126903j3013370J380025K1344268K5288007K657144j9313082
37832H234273j0819469J2656739J3467874q055057j6271875O01342J4486930N374100
$$ plain form
37885 7881104 -3400122 -17029529 -28828135 -34470316 -31617302 -24889973 -20866108 -17714933
37877 -17714933 -7486480 10749577 27244352 31946938 23359486 8516985 -289052
37870 -289052 7372352 27918009 42364423 36818417 20528639 12277374 13828393 12423766
37862 12423766 6026413 5649935 10991402 5863389 -14392712 -30803642 -26934562 -10136457
37854 -10136457 4380857 13417193 17185772 9413908 -7206507 -13091501 158350 9112755
37846 9112755 -9757277 -39736739 -42965875 -13463586 16727799 22155537 8018184
37839 8018184 -10108719 -23122089 -21742064 -397796 24890211 27547355 8234273
37832 8234273 -2585196 10071543 23539417 15484360 -787515 -186173 14300757 19674857
37824A9674857j1416847j6124128j1313566n305486L974353J4978500J5833509
37817A0301192N172965j001590M422075P060759k434394j0173564l502345N133624
37809A4978722j693415j6369273j6966103o1040J5599952J4916485J689857j0662317
37801A432868j3468597q111089k531654j649030j055490M696648R932229M851305
37793e902810o213426q175374J131755O899561J654464l343977J566539R079815
37785c303453R046022K843694n353705j5884591k2916968j4488823M842431J0720500
37777c4494893n640440j7769263l83216L0514417L8355989J5764229j1215136
37770A5131687k1243671j5673319l142621R471328J1900831j393187j7055021
$$ plain form
37824 19674857 8258010 -7866118 -19179684 -24485170 -20510817 -5532317 10301192
37817 10301192 15474157 14472567 18894642 25955401 23521007 13347443 9845098 14978722
37809 14978722 13285307 -3083966 -20050069 -20111109 -4511157 10405328 12095185 1432868
37801 1432868 -12035729 -20146818 -22678472 -24327502 -25382992 -20686344 -10754115 -5902810
37793 -5902810 -12116236 -20291610 -19159855 -12260294 -10605830 -13949807 -12383268 -3303453
37785 -3303453 5742569 8586263 3232558 -12652033 -35569001 -50057824 -45215393 -34494893
37777 -34494893 -40135333 -57904596 -58287812 -27773395 10582594 26346823 15131687
37770 15131687 -6111984 -21785303 -24927924 -15456596 -3555765 -4948952 -22003973
37763b2003973j6073792j149739P896819M907923K882006Q284393J1706047P610974
37755D060658K868166Q93654l337246p846184l179899P265801P470435l611573
37747D583812o832169N029101J3084108M280460n260421J773217J2484507M822812
37739C3965427j4130311j8026832k315871J0839126P474501j977769m586384l064940
37731H176947n455632j0938040j2626937o060486P456603J9176966J7387945L020659
37723B0138025m906992O395819J9735601Q735100j9920946l0425344r452021J2622266
37715B921508O368576j4028743j5092408M602437J4665462j50723j9062079j6610657
37707c6386627L943075J8820310J4797899J346300n230485j485820K615682M3149
$$ plain form
37763 -22003973 -38077765 -39227504 -31330685 -26422762 -23540756 -15256363 -3550316 4060658
37755 4060658 6928824 7822478 4485232 -3360952 -6540851 724950 8195385 4583812
37747 4583812 -2248357 2780744 15864852 20145312 14884891 16658108 29142615 33965427
37739 33965427 19835116 1808284 -507587 10331539 17806040 15828271 11241887 8176947
37731 8176947 2721315 -8216725 -20843662 -26904148 -19447545 -270579 17117366 20138025
37723 20138025 15231033 21626852 41362453 50097553 30176607 -248737 -9700758 2921508
37715 2921508 9290084 -4738659 -19831067 -15228630 -563168 -713891 -19775970 -36386627
37707 -36386627 -32443552 -13623242 1174657 2520957 -2709528 -4195348 -1579666 -1536517
37699a536517l411759m89150K854583l667918j3527318q399319J1699019K2340368
37691E861989R165439r733155j1352210j100031J624015k858004j46128P990889
37683e47196O318115m507818p964240q59039K954940p25935j413924K264578o4920
37674d545439o240471k574431O661280K102774j1353070m133793K5098928L4523806
37666C9539584J027766l8080004l6598022l523157J9493047K0125359J5877592
37659A7862165J1796743k97958j1954658q096990N06050o452739j6928603k587660
37651a6153650K6377580K7523100p602493l6550263k7094087K849056K0800404
37644i850353K0544155J1108651l279889j4162043p766392R693063J2055748n392587
$$ plain form
37699 -1536517 -4948276 -5437426 -2582843 -6250761 -19778079 -28177398 -16478379 5861989
37691 5861989 15027428 5294273 -6057937 -7157968 -5533953 -8391957 -8538085 -547196
37683 -547196 5770919 1263101 -6701139 -7560178 -4605238 -5331173 -6745097 -4480519 -4545439
37674 -4545439 -10785910 -13360341 -6699061 -4596287 -15949357 -20083150 5015778 39539584
37666 39539584 40567350 2487346 -34110676 -37633833 -18140786 1984573 17862165
37659 17862165 29658908 29360950 17406292 9309302 9815352 3362613 -13565990 -16153650
37651 -16153650 10223930 37747030 30144537 -6405726 -33499813 -30650757 -9850353
37644 -9850353 10693802 21802453 18522564 4360521 -3405871 6287192 18342940 12950353
37636A2950353j3007136N798119K3461072R601507k1484623l3311124j8845376
37629c4837208j240238M260896K755857J966245L944858R135942J3432244Q855556
37621H274152j930206m716931K303057K093828j0493686j3985464M698937K3241140
37613I484827J6522159l931348j0937413m600198l944626j0106874r847335m659194
37605b2020002m492862k413621J1511142K0659235L018500k4547783k3601574
37598d1886965N190215K0695292N830396r195814p90162J1744011M648311j0382412
37590a4147128j0671487l2708M940331N059086Q796507R110715l747043j8129529
37582a8821256j4701063K876307J2729278N802761o286856j1020709o736530K672732
$$ plain form
37636 12950353 -56783 5741336 29202408 38803915 17319292 -15991832 -34837208
37629 -34837208 -36077446 -31816550 -29060693 -27094448 -23149590 -14013648 -581404 8274152
37621 8274152 6343946 1627015 3930072 6023900 -4469786 -18455250 -13756313 9484827
37613 9484827 26006986 22075638 11138225 6538027 2593401 -7513473 -17360808 -22020002
37605 -22020002 -26512864 -28926485 -17415343 3243892 6262392 -18285391 -41886965
37598 -41886965 -36696750 -16001458 -10171062 -19366876 -20157038 -8413027 -3764716 -14147128
37590 -14147128 -24818615 -24851323 -19910992 -14851906 -6055399 3055316 -691727 -18821256
37582 -18821256 -33522319 -30646012 -17916734 -12113973 -18400829 -29421538 -36158068 -33485336
37574c3485336J1425021J2717161O372299J491972K999554L062531m556323j1520012
37566a1493133q446892r00956K585551O974693J6729706J6995409n665673l0452185
37558a3673480k1776441J5547286L3204559N147017l2299852k9071816J0745318
37551c2177409L8530251K7665586m31471j5878401j6066730j2618359o939411
37544a7915944M470937J5111923J5951610R340181J481165j0361383k7208884
37537i130395l2849573j0639661K4881546L6143357J0170924k0997049k0635376
37530b3056227O132840K2944717J1214121j0344148j5433365l208677O078329
37523e672410J8029j1395352j0941478K105434J0164624P71889j5166896j6398017
$$ plain form
37574 -33485336 -22060315 -9343154 -2970855 -1478883 1520671 4583202 26879 -11493133
37566 -11493133 -19940025 -20840981 -18255430 -11280737 5448969 22444378 16778705 -13673480
37558 -13673480 -35449921 -19902635 13301924 18448941 -13850911 -42922727 -32177409
37551 -32177409 6352842 34018428 33586957 17708556 1641826 -10976533 -17915944
37544 -17915944 -13445007 1666916 17618526 26958707 28439872 18078489 -9130395
37537 -9130395 -41979968 -52619629 -27738083 8405274 18576198 -2420851 -23056227
37530 -23056227 -16923387 6021330 17235451 6891303 -8542062 -11750739 -5672410
37523 -5672410 -5654381 -17049733 -27991211 -25885777 -15721153 -14949264 -30116160 -46514177
37515d6514177Q61286J8597959K0517142R074891l066975p732821l628920N729978
37507f161637J2054504R208849K528066Q72106l45644j2031130k6236461k0978921
37499d1090268K283363J2257287n297115k0355747k694796K9049646L3941558
37492H093928R352717r882736n583913N387740O115212P11845l263224n641051
37484E290518l008740P600548J3036977j182800k0409449j6366894N254579R304869
$$ plain form
37515 -46514177 -45652891 -27054932 -6537790 2537101 -529874 -8262695 -11891615 -6161637
37507 -6161637 5892867 15101716 17629782 18501888 18156244 6125114 -20111347 -41090268
37499 -41090268 -38806905 -26549618 -31846733 -52202480 -54897276 -25847630 8093928
37492 8093928 17446645 7563909 1979996 7367736 13482948 14194793 10931569 5290518
37484 5290518 2281778 9882326 22919303 21736503 1327054 -15039840 -9785261 -480392
$$ [...]
##END NTUPLES=NMR SPECTRUM
##END=
