##TITLE=31Pdec_LR-0169-C1-B-IPS
 D2O, 64 sc
 22.2.2023
##JCAMPDX= 6.0         $$ Bruker NMR JCAMP-DX V2.0
##DATA TYPE= NMR SPECTRUM
##DATA CLASS= NTUPLES
##ORIGIN= UXNMR, Bruker Analytische Messtechnik GmbH
##OWNER= root
$$ XWIN-NMR		Version 3.5
$$ Wed Feb 22 15:44:47 2023 Russian Standard Time (UT+4h)  she@DPX200
##.OBSERVE FREQUENCY= 81.013821
##.OBSERVE NUCLEUS= ^31P
##.ACQUISITION MODE= SIMULTANEOUS
##.ACQUISITION SCHEME= undefined
##.AVERAGES= 54
##.DIGITISER RES= 16
##SPECTROMETER/DATA SYSTEM= spect
##.PULSE SEQUENCE= zgpg30
##.SOLVENT NAME= D2O
##.SHIFT REFERENCE= (INTERNAL, D2O, 0, 248.564)
##AUDIT TRAIL= $$ (NUMBER, WHEN, WHO, WHERE, WHAT)
$$ ##TITLE= Audit trail, XWIN-NMR		Version 3.5
$$ ##JCAMPDX= 5.01
$$ ##ORIGIN= Bruker BioSpin GmbH
$$ ##OWNER= she
$$ F:/spectra/data/she/nmr/P31/1/pdata/1/auditp.txt
$$ ##AUDIT TRAIL=  $$ (NUMBER, WHEN, WHO, WHERE, WHAT)
(   1,<2023-02-22 15:43:12.96 +0400>,<she>,<DPX200>,
      <continue with go, POWCHK disabled, PULCHK disabled
       configuration hash MD5:
       00 E9 B6 7A A2 85 ED C7 34 08 36 98 17 FE 4E 26
       data hash MD5: 32K
       12 17 D9 1F CC 2D 73 8E 1D 16 D9 33 3F E7 E1 8E>)
(   2,<2023-02-22 15:43:24.40 +0400>,<she>,<DPX200>,
      <Start of raw data processing
       efp BC_mod = 2 LB = 1 FT_mod = 6 PKNL = 1 PHC0 = -10993.4 PHC1 = 177.0102 SI = 64K 
       data hash MD5: 64K
       B5 87 6B DC 21 31 88 E0 FB 52 DB 8D 1B 14 86 37>)
(   3,<2023-02-22 15:43:55.03 +0400>,<she>,<DPX200>,
      <pk PHC0 = -33.4374 PHC1 = 5.4 
       data hash MD5: 64K
       77 16 81 79 A0 81 69 FC 41 1C CE F9 C6 88 0F D4>)
$$ ##END=
$$ 
$$ hash MD5
$$ 55 3D 94 9E 20 A3 92 FE 40 EB 17 76 18 38 E8 4C
##$RELAX= 
##$RELAX= 
##$RELAX= 
##$RELAX= 
##$RELAX= 
##$RELAX= 
##$RELAX= 
##$RELAX= 
##$RELAX= 
$$ Bruker specific parameters
$$ --------------------------
##$DU= <F:/spectra>
##$EXPNO= 1
##$NAME= <P31>
##$PROCNO= 1
##$TYPE= <nmr>
##$USER= <she>
##$AMP= (0..31)
100 100 100 100 100 100 100 100 100 100 100 100 100 100 100 100 100 100 
100 100 100 100 100 100 100 100 100 100 100 100 100 100 
##$AQSEQ= 0
##$AQ_mod= 1
##$AUNM= <au_zg>
##$AUTOPOS= <>
##$BF1= 81.014009
##$BF2= 200.13
##$BF3= 200.13
##$BF4= 200.13
##$BF5= 200.13
##$BF6= 200.13
##$BF7= 200.13
##$BF8= 200.13
##$BYTORDA= 1
##$CFDGTYP= 0
##$CFRGTYP= 5
##$CHEMSTR= <none>
##$CNST= (0..31)
1 1 145 1 1 1 1 1 1 1 1 1 1 1 1 1 1 1 1 1 1 1 1 1 1 1 1 1 1 1 1 1 
##$CPDPRG= <waltz16>
##$CPDPRG1= <>
##$CPDPRG2= <waltz16>
##$CPDPRG3= <>
##$CPDPRG4= <mlev>
##$CPDPRG5= <mlev>
##$CPDPRG6= <mlev>
##$CPDPRG7= <mlev>
##$CPDPRG8= <mlev>
##$CPDPRGB= <>
##$CPDPRGT= <>
##$D= (0..31)
0 1 0 0 0 0 0 0 0 0 0 0.03 2e-05 3e-06 0 0 0 0 0 0 0 0 0 0 0 0 0 0 0 0 
0 0 
##$DATE= 1677066110
##$DBL= (0..7)
120 120 120 11 120 120 24 19 
##$DBP= (0..7)
150 150 150 150 150 150 150 150 
##$DBP07= 0
##$DBPNAM0= <>
##$DBPNAM1= <>
##$DBPNAM2= <>
##$DBPNAM3= <>
##$DBPNAM4= <>
##$DBPNAM5= <>
##$DBPNAM6= <>
##$DBPNAM7= <>
##$DBPOAL= (0..7)
0.5 0.5 0.5 0.5 0.5 0.5 0.5 0.5 
##$DBPOFFS= (0..7)
$$ [...]
##$SUBNAM2= <"">
##$SUBNAM3= <"">
##$SUBNAM4= <"">
##$SUBNAM5= <"">
##$SUBNAM6= <"">
##$SUBNAM7= <"">
##$SUBNAM8= <"">
##$SUBNAM9= <"">
##$SW= 501.771253377433
##$SWIBOX= (0..15)
0 1 3 0 0 0 0 0 0 0 0 0 0 0 0 0 
##$SW_h= 40650.406504065
##$TD= 32768
##$TD0= 1
##$TE= 0
##$TE2= 300
##$TE3= 300
##$TEG= 300
##$TL= (0..7)
0 120 53 12 22 120 120 120 
##$TP= (0..7)
150 150 150 150 150 150 150 150 
##$TP07= 0
##$TPNAME0= <>
##$TPNAME1= <>
##$TPNAME2= <>
##$TPNAME3= <>
##$TPNAME4= <>
##$TPNAME5= <>
##$TPNAME6= <>
##$TPNAME7= <>
##$TPOAL= (0..7)
0.5 0.5 0.5 0.5 0.5 0.5 0.5 0.5 
##$TPOFFS= (0..7)
0 0 0 0 0 0 0 0 
##$TUNHIN= 0
##$TUNHOUT= 0
##$TUNXOUT= 0
##$USERA1= <user>
##$USERA2= <user>
##$USERA3= <user>
##$USERA4= <user>
##$USERA5= <user>
##$V9= 5
##$VALIST= <valist>
##$VCLIST= <CCCCCCCCCCCCCCC>
##$VD= 0
##$VDLIST= <DDDDDDDDDDDDDDD>
##$VPLIST= <PPPPPPPPPPPPPPP>
##$VTLIST= <TTTTTTTTTTTTTTT>
##$WBST= 1024
##$WBSW= 4
##$XGAIN= (0..3)
0 0 0 0 
##$XL= 0
##$YL= 0
##$YMAX_a= 6844
##$YMIN_a= -8577
##$ZGOPTNS= <>
##$ZL1= 120
##$ZL2= 120
##$ZL3= 120
##$ZL4= 120
##$ABSF1= 0
##$ABSF2= 0
##$ABSG= 0
##$ABSL= 0
##$ALPHA= 0
##$AQORDER= 0
##$ASSFAC= 0
##$ASSFACI= 0
##$ASSFACX= 0
##$ASSWID= 0
##$AUNMP= <proc_1d>
##$AZFE= 0.1
##$AZFW= 0.5
##$BCFW= 0
##$BC_mod= 2
##$BYTORDP= 0
##$COROFFS= 0
##$CY= -3
##$DATMOD= 1
##$DC= 0
##$DFILT= <>
##$DTYPP= 0
##$F1P= 0
##$F2P= 0
##$FCOR= 1
##$FTSIZE= 65536
##$FT_mod= 6
##$GAMMA= 0
##$GB= 0
##$INTBC= 1
##$INTSCL= 6.047779e-11
##$ISEN= 30
##$LB= 1
##$LEV0= 0
##$LPBIN= 0
##$MAXI= 10000
##$MC2= 0
##$MEAN= 0
##$ME_mod= 0
##$MI= 50
##$NCOEF= 0
##$NC_proc= -8
##$NLEV= 6
##$NOISF1= 182.463
##$NOISF2= 159.3651
##$NSP= 0
##$NTH_PI= 0
##$NZP= 0
##$OFFSET= 248.5645
##$PC= 4
##$PHC0= -11026.84
##$PHC1= 182.4102
##$PH_mod= 1
##$PKNL= yes
##$PPARMOD= 0
##$PSCAL= 0
##$PSIGN= 0
##$REVERSE= no
##$SF= 81.0140089999694
##$SI= 65536
##$SIGF1= 159.3651
##$SIGF2= -187.1042
##$SINO= 113.3802
##$SIOLD= 16384
##$SREGLST= <1H.CDCl3>
##$SSB= 0
##$STSI= 65536
##$STSR= 0
##$SW_p= 40650.406504065
##$SYMM= 0
##$S_DEV= 0
##$TDeff= 32768
##$TDoff= 0
##$TI= <>
##$TILT= no
##$TM1= 0
##$TM2= 0
##$TOPLEV= 0
##$USERP1= <user>
##$USERP2= <user>
##$USERP3= <user>
##$USERP4= <user>
##$USERP5= <user>
##$WDW= 1
##$XDIM= 65536
##$YMAX_p= 414424351
##$YMIN_p= -202961868
$$ End of Bruker specific parameters
$$ ---------------------------------
##NTUPLES= NMR SPECTRUM
##VAR_NAME=  FREQUENCY,     SPECTRUM/REAL,   SPECTRUM/IMAG
##SYMBOL=    X,             R,               I
##VAR_TYPE=  INDEPENDENT,   DEPENDENT,       DEPENDENT
##VAR_FORM=  AFFN,          ASDF,            ASDF
##VAR_DIM=   65536,         65536,           65536
##UNITS=     HZ,            ARBITRARY UNITS, ARBITRARY UNITS
##FACTOR=    0.620285442955139, 1,           1
##FIRST=     20137.2065510682, 0,            0
##LAST=      -20513.1999529968, 0,           0
##MIN=       -20513.1999529968, -202961868,  0
##MAX=       20137.2065510682, 414424351,    0
$$ Real data points
##PAGE= N=1
##DATA TABLE= (X++(R..R)), XYDATA
$$ [...]
42658B416740Q384351l563067j1803324o555236N294344J1436060Q109546R89359
$$ 2416740 10801091 7238024 -4565300 -11120536 -5826192 5609868 13719414 14708773
42650A4708773l039034k932999k884479m767133m212374J658142O406394K405023
$$ 14708773 11669739 8736740 5852261 1085128 -3127246 -1469104 4937290 7342313
42642G342313n639676o105371J177625M529224j54188l495141k21589J800671
$$ 7342313 1702637 -4402734 -3225109 1304115 1149927 -2345214 -2566803 -766132
42634g66132k821401o079488q51418N844048M886840R8914m42100R41260j839411
$$ -766132 -3587533 -9667021 -10518439 -4674391 212449 311363 -130737 810523 -1028888
42625a028888m983507j268790N344489N001280j708734n215025k383706J027549
$$ -1028888 -6012395 -7281185 -1936696 3064584 1355850 -3859175 -6242881 -5215332
42617e215332J535634R90142J21783j259175J47071N756361Q431421J764376p324507
$$ -5215332 -3679698 -2689556 -2567773 -3826948 -3679877 2076484 10507905 12272281 4947774
42608D947774p383149j006436o60009p114503p724865J750705R357119O281904
$$ 4947774 -2435375 -3441811 -4101820 -11216323 -18941188 -17190483 -7833364 -1551460
42600a551460j70932m77035K474301J727697r18874o15214o7549l728101p053392
$$ -1551460 -1722392 -2199427 274874 2002571 1083697 468483 400934 -3327167 -10380559
42591a0380559k476590P105007J1054995N993557r73145l885453m274717m498307
$$ -10380559 -12857149 -5752142 5302853 11296410 10323265 6437812 2163095 -2335212
42583b335212k658854K075854M866186J238934m976492n178590K335788Q749845
$$ -2335212 -4994066 -2918212 1947974 3186908 -1789584 -6968174 -4632386 4117459
42575D117459N502537m053828q376290k850263M336337L954316k052493n389431
$$ 4117459 9619996 5566168 -2810122 -5660385 -1324048 2630268 577775 -4811656
42567d811656m168296l150805l285303k01548N811502P352008J172563n508382
$$ -4811656 -8979952 -12130757 -15416060 -15617608 -9806106 -2454098 -1281535 -6789917
42559f789917m893184J107255N591741O286059M719224P45375n215304q125326
$$ -6789917 -11683101 -10575846 -4984105 1301954 6021178 6766553 1551249 -6574077
42551f574077m010867K494844L681878M28863M25645M870877N656776j514144
$$ -6574077 -10584944 -8090100 -4408222 -3979359 -3553714 1317163 6973939 5459795
42543E459795q991616p435564R49846N740382K442581k898679l339971J45764
$$ 5459795 -3531821 -10967385 -10017539 -4277157 -1834576 -4733255 -8073226 -7927462
42535g927462K018166P73091l3242J469072K294043P3035k100707l51192K807655
$$ -7927462 -5909296 -5136205 -5169447 -3700375 -1406332 -1333297 -3434004 -3785196 -977541
42526i77541J633871k890182k885029M511367J1357935R295765O94634n784453
$$ -977541 656330 -2233852 -5118881 -607514 10750421 20046186 20740820 14956367
42518A4956367o651306m694061k099054N57526O03018l985687q846552p383908
$$ 14956367 8305061 3611000 1511946 2069472 2672490 -1313197 -10159749 -17543657
42510a7543657o62420L747761L025682J820794K848894K803519L7227j466212
$$ -17543657 -18206077 -14458316 -11432634 -9611840 -6762946 -3959427 -3922200 -5388412
42502e388412N52789K255988P93761p25157K75216Q33626j138086j912375Q89152
$$ -5388412 -4835623 -2579635 -1785874 -2511031 -2235815 -1402189 -2540275 -4452650 -3563498
42493c563498K635447j01253k004159K157430O810667L459559m773845p194027
$$ -3563498 -928051 -1029304 -3033463 -876033 5934634 9394193 4620348 -2573679
42485b573679j983010K285446J197721j61662K122688M538059L283382m08573
$$ -2573679 -4556689 -2271243 -1073522 -1235184 887504 5425563 8708945 8300372
42477H300372m520985q337131q517552j479245P857398Q746117k9183o322747
$$ 8300372 3779387 -4557744 -13075296 -14554541 -6697143 2048974 2019791 -4302956
42469d302956j410041P782970R847028M630967l56088l029592o512084r488602
$$ -4302956 -5712997 2069973 11917001 16547968 16191880 13162288 6650204 -2838398
42461b838398o850063N32659N135630L178393o68217q46906J606544J660473k267677
$$ -2838398 -9688461 -9155802 -4020172 -841779 -1509996 -2356902 -750358 910115 -1357562
42452a357562n856921l928396K511175N927243J478949m880204k885088P078078
$$ -1357562 -7214483 -11142879 -8631704 -2704461 -1225512 -6105716 -8990804 -1912726
42444a912726J2553112N641058o108076j0863127q129652n656998n643701l411032
$$ -1912726 10640386 16281444 10173368 -689759 -8819411 -14476409 -20120110 -23531142
42436b3531142K068550N586635M457910K424191K921827M173503L134832N7625
$$ -23531142 -21462592 -15875957 -11418047 -8993856 -6072029 -1898526 1236306 1293931
42428A293931k796122l943476l019484p39960J009268J019768L92712N82646J020656
$$ 1293931 -1502191 -5445667 -8465151 -9205111 -8195843 -7176075 -6783363 -6200717 -5180061
42419e180061O57578Q2058q2698n97682j166698K86581L197648L250765o74842
$$ -5180061 -4522483 -4440425 -4523123 -5120805 -6287503 -6000922 -2803274 447491 -227351
42410b27351l106480l82252K544094J11394l838346k199167K981905L628982r06494
$$ -227351 -3333831 -3716083 -1171989 -1060595 -4898941 -7098108 -4116203 -487221 -1393715
42401a393715l274069m34358K938766L770860M152094M435783J591647l619455
$$ -1393715 -4667784 -5102142 -2163376 1607484 5759578 10195361 11787008 8167553
42393H167553n867302l686397j304601o32997P89931K620801J154561k117959
$$ 8167553 2300251 -1386146 -2690747 -3323744 -2533813 86988 1241549 -876410
42385h76410m97251O449575J0256004N862340j902821p360803j0459504j0814802
$$ -876410 -1373661 5075914 15331918 21194258 19291437 11930634 1471130 -9343672
42377i343672n478444K595552M397132q95592k386972M661873R173938K306925
$$ -9343672 -14822116 -12226564 -7829432 -8725024 -11111996 -6450123 2723815 5030740
42369E030740o296040l397241O025284P208127n65951n023547k378697r80371
$$ 5030740 -1265300 -4662541 1362743 8570870 8004919 2981372 602675 -377696
42361c77696l861241l856655J464793M753895K828925K262034N914841O638916
$$ -377696 -4238937 -8095592 -6630799 -1876904 952021 3214055 9128896 15767812
42353A5767812R58529l071103n2130J877073m998232j2515005q199467L926015
$$ 15767812 16726341 13655238 13603108 15480181 10481949 -2033056 -10232523 -6306508
42345f306508Q484335K129638k844349O02950L967107r00767p694002o326463
$$ -6306508 2177827 4307465 1463116 2066066 6033173 5132406 -2561596 -8888059
42337h888059O98330L215554Q851p00601L777010N999231J043703n363467n860482
$$ -8888059 -8189729 -4974175 -4965324 -5665925 -1888915 4110316 5154019 -209448 -6069930
42328f069930j644792J605010K455043K596582J614067p75943j041166K761092
$$ -6069930 -7714722 -6109712 -3654669 -1058087 555980 -219963 -1261129 1499963
42320A499963N238597J145487m246376j819525N710483O156522k612597p684615
$$ 1499963 6738560 7884047 3637671 1818146 7528629 13685151 11072554 3387939
42312C387939q63788P835150N212009n256017r669918m600281L34995p63713k460357
$$ 3387939 2524151 10359301 15571310 10315293 645375 -3954906 -3619911 -4383624 -6843981
42303f843981P18658N060150M522690K94524k044609j127025j97660n71509K97768
$$ -6843981 -6125323 -1065173 3457517 3752041 1707432 580407 382747 -188762 109006
42294A09006L575831N642890K462123m179986p836261n196284L0132K580107K229029
$$ 109006 3684837 9327727 11789850 7609864 -226397 -5422681 -5392549 -2812442 -583413
42285e83413J940385J904000J61735j945256p12404K954040L360638j128718m597361
$$ -583413 1356972 3260972 3422707 1477451 765047 3719087 7079725 5951007 1353646
42276A353646k194605K572397L356218m3856k886432k918490j787958p34097M40672
$$ 1353646 -840959 1731438 5087656 5043800 2157368 -761122 -2549080 -3283177 -2842505
42267b842505O88664j760110n628356o560878k371977L315693M609751P79935
$$ -2842505 -2153841 -3913951 -9542307 -16103185 -18475162 -15159469 -10549718 -9769783
42259i769783j717201K706108R512425Q175548k418381r627379m124812N280836
$$ -9769783 -11486984 -8780876 731549 8907097 6488716 -3138663 -7263475 -1982639
42251a982639L933417o000404q382004K049466J2116277J0743883L249088j067447
$$ -1982639 1950778 -4049626 -12431630 -10382164 1734113 12477996 15727084 14659637
42243A4659637k993490o495205q317332m452830R49120K436501K097022L204524
$$ 14659637 11666147 5170942 -3146390 -7599220 -6650100 -4213599 -2116577 1087947
42235A087947K499482k399215n588580k497456P70211j837185m084075J954413
$$ 1087947 3587429 1188214 -4400366 -6897822 -6127611 -7964796 -12048871 -10094458
42227a0094458J0155801Q893270j22321n674665n330067n224153n122589M09774
$$ -10094458 61343 8954613 8832292 3157627 -2172440 -7396593 -12519182 -12109408
42219a2109408P521127O088760k166696m365829K523868O595421P87511o479582
$$ -12109408 -4588281 1500479 -666217 -5032046 -2508178 4087243 4874754 -1604828
42211a604828n964334n73228K460490K102777N89406j272506j507620K057194
$$ -1604828 -7569162 -8142390 -5681900 -3579123 -2989717 -4262223 -5769843 -3712649
42203c712649N327531J506449o590884q126533q82376M914410L016781m26801
$$ -3712649 1614882 3121331 -3469553 -11596086 -12478462 -7564052 -4547271 -4974072
42195d974072K70317J107006j543582l077096m84029M57905l798366n980913L46259
$$ -4974072 -4703755 -3596749 -5140331 -8217427 -8701456 -8243551 -12041917 -18022830 -17676571
42186a7676571Q782524R262593K538660l411502n455005n225798k481371K802395
$$ -17676571 -8894047 368546 2907206 -504296 -5959301 -11185099 -13666470 -10864075
42178a0864075N874742K529411m060770p473333n355349J246050J0015211J4838387
$$ -10864075 -4989333 -2459922 -6520692 -13994025 -19349374 -18103324 -8088113 6750274
42170F750274Q969442l740364r263767j993052N917397K364207o521953p106905
$$ 6750274 15719716 11979352 2715585 722533 6639930 9004137 2482184 -4624721
42162d624721L05124L939515L3379l528497j612297K092902L770005M217883L891837
$$ -4624721 -4319597 -380082 -346703 -3875200 -5487497 -3394595 375410 4593293 8485130
42153H485130J550479j120872n95831K091758K224992j000515l409669k565765
$$ 8485130 10035609 8914737 8318906 10410664 12635656 11635141 8225472 5659707
42145E659707n87986k03319j948146m711998o011586l512871J074299K838725
$$ 5659707 5071721 4868402 2920256 -1791742 -7803328 -11316199 -10241900 -7403175
42137g403175J097135J046968M358226M663970j636035o807447k479334O212479
$$ -7403175 -6306040 -5259072 -900846 3763124 2127089 -4680358 -7159692 -947213
42129i47213O956004k012111r898058q152895N87503Q094170Q889570L534958
$$ -947213 6008791 3996680 -5901378 -14054273 -13466770 -5372600 3516970 7051928
42121G051928j862289j116626L905951M798287o37458m376608j965442q72420
$$ 7051928 5189639 4073013 7978964 12777251 12139793 7763185 5797743 4925323
42113D925323o608743j0505369l591097O012455M796155l430433l780741M474943
$$ 4925323 -1683420 -12188789 -15779886 -9767431 -4971276 -8401709 -12182450 -7707507
42105g707507P535767J346214k898525k66036k40189p039880r185371J362633
$$ -7707507 -171740 1174474 -1724051 -1990087 -2230276 -9270156 -18455527 -17092894
42097a7092894J3626536J2924612J864451n444136l403328J330705K000503j190445
$$ -17092894 -3466358 9458254 11322705 5878569 2475241 3805946 5806449 4616004
42089D616004m364315m405539j143148K145996K302240O60590J32443q14097m862343
$$ 4616004 251689 -4153850 -5296998 -3151002 -848762 -188172 -55729 -869826 -5732169
42080e732169p962716l760431M304021N994720O54261j254738M084204P343149
$$ -5732169 -13694885 -17455316 -13151295 -7156575 -6502314 -7757052 -3672848 3670301
42072C670301K552005k854803k144244j097237n707298r007526k407201Q031298
$$ 3670301 6222306 3367503 1223259 126022 -5581276 -14588802 -16996003 -8964705
42064h964705R575567J696983n006893m814322q43029L524898O584318M683639
$$ -8964705 610862 2307845 -2699048 -7513370 -8356399 -4831501 1752817 6436456
42056F436456k897207q051846l257484N516337O235088q56375m408184q88291
$$ 6436456 3539249 -4512597 -7770081 -2253744 3981344 3124969 -1283215 -2171506
42048b171506R24256l447296o166573j074278N434038M971396N2972j874940r23434
$$ -2171506 -1247250 -4694546 -10861119 -11935397 -6501359 -1529963 -1476991 -3351931 -4275365
42039d275365k291481n275612m025859J767931N240786K627461j451914j500788
$$ -4275365 -6566846 -11842458 -15868317 -14100386 -8859600 -6232139 -7684053 -9184841
42031i184841J199830J920440k07087k313364k955371k726050q46518L940010
$$ -9184841 -7985011 -6064571 -6271658 -8585022 -11540393 -14266443 -15112961 -11172951
42023a1172951Q832695Q445262K497509k795050l509987l008607m423332m060566
$$ -11172951 -2340256 6105006 8602515 5807465 2297478 -711129 -5134461 -9195027
42015i195027J355077O034790K633105m723793n244883J648896N387703J356866
$$ -9195027 -7839950 -1805160 827945 -3895848 -9140731 -7491835 -2104132 -747266
42007g47266k758930j329779K68048k616442m114931J307117P255239N324924
$$ -747266 -3506196 -4835975 -4567927 -7184369 -11299300 -9992183 -2736944 2587980
41999B587980l85161n12291K867456p8488q790003j1553770m098749L813362M396908
$$ 2587980 2202819 1690528 4557984 4479496 -4310507 -15864277 -19963026 -16149664 -11752756
41990a1752756L074971O954427J1225328O655382m204726q619266j392924P444678
$$ -11752756 -8677785 -1723358 9501970 16157352 11952626 3333360 1940436 9385114
41982I385114N950495m232057j0785640o872849J251428L683732r17876n897510
$$ 9385114 15335609 11103552 317912 -6554937 -5303509 -1619777 -2537653 -8435163
41974h435163o170743k626904J560033M160369L686460N21052j621939K69112
$$ -8435163 -14605906 -17232810 -15672777 -11512408 -7825948 -7304896 -8926835 -8657723
41966h657723L239206K182889j556633j977047R95076Q79545l470348m422059
$$ -8657723 -5418517 -3235628 -4792261 -6769308 -5774232 -4894687 -8365035 -12787094
41958a2787094J756501P503771N377690p81052l139601j491371N0460J591169
$$ -12787094 -11030593 -3526822 1850868 1069816 -2069785 -3561156 -3510696 -1919527
41950a919527M276757M388675l58878l994747j357503J455080l269427r814024
$$ -1919527 2357230 6745905 6387027 2392280 1034777 2489857 -779570 -10593594
41942a0593594o820797L116502O394447L01390l372356J215755N116560J367847
$$ -10593594 -17414391 -14297889 -7903442 -7602052 -10974408 -9758653 -4642093 -3274246
41934c274246l312377j347065K851412K067671r26127L60204L936044L184006
$$ -3274246 -6586623 -7933688 -5082276 -3014605 -3940732 -3580528 355516 3539522
41926C539522j753802n172143m859094k401198J963574P253846Q018950J023834
$$ 3539522 1785720 -3386423 -8245517 -10646715 -8683141 -1429295 6589655 7613489
41918G613489o829221o048024J174389L388434k892637p804384l157425N463772
$$ 7613489 784268 -5263756 -4089367 -700933 -3593570 -11397954 -14555379 -9091607
41910i091607P436866K091896k365383j964635j005906k748025l717342p67349
$$ -9091607 -1654741 437155 -1928228 -3892863 -4898769 -7646794 -11364136 -12131485
41902a2131485K242673O35369k293581k33265M414469L129748l542841m127937
$$ -12131485 -9888812 -9253443 -11547024 -11780289 -7365820 -4236072 -7778913 -11906850
41894a1906850N561441J2828485N891431p132693r569848j198525L037638k109023
$$ -11906850 -6345409 6483076 12374507 5241814 -4328034 -5526559 -2488921 -4597944
41886d597944n099231J011309O036401L26059p819217m810254O287386J0126531
$$ -4597944 -9697175 -8685866 -2649465 -2323406 -10142623 -14952877 -8665491 1461040
41878A461040K006073o446383n096328J879653M459273O14422l178146j681897
$$ 1461040 3467113 -2979270 -8075598 -6195945 -1736672 -1122250 -4300396 -5982293
41870e982293K990991M576619K47659n771565p006025k710278J517939J606440
$$ -5982293 -2991302 1585317 1832976 -3938589 -10944614 -13654892 -12136953 -10530513
41862a0530513j74655r0629J379645J916280J780907J873627N62502k900975m595219
$$ -10530513 -10705168 -10795797 -9416152 -7499872 -5718965 -3845338 -3282836 -6183811 -10779030
41853a0779030j052979L797008L026705k645230n094353m51385N754852P306987
$$ -10779030 -11832009 -8035001 -5008296 -7653526 -12747879 -13199264 -7444412 -137425
41845a37425N379512M205290L489894N35830k935395k455333J074792J242299
$$ -137425 5242087 9447377 12937271 13473101 10537706 8082373 9157165 10399464
41837A0399464m000722q026091n063469P97929K245784P55569L255400P943772
$$ 10399464 6398742 -1627349 -6690818 -5892889 -3647105 -2891536 363864 8307636
41829H307636M626367p490976j3933570m999581Q005053Q234643j987538o277123
$$ 8307636 12934003 5443027 -8490543 -13490124 -5485071 2749572 762034 -5515089
41821e515089k29103M139458N36390k081770K596627O335706J256742o002236
$$ -5515089 -5744192 -1604734 -1068344 -3150114 -553487 5782219 7038961 1036725
41813A036725n750444r46738j20300k497764j813636J199574J652258R11032K915550
$$ 1036725 -4713719 -5660457 -5780757 -8278521 -10092157 -8892583 -7240325 -6329293 -3413743
41804c413743M342732r1375n994702m710344K195273N561964L619019K184273
$$ -3413743 928989 837614 -5157088 -9867432 -7672159 -2110195 1508824 3693097
41796C693097J590319l189632r452502p891573J081769N740147J368738k882482
$$ 3693097 5283416 2093784 -7358718 -15250291 -14168522 -8428375 -7059637 -9942119
41788i942119k33269L599719K970959K552718O506338Q420869K222588n690022
$$ -9942119 -10175388 -6575669 -3604710 -1051992 5454346 13875215 16097803 10407781
41780A0407781n877579m92434J969829O50886M40025J050979q75593k281020K267353
$$ 10407781 4530202 4037768 6007597 6658483 7098508 8149487 7273894 4992874 7260227
41771G260227Q826998P576982j916226r159492p673474k333798J67507p8686P75
$$ 7260227 16087225 23664207 21747981 12588489 4915015 2581217 2748724 2670038 2670813
41762B670813Q38004J502405J686715N90904j900344k833241j93449J625403k502478
$$ 2670813 3508817 5011222 6697937 7288841 5388497 2555256 2361807 3987210 1484732
41753A484732p994187n172030M636151Q548963J461181n477035k533578L405384
$$ 1484732 -6509455 -11681485 -7045334 1503629 2964810 -2512225 -5045803 -1640419
41745a640419J470047m577423l573393L346880N344279J440393J408183O275755
$$ -1640419 -170372 -4747795 -8321188 -4974308 369971 1810364 3218547 9494302
41737I494302M588015o673030j3182102m728981P635004Q346947P86340r49304
$$ 9494302 14082317 7409287 -5772815 -10501796 -2866792 5480155 6266495 5317191
41729E317191L589227K413057o015423r163203k029664M179229R49707m303055
$$ 5317191 8906418 11319475 5304052 -3859151 -5888815 -1709586 -759879 -5062934
41721e062934k307380K913425L189097N07866O87352R11282l615333o871285k75150
$$ -5062934 -7370314 -4456889 -1267792 -759926 -72574 838708 -2776625 -9647910 -9923060
41712i923060R902988Q882910l179379r691445k674981N558682K381261o431572
$$ -9923060 -20072 8862838 5683459 -4007986 -6682967 -1124285 1256976 -5174596
41704e174596p578462k50965N714161N619957L059015O86080k214614m335045
$$ -5174596 -12753058 -13004023 -7289862 -1669905 1389110 2075190 -139424 -4474469
41696d474469l076023k37484K54864m01360J760332M553519J642059n544251p089065
$$ -4474469 -7550492 -7787976 -7533112 -7934472 -6174140 -1620621 21438 -5522813 -12611878
41687a2611878N86430P636283M646801l213675m165627K341957N597658O17233
$$ -12611878 -12025448 -4389165 257636 -2956039 -7121666 -4779709 817949 1435182
41679A435182m918629l593063P83953J206810k89206K844668Q401577O958225
$$ 1435182 -3483447 -7076510 -6292557 -5085747 -5374953 -2530285 5871292 12829517
41671A2829517k672564r352759n198579K774092L258178k845515m995676O33789
$$ 12829517 10156953 804194 -4394385 -1620293 1637885 -1207630 -6203306 -5569517
41663e569517O230306M274219k993091q268665p888822l266700K196925N074267
$$ -5569517 660789 4935008 1941917 -6326748 -14215570 -17482270 -15285345 -10211078
41655a0211078L767010L88714j322540n71284N83428J525815L355797M906886
$$ -10211078 -6444068 -6055354 -7377894 -7949178 -7365750 -5839935 -2484138 2422748
41647B422748L357881m23025k281418j667953k418071m882466l882322K089843
$$ 2422748 5780629 5357604 3076186 1408233 -1009838 -5892304 -9774626 -7684783
41639g684783O244699L222376k221814k523331J248258K315003o41065k674770
$$ -7684783 -1440084 1782292 -439522 -2962853 -1714595 600408 -40657 -2715427
41631b715427j285624J089350K625483L763885L543018L02249l793331m527707
$$ -2715427 -4001051 -2911701 -286218 3477667 7020685 7322934 3529603 -998104
41623i98104k101619m08746o7657J605098L577051J449931l684132m678871O4341
$$ -998104 -3099723 -3508469 -3576126 -1971028 1606023 3055954 -628178 -5307049 -5242708
41614e242708K360110k956016q221441l819091O373513R992984M205611j442523
$$ -5242708 -2882598 -5838614 -14060055 -17879146 -11505633 -1512649 2692962 1250439
41606A250439m72635K360287J459734m09269P77615J586308k429842o845967m353677
$$ 1250439 777804 3138091 4597825 4188556 4966171 6552479 4122637 -2723330 -7077007
41597g077007K257370L374764j710593l245832K681441P305493L727335k045227
$$ -7077007 -4819637 -1444873 -3155466 -6401298 -3719857 3585636 7312971 5267744
41589E267744k448491j567751o222985j0850942m767503Q576688J3679119M931968
$$ 5267744 2819253 1251502 -4971483 -15822425 -20589928 -12013240 1665879 6597847
41581F597847o356352r468383o798429m575247k341123J872098N029142M757069
$$ 6597847 241495 -9226888 -16025317 -20600564 -22941687 -21069589 -16040447 -11283378
41573a1283378M203577N096366L364949k024249l814903K244848Q250515N250144
$$ -11283378 -7079801 -1983435 1381514 -642735 -4457638 -2212790 6037725 11287869
41565A1287869k747648n535366k290712j17524r18695m55996J665959J426214
$$ 11287869 8540221 3004855 714143 596619 -322076 -778072 887887 2314101
41557B314101r07661p18766K338393L612464J248040k190456m961798o480397
$$ 2314101 1406440 687674 3026067 6638531 7886571 5696115 734317 -5746080
41549e746080m477048J041220L815117m46759m978573q06472Q008034R275543
$$ -5746080 -10223128 -9181908 -5366791 -5813550 -10792123 -11598595 -3590561 5684982
41541E684982J504462m402838k743409J7397j888440n235845n801882m506887
$$ 5684982 7189444 2786606 43197 60594 -1827846 -7063691 -12865573 -17372460
41533a7372460k246110J982659N108532J907869m554680m706779K569928P605788
$$ -17372460 -19618570 -17635911 -12527379 -10619510 -15174190 -19880969 -17311041 -9705253
41525i705253N492114K147069J298397j467724o464272n538177K723349O893867
$$ -9705253 -4213139 -2066070 -767673 -2235397 -8699669 -14237846 -11514497 -4620630
41517d620630P29024n721119l198709J483414p50563m582334j576823L041033
$$ -4620630 -3891606 -9612725 -12811434 -11328020 -12078583 -16660917 -18237740 -15196707
41509a5196707P70506k631052K529057R868476O309019l940092m924902M107886
$$ -15196707 -14426201 -17057253 -14528196 -4659720 1649299 -2290793 -7215695 -3107809
41501c107809P869604J438808l016517O62622K626688l188741p254851j928998
$$ -3107809 4761795 6200603 3184086 3846708 6473396 3284655 -3970196 -5899194
41493e899194M367468J518497n764851p237981l458831j478636j520998R56809
$$ -5899194 -1531726 -13229 -5778080 -13016061 -16474892 -17953528 -19474526 -18517717
41485a8517717N030617O239655N210817N600078O246276L294844j973945m517170
$$ -18517717 -13487100 -7247445 -2036628 3563450 9809726 13104570 11130625 6613455
41477F613455l212805j220505k56540J35395o43206k965420m066109j468336K074222
$$ 6613455 3400650 2180145 1923605 2059000 1415794 -1549626 -5615735 -7084071 -5009849
41468e009849J978356j034843k172823j64173J401984L53489j160277r53779o4725
$$ -5009849 -3031493 -4066336 -6239159 -6403332 -5001348 -4647859 -5808136 -6761915 -6826640
41459f826640k12220r22537r61695p17709j346440k385346j733496J736204O117937
$$ -6826640 -7038860 -7961397 -8923092 -9640801 -10987241 -13372587 -15106083 -13369879 -7251942
41450g251942P689572M632448p04375l885243k752691O75358K504179Q45233k361101
$$ -7251942 437630 5070078 4365703 480460 -2272231 -1596873 907306 1752539 -608562
41441f08562l493004j706298j76609j051709r49630L963063R179054N459322o446548
$$ -608562 -4101566 -5807864 -5984473 -7036182 -7985812 -4022749 5156305 10615627 4169079
41432D169079j3002655n685105N954694P634682N04619l148105q8583J400909
$$ 4169079 -8833576 -14518681 -8563987 -929305 -424686 -3572791 -3661374 -2260465
41424b260465j699135k185741K804827N602115J722784j964821L37252L292344
$$ -2260465 -3959600 -6145341 -3340514 2261601 3984385 2019564 2356816 5649160
41416E649160R80039j875427J036692M966730J473339o729106r292923l651342
$$ 5649160 6629199 4753772 5790464 10757194 12230533 5501427 -3791496 -7442838
41408g442838L144797O065003O028937L440628k478057p556399n087665L625548
$$ -7442838 -4298041 1766962 7795899 11236527 8758470 1202071 -3885594 -260046
41400b60046Q850403N185258j744149m232477k352340j168268k515589l846033
$$ -260046 8590357 13775615 12031466 7798989 5446649 4278381 1762792 -2083241
41392b083241l065950j059339L8905o85528j985617j664671O72110K557002J590646
$$ -2083241 -5149191 -6208530 -6169625 -6855153 -8840770 -10505441 -9833331 -7276329 -5685683
41383e685683j128999k086035L48603L877274M442237K33929n497674o089887
$$ -5685683 -6814682 -8900717 -8552114 -4674840 -232603 1326 -5496348 -11586235
41375a1586235J410804J0606230J1172777J536554q042136p897454o13915L587256
$$ -11586235 -10175431 430799 11603576 13140130 5097994 -2799460 -3413375 173881
41367A73881P4528n981444o989589r56657O893419Q575726J365897p605759q422544
$$ 173881 248409 -5733035 -12722624 -13679281 -6785862 1789864 3155761 -4449998 -12872542
41358a2872542j046818M726976L861508K654756O187238Q292219K461164n031714
$$ -12872542 -13919360 -9192384 -5330876 -2676120 3511118 11803337 14264501 9232787
41350I232787m089970K534970M024329l80467j498077K575446L356285k267069
$$ 9232787 5142817 7677787 11702116 11321649 9823572 12399018 15755303 13488234
41342A3488234o492907m482288j599115k102419k180878Q9997p05748n651120
$$ 13488234 6995327 2513039 913924 -1188495 -3369373 -3279376 -3985124 -9636244
41334i636244n503680M282134J2391128O937909n599307r323811j800935N095221
$$ -9636244 -15139924 -10857790 1533338 8471247 2871940 -6451871 -8252806 -3157585
41326c157585M734862K819226M233898N055161J365889l462491n101162m818058
$$ -3157585 1577277 4396503 8630401 13685562 15051451 11588960 6487798 1669740
41318A669740m908354l242740K299500P743509O838870l68507o905511o863375
$$ 1669740 -3238614 -6481354 -4181854 3561655 10400525 10032018 3126507 -3736868
41310c736868j565994K685861J759702k197095l899627j511705J563861J857341
$$ -3736868 -5302862 -2617001 -857299 -3054394 -6954021 -8465726 -6901865 -5044524
41302e044524K47197o56686r55502j993920k339865M05410M368676M663172O61629
$$ -5044524 -4797327 -5454013 -6409515 -8403435 -10743300 -10337890 -5969214 -1306042 -644413
41293f44413k369798p86314K143894J468414j787935k249124J519663M509105
$$ -644413 -3014211 -3800525 -1656631 -188217 -1976152 -4225276 -2705613 1803492
41285A803492K134221l450948o254289m066307l33793J209059N79345o69997k226641
$$ 1803492 3937713 486765 -5767524 -9833831 -10167624 -8958565 -8379220 -9049217 -11275858
41276a1275858l086975j94316O548636J0280784M492117o075721r158730j503644
$$ -11275858 -14362833 -14557149 -8008513 2272271 6764388 688667 -8470063 -9973707
41268i973707N943987L674119l105406m158901r25823k747651r063879q131156
$$ -9973707 -4029720 -355601 -3461007 -7619908 -8545731 -11293382 -20357261 -28488417
41260b8488417L866820J4065860J0340878r17625m100900L143795P751542J444185
$$ -28488417 -24621597 -10555737 -214859 -1132484 -5233384 -2089589 5661953 7106138
41252G106138p491502p135884J066090N625005J592450m246547m655448j136358
$$ 7106138 -385364 -7521248 -6455158 -830153 762297 -3484250 -8139698 -9276056
41244i276056Q07074j6068j165215j784765k262013j046106L064461O739678N399163
$$ -9276056 -8468982 -8485050 -9650265 -11435030 -13697043 -14743149 -11678688 -4939010 460153
41235D60153K39118l002826k111279j4653J478281L337972M140084N03634n241037
$$ 460153 699271 -2303555 -4414834 -4429487 -2951206 386766 4526850 5030484 -210553
41226b10553n497855R38688N437973K625667j116576J009170M357330J570368
$$ -210553 -5708408 -4769720 668253 3293920 2177344 3186514 7543844 9114212
41218I114212l569462k433229K901345L020367k224007l622998J107544M162194
$$ 9114212 5544750 3111521 6012866 9033233 6809226 3186228 4293772 8455966
41210H455966K281892J302822K882861J37502q083186j1643187n394740J186960
$$ 8455966 10737858 12040680 14923541 15061043 6977857 -4665330 -10060070 -8873110
41202h873110q7595k247111L082610Q589610K918795p959681q064838L005451
$$ -8873110 -8960705 -11207816 -8125206 464404 3383199 -4576482 -12641320 -9635869
41194i635869R056403K786588m109592j103638N277504M026524k565561m049065
$$ -9635869 -579466 2207122 -1902470 -3006108 2271396 6297920 3732359 -316706
41186c16706J251057M566810L67536o148293o686949o32668M404243K190342l951821
$$ -316706 934351 5501161 5868697 -279596 -6966545 -7599213 -3194970 -1004628 -4956449
41177d956449n187158N10173M953958J950429k694051k85571O126813O226900
$$ -4956449 -10143607 -9633434 -4679476 -2729047 -5423098 -5708669 418144 6645044
41169F645044l80966l276517J138319L395529k824825r486574o938021J114544
$$ 6645044 6264078 2987561 4125880 7521409 4696584 -4789990 -11728011 -10613467
41161a0613467M661344K776320J921542L312217K367157j148477k141830N23165
$$ -10613467 -5952123 -3175803 -1254261 2057956 4425113 3276636 1134806 1657971
41153A657971K017066M3542j575350K10828K750754K160050j068949l209059j978318
$$ 1657971 3675037 3718579 2143229 2354057 5104811 7264861 6195912 2986853 1008535
41144A008535J087835J970525j626014o566664o887126j585872L445616L753019
$$ 1008535 2096370 4066895 2440881 -4125783 -11012909 -12598781 -9153165 -5400146
41136e400146K374318L517676M728442J536236l579513m432271j487998j013164
$$ -5400146 -3025828 491848 5220290 6756526 3177013 -1255258 -2743256 -3756420
41128c756420m217868n178805p70215M473634N537128L034020N6222j853130j779794
$$ -3756420 -7974288 -13153093 -13923308 -9449674 -3912546 -878526 -822304 -2675434 -4455228
41119d455228N69177K516075J003131j563795J83654N212451O113157P12298l650574
$$ -4455228 -3886051 -1369976 -366845 -1930640 -1746986 3465465 9578622 10290920 6640346
41110F640346j292261L171406K528256k323703n248884m211441j934735l82672
$$ 6640346 5348085 8519491 11047747 8724044 3475160 -736281 -2671016 -3053688
41102c053688J48868r47276k827441k132483J988662M897496L088760K31457J051142
$$ -3053688 -2904820 -3852096 -6679537 -8812020 -6823358 -1925862 1162898 1394355 2445497
41093B445497K740143l85271n982424n827004J080409N759569J991352n008801
$$ 2445497 5185640 4800369 -1182055 -7009059 -5928650 -169081 1822271 -3186530
41085c186530o504006j703139L345712M918774M408917L228587K43963m246075
$$ -3186530 -9690536 -11393675 -8047963 -3129189 1279728 4508315 4752278 506203
41077E06203n874639j218960N696970O192602k017358r921529p266011L986078
$$ 506203 -5368436 -6587396 -890426 5302176 3284818 -6636711 -13902722 -9916644
41069i916644J1129556O260520m361179q881956m119197K390793K905863j627184
$$ -9916644 1212912 7473432 3112253 -5769703 -9888900 -7498107 -4592244 -6219428
41061f219428l905667M8559N275873L737064m351127r089559l704745N611453
$$ -6219428 -10125095 -10076536 -4800663 -1063599 -5414726 -14504285 -18209030 -12597577
41053a2597577Q336511M270628J409095J831476L31944l303372k915611R75770
$$ -12597577 -4261066 9562 1418657 3250133 3582077 278705 -2636906 -1661136
41045a661136j59846o542363o307576M328753J1204328L643485p321711o453614
$$ -1661136 -1820982 -8363345 -14670921 -10342168 862160 4505645 -2816066 -9269680
41037i269680J482581K308726k130848M55933P594745M989600o474355r535265
$$ -9269680 -7787099 -5478373 -7609221 -7153288 441457 5431057 -1043298 -10578563
41029a0578563M99148P487649J704128n182513k042153L475613J103348l596751
$$ -10578563 -10079415 -2591766 -887638 -6070151 -8112304 -4636691 -3533343 -7130094
41021g130094j230153L876840K918775j020066m75562J415889j834652n557173
$$ -7130094 -8360247 -4483407 -1564632 -2584698 -3060260 -1644371 -3479023 -9036196
41013i036196j857260M261862K394734m403387m312201K715144N369330Q21221
$$ -9036196 -10893456 -6631594 -4236860 -8640247 -12952448 -10237304 -4867974 -4046753
41005d046753j987851L25320P15223l084436l452009K364563O039237K779535
$$ -4046753 -6034604 -5709284 -4994061 -8078497 -11530506 -9165943 -3126706 -347171
40997c47171j86571K983339N884108J177156o146983o502235m86515L423453J938623
$$ -347171 -533742 2449597 8333705 9510861 3363878 -3138357 -3624872 -201419 1737204
40988A737204p32479j290066p13217j26162R54079K234452K270444M70377k376104
$$ 1737204 1004725 -285341 -998558 -1124720 -170641 2063811 4334255 4804632 2428528
40979B428528m633129m286741j183505J174598k02217k043223J189596P135251
$$ 2428528 -2204601 -6491342 -7674847 -6500249 -6702466 -8745689 -7556093 -420842
40971d20842O883301j092863o769171l223691K743316J895122k718971j865266
$$ -420842 6462459 5369596 -1399575 -4623266 -1879950 15172 -2703799 -4569065
40963d569065M068282O302196K470156q63923o92880j875205o338496p661943
$$ -4569065 -500783 5801413 8271569 7407646 6714766 4839561 -1498935 -9160878
40955i160878j496559O053248O768714J988932o40729J042255K063330l78570
$$ -9160878 -10657437 -4604189 2164525 4153457 3512728 4554983 6618313 6239743
40947F239743k558142j075309R63463j316853o033079n920016R25462O475541
$$ 6239743 3681601 2606292 3569755 2252902 -3780177 -9700193 -8774731 -2299190
40939b299190K933868n450377o966357J140240P925659L813821n843506q506630
$$ -2299190 634678 -4815699 -11782056 -10641816 -2716157 1097664 -4745842 -13252472
40931a3252472j730814N081471M960697J401647O09835K515011L031212Q44415
$$ -13252472 -14983286 -9901815 -4941118 -3539471 -2929636 -414625 2616587 3461002
40923C461002j800796k718091j579054L19752P92726r29077k245180j97309L413478
$$ 3461002 1660206 -1057885 -2636939 -2317187 -1524461 -2453538 -4698718 -4896027 -1482549
40914a482549L644117j28622k765312j088241J506854R01601j562811k444198
$$ -1482549 2161568 2032946 -732366 -1820607 -313753 587848 -974963 -3419161
40906c419161k137270l037682m273922k838592J285187M908915N687981L531840
$$ -3419161 -5556431 -8594113 -12868035 -15706627 -14421440 -9512525 -3824544 -292704
40898b92704o06142m472848m748934p27304L683598M549429K786650J628085J595449
$$ -292704 -898846 -5371694 -10120628 -10847932 -7164334 -2614905 171745 1799830 3395279
40889C395279J419857J327637J323339r86922n946442q105047l009445M640350
$$ 3395279 4815136 6142773 7466112 6479190 532748 -7572299 -10581744 -5941394
40881e941394O655284L379876J979337L762472K807648j914513l517209K86680
$$ -5941394 713890 4093766 6073103 9835575 12643223 10728710 7211501 7498181
40873G498181J764108l979740r687239p097352p9819K221047k05515m33794K401833
$$ 7498181 9262289 5282549 -4404690 -11502042 -11581861 -9360814 -9566329 -10000123 -7598290
40864g598290K631521n58599j160064L009798O117607L461076j768292m026243
$$ -7598290 -4966769 -5525368 -6685432 -3675634 2441973 5903049 4134757 108514
40856A08514k634147k53906J821676L418060L214547J23658m036241n568834k726828
$$ 108514 -2525633 -2779539 -957863 2460197 5674744 5798402 1762161 -3806673 -6533501
40847f533501K219561M868874K888665j650864m824802n178026l632021q9927
$$ -6533501 -4313940 554934 3443599 1792735 -3032067 -8210093 -11842114 -11932041
40839a1932041N702245R793109O504672k343217p019347k912532K385573R55484
$$ -11932041 -6229796 3563313 10067985 7724768 705421 -2207111 178462 1133946
40831A133946k971568r23830M717011M494886j852565m816572j030496J938297
$$ 1133946 -1837622 -2761452 1955559 6450445 4597880 -218692 -1249188 689109
40823F89109o29610k870590P17679N594752M688988r47865n034961m784626j609041
$$ 689109 59499 -2811091 -2093412 3501340 8190328 7242463 2207502 -2577124 -4186165
40814d186165K631124N345436K994362m121210r658170p914468p53140N038420
$$ -4186165 -1555041 3790395 6784757 2663547 -6994623 -14909091 -15662231 -10623811
40806a0623811N415398K111822j55238J468686M290692K323637m892393q768323
$$ -10623811 -5208413 -3096591 -3251829 -1783143 2507549 4831186 -61207 -8829530
40798h829530k805763O018203N953184j582286m421722O4314J193155n096761
$$ -8829530 -11635293 -5617090 336094 -1246192 -5667914 -5603600 -4410445 -9507206
40790i507206p697688N24357R102085O779828K12897K098070R424956Q913999
$$ -9507206 -17204894 -16680537 -7578452 -798624 -585727 1512343 10937299 19851298
40782A9851298r25749q262549o610725j749590p8124j287718l197571m632508
$$ 19851298 18925549 10663000 4052275 2302685 2224561 936843 -2260728 -6893236
40774f893236l342657J210208M264783K201500o28878K92053n6215p227206j3462871
$$ -6893236 -10235893 -9025685 -4760902 -2559402 -3188280 -2896227 -2952442 -10179648 -23642519
40765b3642519o933293P697312J3527394O395948l41407J558187M098797J5787
$$ -23642519 -30575812 -22878500 -9351106 -2955158 -3296565 -1738378 2360419 2376206
40757B376206m482140k392802J434380J24518k883306j161539L253057N075505
$$ 2376206 -2105934 -4498736 -3064356 -2939838 -5823144 -6984683 -3731626 1343879
40749A343879N253672O173949M131116l728007j0519724p916777M15564L605536
$$ 1343879 6597551 12771500 16902616 13174609 2654885 -5261892 -4846328 -1240792
40741a240792m15228l225735K20185M758928L730182j901580n830656m204523
$$ -1240792 -1656020 -4881755 -4661570 97358 3827540 1925960 -3904696 -8109219
40733h109219J047221N136599N426558L388770J560015J86430j159121r69778
$$ -8109219 -7061998 -1925399 3501159 6889929 8449944 8636374 7477253 6507475
40725F507475J206965J589636k262478n092810j055557M752920K383850n603652
$$ 6507475 7714440 9304076 7041598 1948788 893231 5646151 8030001 2426349
40717B426349n802910M195294R746401J633832q871729p546440J609670N073359
$$ 2426349 -3376561 818733 10565134 12198966 3327237 -4219203 -2609533 2463826
40709B463826Q79261k386524j536884m36434L03301K914985M591361J266288l414145
$$ 2463826 3343087 956563 -580321 -1016755 -713454 2201531 6792892 8059180 4645035
40700D645035l460911j419384k761230l613387K681648J0089996O374919n784666
$$ 4645035 1184124 -235260 -2996490 -6609877 -3928229 6161767 12536686 6752020
40692F752020j0374500k553859M564021J863393k917171j328054J563312q71111
$$ 6752020 -3622480 -6176339 -1612318 251075 -2666096 -3994150 -2430838 -3301949
40684c301949k979663K691804R892071O947142m281647j0236516m893483L519518
$$ -3301949 -6281612 -3589808 6302263 13249405 8967758 -1268758 -6162241 -2642723
40676b642723N657446K213001n33403j74010N88625m72512j702735m78074J900087
$$ -2642723 3014723 5227724 4694321 4520311 5108936 4636424 2933689 2455615 4355702
40667D355702J164897k752943l502441K371826P694750L675000n605604p474710
$$ 4355702 5520599 2767656 -734785 1637041 9331791 13006791 7401187 -73523
40659g3523L66387O194838K573049l102149k388674N65986j758258n972073l862885
$$ -73523 292864 6487702 9060751 5958602 3569928 4135914 2377656 -3594417 -7457302
40650g457302K731896M788313J191728j14595M273874Q364019O860590J958687
$$ -7457302 -4725406 62907 1254635 1140040 5413914 13777933 20638523 22597210
40642B2597210k084065m565261o118094o053323m285097k268900o23695J180202
$$ 22597210 20513145 15947884 9829790 3776467 -508630 -2777530 -3401225 -2221023
40634b221023K395457J411283j372923m019490n750507o140513l218449L425580
$$ -2221023 174434 1585717 212794 -3806696 -9557203 -15697716 -18916165 -15490585
40626a5490585R088502Q604763L862823J448422L127436M298633K231340j10330
$$ -15490585 -6402083 2202680 6065503 7513925 10641361 14939994 17171334 17061004
40618A7061004O5001J108079P33519m24605j320145k619136m159916l872925j311322
$$ 17061004 17126005 18234084 18967603 18542998 17222853 14603717 10443801 6570876 5259554
40609E259554R74404J355234J207404J592713J439162P29159J613513M008392
$$ 5259554 6233958 7589192 8796596 10389309 11828471 12557630 14171143 18179535
40601A8179535L825411j329683p630997r396099n833018o34128L240387N505230
$$ 18179535 22004946 20675263 13044266 3648167 -2184851 -2818979 421408 5926638
40593E926638O502522N829465L019873j218351m184060k560940L344871P940460
$$ 5926638 12429160 18258625 21278498 20060147 15876087 13315147 16660018 24600478
40585B4600478O432732J729963O16040L444286L699385j221720n551358m097191
$$ 24600478 31033210 32763173 33379213 36823499 40522884 39301164 33749806 29652615
40577B9652615O91503M023225N085199M353951J041197k314123L09086Q255876
$$ 29652615 30344118 34367343 39452542 43806493 44847690 42533567 42842653 51098529
40569E1098529J1185835L608745m793466k756166N178574O325843j30863m071407
$$ 51098529 62284364 65893109 61099643 58343477 63522051 69847894 69717031 65645624
40561F5645624k546803k501028n532432m644736J140389K788036l385558q679764
$$ 65645624 63098821 60597793 55065361 50420625 51561014 54349050 50963492 42283728
40553D2283728o047634j32406K550593K814310K217554j718141o981934n242539
$$ 42283728 36236094 36103688 38654281 41468591 43686145 41968004 34986070 29743531
40545B9743531L408261N753964m474264j3533773p122940P582485J3615348Q915205
$$ 29743531 33151792 38905756 34431492 20897719 13774779 21357264 34972612 43887817
40537D3887817L612512L68621m831038p635452k86118J0504906R555876k647394
$$ 43887817 47500329 47868950 43037912 35402460 35116342 45621248 55177124 52529730
40529E2529730r843567n356887M83981Q00717J361913M640024L207894l994450
$$ 52529730 42686163 37329276 37813257 38613974 39975887 44615911 47823805 43829355
40521D3829355o269206r3671L555670l79202j077184O817279J0333771J038733
$$ 43829355 37560149 37466478 41022148 40642946 39565762 46383041 56716812 57755545
40513E7755545o882325N64944J1760594P957167n264958q494514j531757o77239
$$ 57755545 50873220 51438164 63198758 71155925 65890967 57396453 55864696 55187457
40505E5187457p626348p175870L588015Q770387J061454o642812m300491M33078
$$ 55187457 47561109 40385239 43973254 52743641 53805095 47162283 42861792 43294870
40497D3294870n16418j328329L742815P220002J630140n894981m565698L401264
$$ 43294870 42778452 41450123 45192938 52412940 54043080 48148099 43582401 46983665
40489D6983665Q178557P094976M036234O21888k576907j720594M407620Q966517
$$ 46983665 55162222 62257198 66293432 66915320 64338413 62617819 67025439 75991956
40481G5991956N661645j434052l840098k18036M469499O657936M878803j859611
$$ 75991956 81653601 80219549 76379451 76161415 80630914 87288850 92167653 90308042
40473I0308042r824758j0520507k249308M281381L28229o960181n291339L104711
$$ 90308042 80483284 69962777 67713469 71994850 72323079 65362898 60071559 63176270
40465F3176270N061141k320337p271396j954993O159360O141774j812971r142566
$$ 63176270 68237411 65917074 58645678 56690685 62850045 68991819 67178848 58036282
40457E8036282j0150977n041937L748668J2266683J4393509O771961m577844p216755
$$ 58036282 47885305 42843368 46592036 58858719 73252228 80024189 75446345 68229590
40449F8229590M451947K0572630K5159920J5036731M367873O454841J6089103
$$ 68229590 72681537 93254167 118414087 133450818 137818691 144273532 160362635
40442A60362635J7664699P944145Q7951L623932J1115021R901975j430026j4731210
$$ 160362635 178027334 185971479 186059430 189683362 200798383 210700358 209270332 194539122
40434A94539122k3391776k4707443j7189483l709539O439986O208630o16430n033249
$$ 194539122 171147346 146439903 129250420 125540881 131980867 138189497 137573067 132539818
40426A32539818m184207j977974j820909m123560p906470j0154865p156648n34732
$$ 132539818 128355611 126377637 124556728 120433168 112526698 102371833 95215185 94680453
40418I4680453K844221Q24914p23998J091313P60984l573214l276498N495905
$$ 94680453 97524674 98349588 97625590 98716903 99477887 95904673 92628175 98124080
40410I8124080J0387377O45526j2756309j1973763q48823J099826r504561j5301482
$$ 98124080 108511457 109156983 96400674 84426911 83578088 84677914 75173353 59871871
40402E9871871p271860K347273K330041j109588N43960K495686k290116q782307
$$ 59871871 52600011 54947284 57277325 56167737 56711697 59207383 56917267 48134960
40394D8134960q810450n243740n697297q696313o840538M84487O520350O641924
$$ 48134960 39324510 34080770 28383473 19687160 12846622 13331109 19851459 26493383
40386B6493383K131602k950186m438397r53407L192474K439937j372202j410420
$$ 26493383 28624985 25674799 21236402 20282995 23475469 25915406 24543204 23132784
40378B3132784K069330J207570n374729q631994l877249J360729O62854p64032
$$ 23132784 25202114 26409684 21034955 12402961 8525712 9886441 10549295 9785263
40370I785263K987074O944361M232994j549708k866648l60388R71624J324285
$$ 9785263 12772337 19716698 23949692 22399984 19533336 19172948 20144572 21468857
40362B1468857K604086J765335k923185n133956J66368O476855N103343o93471
$$ 21468857 24072943 25838278 22915093 17781137 17947505 24424360 29527703 28834232
40354B8834232j618322K247738L019469j356106n427023n714454k953376K099207
$$ 28834232 27215910 29463648 32483117 31127011 25699988 19985534 17032158 19131365
40346A9131365P057541O419969j25633l315203K909758J0495623R041757J631332
$$ 19131365 26188906 32608875 32483242 29168039 32077797 42573420 51615177 53246509
40338E3246509k175027j830000j701780P54758P944846J0646329P57694j0592905
$$ 53246509 51071482 49241482 47539702 48294460 56239306 66885635 67643329 57050424
40330E7050424o914451O062708P766548m246878j1262019m615554K821019R61493
$$ 57050424 50135973 56198681 63965229 59718351 48456332 43840778 46661797 47623290
40322D7623290l286045l128713l409074o727904o035360M44121L700025J081999
$$ 47623290 44337245 41208532 37799458 31071554 25036194 25480315 29180340 30262339
40314C0262339J721942P337618O564632k588259m943967N654576J2995589N514381
$$ 30262339 31984281 39321899 45886531 43298272 38354305 44008881 57004470 62518851
40306F2518851l761363r44527N507146N306894R568538K7861918L9395124J8499193
$$ 62518851 58757488 57812961 63320107 68627001 78195539 106057457 145452581 163951774
40298A63951774k0924489l8805536k3838630m619348m279948j2906184j2240514
$$ 163951774 143027285 104221749 80383119 75763771 71483823 58577639 46337125
40291D6337125k942748M089012N547537M042206J183020k54057K614320O266400
$$ 46337125 43394377 47483389 53030926 57073132 58256152 58002095 60616415 66882815
40283F6882815N868774O515185J5315574K3338552J3969072q698008k0305444
$$ 66882815 72751589 79266774 94582348 117920900 131889972 123191964 102886520
40276A02886520j1016957M88547k853392j1951937j0461319j449177J211486l804801
$$ 102886520 91869563 92358110 89504718 77552781 67091462 65642285 66853771 63048970
40268F3048970o860477m372986J0076N026823J0073369R566523P11732q175356
$$ 63048970 56188493 51815507 51825583 56852406 66925775 76492298 77204030 69028674
40260F9028674p823933j491262J635986Q10942J077014K061953P53824M00240
$$ 69028674 61204741 59713479 61349465 62160407 63237421 65299374 66053198 66453438
40252F6453438M915844Q886330N242141j157998l30306O224895R743478J1808872
$$ 66453438 71369282 80255612 85497753 84339755 84009449 90234344 99977822 111786694
40244A11786694K0915825L1502298K5184428j362114k6311007k9888616j8481100
$$ 111786694 132702519 164204817 189389245 188027131 161716124 131827508 113346408
40237A13346408j0532789r546828n303003M597790R878014L823938p883798j6581240
$$ 113346408 102813619 93266791 87963788 92561578 102439592 106263530 98379732 81798492
40229H1798492j9385093j6162409o715799M712862R666817N996327K353074N787047
$$ 81798492 62413399 46250990 39535191 44248053 53914870 59911197 62264271 68051318
40221F8051318J0386775P147952J014327N368137J8822398K1872174M047770j7744501
$$ 68051318 78438093 85586045 86600372 91968509 110790907 132663081 136710851 118966350
40213A18966350k0434699o203935K971691j439284n002716L175301J2573268R670310
$$ 118966350 98531651 92327716 95299407 93860123 88857407 92032708 104605976 114276286
40205A14276286J50013j304547N427058Q192993M456343M640735J2026546J4152384
$$ 114276286 114426299 113121752 118548810 126741803 131198146 135838881 147865427 162017811
40197A62017811J751000j3552179j1193498J1215910L2010078L0054521J0654401
$$ 162017811 163768811 150216632 139023134 150239044 182249122 212303643 222958044
40190B22958044R02728J8093720M8158715O1210960M5601855J7498329m022509
$$ 222958044 223860772 241954492 290113207 351324167 396926022 414424351 410401842
40183D10401842j9384863l8367286n7439654o1297620m5175239k2952061j0301434
$$ 410401842 391016979 352649693 295210039 233912419 188737180 165785119 155483685
40176A55483685r092219j2203265j5530557j8960743k0398122j6040022o365506
$$ 155483685 146391466 134188201 118657644 99696901 79298779 63258757 56893251
40169E6893251K335537L856621j403015o631219o097219k055841j590960n967204
$$ 56893251 59228788 63085409 61682394 55051175 48953956 46898115 45307155 39339951
40161C9339951p697375j522074O529611P214388J838467j5741M680050Q583409
$$ 39339951 31642576 30120502 36650113 43864501 45702968 45687227 50367277 58950686
40153E8950686O282979K088735J901662L916175K416607l185170p591276n874936
$$ 58950686 65233665 67322400 69224062 73140237 75556844 72371674 64780398 58905462
40145E8905462K002221J1122068J5385702J4203926J4860124K3139321L1874246
$$ 58905462 60907683 72029751 87415453 101619379 116479503 139618824 171493070
40138A71493070K6471490M275756j9446875k9393036k6705806k1627292j7379060
$$ 171493070 197964560 202240316 182793441 153400405 126694599 105067307 87688247
40131H7688247j0812904l927525k991464p079094q284310m827706m044624q975539
$$ 87688247 76875343 72947818 69956354 62877260 54592950 49765244 45720620 36745081
40123C6745081j1318514l911567O723631Q180045j102503j0319627j0151110j863013
$$ 36745081 25426567 21515000 28238631 36418676 35316173 24996546 14845436 12982423
40115A2982423O982791J0136979N533724l975386j1089454r725539k309084K336112
$$ 12982423 19965214 30102193 35635917 31660531 20571077 10845538 8536454 10872566
40107A0872566K98430k508224K31076N375496N178461p53980m868637k801016
$$ 10872566 11170996 8662772 8893848 14269344 19447805 18693825 13825188 11024172
40099A1024172J096401J123962k001719l842717l013837j543963n56744Q36732
$$ 11024172 12120573 13244535 11242816 7400099 4386262 2842299 2285555 3122287
40091C122287L014527M831531N036370L251833K3661l142676m769741n295370
$$ 3122287 6136814 10968345 16004715 19256548 19280209 16137533 11367792 6072422
40083F072422o510903q096493o807820j127705N059927O307657K454860j124531
$$ 6072422 -438481 -8534974 -15342794 -16470499 -11410572 -5102915 -2648055 -3772586
40075c772586l62124K746687L280320j85365l963916m029332q85050J696910K035125
$$ -3772586 -4134710 -1388023 1892297 1706932 -2256984 -6286316 -7171366 -5474456 -3439331
40066c439331K054953K868702K183535j404086m557314l550289k23515J040046
$$ -3439331 -1384378 1484324 3667859 2263773 -2293541 -5843830 -6067345 -5027299
40058e027299M24983J222579K634487P08632l763448n389683k887452m63378L42410
$$ -5027299 -4602316 -3379737 -745250 -36618 -3800066 -9189749 -12077201 -12540579 -12198169
40049a2198169K135898L732023K57293o076405n777082K770958Q804033O001327
$$ -12198169 -10062271 -6330248 -6072955 -12149360 -17926442 -15155484 -6351451 -350124
40041c50124K343518M891864O778247Q52753n073794j339560M731758M09147r083026
$$ -350124 1993394 6885258 13663505 14516258 9442464 8102904 12834662 13243809 4160783
40032D160783q215045J814983M604138l260924o914452M79412O893836L734441
$$ 4160783 -4054262 -2239279 2364859 -896065 -7810517 -7331105 -437269 3297172
40024C297172l39726K526174M940734k97773n512275k225423L011933J067843
$$ 3297172 2957446 5483620 10424354 10126581 4614306 2388883 5400816 6468659
40016F468659k671005J125421P325283M858684l044925l928254K529991M681373
$$ 6468659 3797654 4923075 12248358 17107042 14062117 10133863 12663854 17345227
40008A7345227r37179n107795k442872J510584K005624J756868K716407J766142
$$ 17345227 16408048 11300253 8857381 10367965 12373589 14130457 16846864 18613006
40000A8613006j837396l752145k450157j571777j779149J155653P008936Q629168
$$ 18613006 16775610 13023465 10573308 9001531 7222382 8378035 15386971 24016139
39992B4016139L196681k107468j094834J921960N8519m539397m541029O44255
$$ 24016139 27212820 25105352 24010518 25932478 25990997 21451600 16910571 17554826
39984A7554826M271621K485486j069208j312763K021651N151763M374751j213426
$$ 17554826 21826447 24311933 23242725 21929962 23951613 29103376 33478127 32264701
39976C2264701q915571j3711794j1990896m888873K589615N849386L851157j111339
$$ 32264701 23349130 9637336 -2353560 -7242433 -4652818 1196568 5047725 3936386
39968C936386n335217n582479j079512M844715O354815J087383n230566l597039
$$ 3936386 -1398831 -6981310 -8060822 -3216107 3138708 4226091 -1004475 -4601514
39960d601514O618999J4243727Q967624m707919j2235753p297260J742939N167413
$$ -4601514 2017485 16261212 25228836 20520917 8285164 987904 2730843 7898256
39952G898256L835165L307853L159228m09806n525671o381099k453254J165239
$$ 7898256 11733421 15041274 18200502 17790696 12265025 5883926 3430672 4595911
39944D595911J967765J839833R72850k677235o703062m628148L609686Q198542
$$ 4595911 6563676 8403509 9376359 6699124 -3938 -4632086 -1022400 7176142
39936G176142J996627q080774r124073K78788Q017136M961513l454567o375239
$$ 7176142 9172769 1091995 -8032078 -7753290 263846 5225359 1770792 -4604447
39928d604447k969724j474968m698682n470968P80580P225198N903607P42019
$$ -4604447 -7574171 -9049139 -13747821 -19218789 -18438209 -11213011 -5309404 -4567385
39920d567385J233174O382414N678798l669382j1245477q708964j313250J465946
$$ -4567385 -3334211 3048203 8727001 5057619 -6187858 -14896822 -16210072 -14744126
39912a4744126n03938o46018L079363O411434N738418J702365k453640l131160
$$ -14744126 -15248064 -15894082 -12814719 -6403285 -664867 1037498 -1416142 -4547302
39904d547302O01485M548001L701012j28173p34076J635525K03510n273213n827587
$$ -4547302 -3945817 602184 4303196 4175023 3440947 5076472 5279982 6769 -5820818
39895e820818J332422O094636J962662k167572K300850P129062J016068q752332
$$ -5820818 -4488396 1606240 3568902 1401330 3702180 10831242 11847310 3094978
39887C094978o161608O701665J1568007K232640p429395o585853j607631j291646
$$ 3094978 -3066630 3635035 15203042 17435682 10006287 3420434 1812803 521157
39879E21157k707858P4525M506977N228759K886418L46946k766244o077832n938649
$$ 521157 -2186701 -2112176 2394801 7623560 10509978 10856924 8090680 2012848 -3925801
39870c925801j973089O57249K4287J174550O403808R429599M967823k635403o115475
$$ -3925801 -5898890 -5241641 -5217354 -4042804 2361004 11790603 16758426 14123023 8007548
39861H007548m659153j429461K132944M437679K446704k522787l999562m73380
$$ 8007548 3348395 1918934 4051878 8489557 10936261 8413474 4413912 3940532
39853C940532P87895m040504p137285j058310Q082157R303031L499935P22427
$$ 3940532 4728427 687923 -6449362 -7507672 574485 9877516 13377451 14099878
39845A4099878L586453M480501p11688o116375n596230j462775J80408j928755
$$ 14099878 17686331 22166832 21455144 15338769 9742539 8279764 8460172 6531417
39837F531417l846217k534955L28238P80746j870677l368502k32595M373781M700489
$$ 6531417 2685200 150245 478483 1259229 -611448 -3979950 -4212545 161236 4861725
39828D861725J514499R15524L494200K747600k675494m146375L248591J0321900
$$ 4861725 6376224 7291748 10785948 13533548 10858054 6711679 9960270 20282170
39820B0282170O240113m504514q376710k820199J690377n72787k608115J809597
$$ 20282170 26522283 22017769 13641059 10820860 12511237 11938450 9330335 11139932
39812A1139932O684719L163730n626818p846884J77071Q182628N836741l189875
$$ 11139932 17824651 20988381 15361563 7514679 7691750 15874378 21711119 18521244
39804A8521244o793216j733760K507919r71157n761947l232463K571290J642364
$$ 18521244 11728028 9994268 12502187 11531030 5769083 2536620 5107910 6750274
39796F750274m147551l045506O407283J1014010L164479p200272q106802k189428
$$ 6750274 2602723 -442783 5964500 16978510 20142989 12942717 4835915 2646487
39788B646487J091858O80185J202192K239052Q10872q70255J69825O86112k004459
$$ 2646487 3738345 4418530 5620722 7859774 8670646 7800391 7970216 8656328 6651869
39779F651869k291364M105703R051216L317116o166846n270162M084786O055397
$$ 6651869 4360505 8466208 17517424 20834540 14667694 9397532 13482318 19537715
39771A9537715l510347j0428331n049829L806508M766976M58710r63346l68254
$$ 19537715 16027368 5599037 549208 4355716 9122692 9581402 8618056 8249802
39763H249802l162916p094670n061527K854931Q465077N943763j845642p102906
$$ 8249802 5086886 -2007784 -7069311 -4214380 4250697 10194460 8348818 1245912
39755A245912m729759K511780N942345Q92170n988397m503458M462969R449821
$$ 1245912 -3483847 -972067 4970278 5862448 -125949 -4629407 -166438 9283383
39747I283383M678485k628503m320344k227417j927651l124419k592216q08719
$$ 9283383 13961868 11333365 7013021 4785604 2857953 -266466 -2858682 -3667401
39739c667401N99535K869386N760474M761231r94106l858305J537248P976403
$$ -3667401 -3067866 -198480 5561994 10323225 9329119 5470814 7008062 14984465
39731A4984465N393519l195981o077103j049550K037874k488382q171366p659581
$$ 14984465 20377984 17182003 11104900 10055350 12093224 9604842 1433476 -6226105
39723f226105k687204J495745M084050O062496N695656K113959j136777j156865
$$ -6226105 -8913309 -7417564 -3333514 2728982 8424638 10538597 9401820 8244955
39715H244955m72427k077173l536096j266784K648665L691059K227080J472706
$$ 8244955 7772528 5695355 2159259 892475 3541140 7232199 9459279 10931985
39707A0931985N70805l047600n965587k234586M974719M886568m311502r921715
$$ 10931985 11502790 8455190 2489603 255017 5229736 10116304 5804802 -4116913
39699d116913k327542R771757J0878148K39183q592324p322017j153838K733861
$$ -4116913 -6444455 3327302 14205450 14444633 5852309 -1469708 -2623546 110315
39691A10315M196339M662783K208339k817298m583536J14057O102350P347997
$$ 110315 4306654 8969437 11177776 8360478 3776942 3890999 9993349 17341346
39683A7341346N070349L282254J639437j274061k596878j37872J603746j894227
$$ 17341346 22411695 25693949 27333386 26059325 23462447 23324575 24928321 23034094
39675B3034094o039294l376650L425663M604256j197983m696508j076285K569449
$$ 23034094 16994800 13618150 17043813 21648069 20450086 15753578 14677293 17246742
39667A7246742o59255o309643o033406l97130L085524J579534n12324K52868J871515
$$ 17246742 16587487 10277844 4244438 3847308 6932832 8512366 8000042 8252910 10124425
39658A0124425J673569P14207R57509J288354m34412k867104k327150J384738
$$ 10124425 11797994 12512201 13469710 14758064 14323652 11456548 9129398 10514136
39650A0514136L847456K336781q0966J66601R73416j392014m392095k276335L491991
$$ 10514136 14361592 16698373 16617407 16784008 17757424 16365410 11973315 9696980 13188971
39641A3188971M943482L11224k567398Q11784M119662J625313j344021J963063
$$ 13188971 18132453 18443677 15876279 16688063 20807725 22433038 21089017 23052080
39633B3052080O505310K680665p341630j1912191p023620l69599J920974K492875
$$ 23052080 29557390 32238055 24896425 12984234 5960614 5591015 7511989 10004864
39625A0004864M773765O478575M368796n36302m915186o003464k268074M093129
$$ 10004864 14778629 21257204 25626000 25089698 20174512 14171048 11902974 15996103
39617A5996103O420788J152119n328637m092827L543811Q111629N542230M93552
$$ 15996103 22416891 23569010 18240373 14147546 17691357 25802986 31345216 31838768
39609C1838768k717909l725238j671628L324847N166189j303346r076214o500219
$$ 31838768 29120859 25395621 23723993 27048840 32215029 30911683 21835469 15335250
39601A5335250M028789Q220003J902970l916839k969547k408593n767667m127928
$$ 15335250 19364039 27584042 29487012 25570173 22600626 20192033 14424366 10296438
39593A0296438O141194J2497180N627255l715959j688911O086899M915291m590214
$$ 10296438 16437632 28934812 34562067 30846108 29157197 35244096 40159387 35569173
39585C5569173r357010n656894j653735j036936N65509L720986L494008j4181
$$ 35569173 26212163 20555269 18901534 17864598 18430107 22151093 25645101 25630920
39577B5630920j160743Q58027J459560P7497J4038j80191m606941r880821p883937
$$ 25630920 24470177 25328204 26787764 26865261 26879299 26699108 22092167 12211346 4327409
39568D327409J129905Q329421R247030O927822K784210m303265r480764m919406
$$ 4327409 5457314 13786735 23033765 29961587 32745797 28442532 18961768 14042362
39560A4042362O383120J1521173N717801j596252k439665p16691j840739k866389
$$ 14042362 20425482 31946655 37664456 36068204 33628539 32911848 31071109 28204720
39552B8204720j82358K013861q79759m809512l480944J161236K458336l14329
$$ 28204720 28022362 30036223 29156464 24346952 20866008 22027244 24485580 24171251
39544B4171251j656164J351198N071153L990838k771124r041289o481529M948239
$$ 24171251 22515087 23866285 28937438 32928276 30157152 21115863 14634334 19582573
39536A9582573J3303847P607518o564580j2718731n144659M743997O262876K944377
$$ 19582573 32886420 40493938 33929358 21210627 16065968 20809965 27072841 30017218
39528C0017218K672418M368093K901337k31892n57308J17076k684065o569644
$$ 30017218 32689636 37057729 39959066 39727174 39169866 39286942 36602877 30033233
39520C0033233n246617P38779M372060K771131J48584l04028r37274l992052o278114
$$ 30033233 24786616 25525395 29897455 32668586 32817170 32513142 31575868 27583816 21305702
39511B1305702l030014M455896Q188886K467190p213736q554800J385818R678587
$$ 21305702 18275688 22731584 30920470 33387660 26173924 17619124 19004942 28683529
39503B8683529M264167p329154p634693L987013R550122Q49928p215492j240550
$$ 28683529 32947696 25618542 17983849 21970862 31520984 32370912 25155420 23914870
39495B3914870Q471989N429799n412479o674885J879772L925983m870589r966403
$$ 23914870 32386859 37816658 32404179 25729294 27609066 31535049 26664460 16698057
39487A6698057l177776M483314K835213j219138J849785O839662L784454m136648
$$ 16698057 13520281 18003595 20838808 19619670 21469455 28309117 32093571 27956923
39479B7956923o166484j669177P21182j405725j961513R01517J202008l514633
$$ 27956923 21790439 20121262 20842444 19436719 17475206 18376723 19578731 16064098
39471A6064098o718062k966286L482731N124393J663876j204418q24657N5283
$$ 16064098 9346036 6379750 9862481 14986874 16650750 15446332 14621675 14676958
39463A4676958m07646L47625M093060O758410L273960l449207m215582L433073
$$ 14676958 14269312 14616937 18709997 25468407 28742367 25293160 21077578 24510651
39455B4510651R440013L995673p736725j1501651l461215M996189L724125l538126
$$ 24510651 33950664 37946337 30209612 18707961 15246746 20242935 23967060 20428934
39447B0428934p280063n364392j799607J590649M754661M907306M12623l559235
$$ 20428934 13148871 7784479 5984872 7575521 12330182 17237488 17650111 14090876
39439A4090876j240748L719541K855051l363398n554413j86878N034024L669205
$$ 14090876 12850128 16569669 19424720 16061322 10506909 10320031 15354055 19023260
39431A9023260k35852m52055J374338N19360j789739j692778q98044l314322n916687
$$ 19023260 18787408 18335353 19709691 20229051 18439312 16746534 15848490 12534168 6617481
39422F617481j975110O622570R351687K220395m913162j643904P924278J0678402
$$ 6617481 4642371 11264941 20616628 22837023 17923861 16279957 24204235 34882637
39414C4882637K691445n828882m997737J901413M271596r84424o354873m923481
$$ 34882637 37574082 31745200 26747463 28648876 32920472 31936048 25581175 20657694
39406B0657694Q38725L764324J618470j634648k211391k35330K344548M009187
$$ 20657694 21496419 25260743 26879213 25244565 23033174 22797844 25142392 29151579
39398B9151579L686249J604116L53058K007071M131412K494519j790393k657254
$$ 29151579 32837828 34441944 34795002 36802073 40933485 43428004 41637611 38980357
39390C8980357J690262N226410L079037r85672q79365K363066L637961K953426
$$ 38980357 40670619 45897029 48976066 47990394 47111029 49474095 53112056 56065482
39382E6065482M127295O074914L680863k357993m844724j339924J653558o86982
$$ 56065482 60192777 66267691 69948554 67590561 62745837 61405913 63059471 62372489
39374F2372489l919080k498474P32199p1345l398180l044259J253034L438950
$$ 62372489 58453409 55954935 56687134 56615789 53217609 50173350 51426384 54865334
39366E4865334R12102k103862j612611J479216M655628O455304M899067j104369
$$ 54865334 55777436 53673574 52060963 53540179 58195807 64651111 69550178 68445809
39358F8445809p188600o387127O69916M531555J29523m844151j186748P171739
$$ 68445809 61257209 54870082 55539998 60071553 60201076 55356925 54170177 61341916
39350F1341916Q607776J544719l369365J60720N287740M035796n56335j215973
$$ 61341916 69949692 71494411 68125046 68285766 73573506 77609302 77052967 75836994
39342G5836994J096511K67177l120595k656230J855559K616341l700029r602678
$$ 75836994 76933505 77200682 74080087 71423857 73279416 75895757 72195728 62593050
39334F2593050p128434J060525N813700L376424j369567k061129J991218N574090
$$ 62593050 55464616 56525141 62338841 65715265 64345698 62284569 64275787 69849877
39326F9849877L502652k753651n663703j167674M870006M611226P2199p68162
$$ 69849877 73352529 70598878 64935175 63767501 68637507 73248733 73320932 72552770
39318G2552770J738775p78161q647768j0787807k585386N108263L120398j470648
$$ 72552770 74291545 73513384 64865616 54077809 51492423 56600686 59721084 58250436
39310E8250436J066162N529880J912911n259057m170530L086103M108832j702258
$$ 58250436 59316598 64846478 66759389 61500332 57329802 60415905 64524737 62822479
39302F2822479k805932K756404L704684l668181q756596n618123k016285l297736
$$ 62822479 60016547 62772951 66477635 62809454 54052858 48434735 46418450 43120714
39294D3120714l357885Q27845J505373m058906n590309J752422O037906j655385
$$ 43120714 39762829 40590674 42096047 38037141 32446832 34199254 40237160 38581775
39286C8581775j0260697o370932L518568M871083j076347k856390p540o52184
$$ 38581775 28321078 21950146 25468714 30339797 29263450 26407060 26399520 25747336
39278B5747336l657359j285767L999264K671665m184776o578858l148677j294485
$$ 25747336 22089977 20804210 24803474 27475139 23290363 16711505 13562828 12268343
39270A2268343j710801J091516M453659P53541n869495l777871M852824N716901
$$ 12268343 10557542 11649058 16102717 16856258 10986763 7208892 12061716 17778617
39262A7778617k732974n792671J770596O539592L22983n958680k337703L566867
$$ 17778617 15045643 9252972 11023568 17563160 17886143 11927463 9589760 13156627
39254A3156627J931443k417304j518513N61423k355952n027278j049783L575061
$$ 13156627 15088070 12670766 11152253 11713676 9357724 4330446 3280663 6855724
39246F855724J353073j570571L554170R863010M453459q878595j3505334m768318
$$ 6855724 8208797 6638226 10192396 20055406 24508865 15630270 2124936 -2643382
39238b643382M805024N484253J322126r86170j650033k316743j087849K435496
$$ -2643382 2161642 7645895 8968021 7981851 6331818 4015075 2927226 5362722
39230E362722M282518K030863j576119l112104k117834N82877L652916M106180
$$ 5362722 9645240 11676103 10099984 6987880 4870046 5452923 9105839 13212019
39222A3212019K03207m423851m354072j35575K319242K10916l000081l362652
$$ 13212019 13415226 8991375 4637303 4501728 6820970 7031886 4031805 669153
39214F69153j046959J505959K521882J420470r25097k424805k119156j219123
$$ 669153 -377806 1128153 3650035 5070505 4145408 1720603 -398553 -1617676
39206a617676l02926J931368M988567N345527K166145J08914K025624L217212
$$ -1617676 -1920602 10766 4999333 10344860 12511005 12619919 14645543 17862755
39198A7862755j158587o875474o210105k21390K611986p08600m007096j966326
$$ 17862755 16704168 9828694 3618589 3397199 6009185 5300585 1293489 -672837
39190f72837K952363N324322L112156k226048p226088p078243J17713Q388735
$$ -672837 2279526 7603848 10716004 8489956 1263868 -5814375 -5696662 2692073
39182B692073Q412740n58543p987508m849245M365131P224573k77514q164896
$$ 2692073 11104813 10546270 2558762 -2290483 2074648 9299221 9021707 856811
39174H56811n461098M958269R732984L021213n473340m509795K660307M334063
$$ 856811 -4604287 353982 10086966 13108179 7634839 3125044 5785351 10119414
39166A0119414j145936l916255K31021L257763m27496l989564j65855O023731
$$ 10119414 8973478 5057223 5288244 8546007 8118511 4128947 3963092 9986823
39158I986823N629342m5003k996956j189153J258712K368996K436732k04972n520364
$$ 9986823 15616165 15571162 12574206 11385053 12643765 15012761 17449493 17244521 11724157
39149A1724157p954500m183631P4211o10746j133831M576717R645190L420443
$$ 11724157 3769657 -413974 -339763 -950509 -2084340 2492377 12137567 15558010
39141A5558010q915761j1054218Q2050R238158M924194o089047j0712955n494520
$$ 15558010 6642249 -4411969 -4329919 4908239 9832433 3743386 -6969569 -12464089
39133a2464089L953725J0836043J0446726K882841m541408m134085J730780M223885
$$ -12464089 -8510364 2325679 12772405 15655246 11113838 6979753 8710533 12934418
39125A2934418J849091J167647L480340K163232m288777q023680m774324m91001
$$ 12934418 14783509 15951156 19431496 21594728 17305951 9282271 4507947 4016946
39117D016946l34885j143907J0677j82863k835417k228258L587498O826828K149038
$$ 4016946 3682061 2538154 2548831 2365968 -469449 -2697707 889791 7716619 9865657
39108I865657l784218l101102Q32224O75832k057026j041855L193633M976675
$$ 9865657 6081439 2980337 3812561 4488393 2431367 1389512 4583145 9559820
39100I559820L107129O17225j545303l184397j226427M820540P813752J981384
$$ 9559820 12666949 13284174 11738871 8554474 7328047 12148587 19962339 21943723
39092B1943723o279707n936501K212903O314967R05821n694746m180237K821961
$$ 21943723 15664016 9727515 11940418 18255385 19161206 13466460 9286223 12108184
39084A2108184N280858o19069q050902q324786j169631N585894N988184K477846
$$ 12108184 17389042 16769973 8719071 394285 -775346 4810548 10798732 13276578
39076A3276578M96430K43681j363155l355563k260201M82526N29674p47516J231790
$$ 13276578 13773008 14016689 12653534 9297971 7037770 7520296 8049970 7302454 8534244
39067H534244L534812j204160r753708r604614P79695P326570K752313j338908
$$ 8534244 12069056 10864896 1111188 -8493426 -7713731 -387161 2365152 1026244
39059A026244M806309J0772873L242468j0057899j1426620o48896O954808N472649
$$ 1026244 5832553 16605426 19847894 9789995 -1636625 -2285521 4669287 10141936
39051A0141936K962901K907399l68460o381972o013210J647835N351074l0531
$$ 10141936 13104837 16012236 15643776 9261804 3248594 4896429 10247503 10216972
39043A0216972m996258j620555M044848L372523j380686l189070j616814j48705
$$ 10216972 5220714 3600159 7645007 11017530 9636844 6447774 4830960 4682255
39035D682255J277374L732827M555368J665132j695826j949736p54699r28630
$$ 4682255 5959629 9692456 14247824 15912956 14217130 12267394 11512695 10584065
39027A0584065j248433k5147M44004k065530m814366l925514j90390K729859L041855
$$ 10584065 9335632 9310485 9754489 7688959 2874593 -1050921 -1241311 1488548 4530403
39018D530403Q63140k930480n236799k406855L646184N855800J928765j646868
$$ 4530403 5393543 2463063 -2773736 -5180591 -1534407 4321393 6250158 4603290
39010D603290O2801K211626j184473n791217k984983N553119Q942949K882426
$$ 4603290 4666091 6877717 5693244 -97973 -3082956 2470163 11413112 14295538
39002A4295538m591181n373720j602005L98675K96122J980987N090334M784320
$$ 14295538 9704357 4330637 2728632 3127307 3423429 5404416 10494750 15279070
38994A5279070l89423n657009o365476l363035j08142K343674M440647M633872
$$ 15279070 14889647 9232638 2867162 -495873 -604015 1739659 6180306 10814178
38986A0814178J065839l905968n371914k760561p19077j544834j414078K737954
$$ 10814178 11880017 7974049 2602135 -158426 -877503 -2422337 -3836415 -1098461
38978a098461O973615N813026Q92770j434722N18546K574484K212554J324080
$$ -1098461 5875154 11688180 12580950 11146228 11664774 14239258 16451812 17775892
38970A7775892Q83687j281548n418723p486123m715396J37220K958410L647858
$$ 17775892 18659579 17378031 11959308 4473185 -242211 -104991 2853419 6501277
38962F501277M220971M009263O74993m609056o650431k448876L827677M563595
$$ 6501277 10722248 14731511 15406504 10797448 4147017 1698141 5525818 10089413
38954A0089413k000644q349202o181601K736532Q270321M974852j488165l431510
$$ 10089413 8088769 -260433 -6442034 -3705502 4564819 9539671 8051506 4619996
38946D619996j481641j134601l063595l201305m73610J897689K267762K186962
$$ 4619996 3138355 2003754 -1059841 -4261146 -4734756 -2837067 -569305 1617657
38938A617657K273508J531016P98775K109686M497259M817347K572022k22928
$$ 1617657 3891165 5422181 6220956 8330642 12827901 17645248 20217270 19994342
38930A9994342l003845n769019n759354j023712L825362K347638l611043n979280
$$ 19994342 16990497 11221478 5462124 4438412 8263774 10611412 7000369 1021089
38922A021089k768292O009j65691J734690P390182R541302L181470n043254n846227
$$ 1021089 -1747203 -1741194 -1906885 -172195 7217987 16759289 19940759 14897505 9051278
38913I051278n87000J758287k253488p207908p327813k891266J681711K800246
$$ 9051278 8464278 10222565 7969077 761169 -6566644 -9457910 -7776199 -4975953
38905d975953R13617Q4570L004914O406325M845222q33128m082088k826219k362260
$$ -4975953 -4062336 -3977766 -972852 5433473 10278695 9445567 5363479 2537260 175000
38896A75000n137676n028008K463763J0500279R152384l07083p232296o029554
$$ 175000 -4962676 -9990684 -7526921 2973358 12125742 11818659 4586363 -1443191
38888a443191j411938M47819p91426k446879l379246l349249j436535K312858
$$ -1443191 -2855129 -2407310 -3198736 -5645615 -9024861 -12374110 -13810645 -11497787
38880a1497787N512471N743170L591773K053417K790135L946004K795551L8111
$$ -11497787 -5985316 -242146 3349627 5403044 8193179 12139183 14934734 14972845
38872A4972845j095875n94400k472431p178790q099807j173101O401212N178593
$$ 14972845 13876970 13282570 10810139 3631349 -4468458 -5641559 759653 5938246
38864E938246j769560l248000K008347L571294k697573p511833l900612J709677
$$ 5938246 4168686 920686 2929033 6500327 3802754 -3709079 -7609691 -5900014
38856e900014J449954j292757l0989K642587R21229k938878l046497j64451J501781
$$ -5900014 -4450060 -5742817 -5773806 -3131219 -2209990 -5148868 -8195365 -8359816 -6858035
38847f858035K482677M214762K978859k748877n252908R43953O703033O81409
$$ -6858035 -4375358 -160596 2818263 69386 -5183522 -4239569 2463464 3144873
38839C144873j0630079j0571316K044124J0963904P052144p58670k466315m36734
$$ 3144873 -7485206 -18056522 -16012398 -5048494 2003650 1244980 -1221335 -1658069
38831a658069k08614n09258M94976o25453m855647n930355k95199N769590N814458
$$ -1658069 -1866683 -2375941 -1880965 -2506418 -7362065 -13292420 -13587619 -7818029 -2003571
38822b003571L029560L478959N781818M731793K41054l970331o401243o738126
$$ -2003571 1025989 4504948 10286766 15018559 15259613 11289282 4888039 -1850087
38814a850087l298688K671536M691690n77123o569541n069841K015978N986220
$$ -1850087 -5148775 -2477239 2214451 1637328 -4932213 -10002054 -7986076 -1999856
38806a999856L995201J222589J396949K015291p6851l430581m110469n24514M659198
$$ -1999856 1995345 3217934 4614883 6630174 6553323 3122742 -987727 -1512241 3146957
38797C146957O468213K538058l144731l949459O38850L636590L44178m711190
$$ 3146957 9615170 12153228 9008497 5059038 5697888 9334478 9678656 4967466
38789D967466m521274N08172M447107M801133L936318L188631J346139j204396
$$ 4967466 446192 954364 5401471 10202604 14138922 17327553 18673692 17469296
38781A7469296j871332r4949J533941R02654j733161n232996q017101p641918
$$ 17469296 15597964 15503015 17036956 17939610 16206449 10973453 2956352 -4685566
38773d685566l243732J974131L936901K943658K406047L013749K187541p19180
$$ -4685566 -7929298 -5955167 -2018266 925392 3331439 6345188 8532729 7813549
38765G813549k989078l047677k408003k091744j033235O80666J092576N80964
$$ 7813549 4824471 1776794 -631209 -2722953 -3756188 -3075522 -1982946 -1401982
38757a401982K245990N526947M540095k688818q053120l381058O159484P339574
$$ -1401982 844008 6370955 10911050 8222232 169112 -3211946 2947538 10287112
38749A0287112k327383j0241421o437053K917897N953873K029685m87838J169547
$$ 10287112 7959729 -2281692 -8718745 -5800848 153025 2182710 1694872 2864419
38741B864419K138402R15490J583710L970176K134910m099758o338538j483988
$$ 2864419 5002821 5918311 7502021 11472197 13607107 9507349 3168811 1684823
38733A684823J567092l435796q180027k915791O094102N381579l765269o675942
$$ 1684823 3251915 -183881 -8363908 -11279699 -5185597 195982 -3569287 -10245229
38725a0245229J704065R377718O140722k519159o136194l931469j574977n56343
$$ -10245229 -8541164 836554 6977276 4458117 -1678077 -5609546 -7184523 -7740866
38717g740866J542850M445598N349824L533515P07649j266955r73817J234441
$$ -7740866 -6198016 -1752418 3597406 7130921 7838570 6571615 5597798 6832239
38709F832239J541718l200790q923933q059168j161653K726692j8640j951768
$$ 6832239 8373957 5173167 -3750766 -11809934 -12971587 -10244895 -10263535 -12215303
38701a2215303K468288P008767L954403l110156n384201k071678J359316L500955
$$ -12215303 -9747015 -2738248 1216155 -1894001 -7278202 -9349880 -7990564 -4489609
38693d489609O216611P067452K419275l847725m354726m0149J306392k000746
$$ -4489609 1727002 8794454 11213729 7366004 3011278 2971129 4277521 2276775
38685B276775l619730j119677j60167l873179o714646l382635K814217N357524
$$ 2276775 -1342955 -2462632 -2622799 -6495978 -13210624 -16593259 -13779042 -8421518
38677h421518L374053O53480l61300L88643K490523M396242L244485j381182n210410
$$ -8421518 -5047465 -4393985 -4755285 -4366642 -1876119 2520123 5764608 4383426 -826984
38668h26984l658362K347779O798796M697084k648557q043326n210742L439395
$$ -826984 -4485346 -2137567 4661229 9358313 6709756 -1333570 -6544312 -3104917
38660c104917P915730K440722o249221p247846l80333M061938P40551l508616
$$ -3104917 4810813 7251535 1002314 -6245532 -6625865 -2563927 -1823376 -5331992
38652e331992j194321M277843M727020J37131k144143M58640K029849j860231
$$ -5331992 -6526313 -2248470 2478550 2615681 471538 930178 2960027 1099796
38644A099796o575178m851675K517837P326668M692722j283353l902714k063644
$$ 1099796 -5475382 -10327057 -7809220 -482552 4210170 2926817 -975897 -3039541
38636c039541Q90552L433179O183137P378594L860630k697649o129678m255546
$$ -3039541 -2148989 1284190 7467327 14845921 18706551 16008902 9879224 5623678
38628E623678j769910k267240l118024j742624q34586k333949k206860K311983
$$ 5623678 3853768 1586528 -1531496 -3274120 -4108706 -6442655 -8649515 -6337532
38620f337532N883922L289559o51739J224687N143224K046718o062025q101737
$$ -6337532 -453610 2835949 2184210 3408897 8552121 10598839 4536814 -3564923
38612c564923k049539J999262r76906l679888p76556K026341k63513k281375J290729
$$ -3564923 -5614462 -3615200 -4592106 -8271994 -9048550 -7022209 -7285722 -9567097 -8276368
38603h276368N094198K236827l342311l274971K001478N415699M250828R16440
$$ -8276368 -3182170 -945343 -4287654 -7562625 -5561147 -145448 4105380 5021820
38595E021820k990807n925307m347243J160250L091032j742947m627874J529612
$$ 5021820 2031013 -3894294 -8241537 -7081287 -3990255 -5733202 -10361076 -8831464
38587h831464P892754K031245j0225306j0944554K766087J3567356Q653515m273104
$$ -8831464 -938710 1092535 -9132771 -20077325 -17311238 -3743882 4909633 636529
38579F36529j0661433o895189J204657P533715P713518Q29592n887187k895478
$$ 636529 -10024904 -16920093 -15715436 -8181721 -468203 361389 -5525798 -8421276
38571h421276O864424R169837l58747q060943l028656N751365M307050m334656
$$ -8421276 -1556852 7612985 7254238 -806705 -3835361 1916004 6223054 1888398
38563A888398p021138k268515J43715k330214k356376J958732L534967l5753k094062
$$ 1888398 -5132740 -7401255 -7257540 -9587754 -11944130 -9985398 -6450431 -6486184 -8580246
38554h580246P39126L227759K168456J593976L028595J139560n246615p801812
$$ -8580246 -7841120 -4613361 -2444905 -850929 2177666 3317226 -1929389 -9731201
38546i731201j522558N870573N491177O11092o13919Q82528j140806n147124l973414
$$ -9731201 -11253759 -5383186 107991 719083 105164 987692 -153114 -5300238 -9273652
38537i273652J884051M246924P76426j698015P25754K886984M5024m311307m732823
$$ -9273652 -7389601 -3142677 -2366251 -4064266 -3338512 -451528 -406504 -4717811 -9450634
38528i450634j843817O96640K489060M757495O068797M497511J526647l70938
$$ -9450634 -11294451 -10597811 -8108751 -3351256 2717541 7215052 8741699 8370761
38520H370761j743971l831925m685359k195751R27767M08837k377138k033393
$$ 8370761 6626790 2794865 -1890494 -4086245 -3158478 -2749641 -5126779 -7160172
38512g160172J944727L859874R87154j877762l42816K488404J869279n8337J580719
$$ -7160172 -5215445 -1355571 -368417 -2246179 -2588995 -100591 1768688 1710351 3291070
38503C291070M474403J865803m993633o552911l297M697809j57541p331960n969015
$$ 3291070 7765473 9631276 4637643 -1915268 -1918565 2779244 2621703 -4710257 -10679272
38494a0679272R40288K264712j834145l96249P967453J0237806j66503j1095526
$$ -10679272 -9738984 -7474272 -9308417 -9704666 -1737213 8500593 8334090 -2761436
38486b761436r049943J778281Q280742P572321N466403K631366m109545j0435484
$$ -2761436 -11811379 -10033098 -1752356 5819965 11286368 13917734 9808189 -627295
38478f27295q350147k60159L559646J331995P43286L108030R20879n740513n380011
$$ -627295 -8977442 -9237601 -5677955 -4345960 -3602674 -494644 426235 -5314278 -10694289
38469a0694289N537574J2967446N063747r125037j2416027l275576N420187O437299
$$ -10694289 -5156715 7810731 12874478 3749441 -8666586 -11942162 -6521975 -84676
38461h4676M427039L913680K838556l77981k488802j333471j7639j937521n365423
$$ -84676 4342363 8256043 11094599 10716618 8227816 6894345 6876706 4939185 -426238
38452d26238n828221k220557J447878P63649l002024l481954K014216O953213
$$ -426238 -6254459 -8475016 -7027138 -6263489 -9265513 -12747467 -10733251 -3780038
38444c780038L861035l755901n411453N43881M455911R44039l145189j061868
$$ -3780038 80997 -3674904 -9086357 -8542476 -4086565 -3142526 -6287715 -7349583
38436g349583L293451L677102J539503L49124j733057n432609n049017J345234
$$ -7349583 -4056132 -379030 1160473 1509597 -223460 -5656069 -10705086 -9359852
38428i359852M876879n85800o333098k255369N815833O210277J492975K225961
$$ -9359852 -4482973 -5068773 -11401871 -13657240 -7841407 -1631130 -138155 2087806
38420B087806O340724K948532o192683q056392j007458K705409j106776k741833
$$ 2087806 8428530 11377062 5184379 -2872013 -3879471 -1174062 -2280838 -5022671
38412e022671J740605L579077m12317q02948N525306O843316l025686j1584084
$$ -5022671 -3282066 297011 -115306 -918254 4607052 11450368 8424682 -3159402
38404c159402o782903M126527P261080K306891k158530l663677m259737k522641
$$ -3159402 -9942305 -5815778 1445302 3752193 1593663 -2070014 -6329751 -8852392
38396h852392J878188L605656J183812J937315Q099210R154031p04025r429379
$$ -8852392 -6974204 -3368548 -2184736 -247421 7851789 17005820 16301795 6872416
38388F872416n324076L070540J628254n118180l358425M380780M107614l773520
$$ 6872416 1548340 4618880 6247134 1128954 -2229471 2151309 6258923 2485403
38380B485403n378289J066842K328237n019828p784773M78289Q159840N364209
$$ 2485403 -2892886 -1826044 502193 -4517635 -12302408 -11824119 -3664279 1699930
38372A699930j245304k177244K39327K75467k8564K368672L546188M77871j840211
$$ 1699930 454626 -1722618 -1483291 -1207824 -1236388 1132284 4678472 5156343 3316132
38363C316132M98359K353684r86059m446831k247907J103929j140907n019553
$$ 3316132 3814491 6168175 5182116 735285 -1512622 -408693 -1549600 -6569153
38355f569153j814307O794891J0238220M398114l793744p069352n259797j289485
$$ -6569153 -8383460 -1588569 8649651 13047765 9254021 2184669 -3075128 -4364613
38347d364613L293856O773575O447838K053876k823984m604794l355191j727561
$$ -4364613 -1070757 5702818 12150656 14204532 11380548 6775754 3420563 1693002
38339A693002j593377k472496k649218j236513J121672L398747M894683M418407
$$ 1693002 99625 -2372871 -5022089 -6258602 -5136930 -1738183 3156500 7574907
38331G574907Q63257l925108n435628k226439J324369J318715J41162J356320
$$ 7574907 8438164 4513056 -922572 -3149011 -1824642 -505927 -364765 991555
38323I91555K480814m31777l964269j748092L684800L413524k837384m798803
$$ 991555 3472369 3040592 -923677 -2671769 1013031 4426555 1589171 -3209632
38315c209632K025333Q397754N361278k468903m870630o97921L214300L312613
$$ -3209632 -1184299 7213455 12574733 10105830 5235200 4537279 7751579 11064192
38307A1064192J851962P77572k18388p49888l1065N99210q81539m113617p128877
$$ 11064192 12916154 13693726 13475338 12725450 12694385 13293595 12412056 8298439 1169562
38298A169562q502773p018926j904946M685434Q381690P546972M529229J201849
$$ 1169562 -7333211 -14352137 -16257083 -11571649 -3189959 4357013 8886242 10088091
38290A0088091k477393m916660l805060j826403m334512r126024p018125L311040
$$ 10088091 7610698 2694038 -1111022 -2937425 -7271937 -16397961 -23416086 -20105046
38282b0105046J0283045N770925k262662k282517L251550L727407j653627l962439
$$ -20105046 -9822001 -4051076 -6313738 -8596255 -5344705 -1617298 -3270925 -7233364
38274g233364o5271L833118L850556K755564J737501j907745o687450n942728
$$ -7233364 -7298635 -3465517 385039 3140603 4878104 2970359 -3717091 -9659819
38266i659819J545101P952522P310973L078093Q21691p805j977426l103899o46982
$$ -9659819 -8114718 -162196 7148777 10226870 11048561 11040756 9063330 5959431 5312449
38257E312449K312521O58917m090682n019865J79243N658984N483973J165294
$$ 5312449 7624970 8283887 4193205 -826660 -647417 5011567 10495540 11660834
38249A1660834j737927j753736k021381l503223k828745J124268L317381k54382
$$ 11660834 9922907 8169171 6147790 2644567 -184178 940090 4257471 4003089
38241D003089m942331l360480K915239N182454J062280k499600j583304j258526
$$ 4003089 -939242 -4299722 -1384483 3797971 4860251 2360651 777347 -481179
38233d81179m693996n622980Q68705P833801O204684p06161k918156N133j18915
$$ -481179 -5175175 -10798155 -9929450 -2095649 4109035 3402874 484718 489851 370936
38224C70936m797220o402367j826075K563621K474117K241350N401992P267282
$$ 370936 -4426284 -10828651 -12654726 -10091105 -7616988 -5375638 26354 7293636
38216G293636K884670l776372m985058K2499M844462M451740n19l746237l379962
$$ 7293636 10178306 6401934 1416876 1439375 6283837 10735577 10735058 6988821 3608859
38207C608859r5416J399652j262849m118009k002898L202176M489959J20395l778725
$$ 3608859 3513443 4913095 3650246 -467763 -2470661 731515 5221474 5341869 1563144
38198A563144k748704k25724r60394l413356l292818r50842r8465j096345m45916
$$ 1563144 -1185560 -1411284 -2371678 -5785034 -9077852 -10028694 -10127159 -11223504 -11669420
38189a1669420L203095O266570M437591k130235q647337j0140547n902822M36296
$$ -11669420 -8466325 -2199755 2237836 107601 -8539736 -18680283 -24583105 -24146809
38181b4146809N150102P735631R340404R482768O365033j71374p549623j1689871
$$ -24146809 -18996707 -11261076 -1920672 7562096 13927129 13755755 6206132 -5483739
38173e483739q930930N71126R898109R870681P1389q399680o038967K692403O216997
$$ -5483739 -14414669 -13843543 -3945434 5925247 5996636 -2403044 -8442011 -5749608 467389
38164D67389J915519k467763j826363P30863J693274J984260K126522K91389k336710
$$ 467389 2382908 -84855 -1911218 -1180355 512919 2497179 4623701 4915090 2578380
38155B578380j315368L250926N399681K518657r37117j760641k702489n268794
$$ 2578380 1263012 4513938 9913619 12432276 11495159 9734518 7032029 1763235
38147A763235n388249j057064K787129K479446J922921M542828N584264j12667
$$ 1763235 -3625014 -4682078 -1894949 584497 2507418 7050246 12634510 12521843
38139A2521843q092417j0020067n335033L04445M196027O443299M684200k039904
$$ 12521843 4429426 -5590641 -10925674 -10621229 -6425202 18097 4702297 2662393
38131B662393p054823l302322M762487O257496K27160l389300k6012L120809L99788
$$ 2662393 -4392430 -7694752 -2932265 3325231 3552391 163091 137079 3257888 3657676
38122C657676k826522j88927M325244K992551k889836n332434k257087L25322
$$ 3657676 831154 642227 4967471 7960022 5070186 -262248 -2519335 -2194013
38114b194013j322236l313168j346283K205137K250469j049980k582294K62937
$$ -2194013 -3516249 -6829417 -8175700 -5970563 -3720094 -4770074 -7352368 -7089431
38106g089431M215743M943005K311878o91202j983473j263830J108806L332671
$$ -7089431 -2873688 2069317 4381195 3689993 1706520 442690 1551496 4884167
38098D884167J917158m080254r396441p484259N72166O404575M830810j39891
$$ 4884167 6801325 2721071 -6675370 -14159629 -13587463 -7182888 -2352078 -2491969
38090b491969j582202J952713O688038Q815832O780017J297093m283465o052181
$$ -2491969 -4074171 -2121458 4566580 13382412 20162429 21459522 17176057 11123876
38082A1123876l945162j580729p11010K77711J268740n81999m299289m016214
$$ 11123876 7178714 5597985 4886975 5164686 6433426 5851427 1552138 -2464076
38074b464076J341085L981461j046127o457169l230348M678461O117978R4630
$$ -2464076 -1122991 2858470 1812343 -4644826 -7875174 -3196713 2921265 3015895
38066C015895l662480p07485K792772K375603K096969M788968M835419k721205
$$ 3015895 -646585 -1354070 1438702 3814305 5911274 10700242 15535661 12814456
38058A2814456j2089010j2865021l412303P280560R885023L573418m465527o538030
$$ 12814456 725446 -12139575 -15551878 -8271318 1613705 5187123 721596 -5816434
38050e816434k263662J312840q38232m389055k312909L393410M314189k84066
$$ -5816434 -8080096 -6767256 -7605488 -11994543 -14307452 -10914042 -6599853 -6883919
38042f883919j453038M514257Q863729L993812m124137n323617o52682J200651
$$ -6883919 -8336957 -3822700 5041029 9034841 4910704 -412913 -1065595 135056
38034A35056j158762q76098M315476Q055659N515083j46517l625744l760482k100671
$$ 135056 -1023706 -1899804 2415672 10471331 15986414 15839897 12214153 8453671 6353000
38025F353000m43414j288598n612215q853159m739991M922175J0157243N585419
$$ 6353000 5909586 4620988 -991227 -9844386 -14584377 -9662202 495041 6080460
38017F080460k169816l862128L87461L380199J386075k969251n893094n398948
$$ 6080460 3910644 48516 435977 3816176 5202251 2233000 -3660094 -9059042
38009i059042r11545N252641P589403L487404j843960j750443K010367K096720
$$ -9059042 -9970587 -4717946 2871457 6358861 4514901 2764458 4774825 6871545
38001F871545k441605m664467j479665J206723j197788l825964m14193O012776
$$ 6871545 4429940 -234527 -1714192 -507469 -1705257 -5531221 -5945414 67362
37993F7362P633656L568678k02046q71492j487149l820069n360393m638117l789886
$$ 67362 7701018 11269696 11067650 10196158 8709009 4888940 -471453 -5109570 -8899456
37984h899456l924911k751268R12850M234997M398755K442834Q94255J23337r59836
$$ -8899456 -12824367 -15575635 -14662785 -10427788 -6029033 -3586199 -2691944 -2568607 -3528443
37975c528443k499427l415785k165781K270652Q018178R610816L376168o342022
$$ -3528443 -6027870 -9443655 -11609436 -9338784 -1320606 8290210 11666378 5324356
37967E324356j0509367n927957J435295M643981L148531N36718p97331o27918
$$ 5324356 -5185011 -11112968 -9677673 -5033692 -1885161 -1348443 -2145774 -2773692
37959b773692L1976o71390k718546j839160N053198J1904375Q457002m514143
$$ -2773692 -2741716 -3413106 -6131652 -7970812 -2917614 8986761 17443763 12929620
37951A2929620j3112307q298282J658394L448481l117144p674228n347181p80349
$$ 12929620 -182687 -8480969 -6822575 -3374094 -6491238 -14165466 -19512647 -20292996
37943b0292996J704130K959632M031063L689666J913677N49595J29426Q151O44187
$$ -20292996 -18588866 -15629234 -11598171 -7908505 -5994828 -5445233 -5315807 -5307656 -4663469
37934d663469J852152J038148k319692l590955J2018L077633j06995m806850k197840
$$ -4663469 -2811317 -1773169 -4092861 -7683816 -7671798 -4594165 -4701160 -9508010 -11705850
37925a1705850N623321P614978J065150l868269K48572P338805P184562j171526
$$ -11705850 -6082529 1532449 2597599 -1270670 -1022098 6316707 13501269 12329743
37917A2329743r616621r935650n64749J0913956J2026839j178507j5408077j3847353
$$ 12329743 2713122 -7222528 -7787277 3126679 15153518 13975011 -1433066 -15280419
37909a5280419Q93217Q951334J232639p955517l573022P440888Q213785j995822
$$ -15280419 -14387202 -5435868 -4203229 -12158746 -15731768 -8290880 -77095 -2072917
37901b072917q337711l470755L930383M664367J334084J262898N083435P358718
$$ -2072917 -10410628 -13881383 -9951000 -5286633 -3952549 -2689651 2393784 9752502
37893I752502M515951j519857o002967o151417l865824l031206l619863j591020
$$ 9752502 14268453 12748596 6745629 594212 -3271612 -6302818 -9922681 -11513701
37885a1513701L288502M280951k507674r151485m660020Q432565J4950891O728284
$$ -11513701 -8225199 -3944248 -6451922 -15603407 -20263427 -11830862 3120029 9848313
37877I848313o238417r099583j228873M715509P37721o748870p193594m62165
$$ 9848313 3609896 -5489687 -6718560 -2003051 -1265330 -8014200 -15207794 -15669959
37869a5669959M281803K486539K96987M104611R596048P541645j787884p604849
$$ -15669959 -11388156 -8901617 -8604630 -4500019 5096029 12637674 10849790 3244941
37861C244941l193944N189764P317467J707856m871216o841039m223985p7935
$$ 3244941 50997 5240761 12558228 14266084 9394868 2553829 -1670156 -1748091
37853a748091K356820J519615l93980Q52103N138664O320617N75752o676698p141729
$$ -1748091 608729 2128344 1734364 2586467 7725131 14045748 14621500 7944802 803073
37844H03073q68537M337111L770632N23667r51370o56129p48541j568060k308552
$$ 803073 -65464 4271647 8042279 8565946 7614576 6958447 6209906 4641846 2333294
37835B333294k984396l648916l486354k316042j449585j484243n87540K998638
$$ 2333294 -651102 -4300018 -7786372 -10102414 -11551999 -13036242 -13623782 -10625144
37827a0625144P208845P186340J199977n836839o945773j223532M943937N765891
$$ -10625144 -3416299 3770041 4970018 -866821 -7812594 -9036126 -4092189 1673702
37819A673702K462621l40353j683215l639413n450036l681760J562768N539081
$$ 1673702 4136323 3795970 2112755 -1526658 -6976694 -10658454 -9095686 -3556605
37811c556605N194730K579781Q42429O76315J619358K803859J732632l021632
$$ -3556605 1638125 4217906 5060335 5736650 7356008 10159867 11892499 8870867
37803H870867p226638m771194K647001O114906K149709k344521j496739O48133
$$ 8870867 1644229 -3126965 -479964 5634942 7784651 5440130 3943391 4591524
37795D591524j552787n015891l730693K40953M98576j996575k81500O269892R796293
$$ 4591524 3038737 -1977154 -5707847 -5466894 -4968318 -6964893 -7246393 -976501 8819792
37786H819792N644217j041875l276801j349544l43758j980315l040288j223457
$$ 8819792 14464009 13422134 10145333 8795789 8452031 6471716 3431428 2207971
37778B207971P08639j389506o151581o894899p78251N641726M747154p86242j943715
$$ 2207971 2916610 1527104 -4624477 -11519376 -12297627 -6655901 -1908747 -2694989 -4638704
37769d638704K439349M382921P43175j713375Q73139J864762l875955r498919
$$ -4638704 -2199355 2183566 2926741 1213366 2086505 3951267 75312 -9423607
37761i423607o531312J381956M715972K588072J284392K497828K798149J848251
$$ -9423607 -15954919 -14572963 -9856991 -7268919 -5984527 -3486699 -688550 1159701
37753A159701J986219J956646o40252l227565k454483j148871k784678l148137
$$ 1159701 3145920 5102566 4462314 1234749 -1219734 -2368605 -5153283 -8301420
37745h301420K735335R231574O881108k011308o286751l009387K27087m27213
$$ -8301420 -5566085 3665489 10546597 8535289 2248538 -760849 -533762 -960975
37737i60975n51901K003286L525262K934235L319688L721796p0966n413929m615630
$$ -960975 -1512876 490410 4015672 6949907 10269595 13991391 13920425 8506496 3890866
37728C890866J605428L992138J96469j624533K262666M899520J792563j416709
$$ 3890866 5496294 9488432 9684901 8060368 10323034 15222554 17015117 15598408
37720A5598408j00650J281581j465769m423725l298438m12441J590757M455936
$$ 15598408 15497758 16779339 15313570 10889845 7591407 7178966 8769723 13225659
37712A3225659P455788M709316m824937j2854832j2686025o953812l83656O133559
$$ 13225659 20681447 25390763 20565826 7710994 -4975031 -11928843 -12312499 -6178940
$$ [...]
##END NTUPLES=NMR SPECTRUM
##END=
