##TITLE=31Pdec_LR-0169-C-C6H6-K
 CCl4, 128 sc
 22.2.2023
##JCAMPDX= 6.0         $$ Bruker NMR JCAMP-DX V2.0
##DATA TYPE= NMR SPECTRUM
##DATA CLASS= NTUPLES
##ORIGIN= UXNMR, Bruker Analytische Messtechnik GmbH
##OWNER= root
$$ XWIN-NMR		Version 3.5
$$ Wed Feb 22 15:30:35 2023 Russian Standard Time (UT+4h)  she@DPX200
##.OBSERVE FREQUENCY= 81.013821
##.OBSERVE NUCLEUS= ^31P
##.ACQUISITION MODE= SIMULTANEOUS
##.ACQUISITION SCHEME= undefined
##.AVERAGES= 128
##.DIGITISER RES= 16
##SPECTROMETER/DATA SYSTEM= spect
##.PULSE SEQUENCE= zgpg30
##.SOLVENT NAME= CDCl3
##.SHIFT REFERENCE= (INTERNAL, CDCl3, 0, 248.564)
##AUDIT TRAIL= $$ (NUMBER, WHEN, WHO, WHERE, WHAT)
$$ ##TITLE= Audit trail, XWIN-NMR		Version 3.5
$$ ##JCAMPDX= 5.01
$$ ##ORIGIN= Bruker BioSpin GmbH
$$ ##OWNER= she
$$ F:/spectra/data/she/nmr/P31/1/pdata/1/auditp.txt
$$ ##AUDIT TRAIL=  $$ (NUMBER, WHEN, WHO, WHERE, WHAT)
(   1,<2023-02-22 15:01:39.50 +0400>,<she>,<DPX200>,
      <continue with go, POWCHK disabled, PULCHK disabled
       configuration hash MD5:
       00 E9 B6 7A A2 85 ED C7 34 08 36 98 17 FE 4E 26
       data hash MD5: 32K
       EB 55 D7 B4 9E 7D 5B D4 1B DC C9 9F E5 74 C4 87>)
(   2,<2023-02-22 15:29:46.06 +0400>,<she>,<DPX200>,
      <Start of raw data processing
       efp BC_mod = 2 LB = 1 FT_mod = 6 PKNL = 1 PHC0 = -11008.31 PHC1 = 177.0102 SI = 64K 
       data hash MD5: 64K
       A9 DC 17 30 00 EC B0 4A 6D 1F 84 BD BE B6 07 1B>)
(   3,<2023-02-22 15:29:57.07 +0400>,<she>,<DPX200>,
      <pk PHC0 = 14.91388 PHC1 = 0 
       data hash MD5: 64K
       A2 9B 4F C0 2D 73 D0 31 FF D3 CC 79 DF 93 C5 C1>)
$$ ##END=
$$ 
$$ hash MD5
$$ AA E3 5F 68 A6 42 3C 94 F6 60 69 1B 53 17 AA AA
##$RELAX= 
##$RELAX= 
##$RELAX= 
##$RELAX= 
##$RELAX= 
##$RELAX= 
##$RELAX= 
##$RELAX= 
##$RELAX= 
$$ Bruker specific parameters
$$ --------------------------
##$DU= <F:/spectra>
##$EXPNO= 1
##$NAME= <P31>
##$PROCNO= 1
##$TYPE= <nmr>
##$USER= <she>
##$AMP= (0..31)
100 100 100 100 100 100 100 100 100 100 100 100 100 100 100 100 100 100 
100 100 100 100 100 100 100 100 100 100 100 100 100 100 
##$AQSEQ= 0
##$AQ_mod= 1
##$AUNM= <au_zg>
##$AUTOPOS= <>
##$BF1= 81.014009
##$BF2= 200.13
##$BF3= 200.13
##$BF4= 200.13
##$BF5= 200.13
##$BF6= 200.13
##$BF7= 200.13
##$BF8= 200.13
##$BYTORDA= 1
##$CFDGTYP= 0
##$CFRGTYP= 5
##$CHEMSTR= <none>
##$CNST= (0..31)
1 1 145 1 1 1 1 1 1 1 1 1 1 1 1 1 1 1 1 1 1 1 1 1 1 1 1 1 1 1 1 1 
##$CPDPRG= <waltz16>
##$CPDPRG1= <>
##$CPDPRG2= <waltz16>
##$CPDPRG3= <>
##$CPDPRG4= <mlev>
##$CPDPRG5= <mlev>
##$CPDPRG6= <mlev>
##$CPDPRG7= <mlev>
##$CPDPRG8= <mlev>
##$CPDPRGB= <>
##$CPDPRGT= <>
##$D= (0..31)
0 1 0 0 0 0 0 0 0 0 0 0.03 2e-05 3e-06 0 0 0 0 0 0 0 0 0 0 0 0 0 0 0 0 
0 0 
##$DATE= 1677063479
##$DBL= (0..7)
120 120 120 11 120 120 24 19 
##$DBP= (0..7)
150 150 150 150 150 150 150 150 
##$DBP07= 0
##$DBPNAM0= <>
##$DBPNAM1= <>
##$DBPNAM2= <>
##$DBPNAM3= <>
##$DBPNAM4= <>
##$DBPNAM5= <>
##$DBPNAM6= <>
##$DBPNAM7= <>
##$DBPOAL= (0..7)
0.5 0.5 0.5 0.5 0.5 0.5 0.5 0.5 
$$ [...]
##$SUBNAM2= <"">
##$SUBNAM3= <"">
##$SUBNAM4= <"">
##$SUBNAM5= <"">
##$SUBNAM6= <"">
##$SUBNAM7= <"">
##$SUBNAM8= <"">
##$SUBNAM9= <"">
##$SW= 501.771253377433
##$SWIBOX= (0..15)
0 1 3 0 0 0 0 0 0 0 0 0 0 0 0 0 
##$SW_h= 40650.406504065
##$TD= 32768
##$TD0= 1
##$TE= 0
##$TE2= 300
##$TE3= 300
##$TEG= 300
##$TL= (0..7)
0 120 53 12 22 120 120 120 
##$TP= (0..7)
150 150 150 150 150 150 150 150 
##$TP07= 0
##$TPNAME0= <>
##$TPNAME1= <>
##$TPNAME2= <>
##$TPNAME3= <>
##$TPNAME4= <>
##$TPNAME5= <>
##$TPNAME6= <>
##$TPNAME7= <>
##$TPOAL= (0..7)
0.5 0.5 0.5 0.5 0.5 0.5 0.5 0.5 
##$TPOFFS= (0..7)
0 0 0 0 0 0 0 0 
##$TUNHIN= 0
##$TUNHOUT= 0
##$TUNXOUT= 0
##$USERA1= <user>
##$USERA2= <user>
##$USERA3= <user>
##$USERA4= <user>
##$USERA5= <user>
##$V9= 5
##$VALIST= <valist>
##$VCLIST= <CCCCCCCCCCCCCCC>
##$VD= 0
##$VDLIST= <DDDDDDDDDDDDDDD>
##$VPLIST= <PPPPPPPPPPPPPPP>
##$VTLIST= <TTTTTTTTTTTTTTT>
##$WBST= 1024
##$WBSW= 4
##$XGAIN= (0..3)
0 0 0 0 
##$XL= 0
##$YL= 0
##$YMAX_a= 2610
##$YMIN_a= -3002
##$ZGOPTNS= <>
##$ZL1= 120
##$ZL2= 120
##$ZL3= 120
##$ZL4= 120
##$ABSF1= 0
##$ABSF2= 0
##$ABSG= 0
##$ABSL= 0
##$ALPHA= 0
##$AQORDER= 0
##$ASSFAC= 0
##$ASSFACI= 0
##$ASSFACX= 0
##$ASSWID= 0
##$AUNMP= <proc_1d>
##$AZFE= 0.1
##$AZFW= 0.5
##$BCFW= 0
##$BC_mod= 2
##$BYTORDP= 0
##$COROFFS= 0
##$CY= -3
##$DATMOD= 1
##$DC= 0
##$DFILT= <>
##$DTYPP= 0
##$F1P= 0
##$F2P= 0
##$FCOR= 1
##$FTSIZE= 65536
##$FT_mod= 6
##$GAMMA= 0
##$GB= 0
##$INTBC= 1
##$INTSCL= 6.047779e-11
##$ISEN= 30
##$LB= 1
##$LEV0= 0
##$LPBIN= 0
##$MAXI= 10000
##$MC2= 0
##$MEAN= 0
##$ME_mod= 0
##$MI= 50
##$NCOEF= 0
##$NC_proc= -8
##$NLEV= 6
##$NOISF1= 182.463
##$NOISF2= 159.3651
##$NSP= 0
##$NTH_PI= 0
##$NZP= 0
##$OFFSET= 248.5645
##$PC= 4
##$PHC0= -10993.4
##$PHC1= 177.0102
##$PH_mod= 1
##$PKNL= yes
##$PPARMOD= 0
##$PSCAL= 0
##$PSIGN= 0
##$REVERSE= no
##$SF= 81.0140089999694
##$SI= 65536
##$SIGF1= 159.3651
##$SIGF2= -187.1042
##$SINO= 113.3802
##$SIOLD= 16384
##$SREGLST= <1H.CDCl3>
##$SSB= 0
##$STSI= 65536
##$STSR= 0
##$SW_p= 40650.406504065
##$SYMM= 0
##$S_DEV= 0
##$TDeff= 32768
##$TDoff= 0
##$TI= <>
##$TILT= no
##$TM1= 0
##$TM2= 0
##$TOPLEV= 0
##$USERP1= <user>
##$USERP2= <user>
##$USERP3= <user>
##$USERP4= <user>
##$USERP5= <user>
##$WDW= 1
##$XDIM= 65536
##$YMAX_p= 146481821
##$YMIN_p= -324479538
$$ End of Bruker specific parameters
$$ ---------------------------------
##NTUPLES= NMR SPECTRUM
##VAR_NAME=  FREQUENCY,     SPECTRUM/REAL,   SPECTRUM/IMAG
##SYMBOL=    X,             R,               I
##VAR_TYPE=  INDEPENDENT,   DEPENDENT,       DEPENDENT
##VAR_FORM=  AFFN,          ASDF,            ASDF
##VAR_DIM=   65536,         65536,           65536
##UNITS=     HZ,            ARBITRARY UNITS, ARBITRARY UNITS
##FACTOR=    0.620285442955139, 1,           1
##FIRST=     20137.2065510682, 0,            0
##LAST=      -20513.1999529968, 0,           0
##MIN=       -20513.1999529968, -324479538,  0
##MAX=       20137.2065510682, 146481821,    0
$$ Real data points
##PAGE= N=1
##DATA TABLE= (X++(R..R)), XYDATA
$$ [...]
##PAGE= N=2
##DATA TABLE= (X++(I..I)), XYDATA
14891 4593625 -1744128 -435044 6862931 8285665 -365348 -9411498 -10222406 -5487849
14883 -5487849 -460260 5057052 9961497 7439175 -4239175 -14273085 -11879571 -915764
14875 -915764 6951665 9456847 14144888 23174100 28159865 22891712 13234496 8944220
14867 8944220 10165913 8693993 1492573 -4233110 -2229366 2857923 3240748 1432756
14859 1432756 5930145 14141883 12253611 -3091079 -15372889 -10302483 2629790 4157725
14851 4157725 -5848747 -9451871 1532082 15130801 18781172 14658954 10654069 8403746
14843 8403746 6432401 5213083 3338606 -2401551 -8214148 -4346005 9255832 18422580
14835 18422580 13400769 2678727 -535348 2906000 3141591 -1721191 -5164046 -4683716
14827 -4683716 -3769694 -3580429 -2113106 -378392 -1194455 -2991491 -2043294 758644 2178618
14818 2178618 3186476 5845350 6672917 1867786 -3560463 -2370102 652528 -6579914
14810 -6579914 -22763536 -30114111 -17968578 960815 6642094 -2865865 -11732955 -8629806
14802 -8629806 1161326 6502429 5195805 3934332 7613996 13688341 16757897 14817564
14794 14817564 9174633 1177732 -7115869 -10462108 -4290012 7533039 14166427 10203432
14786 10203432 1974140 -2240617 -2929123 -4569014 -5382811 -598968 6624972 7244676
14778 7244676 -338642 -7656589 -8474785 -5695276 -3537701 -702284 4591314 9199276
14770 9199276 9369200 5665111 -122303 -7901598 -15164168 -15325515 -5532913 7746399
14762 7746399 15972272 18068678 18229093 18128020 16948192 15952686 16631725 16215253 11375516
14753 11375516 5390273 5282133 11704411 17595945 18013245 15970278 16355124 18432936
14745 18432936 17748895 13240195 9116972 9455156 12553534 12210074 5297761 -3577568
14737 -3577568 -7888053 -8663038 -12842611 -20942525 -23163518 -12598880 3353121 11770827
14729 11770827 10582561 8329728 10169129 13057561 14249284 15408050 17042139 17425705
14721 17425705 19025877 27047142 38030691 39059548 24657064 7278089 3169529 12408045
14713 12408045 20635559 17615148 6538164 -3764623 -8751279 -9439755 -8684688 -8020273
14705 -8020273 -6645566 -3706218 -1654286 -4104237 -9155215 -9819208 -4171579 460868
14697 460868 -1645881 -5110945 -1774063 6044681 9301281 6389012 3875236 4047392
14689 4047392 1985664 -3518941 -6103057 -2798377 -485175 -5885148 -15320326 -20374613
14681 -20374613 -19325510 -16972503 -15914072 -13922986 -9445675 -5279022 -5676611 -11245423
14673 -11245423 -16929005 -15404113 -4359012 9392420 15402625 9840658 -1580519 -10505418
14665 -10505418 -12923221 -9832200 -5009381 -2698722 -3849951 -4113933 840543 8033897
14657 8033897 9656985 3191140 -5704092 -10812774 -10655792 -5940711 1757884 7566364
14649 7566364 6659444 2191836 2546439 8047553 8886982 524973 -7994245 -7809814 -3828596
14640 -3828596 -5643657 -11742596 -13148646 -8113350 -2549139 971066 3929316 3910342
14632 3910342 -2500170 -9369816 -5878362 7102526 16085340 13887666 8581713 8368023
14624 8368023 8205489 275620 -10098404 -10309084 696376 10030009 8170124 230118
14616 230118 -3038714 968630 6629527 9512618 9713404 7231813 886496 -6258298
14608 -6258298 -6652610 1481402 7968578 1942985 -12537368 -20280764 -14732466 -5202989
14600 -5202989 -1691011 -1600695 2600117 10023782 13463516 9946661 1941871 -7761529
14592 -7761529 -15446944 -15450187 -7844682 -2868516 -8532111 -17460490 -16344866 -5675545
14584 -5675545 1603124 -58806 -2814026 -96286 5215310 9745557 14191117 15029754
14576 15029754 4828324 -12373333 -18539507 -4668877 13505991 14880351 1226027
14569 1226027 -6890622 1157021 14709834 19612371 15439190 10655898 8828488 6047096
14561 6047096 -1044108 -9753238 -14429463 -13294951 -10782277 -12056209 -16059378 -16757205
14553 -16757205 -11530573 -4719548 -1468336 -1835697 -3126713 -4173429 -4344747 -1870384
14545 -1870384 3320855 7916512 9509431 9649394 9786592 8055467 3838285 1218569
14537 1218569 2676610 3205880 -2713405 -11066040 -12907507 -7918027 -5115144 -8947036
14529 -8947036 -12593242 -8509246 756573 7032410 7153986 3650318 -2086503 -10738994
14521 -10738994 -19367698 -20900624 -12316745 -282779 4666547 -1251024 -12338272 -20495047
14513 -20495047 -22548380 -20483156 -17125711 -13492802 -9539172 -5867047 -4035814 -4843664
14505 -4843664 -6250128 -4515700 1003605 5825019 6017572 4394263 6519940 11389873
14497 11389873 12227627 6985821 553865 -5283556 -14570179 -25053868 -24087830 -6401267
14489 -6401267 12591645 14076791 1010384 -7820908 -5200917 -1140485 -2031555 -1762996
14481 -1762996 2503062 2502709 -5148607 -9094942 385235 15710110 22980131 20082767 14039449
14472 14039449 8221464 2682331 608477 3575420 5291985 187697 -6198557 -5242058
14464 -5242058 841955 3648680 3210807 6203087 11778324 11696861 5056953 1287234 5753209
14455 5753209 12020612 12230696 7572732 4306294 5019424 7810006 10536365 12873026
14447 12873026 15809669 19679901 21401782 16035762 4532893 -3209845 1097322 12370120
14439 12370120 17605189 12525355 5934643 6804896 13699946 19317648 20126896 18039318
14431 18039318 15576486 12690276 8112401 2807449 941579 5120225 10838076 10188316
14423 10188316 2655479 -3511789 -3927957 -5193423 -13457366 -22496515 -21982379 -13151878
14415 -13151878 -6527537 -6676549 -8945069 -9672260 -9655372 -8075230 -3067071 1400164 -528716
14406 -528716 -4811547 -841424 10498780 13651875 -438333 -19286382 -23301535 -9353194
14398 -9353194 7977581 14686114 9203962 -1728329 -11052340 -14121978 -9334747 291590
14390 291590 8008222 8795609 4406930 1290025 2560497 4126039 1234715 -3554325
14382 -3554325 -3981180 -370206 697509 -2752353 -6070525 -8516904 -15182805 -23911834
14374 -23911834 -22321202 -6323142 9642285 12012879 7204174 7733102 9610305 1548133
14366 1548133 -10720370 -10777022 184636 3282218 -7773204 -17114068 -12915186 -4156890
14358 -4156890 -2906745 -6032566 -4523030 1428237 5842490 5924612 1437872 -5543420
14350 -5543420 -7101731 2451672 12851878 7539885 -9684831 -16139477 -4483301 5383166
14342 5383166 -818512 -8614888 -808251 12602473 11543019 -1246104 -6817282 -150403
14334 -150403 7447077 9277941 6974598 -835633 -14542104 -23481111 -18699948 -10751109
14326 -10751109 -15384592 -26618953 -25731459 -13621808 -9998594 -19766557 -25052021 -15907453
14318 -15907453 -5701504 -6919257 -11959311 -9521529 -3379701 -2430896 -5348729 -6911500
14310 -6911500 -8385767 -10606289 -6972736 5327525 15583032 12256277 -733946 -9966599
14302 -9966599 -9345427 -2685068 5039281 10690085 11526313 8111590 5196360 4309786 97206
14293 97206 -10764963 -22317164 -26591587 -23068192 -15705445 -6422514 2529767 5786443
14285 5786443 1796259 -2106152 1201033 8020223 8897755 1267622 -8680080 -13755463
14277 -13755463 -10536465 -128611 10976520 14754023 10775364 6802003 6582507 4567951
14269 4567951 -1392816 -1637031 10375776 22341983 16625029 -3682266 -16835876 -10917532
14261 -10917532 3535178 12031078 13729613 14372324 13284079 7268432 508741 144450
14253 144450 4450604 4121611 -4391945 -13219297 -12499909 -1641295 10692527 15729396
14245 15729396 12147407 5477081 1614094 1812980 3733793 5468942 6807114 7776777
14237 7776777 8659567 11023862 15494200 18205678 13620764 3051506 -3490892 1815803
14229 1815803 14037739 20928158 18295816 13831255 14076089 14740170 9704395 3923380
14221 3923380 7323703 17033385 17506042 2801173 -11799512 -9447749 4489995 10439403
14213 10439403 2835117 -3829141 1309795 9929344 9913666 5250373 8989425 21486364
14205 21486364 27682071 16636132 -4934423 -21294499 -24044180 -16572056 -6263746
14198 -6263746 2784979 9208039 10361871 3102374 -10214290 -20088838 -18780565 -9803972
14190 -9803972 -3481329 -3139564 -2011467 4623936 11532310 11948933 7267425 2144528
14182 2144528 -4351588 -14350996 -21607860 -16428556 -413985 12510183 12163712 2378242
14174 2378242 -7338361 -13540488 -17747209 -19147504 -15136529 -7440462 -1971639 -1884626
14166 -1884626 -4447434 -5877233 -6335207 -8164853 -11154929 -12570055 -11752055 -11606880 -13920676
14157 -13920676 -15616068 -12489059 -5301172 1094964 3929663 4211739 2773161 -893614
14149 -893614 -5455179 -8243705 -10008708 -13909600 -18207088 -16379140 -7819984 -1628137
14141 -1628137 -4263091 -9501830 -7821217 -675840 3354644 3077165 4994551 9964012
14133 9964012 10169084 1756993 -8281018 -11675686 -8603987 -4002576 44908 3850106
14125 3850106 6369331 6204607 3800866 165969 -3671209 -4415008 1801168 12644209
14117 12644209 18768487 13755791 2115735 -6085424 -6252549 -1865207 1477129 958255
14109 958255 -3086042 -8196044 -11121900 -9954439 -5167412 1340787 7038961 9251990
14101 9251990 7397774 4371330 2733635 480835 -4999777 -9891812 -7742459 -1007075
14093 -1007075 -525786 -10003407 -19042395 -17262094 -8141336 -1630581 408948 2239578
14085 2239578 3113401 -531153 -4450887 -628344 7700305 7483962 -4321607 -13972509
14077 -13972509 -10066122 596914 4645663 1432285 -107449 1311465 -1949501 -10753037
14069 -10753037 -14357835 -5741092 6957355 10808487 4624775 -1810641 -2413159 -1641491
14061 -1641491 -6248747 -15734545 -23417042 -23868779 -16879376 -5975282 4426714 10883052
14053 10883052 11924216 8094376 1316975 -5382827 -8502303 -6621861 -2607618 -943264
14045 -943264 -2190719 -2790280 -1380933 -1595439 -6052220 -11520577 -14252056 -16432541 -21272220
14036 -21272220 -24514948 -19137165 -8115497 -3231430 -8645232 -14545691 -12002039 -6105072
14028 -6105072 -7259493 -15661852 -22755388 -23656944 -19377898 -10274503 2505996 10717444
14020 10717444 5574820 -7779196 -12963448 -3369720 8874729 10238128 3305627 -631089
14012 -631089 683435 301966 -3952605 -6145508 -3152170 369861 570895 377200 2599777
14003 2599777 3062634 -3337142 -12941989 -16180305 -9620549 318314 6590959 9238173
13995 9238173 11113757 10462027 3264706 -8394378 -16082584 -14637080 -8022036 -3538473
13987 -3538473 -3546070 -5519385 -7272124 -8420165 -8326445 -6249416 -2981765 234136 3448287
13978 3448287 6388777 7027752 4939795 4002182 7483792 12098591 12013645 7611245 4272268
13969 4272268 2803232 -1808383 -10692886 -17540970 -18128551 -16667382 -17682698 -17379735
13961 -17379735 -9831527 2017495 9039376 8319609 5994589 7235100 9353545 7039206
13953 7039206 288691 -5854838 -7548028 -5708191 -3804155 -3754304 -4785194 -5841179
13945 -5841179 -7371740 -9433022 -9738098 -6538070 -2535699 -2047466 -4358405 -4430574 -864303
13936 -864303 2051695 1732301 761426 59745 -5013709 -16741039 -28707975 -33634371
13928 -33634371 -33240178 -33494176 -33655887 -28003572 -16622812 -6541290 -2390032 -2780893
13920 -2780893 -5763318 -10957732 -15718949 -15755825 -10920618 -5120041 -2920 5842267
13912 5842267 11499273 13906492 13815523 14877452 16205207 13353572 7964758 7808902 14037818
13903 14037818 17092702 10770912 2949463 5058681 15788436 22600516 16821771 1242712
13895 1242712 -15368603 -26018612 -28782312 -26446866 -22680104 -17356809 -8221796 2172689
13887 2172689 6596971 3026532 -1404805 -778903 852185 -3133114 -10767548 -14747145
13879 -14747145 -13084268 -9245235 -4857042 -199160 539699 -6507379 -16109936 -18279080
13871 -18279080 -12070875 -6689274 -7355640 -8539486 -4198375 3174932 8101089 9930208
13863 9930208 9901682 6125608 -2316269 -10335889 -12351655 -10393172 -10713240 -13941878 -14747414
13854 -14747414 -10961000 -6982258 -6719750 -8197596 -7774875 -5973885 -5693340 -6715744
13846 -6715744 -5529207 -297187 6427280 10163494 8379506 2513246 -2185746 189370
13838 189370 10184364 20005291 20069387 9926128 -670290 -3591939 -1406655 -1173461
13830 -1173461 -3305677 -2790267 760736 1979865 -998709 -3756141 -4244589 -6853488
13822 -6853488 -13655061 -18014384 -13038841 -2350538 3731096 537584 -7477046 -13632837
13814 -13632837 -14544838 -10281078 -3798087 142455 -1173865 -5968106 -10691706 -12748339
13806 -12748339 -9437545 712790 12411946 15275648 6275248 -4768366 -7989909 -5749450
13798 -5749450 -4582175 -1878495 7785517 17617212 14235852 -1861647 -14914334 -14990009
13790 -14990009 -8088149 -2520485 1599264 4173108 -595313 -13502994 -24223063 -24685682
13782 -24685682 -20004298 -17580837 -14266698 -4825054 4622072 4285494 -2750519 -4331603
13774 -4331603 2384905 7966949 5846315 -11005 -3480022 -3338913 -639355 3285230
13766 3285230 5168020 3107634 1559026 5410116 9395069 2987254 -12467527 -21634428
13758 -21634428 -14686376 -377051 6223247 2098581 -4336797 -6777018 -6009574 -3819826
13750 -3819826 788503 8733552 18332055 26122885 28464230 23819115 15592711 10678806
13742 10678806 12466437 16888239 17855196 14777900 11933558 12023738 13505793 13499469 10705464
13733 10705464 5975345 2034035 1923406 5860537 10249606 11022509 6887868 -1169773
13725 -1169773 -10623301 -15973168 -10867389 3684886 15916361 14305399 1717502 -7365331
13717 -7365331 -4799128 2236878 3401247 352684 2902756 12465578 17757120 9686021
13709 9686021 -5608774 -14147272 -11479688 -5855655 -4116122 -2199635 5860622 15450808
13701 15450808 15925364 5914290 -4187892 -6267773 -3430258 -1929466 -1818682 -1276421
13693 -1276421 -3586460 -11339975 -17640022 -12855059 693233 9977124 7994192 547683
13685 547683 -5196995 -9158297 -11482493 -7431389 3330586 10515193 6202114 -1436651
13677 -1436651 1435053 13121818 17908243 9275135 -545492 1341667 10718533 13625544
13669 13625544 5229171 -6126176 -10677819 -7052511 -1711600 -2606639 -11870898 -21958546
13661 -21958546 -21610593 -9042182 3490193 2493081 -11114182 -23256931 -22576646 -11199432
13653 -11199432 -18607 3269946 513076 -980462 1991592 4413946 793756 -4821878
13645 -4821878 -2744697 7609853 14809533 11308652 4156428 2784659 3821437 -1280106
13637 -1280106 -8976271 -7627904 2688778 8644182 4170655 -1222951 153977 1673815
13629 1673815 -3840560 -9067858 -3387388 7916922 9590752 -905147 -9917880 -7892129
13621 -7892129 -1175676 617855 -1048441 742337 4839804 3124103 -6455383 -15571479
13613 -15571479 -15986899 -9391734 -3936990 -4021162 -7116053 -9329690 -9800233 -8701886 -4874159
13604 -4874159 1569663 6731990 6909478 4130369 3754092 6443102 6508277 -351488 -10791504
13595 -10791504 -17336863 -16350874 -11017619 -7678629 -10089522 -16162897 -19939684 -17589983
13587 -17589983 -10971799 -4482874 -566706 -438301 -5757163 -14540753 -17936928 -8278978
13579 -8278978 9601518 21990163 22235535 16456563 12311530 10101243 7951088 7564949
13571 7564949 9540926 9547269 4901733 -445932 -2665377 -3952561 -6109746 -4762138 2639250
13562 2639250 8977432 6621421 -26180 -889774 3926521 5062130 -648468 -6329040
13554 -6329040 -7405174 -7564795 -9571578 -9186874 -3159107 3211870 2169076 -6086006
13546 -6086006 -13296728 -12071737 -2810105 7099352 10145466 5746720 116253 -1656377
13538 -1656377 -1162293 -2440361 -5369288 -6688420 -4897535 -682983 4480125 6816723
13530 6816723 1849658 -7917614 -12152540 -5571274 3765205 6209770 4484297 6648611
13522 6648611 11235930 11219039 8005360 7920502 8208058 1720572 -6367614 -3417693 8872602
13513 8872602 15482413 13042589 14031160 20553071 15336495 -9652575 -34641634 -37704660
13505 -37704660 -24213242 -14140099 -12503987 -10746687 -7969927 -10863556 -17109093 -16921376
13497 -16921376 -9383171 -2334480 1988408 7363431 12178234 11610798 8930623 10619031
13489 10619031 12640257 6477956 -3312641 -4177718 2395459 1692277 -9532917 -17165356
13481 -17165356 -12785320 -5095664 -2153919 396521 4573360 450239 -16039193 -29355932
13473 -29355932 -23235043 -4018270 9051127 9967024 8525039 11313937 13768359 10189381
13465 10189381 1086547 -9593586 -17197167 -17650062 -12476364 -10145181 -15993214 -23764190
13457 -23764190 -23913950 -17171524 -12491738 -14066769 -17581249 -17315231 -10701226 1090657
13449 1090657 10649769 7048247 -10201372 -24176403 -18465697 481312 11170058 6517775
13441 6517775 1479789 8022626 16552274 11087369 -6626566 -19272623 -16465972 -5655952
13433 -5655952 -503892 -4894020 -10821705 -9511855 -1978997 2978195 927028 -2234489
13425 -2234489 -56809 2989257 -2481829 -14761694 -20648531 -13335154 -1809076 2362353
13417 2362353 125967 358861 5879574 11649831 13777723 12967638 10111472 4705307
13409 4705307 -2107288 -7557740 -10811958 -13219721 -15009077 -14623323 -11529567 -7797347
13401 -7797347 -6962053 -11634171 -20077182 -24697584 -18245644 -3878813 5801425 3749166
13393 3749166 -2484607 -2310069 2675600 3750707 1457651 4763660 13354975 13966679
13385 13966679 355792 -13990692 -13058702 -1331238 2195988 -9446737 -22557829
13378 -22557829 -22356792 -10701428 789221 6832662 9667512 9404985 3551686 -3950118
13370 -3950118 -2787489 10387543 24996406 28430574 20929474 12786162 9786352 8759183
13362 8759183 6604305 5209479 5115888 2185018 -4436606 -7351149 -944630 7655294
13354 7655294 5968709 -6559397 -16713750 -14364341 -4331122 1765615 248442 -2599001
13346 -2599001 -574392 4865061 7030608 1602672 -8855014 -17474000 -19856921 -17433712
13338 -17433712 -13727380 -9595183 -4486640 -100736 1437617 2081215 5700431 11118498
13330 11118498 12147539 6089525 -1787591 -4088234 1335475 10600392 17021426 15030771
13322 15030771 5420432 -2930664 -1869970 5043134 7060718 2661873 2270609 10796673
13314 10796673 17557448 11232515 -3657601 -14960488 -20391237 -24951935 -26303982 -17159722
13306 -17159722 -671746 11058582 14899930 18983007 24518487 20942645 5969384 -4570015
13298 -4570015 1593085 13368653 12204160 -631480 -8537106 -6513205 -6079886 -13096319
13290 -13096319 -17888607 -12955505 -6061282 -6617491 -9792470 -5337208 4556838 8109414
13282 8109414 1932826 -4704404 -3906899 1539224 4946640 4764765 3901572 5045287 9103802
13273 9103802 14134802 14315797 5053251 -8648397 -14433406 -6863821 5363928 10564797
13265 10564797 7584877 3215593 1241856 1047497 3007264 6701175 6342979 -2461519
13257 -2461519 -12521388 -12078698 -2518139 2286101 -3134915 -7700362 -1831114 8292911
13249 8292911 12636178 12418348 12575167 8791173 -4285518 -18552707 -21083405 -13467410
13241 -13467410 -7726273 -5533559 1997600 13659577 15165490 1707713 -12435415 -14485780
13233 -14485780 -9767202 -8897870 -10778482 -9179249 -6122125 -6585631 -7275276 -2604875
13225 -2604875 3704508 4508503 2273692 4845857 11479904 14280699 11329911 7484291
13217 7484291 3687369 -3433528 -11813018 -14770908 -12223092 -10709867 -11360747 -8707976
13209 -8707976 -3308331 -3599408 -10651603 -12565510 -1648252 12065427 13947036 5072534
13201 5072534 -1050957 1122540 2789644 -4221036 -14802469 -17276948 -8328556 3400959
13193 3400959 7739300 3849887 -311479 2108258 9487126 14439040 11805211 2411237
13185 2411237 -9485929 -19990966 -27284037 -31549602 -33123294 -30177392 -20460674 -7080148
13177 -7080148 757126 -2944762 -12547066 -16192847 -9137315 2154968 8441087 6145674
13169 6145674 -1774322 -8602782 -7461545 3171012 16559957 23668870 22211205 16906280
13161 16906280 12005967 7674747 2578461 -4525336 -14408136 -23681909 -23938419 -11511310
13153 -11511310 3810489 8442142 2778107 -190944 5612135 12241859 12591798 10394742
13145 10394742 9833312 6684426 -1424505 -5406417 3486452 18200219 23430450 15487324
13137 15487324 4591562 -637518 -1120421 -131271 2190491 4662507 2549240 -6580537
13129 -6580537 -17564471 -21221782 -13215146 686709 9079318 7230863 3763823 9413809
13121 9413809 19544972 17444997 -1454204 -19695456 -20342624 -9560016 -4775419 -7935146
13113 -7935146 -5966306 5211111 13637768 10330693 1128279 -5163190 -8537060 -11392467
13105 -11392467 -10158431 -1242578 10684617 17153112 14960291 6567296 -4160288 -12487141
13097 -12487141 -13361232 -6098949 3811322 10280385 11591350 8918638 4082726 55721
13089 55721 -1030010 -1719579 -5801598 -9988280 -6239326 4661889 9693090 -438890
13081 -438890 -17786504 -26376236 -21146153 -11271046 -7164029 -10451196 -16040025 -18871432
13073 -18871432 -17566303 -13630754 -7849254 1300101 12947727 19390361 13012302 -1556462
13065 -1556462 -10138649 -6991529 -1782479 -3494244 -6323822 -396421 10543173 13676948
13057 13676948 6081122 -2320843 -4299464 -3224230 -3798568 -4260418 -1495066 2900203
13049 2900203 5687198 6693756 7534634 8854458 10373161 10773645 7532286 682443
13041 682443 -3892611 -227055 8506717 12277914 6573802 -3189348 -10555827 -14837557
13033 -14837557 -17195728 -16975398 -15444865 -16775474 -21000986 -22069157 -17876709 -15838887
13025 -15838887 -21469510 -27049938 -21220047 -7064465 -89310 -7415011 -18450076 -19508644
13017 -19508644 -10085788 -90267 3140325 -215948 -6088642 -9504447 -6877536 -503208
13009 -503208 1627702 -4317009 -10765707 -7623617 3305129 10408818 8614534 4801124
13001 4801124 4741808 4454203 410292 -754490 7261702 16086992 11332499 -5622253
12993 -5622253 -16747485 -10794018 2878976 8552350 3403934 -3762269 -6213151 -4367519
12985 -4367519 -1345307 -75646 -2413478 -6317046 -6667100 -2731924 -517956 -3033001
12977 -3033001 -3725716 3249982 11089319 8257774 -3815975 -11164291 -6036322 3923903
12969 3923903 7513864 2998209 -4069657 -9205544 -10661912 -7662063 -1744713 2759036
12961 2759036 2991496 637586 -1028050 -1037108 -329237 297140 463580 -113786 -1748124
12952 -1748124 -5315472 -11107105 -15738710 -13761651 -5866335 -1132631 -5263384 -10856444
12944 -10856444 -7509532 2038733 6241919 2786867 -249073 -619423 -4335503 -9509158
12936 -9509158 -4724579 9261836 12984370 -4408961 -25626955 -28539950 -17353084 -12105307
12928 -12105307 -15807933 -13973663 -3455384 1809959 -3054920 -4049383 6969145 16782522
12920 16782522 12512103 3597316 6567386 18304428 21537353 11778163 2168353 2071594
12912 2071594 5545141 4052996 -1229965 -4702630 -4789771 -1447338 7487185 20677060
12904 20677060 29143158 25424795 14641049 9149323 12337710 14546143 7005904 -6247673
12896 -6247673 -14459799 -13671076 -8507797 -3150680 2264323 6053457 3530981 -5149407
12888 -5149407 -11749134 -10170530 -5649127 -6923461 -12110464 -10976184 -1295945 6185680
12880 6185680 2731934 -5976903 -8424517 -3163531 1127320 -892413 -5181229 -6090616
12872 -6090616 -3768703 -1514375 -466624 -124841 -1080005 -3890286 -7002414 -8577477
12864 -8577477 -8874257 -8217557 -4695615 2128798 6868740 3586216 -4193474 -5646876
12856 -5646876 2168875 8442354 3963618 -4232755 -3478849 3385178 1084570 -12824511
12848 -12824511 -20642927 -9856103 6921282 9538485 -929895 -6328118 -184491 4908004
12840 4908004 405073 -4496664 -71599 6406192 2378636 -8908275 -12426482 -3220758
12832 -3220758 8467000 14029891 16364490 19408799 18838418 10836302 2471978 3187097
12824 3187097 9473683 8964458 11163 -3899553 6291182 20795763 24027599 15200883
12816 15200883 5993153 2253726 105596 -1291713 3074312 11390686 13034358 5567843
12808 5567843 1321067 7921246 13851593 6104735 -7267477 -8424901 2119242 6794177
12800 6794177 -867689 -8205601 -6892020 -6149743 -14355224 -23145402 -21830221 -15858010
12792 -15858010 -16943454 -22615565 -20665308 -10561797 -5559775 -12080198 -19504388 -15581347
12784 -15581347 -3277438 4722713 3672390 1264734 4768814 10625367 11279519 8345479
12776 8345479 10902047 19818758 23052734 12664997 -1552732 -5620733 -2528158 -6096467
12768 -6096467 -16549189 -19084738 -9102924 -1342562 -6378090 -13721554 -9477301 2206043
12760 2206043 8538615 8409610 8795035 9074679 4515832 -100966 3955566 13133401 15452139
12751 15452139 8735601 1571921 -1663829 -2676800 1431049 14339537 26231625 21011282
12743 21011282 855332 -13501898 -12096468 -8300411 -14376912 -21543723 -16722854 -5182221
12735 -5182221 -936449 -3800816 -2408054 4531081 5807089 -3555868 -14321256 -16664650
12727 -16664650 -12033480 -7320922 -4157174 818908 8438793 14741391 16418658 15431615
12719 15431615 15653233 15871146 10657482 261120 -5742940 -113737 11357943 18380739
12711 18380739 20989035 25337195 28198998 20256321 5218584 -818424 6078908 10109064
12703 10109064 990638 -9317543 -7526650 -1938339 -7572868 -19311414 -19715299 -7877035
12695 -7877035 -266063 -4079697 -8868928 -6830756 -3744409 -4460144 -2893673 5828581
12687 5828581 15217794 17473276 14393016 11034701 6981184 1431538 -724787 3350398
12679 3350398 6256305 -862848 -14173393 -20169594 -12446635 1028003 8443436 7403951
12671 7403951 5433463 9061397 15016584 14260925 4541111 -5091152 -5358078 1510589
12663 1510589 6581622 7488343 9035046 12128634 11791364 7475413 5700900 8974588
12655 8974588 10965275 7468053 3836896 5444191 8409129 7226228 4855898 6325370
12647 6325370 7575247 1051753 -10278016 -15117806 -10073426 -4115626 -4995245 -9770963
12639 -9770963 -12477518 -13907424 -17915785 -22384141 -20684859 -11731750 -3413502 -3821659
12631 -3821659 -11323180 -16105546 -11696745 -2617963 1254196 -3495826 -10663010 -12879114
12623 -12879114 -9584251 -5153333 -2390412 -830660 31229 -1230397 -6146240 -13126023
12615 -13126023 -16576714 -11260885 685958 9832579 10559939 9170516 14101733 20299178
12607 20299178 14121734 -4488697 -17309500 -12277700 -1385114 -2925688 -14259640
12600 -14259640 -16866057 -4738542 8052404 9372116 4045560 1702834 1714587 -1407823
12592 -1407823 -5791063 -5059635 150341 1749822 -5028658 -15420157 -19958273 -13124841
12584 -13124841 1827634 14789207 17021533 9283049 456097 -2701046 -1924234 -2318097
12576 -2318097 -4100647 -2631799 4428397 12586327 13873638 4866709 -8459990 -15414027
12568 -15414027 -11670120 -3631082 833991 2839444 8446158 16571694 18771768 11781874
12560 11781874 2571452 -1898658 -3189411 -5685925 -8284429 -7043176 -2272931 2021522
12552 2021522 3522367 2853020 1586458 1622447 4232332 7894668 9713705 9617763 9195428
12543 9195428 6660877 -400738 -6794039 -3515206 7118310 10622254 729219 -9868446
12535 -9868446 -8070696 225710 1082556 -5564909 -9502163 -9649293 -12925789 -16290558
12527 -16290558 -8224459 9889329 21127740 16934587 8209745 5674209 4131906 -3803545
12519 -3803545 -11498564 -8879671 -44939 3248235 -309043 -2967834 -3171817 -6073116
12511 -6073116 -10474024 -8382805 871740 7244544 4122229 -2802911 -4642382 -247948
12503 -247948 5950966 10933328 13133350 10193478 2289449 -4593234 -3918637 3058953
12495 3058953 8172415 6540385 2813777 4714054 11889703 15373540 9721233 1740562
12487 1740562 2358268 11459777 17082801 10879079 -1362483 -7430355 -2263250 9270528
12479 9270528 18679806 19338904 10094310 -2161287 -7152682 -2679874 2376341 508012
12471 508012 -4241226 -4325058 -1210582 -1482450 -4763282 -5435819 -3759669 -4408788 -5109370
12462 -5109370 1139245 11295965 12426077 870251 -10459874 -10323381 -4001245 -1717215
12454 -1717215 -2173943 1240667 5392865 2106330 -5661219 -6326975 1366565 4918046
12446 4918046 -3099258 -14254997 -18120310 -17127821 -19147840 -22311960 -18081145 -6946847
12438 -6946847 -268158 -4510631 -12153279 -12859438 -7835771 -6800582 -13310426 -19733810
12430 -19733810 -17649005 -8404735 -728604 -364039 -4905942 -8270777 -8130732 -8000127
12422 -8000127 -12054715 -18613210 -20749962 -14850573 -6410795 -3743820 -7054157 -8927559
12414 -8927559 -6133493 -4417051 -8338062 -12811722 -10873977 -4902118 -1951389 -1017248
12406 -1017248 4885329 13824136 13230257 -2141993 -19197768 -20896452 -6618049 9207721
12398 9207721 15589435 14393031 12433937 11967443 11045174 7958596 2456304 -4350778
12390 -4350778 -9228560 -8560962 -2833596 2700914 3743670 1656346 687072 2182740
12382 2182740 3749782 2838070 -1445911 -9186000 -19024585 -26535397 -26761825 -19924168
12374 -19924168 -11861120 -7171942 -5077626 -4375847 -8067927 -17656106 -25969102 -23586377
12366 -23586377 -12313408 -3949788 -3533914 -2645615 5509318 12760138 6626141 -10774274
12358 -10774274 -24654274 -26609325 -22022765 -18220601 -14767684 -8476809 -441093 6198277
12350 6198277 10437816 12021037 10290131 7326905 7879281 12913057 16821736 14015618
12342 14015618 5298609 -4298867 -10380624 -10047249 -2618728 7435421 12648083 11278093
12334 11278093 9957319 13875622 18612839 16796317 9332348 3816529 3618378 4765452
12326 4765452 3344640 310064 -2018601 -3589854 -4992006 -5438183 -4158357 -1753618
12318 -1753618 951859 3630110 5208492 3782169 -942012 -6262924 -8756407 -7410367
12310 -7410367 -3823050 -82506 2416012 2666378 627356 -1392803 -424163 2240544
12302 2240544 789774 -6320333 -10178125 -1703306 12148800 12983559 -3770368 -19040322
12294 -19040322 -14914845 -193378 2425650 -10949701 -21982094 -18410255 -8508413 -3620472
12286 -3620472 -2537977 -656027 -435046 -2852272 -387354 10121651 17645700 12368533
12278 12368533 2371353 1042948 4557774 -1970931 -18658190 -27809222 -18890363 -2630158
12270 -2630158 4820402 1295586 -3887959 -4370924 -2073781 -1675788 -4688850 -8230987
12262 -8230987 -8045387 -3202110 3032813 8014325 12606091 17019666 17898340 13699977
12254 13699977 8967498 8109565 8927417 8107490 8496011 13259737 16918275 11667448 483325
12245 483325 -5704987 -3156662 1505662 3021286 3267157 4649150 6171209 7009070 6381417
12236 6381417 98686 -13914472 -26683352 -25164644 -10200445 2332978 1271151 -8172072
12228 -8172072 -15530787 -17938636 -17015705 -12245545 -4376745 1167381 861850 -1449209
12220 -1449209 -409685 3868902 8298955 11540460 13073163 12413407 11678888 13500754
12212 13500754 14811619 9902644 1704935 1025490 10485890 18613969 16093755 9031004
12204 9031004 7937170 11191495 9645990 2840212 -215157 4654654 10526802 8715033
12196 8715033 -996979 -10742147 -12685652 -6708481 -495646 -341259 -3175575 -2266435
12188 -2266435 1114779 79444 -4179395 -2405827 6160345 9776957 2894658 -3624600
12180 -3624600 -3693 6682180 6135519 3385571 8539822 16198737 12927331 1351575
12172 1351575 -1603147 9019020 18639733 15444096 5643287 915719 2614865 5005738
12164 5005738 4942447 2116545 -3128430 -7264206 -5209414 1832173 6695269 7216008 9059853
12155 9059853 14100310 14854799 6333980 -4501382 -8605534 -7971694 -10524803 -16131953
12147 -16131953 -16721529 -9150397 -243423 1937685 -3330565 -10569183 -14014443 -11480878
12139 -11480878 -5118295 558236 2531202 1199835 -1983829 -7089896 -14072029 -19805789
12131 -19805789 -19394922 -10954258 1997724 13319007 19249859 20804634 21258124 21535247
12123 21535247 19351550 13460169 6697346 2962772 3033084 5669691 10307206 14659775
12115 14659775 12255087 -730387 -15862697 -17429024 -1204873 17319108 19479274
12108 19479274 5240609 -7997553 -7413491 1721219 6952586 6274272 7784903 14247045
12100 14247045 17213432 10135834 154524 -886884 6118358 8361374 -117011 -9604510
12092 -9604510 -8305785 3011260 15350748 23740355 28051911 26871491 19254755 10065998
12084 10065998 5534477 4795596 2925868 618990 2749041 8236449 10295630 7507158
12076 7507158 5776286 7168573 5556256 -2592844 -10595434 -10153417 -2418631 4509633
12068 4509633 5315829 667755 -5621312 -8669786 -5018311 2930690 7206458 2287007
12060 2287007 -8734943 -17771322 -19223008 -12801570 -2600087 4593353 3590687 -4072147
12052 -4072147 -11838963 -15934527 -17543550 -16394982 -8473686 5953928 17164006 14640359
12044 14640359 -827491 -17392088 -23193326 -15515765 -1842097 6344957 3958847 -2218412
12036 -2218412 -2422509 1665233 -1293226 -13989950 -23514741 -18804359 -6300293 634096
12028 634096 542354 1067819 2927774 65426 -6339386 -7775389 -3384834 -2375693 -8511685
12019 -8511685 -13864667 -12268408 -7968709 -5524548 -2008966 3664888 4306759 -3139872
12011 -3139872 -8022575 -401519 12352952 16556342 13979607 16868771 23882391 19327263
12003 19327263 -235092 -15951352 -11934493 3033593 10199846 6710881 3677290 5581337
11995 5581337 6344655 3515586 2760103 7041540 11950030 13551302 12066829 6885426
11987 6885426 -2623249 -9982721 -5861847 7142801 14201321 7731549 -2437869 -4506208
11979 -4506208 -515422 1746236 3557774 10203307 16934564 13325967 148331 -10162233
11971 -10162233 -10903270 -8460310 -9622672 -10871827 -5363585 5558315 13473305 13172212
11963 13172212 8284815 6916450 12331413 18156146 15271968 4501439 -2558312 836666
11955 836666 6114932 1811220 -8560319 -11202861 -2275174 7688580 9871272 6949245
11947 6949245 4799191 4443578 5319950 7389026 6663872 -2187970 -14960773 -19192338
11939 -19192338 -11406830 -3676069 -6551707 -14392200 -15614897 -9670946 -4518203 -3202763
11931 -3202763 -2643681 -1676815 -1181580 915806 6442797 11072643 9253445 3139100 -326233
11922 -326233 669752 2188866 1620912 -761345 -4680562 -8245693 -6921920 -682397 2132766
11913 2132766 -3916883 -10834318 -7805353 1598045 4722989 20276 -1538830 4570448
11905 4570448 10023438 9064558 6800613 7067317 4870544 -1925734 -5187776 34699
11897 34699 4864994 227515 -7266732 -5308363 4427047 9884631 8125309 7018784
11889 7018784 8268706 3419765 -9888895 -20693760 -20156535 -14006605 -11606814 -10781544
11881 -10781544 -3466698 8470582 13958475 8451113 -406373 -4391844 -4373530 -5411440
11873 -5411440 -8310825 -10242700 -9789339 -7400572 -3691192 -702792 -1880217 -6767619
11865 -6767619 -8386427 -918614 11380510 17947689 13923042 3622650 -6948644 -14657942
11857 -14657942 -16072047 -7709975 6710568 15544394 11164800 -1273548 -11492146 -15926981
11849 -15926981 -16106013 -10034616 5271301 23317207 29973545 19590461 2915903 -5566109
11841 -5566109 -3709410 -185541 -167648 806374 7973896 17643933 20230951 11616134 -1969122
11832 -1969122 -11117989 -12635750 -9900953 -6376704 -2816352 -339353 -1314068 -5254917
11824 -5254917 -7682234 -5772858 -2192199 -713635 -1155210 -1753115 -3260791 -6623865
11816 -6623865 -9432187 -9315963 -8289727 -8398373 -5540928 5327056 19571965 25137133
11808 25137133 17036882 3170784 -6471635 -10097532 -10454568 -7361270 259463 8714907
11800 8714907 12364720 11093612 9830162 10536336 9143697 1932276 -8212981 -14421201
11792 -14421201 -13558412 -9098720 -6194575 -5964250 -6135705 -5658232 -5448276 -4721222 -757695
11783 -757695 5837411 9564668 6928481 1617538 -1027726 -1438091 -2878509 -4363036
11775 -4363036 -2969289 -893717 -2517163 -5612943 -4167733 68670 -975725 -6597144
11767 -6597144 -5116730 7328552 16550710 8626640 -9352733 -18598097 -14000000 -7415923
11759 -7415923 -7204512 -8128228 -4499981 -1038216 -3698467 -8510122 -8198761 -4439475 -4287381
11750 -4287381 -7111101 -4869937 3739272 8498359 1559857 -10333891 -14188084 -7818961
11742 -7818961 -932373 51785 -225215 3806213 8624588 8003344 3939193 3064527 5205893
11733 5205893 4621920 1565481 2420280 6864680 5632135 -4445237 -13109376 -11029016
11725 -11029016 -2478191 4350362 10303244 17309553 16384990 -147279 -19268485 -19474940
11717 -19474940 -3025411 4397265 -7668696 -16930866 -2765029 19701923 20306986 -2089295
11709 -2089295 -19667799 -16675013 -7063355 -7459620 -13867493 -15172153 -12886715 -13672909
11701 -13672909 -13767104 -5917954 4892747 7176805 1123360 -2248248 913281 2676850
11693 2676850 -2089490 -8021520 -9608476 -9743415 -13185772 -18667747 -22253785 -23016545
11685 -23016545 -21328763 -16539252 -10080741 -6053771 -5049366 -2202602 4817747 10962976
11677 10962976 11496213 9606252 10741844 13451971 12299762 7192174 3325961 3200248
11669 3200248 4395833 4443781 2841669 -867208 -6058125 -8919272 -6516499 -2548118
11661 -2548118 -3918802 -11410145 -18543787 -20242511 -18173690 -16563749 -16507429 -15630107 -11014255
11652 -11014255 -2526017 4837658 4031601 -5183169 -13373305 -12693494 -8096860 -9883530
11644 -9883530 -17122573 -18570468 -11084545 -5861603 -10943581 -17120871 -10352127 7173610
11636 7173610 18259120 11904263 -4582383 -15780374 -14831504 -7850423 -5241223 -10999416
11628 -10999416 -19274553 -20081883 -8806469 9071183 22197550 22570049 11986802 143277
11620 143277 -4979869 -5322531 -8688700 -15842110 -17519517 -8736120 499018 -2198197
11612 -2198197 -12565657 -15312346 -7477750 -2011278 -5266292 -5982250 5474660 20160289
11604 20160289 24413600 20539867 20089080 23607444 22048639 14724271 10687200 12421858
11596 12421858 12000342 5446375 -1396471 -4453083 -7635399 -13455282 -17752708 -18486842
11588 -18486842 -19867724 -22081966 -16858260 -1233223 12699952 11678532 -735629 -10068754
11580 -10068754 -10978584 -10731195 -13969051 -14832154 -6913321 6603273 16503808 16834199
11572 16834199 8574607 -1817904 -5940494 86046 10520310 15217042 11901301 8881947
11564 8881947 12788851 18595581 16971324 7963873 666878 683365 5013091 9634123
11556 9634123 14327648 17259870 12679695 -132921 -11829949 -14470187 -13063820 -16179241
11548 -16179241 -18965728 -8861897 11204053 20374384 7413328 -12088792 -16873955
11541 -16873955 -8536510 -5049836 -12101096 -17350168 -12401593 -4118929 176789 4651736
11533 4651736 14219998 22564839 20871013 11937836 5783599 4926459 3243765 -1985543
11525 -1985543 -5506173 -2972092 1746082 1347835 -5120888 -9655849 -3304116 12562136
11517 12562136 24532153 20444793 4259250 -7469830 -5108842 4325553 9533598 9176438
11509 9176438 7636230 3731911 -6364234 -18269857 -22094537 -16313891 -10093757 -10247834
11501 -10247834 -13646273 -14713671 -12922878 -9396731 -2907898 5687014 10003564 4869937
11493 4869937 -5917435 -13119778 -12057413 -5999052 -967157 101292 -1105562 -756117
11485 -756117 2442561 4939030 2895782 -1314494 -1398872 3319565 6205905 3880405 2598126
11476 2598126 8813482 17905988 19307047 10782018 711799 -3325190 -1679346 2237849
11468 2237849 7370353 12899931 15675672 13568782 9026344 6601626 8283149 12496546
11460 12496546 15932552 15420475 10059570 2621135 -2718472 -4432300 -3865796 -2353755
11452 -2353755 -1340826 -4366391 -13535576 -23245234 -23734290 -13913543 -4749574 -5228823
11444 -5228823 -10378119 -9661539 -2793175 1314254 -894301 -3772334 -3772382 -4940095 -9590228
11435 -9590228 -11910814 -6769509 1255400 4443831 3176029 3332947 5422024 4441378
11427 4441378 -137963 -2434701 146954 2351948 -535684 -5375376 -6481872 -4168684
11419 -4168684 -3410266 -6626929 -11996845 -16940731 -19414053 -17801649 -13841398 -13617137
11411 -13617137 -20089929 -25626390 -18659631 871284 18838875 22487393 13627497 3138878
11403 3138878 -2351232 -3330478 -1497800 1929013 3738051 1319364 -2302612 -1956144
11395 -1956144 714963 -2042527 -12540958 -22533036 -23101106 -15594495 -8984849 -9072285
11387 -9072285 -13770085 -17405746 -16918621 -14522416 -15069309 -19204224 -19940433 -10536363 3970373
11378 3970373 9780038 1902260 -8082034 -7238964 1704953 5864212 134422 -9023309
11370 -9023309 -14979164 -16891710 -15315797 -11081654 -8842296 -12738573 -17472988 -12977238
11362 -12977238 4207 8778290 6606113 1574672 2145496 4110237 287570 -5675221
11354 -5675221 -6128143 -3899961 -7808383 -16821608 -20861232 -16930640 -13051205 -14602491
11346 -14602491 -17101568 -15656740 -12394118 -10145811 -6706006 -758554 2928113 343876
11338 343876 -4298289 -3933873 1470729 5611873 4310148 -1151849 -7278512 -10785105
11330 -10785105 -9291119 -3605923 1538158 2325018 527903 453775 2543702 3513215 2171477
11321 2171477 1397504 3714654 7445985 8314664 4013415 -2806491 -6010415 -2029064
11313 -2029064 5053203 7162892 2432516 -1664151 1876728 10144131 14889640 13687892
11305 13687892 11206776 11104431 12476552 13640487 13590458 9935401 1683126 -5619461
11297 -5619461 -4642802 2346086 4549582 -1902144 -7631810 -4229123 3112795 4771167
11289 4771167 1831782 1982435 4431749 667049 -10193462 -18116959 -16744874 -11634326
11281 -11634326 -9890920 -9993686 -7553497 -4474158 -5502369 -9712328 -11801036 -9724977
11273 -9724977 -6162292 -4038293 -4347592 -6569207 -8152832 -5889119 -537501 2829644
11265 2829644 1696123 -638416 -1723062 -4647989 -11345929 -16766835 -16365414 -14230857
11257 -14230857 -15361350 -14519965 -3901281 10454283 13040564 1284263 -9204820 -6706714
11249 -6706714 739816 -600589 -9467113 -13525945 -8785459 -3882694 -5624773 -9503122
11241 -9503122 -7176134 2186612 11087727 11652622 2485681 -11069955 -21949891 -26323333
11233 -26323333 -24210493 -17397526 -8775869 -2014938 1487736 4250481 7708345 7656654
11225 7656654 545354 -7294342 -5254268 5684701 11906513 5481358 -5309852 -9090471
11217 -9090471 -6643228 -5628199 -6895308 -5055662 1287615 8040470 11946685 12243951
11209 12243951 9047697 5363587 6188288 9967893 7128250 -5428909 -15316926 -10252500
11201 -10252500 3450801 9983035 6519629 2603877 760610 -5711900 -15916792 -19741058
11193 -19741058 -16236903 -16767549 -24027931 -24513315 -11067552 2134561 -469732 -12785631
11185 -12785631 -17685827 -11541912 -3637516 2076424 8814039 13710876 8519242 -5183216
11177 -5183216 -14234802 -10523729 52904 7811048 9918478 7947227 2731615 -4015202
11169 -4015202 -8491078 -9258944 -9373423 -11486609 -13984346 -13874720 -10644510 -5812222 -1189775
11160 -1189775 1489753 1523714 210832 -1171698 -3716211 -8499050 -12847423 -12531937 -7209578
11151 -7209578 -374372 5211807 8327218 6987710 682674 -5204543 -3020170 7295404
11143 7295404 16268151 14886157 3718102 -8770794 -14039376 -9509555 -468478 3897004
11135 3897004 172430 -4057357 410113 10500718 13553715 4990689 -5206090 -7468122
11127 -7468122 -5405988 -6546590 -7746227 -591613 11951940 16278802 7137160 -4310912
11119 -4310912 -6159361 -1665297 -2444878 -10575166 -16175284 -12400411 -4877257 -2774944
11111 -2774944 -5799184 -5720490 1084270 8707282 10499818 7613628 5267837 4117036
11103 4117036 551400 -5683480 -9745627 -8511130 -4569549 -1680638 -164122 1136239
11095 1136239 2133407 3260919 5983294 8308291 4159851 -7845924 -18834667 -19511325
11087 -19511325 -13081985 -10479803 -13618219 -12806526 -3014800 6761373 6109924 -2114131
11079 -2114131 -7296682 -6289873 -4455115 -4018462 -740128 6941139 13329009 13064968
11071 13064968 8054561 3849669 2845114 3449170 3066450 297903 -3052053 -1595472
11063 -1595472 8067110 20567473 25555473 20313875 13548962 13684063 18567006 20935185
11055 20935185 19033044 16005110 12692253 8128246 5213297 8520935 16195404 20091720
11047 20091720 15183450 4353906 -6760771 -15164633 -19824356 -19992024 -16163574 -10277104
11039 -10277104 -4307947 -585470 -2209653 -9461059 -16739820 -17493136 -11869023 -5339563
11031 -5339563 -750024 3085076 5913470 5737885 3941299 3718559 3018129 -2886924 -10600474
11022 -10600474 -10116172 -757915 4521178 -2883566 -14381757 -17905687 -15838539 -17690388
11014 -17690388 -21271013 -15631322 -1056790 8432931 5192608 -1943010 -2845531 -861084
11006 -861084 -4848417 -14026722 -19623256 -17735174 -12517735 -8237861 -5212045 -3536025
10998 -3536025 -4539405 -6805010 -5482201 1508134 9310180 11292272 7311484 3927927
10990 3927927 6033608 10723998 11212061 5395753 -2034492 -5778895 -5264222 -2880079
10982 -2880079 -92663 2016180 740640 -5520757 -12876555 -14473079 -8946323 -3258407
10974 -3258407 -4502263 -10566754 -12116768 -3987576 8111910 13835127 9411421 196817
10966 196817 -7076976 -10826765 -12324774 -11251286 -7576218 -5169855 -7951235 -12927029
10958 -12927029 -12690118 -5825710 523197 453126 -3465881 -5739120 -5994769 -7292343 -9868743
10949 -9868743 -11136053 -9904915 -6901961 -2731787 1732284 4764279 5965595 6652597
10941 6652597 6186399 1654568 -6193114 -11317255 -10516814 -8446362 -9828292 -11696856
10933 -11696856 -9359568 -5047043 -3179580 -1695114 2758773 4823207 -3123007 -15991323
10925 -15991323 -19655332 -10911360 -1996439 -1894065 -4741264 -2749202 -10984 -4342445
10917 -4342445 -12762872 -15575489 -11438248 -8634970 -11821038 -15699089 -13821443 -7859628
10909 -7859628 -4567922 -6171701 -7461360 -2939230 5521457 10794764 9631668 5564505
10901 5564505 1630711 -3882950 -10185104 -9008572 4502489 19984581 21773736 9682186
10893 9682186 -1086096 -1336435 2591174 3323447 3984937 9110391 14506012 13900443 8074234
10884 8074234 1107559 -4847650 -6002826 1851039 11884592 7576708 -14461225 -34014557
10876 -34014557 -32384918 -18251660 -13255788 -19989492 -22726649 -15476216 -9158448 -10438520
10868 -10438520 -12344549 -9732353 -7425125 -7892038 -6247110 -3390011 -8686363 -21665884
10860 -21665884 -26134466 -13411009 1652199 959485 -10974672 -16040570 -9807330 -3930776
10852 -3930776 -4981635 -6610978 -3536997 32694 -422896 -2060635 -771708 1792107
10844 1792107 1658934 -1200368 -3501413 -3346603 -2376435 -4128241 -10222433 -17547027 -20939966
10835 -20939966 -19633730 -18089983 -19062549 -20040431 -18728990 -16763393 -14817107 -10333697
10827 -10333697 -4541730 -4279998 -10438495 -12828613 -5655001 355644 -6155906 -16566253
10819 -16566253 -13935266 -752197 4510597 -1712925 -2258482 10376165 19457699 11249647
10811 11249647 -2239049 -3988195 -329327 -8549477 -25782200 -32092613 -21386475 -8859474
10803 -8859474 -6260453 -7685825 -4626497 103103 852087 338831 4240699 11607740
10795 11607740 17231075 18955784 18159869 16488035 14664845 11646794 5042739 -3637226
10787 -3637226 -6408450 1732433 12943678 14967142 7993329 2831646 3214201 2452570
10779 2452570 -1489562 -1940404 1994983 1795935 -3757876 -3470735 6250883 11661654 3551175
10770 3551175 -5727464 -1795985 8192564 9075620 3828065 5727025 12068692 8466412
10762 8466412 -3850331 -8324609 -1577232 1033418 -7280970 -13714422 -9997404 -7064315
10754 -7064315 -14024570 -20270220 -13268222 -439523 2781092 -2963568 -4735248 1084267
10746 1084267 6003592 5018278 1761410 -833138 -4109531 -8002674 -10253972 -11122705
10738 -11122705 -12349218 -12643722 -9951371 -6209402 -4610899 -4806493 -5317262 -6406936
10730 -6406936 -5799130 2128329 15991496 22981939 14033692 -1985567 -9151292 -4774913
10722 -4774913 1606217 4548679 5618620 3782017 -3031466 -8318269 -3443126 6217412
10714 6217412 6416848 -3223400 -7528454 -643455 4261661 -2141176 -8891214 -3178415
10706 -3178415 7781503 8150478 -2051224 -9465129 -9234533 -8735274 -11265089 -11116379
10698 -11116379 -6840854 -6242933 -13324503 -20426903 -19411923 -13026778 -8592175 -6229509
10690 -6229509 -1087184 5660119 5996424 -4028778 -18208145 -27040082 -26956075 -20673802
10682 -20673802 -12098478 -4609406 -1826153 -4732032 -8351214 -6620779 -1291385 -23935
10674 -23935 -3916231 -4668089 1147579 3522522 -6221446 -18858987 -18131665 -4953326
10666 -4953326 3748180 855416 -1571268 6602647 17471313 18398659 9881710 573795
10658 573795 -5937998 -9601466 -8171880 -3611443 -5540574 -16670317 -23835812 -17637522
10650 -17637522 -11880277 -24676595 -46284763 -48673282 -26997330 -7561540 -8556571 -16142434
10642 -16142434 -11659435 -1951623 -4262761 -15401775 -17410267 -7070095 619787 -2922000
10634 -2922000 -9380866 -9836535 -6841500 -5607209 -4443347 110750 6245412 10273344
10626 10273344 11934310 12194581 9531104 2048882 -8330837 -15688276 -14241621 -4282326
10618 -4282326 5272536 4294895 -5976876 -12965025 -9370554 -2787794 -1846547 -984057
10610 -984057 8972003 20938513 18304326 799863 -12508001 -9452067 406811 2506201
10602 2506201 -4292704 -12791307 -18959730 -20242201 -12944251 -260685 5982795 171976
10594 171976 -8732243 -11343541 -10892314 -13489132 -15825394 -13543891 -11941813 -15640590
10586 -15640590 -16964443 -9228044 -3012312 -11973721 -28692286 -33462176 -23621220 -14819285
10578 -14819285 -14488038 -14088435 -8987102 -5857526 -6264553 -2258409 5665401 4971351 -6659586
10569 -6659586 -13672429 -7416914 -1478320 -9636932 -23585228 -27094675 -20108017 -13785005
10561 -13785005 -11596698 -10145884 -10384768 -13499349 -12815638 -3842325 4289412 1317404
10553 1317404 -6923185 -8496488 -6095495 -10954947 -20529237 -20778594 -10094205 -3021535
10545 -3021535 -7364877 -13396219 -10890826 -3752390 -1246641 -4470239 -7839003 -7466416
10537 -7466416 -3496358 1346163 3322668 1509006 -319608 262942 -935304 -8025786
10529 -8025786 -16360455 -18019928 -13217355 -8599939 -7116378 -7259996 -8772189 -11009754
10521 -11009754 -9968444 -5324172 -4744714 -11773271 -16591657 -10173595 418684 4043271
10513 4043271 3437604 5243536 2668034 -11425905 -23984673 -19196000 -8527563 -14756007
10505 -14756007 -31929749 -34271591 -22203819 -21692044 -35528359 -37146729 -21661657 -18480778
10497 -18480778 -37327679 -48081475 -37277754 -35873415 -58828940 -69311345 -49672043
10490 -49672043 -54913630 -124833254 -181985962 -109847047 73940949 214485619 209693573
10483 209693573 123366809 74033946 84365655 96871799 84279065 72226761 74914470
10476 74914470 73299648 57018547 40984219 35153932 32037236 28181084 29727814 33546723
10468 33546723 27943588 15174478 10634954 16712782 18660553 9945759 1564232 1532657
10460 1532657 3838118 3473877 5300537 11274148 14235391 11564936 11117406 16160644
10452 16160644 17620433 10014390 3255075 8095358 18657042 20345941 9664440 -3503601
10444 -3503601 -9990097 -9383597 -5527682 -805728 4504108 10712250 17134547 21550722
10436 21550722 22720399 23032437 25585267 29078200 29531006 26344093 21645051 14695147
10428 14695147 4044212 -4711716 -2301638 10173003 19123919 15413173 6041339 2851158
10420 2851158 6330712 8541278 6977418 5941175 6336115 3724189 -2689126 -7210205
10412 -7210205 -6144498 -2736376 -746803 1203590 4772139 5962795 -283354 -11605304
10404 -11605304 -19868808 -21079993 -18582892 -15453726 -9277419 1806753 12138457 13784369
10396 13784369 7580932 2669657 4146973 7344936 6980818 5609498 7626408 9966066
10388 9966066 6600386 -5471 -613080 7025835 14244977 13922454 9539604 7550862
10380 7550862 7347028 5163170 3015103 5630151 10690858 10608907 4370529 -356006 769690
10371 769690 2197477 -1419852 -5017977 -379362 9979751 14888945 10397479 5249354
10363 5249354 7739403 14278623 16280556 13233054 11887336 14749757 16694943 13591327
10355 13591327 8403629 6720647 10273777 16708589 22461266 24336003 21447624 17156853
10347 17156853 15964728 17034256 14339265 5323697 -4120665 -6233276 -301733 7729898
10339 7729898 12226880 11845411 8790171 6702414 7506220 8703845 6489594 2845496
10331 2845496 4743557 12857331 16330338 5385854 -13488863 -22343490 -12258714 6436440
10323 6436440 15897079 8935905 -6061935 -15806158 -15585816 -11734366 -10902905 -9989343
10315 -9989343 -1781713 10761353 15014568 6790542 -1662811 1047711 8952792 9872759
10307 9872759 5627084 7282736 14596220 16303708 10652850 9018057 15291850 17541302
10299 17541302 7771991 -3553997 -2926064 6610677 12142781 9382023 3535997 -2335853
10291 -2335853 -8617375 -12407324 -10007527 -4640019 -3138861 -5968111 -7521004 -4912001
10283 -4912001 -288131 3486384 3622999 -2740179 -12657594 -15222772 -3960141 11311436
10275 11311436 14429751 3302597 -9125284 -13363612 -12054779 -9269247 -2990934 6863098
10267 6863098 12790382 9697456 4564372 8417723 21366499 31926917 30535388 19189727
10259 19189727 7279014 886163 -2171174 -7262434 -14677468 -18842493 -16193115 -10417608
10251 -10417608 -7262682 -6950303 -5285200 -206620 6169921 10011531 7600414 -1624137
10243 -1624137 -10452173 -7772326 7059384 19236146 16002077 4286760 871082 8968775
10235 8968775 16836195 17566625 16111192 15618232 11410746 2919400 -1657701 1023906
10227 1023906 2683572 -2723674 -9050002 -9678472 -9059104 -13275603 -17840684 -15088251
10219 -15088251 -6830670 266522 5746283 11711590 13850547 7329084 -2069417 -3715708
10211 -3715708 2751982 7576454 4737864 -2728652 -9507447 -11909609 -6974793 3767927
10203 3767927 11034038 6752670 -4431852 -10377627 -7206465 -2150993 -1670965 -4701194
10195 -4701194 -7289008 -6410725 319920 11370025 18489220 14807923 5005636 -234317
10187 -234317 1264187 2669540 954726 209584 1693749 841167 -3459111 -5694101 -2909476
10178 -2909476 779274 1777808 1978883 3479386 4914197 5139213 4138093 -917635 -13019360
10169 -13019360 -27113630 -32447777 -25613130 -14203668 -5711766 -322392 3683003 5817337
10161 5817337 7029439 9268121 9503700 3147296 -4817776 -2838218 9837496 20088127
10153 20088127 19728320 15489023 14175271 10749755 668976 -7486058 -4107416 4977088
10145 4977088 6985209 1396613 -1917913 11122 310781 -4635406 -10225792 -12456696
10137 -12456696 -12867806 -13246077 -12168077 -8698423 -5245910 -5266196 -9580611 -14401662 -13399876
10128 -13399876 -5223634 1948037 -216137 -6933005 -6125618 1569270 1557092 -11305307
10120 -11305307 -21964627 -16172078 695041 15757778 26214793 32189277 25640549
10113 25640549 3593456 -17887020 -21714173 -14239783 -13078911 -17982314 -15336687 -6469733
10105 -6469733 -6980992 -18066520 -22712410 -14244581 -6145078 -7308431 -8752071 -3053731
10097 -3053731 3018476 5023434 10746134 21700915 22874592 5745070 -13747533 -16606726
10089 -16606726 -7891735 -5578133 -12308121 -16148347 -12819873 -9054222 -6604935 294586
10081 294586 10724133 14151946 4983156 -9143022 -16160958 -10806887 3020628 15711079
10073 15711079 18688263 12637751 7429531 9989056 15810198 16892547 12799522 7412377
10065 7412377 153132 -10708490 -19420753 -17128188 -4518225 7634493 11159653 8016034
10057 8016034 4820096 4468475 3945075 -1460971 -10832577 -14941476 -6109594 8553542
10049 8553542 12350658 1346610 -8149078 -1672474 13014284 17658213 8059384 -4857137
10041 -4857137 -12697629 -15391628 -13140263 -6125723 -687269 -2706041 -5184514 4483181
10033 4483181 23764435 34575876 26774243 10391131 395793 -70411 3312249 5597124
10025 5597124 3457308 -4569470 -12773942 -11220738 41249 7553310 1922102 -8772365
10017 -8772365 -10978618 -4479982 338572 -572919 -1447708 1270227 3746350 3311201 3766043
10008 3766043 8330024 13143180 12494772 7205877 3322566 4113438 7639872 11841631
10000 11841631 17179399 22198830 21024746 10685799 -795784 -735433 11738806 21968290
9992 21968290 17256031 3030280 -5162682 -2403459 1524171 -1585071 -7247610 -6920032
9984 -6920032 -529882 5292288 7326958 8274604 10915577 14611439 17186517 16768057 12267530
9975 12267530 5372158 1511334 4690447 10673055 9706917 -1528079 -14462563 -18865558
9967 -18865558 -15296362 -11893186 -11267509 -9015887 -5686971 -9490941 -21355717 -27111522
9959 -27111522 -15156424 4375593 10984952 1497469 -7564767 -5379049 556508 1286037
9951 1286037 915794 5561367 9783969 5329949 -4641775 -10962837 -12100701 -12300613 -11424100
9942 -11424100 -6944933 -1825275 -290892 606571 5223573 8785998 3614875 -6766262
9934 -6766262 -11614048 -10029446 -11646539 -19016739 -21633112 -12167307 1108273 4692371
9926 4692371 -3325317 -12830899 -14713784 -9298828 -2970418 -326464 -1172006 -4015913
9918 -4015913 -9248664 -16193049 -19860821 -16383365 -10267821 -8905242 -10788921 -8783033
9910 -8783033 -4706082 -7622561 -15641701 -15279681 -4556010 535840 -8155138 -16446058
9902 -16446058 -11796752 -4009533 -6129871 -12093895 -12079217 -12859192 -21471822 -26353249 -19348024
9893 -19348024 -17378835 -32839215 -44405185 -36805229 -47615085 -117760866 -203909696
9886 -203909696 -207582889 -105312586 12352626 57998758 46476840 40575270 51642316
9879 51642316 48685584 30018937 24103862 33650862 32685662 15452448 3721297 5895210
9871 5895210 7852625 5838556 12786099 28274051 34351110 26458209 20160608 22295036
9863 22295036 21930524 14879700 11725373 15627576 15688976 8383319 3824162 5529881 5108055
9854 5108055 1554356 4262689 12219335 12494329 5003354 5887995 18995733 26929077
9846 26929077 19805544 10574137 10265411 9523212 -789259 -9519325 -2715812 12743240
9838 12743240 19190743 12088102 881937 -5653442 -4427442 3516873 10929350 8578541
9830 8578541 -2248988 -10357322 -11591575 -13095396 -16682772 -13391338 -1616766 5211698
9822 5211698 -1293443 -11153376 -12746990 -8616953 -4198195 4028839 16364767 20400361
9814 20400361 8865175 -5060863 -5801998 1694575 2762614 -2710212 -3458430 2877352
9806 2877352 9066497 12965895 17845948 21767324 20152095 15730180 13964368 12389890
9798 12389890 5951349 -1478435 -2681516 33698 -703938 -3982788 -3493017 -158714
9790 -158714 -134626 -2983956 -2875187 840627 4074723 5948199 7174115 4840337 -1636636
9781 -1636636 -4439202 2408266 11903006 13830568 9934657 7972579 7186496 2978146
9773 2978146 -105534 4783352 11696421 9696922 2434734 3252458 12607413 17457475
9765 17457475 12980281 7831288 6231871 1542193 -8735098 -16540989 -16262560 -11434118
9757 -11434118 -5400609 2095393 6852171 2526404 -6125122 -6463833 2056380 5694266
9749 5694266 -1383530 -7867968 -4530286 2089458 3333270 2287778 4612607 7222157
9741 7222157 5974389 4689392 6921373 7466882 1219677 -7090307 -10094191 -7654824
9733 -7654824 -3046804 2601554 5993952 1428087 -8191382 -10570433 -2449474 2181038
9725 2181038 -7696178 -22448691 -26349607 -20169071 -15615323 -15268118 -13017575 -8801722
9717 -8801722 -7608715 -7158263 -1153922 7088292 7987968 1587948 -2924876 -2711357 -3064351
9708 -3064351 -3942346 1259300 11624462 16748434 12287466 5554975 1978492 -2159058
9700 -2159058 -8801547 -11724925 -7735012 -4240327 -8142697 -15324385 -18370468 -17312835
9692 -17312835 -15514205 -11999262 -5643391 -612255 281743 1469900 5633553 5777606
9684 5777606 -2989505 -9913146 -898369 18154883 25694630 13905185 -1078676 -3535586
9676 -3535586 1243379 -68206 -6826588 -8379598 -3110887 774113 1209780 5122516
9668 5122516 13566035 16365932 7073588 -5597356 -8088648 1553180 13326973 17557439
9660 17557439 12542578 3067024 -3911862 -3915793 1283359 6020013 8029787 9552090 10074377
9651 10074377 4895013 -4976897 -8934257 -86658 13300309 18262214 14343124 10584957
9643 10584957 9302891 4970392 -2055642 -3921792 649268 3123319 43145 -611533
9635 -611533 6028880 11785569 8391647 1308920 646943 5054785 5501963 851383 -1360656
9626 -1360656 1870726 4983906 3451658 -626984 -3585721 -4319716 -2461009 1759784
9618 1759784 4918681 2882394 -3230544 -8080488 -9231828 -8455540 -6275835 -1328272
9610 -1328272 4114402 4660515 317342 -1481019 4044645 11812137 13777802 8896883
9602 8896883 1937837 -3672568 -6609456 -4793796 1364492 4763158 -1198806 -10587641
9594 -10587641 -8818290 7438727 21963563 17627938 -2168259 -19592760 -26250513 -29294369
9586 -29294369 -33575251 -31557931 -18082270 -4135618 -4054088 -14452017 -18297200 -8586348
9578 -8586348 3655988 6557771 2275764 635151 5680949 13634501 19232620 19767396
9570 19767396 15977218 11502857 8934288 6223570 975786 -2973962 -71789 6361258
9562 6361258 6988535 1248605 -891246 4536081 8154695 2811997 -3869214 -1573353
9554 -1573353 6566199 10414671 8743378 7314160 6100625 597842 -7036734 -10207440
9546 -10207440 -9873801 -12640082 -17336853 -15646441 -7435678 -3356307 -8512650 -14384960
9538 -14384960 -12319921 -5944583 -3921007 -7636748 -12568616 -16134575 -17853323 -16307637
9530 -16307637 -12165681 -10628830 -14753312 -18910658 -15007346 -4075107 3910352 2056674
9522 2056674 -5971625 -11512314 -10427882 -4999465 1429998 8086158 14170157 15894013
9514 15894013 10382288 2211334 792397 8738104 17418723 17956889 12312210 8174136
9506 8174136 6935348 4067645 -1003204 -3805212 -3301334 -3630176 -6651637 -9771205 -11640997
9497 -11640997 -12633094 -9464033 1470681 13716881 14133528 1188486 -9746387 -5885342
9489 -5885342 6567947 13161803 10678018 6301558 3306893 -846249 -4691603 -2801115
9481 -2801115 3329179 4455145 -3069233 -10871859 -9911433 -2560929 1794346 -409198
9473 -409198 -4251182 -5578779 -7350929 -14176310 -23601285 -27521397 -22927576 -16814350
9465 -16814350 -16725345 -19458677 -15196660 -2406219 8250449 7298247 -2098400 -10031864
9457 -10031864 -12521155 -13124721 -14780866 -15515240 -11787507 -2676099 8768995 16355044
9449 16355044 14773633 5315794 -4102409 -6758420 -3145066 1980883 4876883 3024608
9441 3024608 -4937077 -14985373 -17525942 -7250149 9222909 20787577 24432055 24783614
9433 24783614 23966350 19565964 11892811 5318979 1271376 -2798795 -5431902 100422
9425 100422 14274930 24744860 18800371 331423 -12769011 -9263897 2873438 7672906
9417 7672906 778480 -7897460 -9881965 -8640439 -10481984 -11864553 -4559703 9190171
9409 9190171 16983129 12910134 4234663 -1479739 -5766436 -10487832 -10105429 -1457744
9401 -1457744 7344843 8370089 7174228 12773586 20284076 17548259 5350143 -4134971
9393 -4134971 -7368174 -11633015 -16798421 -12996314 -1023378 3039294 -7524970 -16954030
9385 -16954030 -10499035 2894314 6082023 744530 1669494 11021626 16597953 13340031
9377 13340031 9107462 7748058 2493810 -9036476 -16771382 -12510418 -2580400 1866274
9369 1866274 644061 2620646 11478222 20465031 21040446 12571981 2738041 -311406
9361 -311406 3944621 8321251 6383768 -669509 -6998214 -9085931 -6645830 -54798
9353 -54798 7854152 10112506 2512346 -8842539 -13599824 -10192103 -5772422 -3820948
9345 -3820948 -720132 4286787 5896160 3430165 4868276 13430714 18606863 10153555
9337 10153555 -4433020 -7737995 3386216 12157236 3622721 -15515120 -24657400 -13768354
9329 -13768354 5675318 14926334 8990464 -391526 -1395601 4221446 7109782 4574897
9321 4574897 2086413 3230556 6225463 9939122 14792301 16687764 9504326 -3155837
9313 -3155837 -8153238 -53971 10369732 11337042 5460455 1847509 573236 -4445068
9305 -4445068 -12420058 -16807352 -16518152 -15557662 -13568704 -7113781 913838 3732449 2429806
9296 2429806 5071836 13257662 19318903 18435594 14328929 11017349 7832738 4985205
9288 4985205 5601113 9436757 12020904 12096158 12640433 13590760 11949610 9757487 12243770
9279 12243770 17178276 17088441 13177386 13862256 17183322 10758911 -4817383 -10013995
9271 -10013995 5148464 22359769 19731665 2840619 -5871310 467683 9392346 12008822
9263 12008822 11547424 11155401 9324062 7319275 7701191 6238914 -2067290 -10614440 -8160872
9254 -8160872 3265407 10921306 10286716 7302953 3563055 -4496823 -12139327 -9782295
9246 -9782295 -1353823 -892027 -8086307 -7067871 5360761 11974651 4753226 100471
9238 100471 10027644 18715758 7938273 -10265693 -10551242 5616017 12166202 -1705268
9230 -1705268 -17382100 -16156866 -3630585 2578945 -3793075 -14675781 -20078014 -17042581
9222 -17042581 -10090817 -5675000 -4261870 310473 9963694 15374262 7192297 -9059896
9214 -9059896 -18182861 -13941243 -4151273 1810172 2149325 -446262 -3048519 -2885510 418724
9205 418724 3305805 3852924 5933520 11600133 13836129 5793087 -6693067 -12383370
9197 -12383370 -11445423 -13354941 -20167481 -24719436 -24558054 -23816580 -20837802 -9024595
9189 -9024595 7356241 13809507 7242985 1917889 6555173 10225689 1266798 -12657269
9181 -12657269 -16131368 -8153287 229462 3536034 4486382 3855780 -252253 -5613838
9173 -5613838 -8484347 -10891969 -16662608 -22581167 -21830638 -14127871 -5031514 2192766
9165 2192766 6963652 7321011 3429257 1563647 6155651 11452666 10136556 6259109
9157 6259109 8769965 15357491 15411485 7898801 2599752 2362298 -1496933 -11531005 -15528591
9148 -15528591 -3977897 13791395 20564313 12142165 -992504 -7941780 -5495748 3819123
9140 3819123 13322966 13857892 1878885 -13797214 -19184203 -10145747 3419589 8587090
9132 8587090 1563860 -10714907 -17765813 -14051359 -3065592 5991554 6435184 -990843
9124 -990843 -10986620 -18962931 -22376064 -20082183 -13489040 -6579410 -1824502 2591861
9116 2591861 8832403 14568890 15786031 13210250 11529397 12242705 11881004 8557095 5747963
9107 5747963 6593936 7856412 3922822 -4464751 -9948891 -7710371 -1303508 2603334
9099 2603334 2814916 3991865 9222148 15072512 14913852 5788461 -8622968 -20791408
9091 -20791408 -24710083 -19879372 -11064900 -3681802 941840 5162359 10310526 14419747
9083 14419747 15392310 14044436 11724469 6533809 -4407987 -18297814 -25557183 -18497550
9075 -18497550 -740146 14499348 16886442 8731929 923356 93054 2689769 2364419
9067 2364419 -609259 -939517 2712896 5418154 3186436 -1768877 -4695651 -3951453 -1074332
9058 -1074332 1890030 2924857 383296 -4788333 -8877676 -9127952 -5753075 541321
9050 541321 9342622 16725605 15160580 1949804 -14634816 -22489535 -18183865 -8811771
9042 -8811771 -2569265 -1339656 -2038256 -1523901 473400 1463672 -535371 -3227632 -1898280
9033 -1898280 3698296 7993417 7493503 5508139 5423462 4496693 -158874 -4445642 -3298964
9024 -3298964 467783 1494604 1847316 5646184 7362826 -1648871 -15835611 -19064688
9016 -19064688 -8234366 854103 -3222532 -11631793 -10785830 -1807110 5868584 10397889
9008 10397889 14926366 16624737 11567270 5921735 9133252 18124636 20460845 12449745
9000 12449745 2660626 -2588147 -5811704 -9098125 -9605701 -7687894 -9323538 -15410116
8992 -15410116 -17042513 -7502771 7208172 15660939 14396960 9063089 5806027 6247477
8984 6247477 8718705 10821287 11828665 13512014 16162932 14487495 3140327 -12660001
8976 -12660001 -19219974 -10872681 1792211 5300180 -291582 -4399506 -1285646 4570653
8968 4570653 6556411 2995516 -3367166 -7917195 -6594014 -111766 4690320 1652985
8960 1652985 -7148855 -14275507 -16123335 -15040168 -13553043 -11829826 -10863842 -12798929
8952 -12798929 -16654094 -17686935 -12343739 -1188448 12514913 23313647 24177316 13105900
8944 13105900 -576490 -4021489 2763887 5882714 -3321925 -16098544 -19517959 -14298997
8936 -14298997 -10103987 -8663032 -3647737 4554980 6935029 860820 -4768302 -3981444
8928 -3981444 -2658641 -6221443 -8238860 -1100779 9419582 12361327 10110845 15286357
8920 15286357 29171582 36362237 25111534 2785377 -14811440 -21610168 -22151767 -20525851
8912 -20525851 -16408672 -9403151 -854540 7712556 14056146 15147167 11241958 7360052
8904 7360052 6801573 6184682 1423424 -4534969 -5587425 -1655864 2318344 5081696 10013255
8895 10013255 17496046 22783153 22454463 17684174 10484565 2234666 -3338987 -2016085
8887 -2016085 3954493 6400567 1488000 -5580836 -9004751 -10341227 -13908602 -18451619
8879 -18451619 -18601055 -12839285 -5928301 -3914914 -8759242 -16818902 -21524445 -19297446
8871 -19297446 -13366924 -9415058 -7958666 -5292919 -1686868 -2132944 -7095320 -9398499
8863 -9398499 -4014194 5223596 12713760 18245034 22032490 20063385 11865062 6260820
8855 6260820 10008399 15868889 12338700 1093751 -6738685 -8339946 -9801659 -10553002
8847 -10553002 -2934074 10287453 13986690 2758092 -9321144 -9807977 -5629047 -8230429
8839 -8230429 -12862276 -8073951 1959365 2052701 -9756143 -19132192 -17190990 -9910423
8831 -9910423 -2965921 7391859 21373287 27046291 15800909 -1924876 -7883045 1331021
8823 1331021 12868008 16055872 12228903 6786134 1446900 -2789722 -2750256 1888227
8815 1888227 5153076 1352011 -6905590 -11438659 -8743560 -4100294 -4608024 -10363240
8807 -10363240 -14285437 -10100359 887723 11030081 13176782 6124497 -4922821 -11891590
8799 -11891590 -9480169 -46473 7486292 6350924 -369451 -3700735 -525577 2840670
8791 2840670 413459 -4839419 -5975408 -2067346 1940537 3229403 3189817 2277899 -996443
8782 -996443 -4920136 -4195678 2834304 11166073 15783756 16613814 13977826 5103525 -8914330
8773 -8914330 -17510221 -10851325 5493528 14880844 9901494 46232 -3879901 -4118826
8765 -4118826 -8274818 -14806400 -16271173 -13351269 -14365707 -20798221 -24314654 -20964112
8757 -20964112 -17670124 -19001590 -17646447 -7292422 2934891 -746039 -15430334 -23972714
8749 -23972714 -18256050 -7469872 -1696707 -249234 -598783 -5883278 -15749551 -20958501
8741 -20958501 -16887033 -12589030 -15245816 -15538648 -3570328 8785170 1418658 -20646437
8733 -20646437 -29390220 -13399803 5669911 5946448 -4110196 -3118474 9574872 16726021
8725 16726021 11936824 6039345 6502188 7841866 4948764 1966851 3602471 8107619
8717 8107619 12790473 17635591 20187274 15352420 3939952 -6063887 -9826369 -10097148
8709 -10097148 -9221841 -5517559 -874932 -2380053 -11045830 -17788387 -16887942 -14778389
8701 -14778389 -17950309 -20874945 -15918565 -7943143 -7004304 -11312282 -10392259 -2894520
8693 -2894520 2048235 1438123 3082032 10387526 14470128 7418846 -5702843 -14632669
8685 -14632669 -16435956 -13889886 -8171493 -959510 1373377 -5102106 -12647345 -8721297
8677 -8721297 6935708 19141191 14220063 -4097599 -19026513 -19062211 -9090034 -3124627
8669 -3124627 -8041267 -16927637 -19154919 -13780337 -8803447 -8591304 -8413915 -3213663 4322462
8660 4322462 8435891 8122397 5443310 499986 -5842014 -8215321 -3594753 777110
8652 777110 -4115191 -13095870 -10456843 7084422 21965897 17870934 2023662 -4814109
8644 -4814109 4103276 15528726 16920906 11271755 7489271 5718714 14915 -9191015
8636 -9191015 -13540384 -7512028 4569922 13455934 14111822 9393830 6522401 10030992
8628 10030992 16797035 18505752 10519947 -2486586 -11455236 -12388275 -8528461 -4401228
8620 -4401228 -1602206 -739837 -3048674 -7497084 -9469745 -6053706 -1253572 -2213281 -10222332
8611 -10222332 -18651559 -20627063 -16027835 -9529836 -4409424 -928427 906846 718947
8603 718947 -60238 1076566 3507284 3160754 -1413024 -5683826 -5372716 -3498635 -5925217
8594 -5925217 -10914191 -9943536 -756635 7166083 4836507 -3675492 -7198495 -2609150
8586 -2609150 3434443 6570869 10147061 16674631 21239132 18086903 9528663 3600283
8578 3600283 4855826 10694291 14971268 12460643 1803127 -12355246 -20953589 -17767370
8570 -17767370 -6023746 3932525 4595632 -1424962 -4523263 1355779 11964682 18119238
8562 18119238 17331521 15991938 18066125 17383249 7374533 -5984711 -10620552 -6378688
8554 -6378688 -5341927 -12262257 -16598212 -9500289 2639382 10252810 16111408 26854875
8546 26854875 36376461 32120865 15009131 -1014184 -9133791 -15789222 -24652762 -28034810
8538 -28034810 -20021207 -7370747 97474 2133302 3807951 4967067 1682560 -5649426
8530 -5649426 -12355129 -15157566 -12914719 -4852006 6710205 14524300 12791446 4090428
8522 4090428 -4182045 -8568856 -10683923 -11530476 -9696813 -4882824 1032446 7064152
8514 7064152 14244100 22766285 29803076 31100207 24673052 13411659 3782123 397372
8506 397372 1757835 2814798 903966 -3285850 -8869653 -14160647 -13960160 -4186097 9730221
8497 9730221 16197824 11860964 5555249 4321361 3566559 -2603900 -8895681 -5952876
8489 -5952876 4871280 13916804 17748246 21076637 25013439 23923978 15778546 6458002
8481 6458002 714619 -2989930 -4921959 215520 13465051 23814029 18993386 2093450
8473 2093450 -10248831 -6822489 6891598 18018722 21450631 21599705 22124920 20208994
8465 20208994 12917656 4817022 4178226 11989867 19427704 18247824 10231163 3122128
8457 3122128 -278025 -4248234 -11517821 -17222145 -14352837 -3245113 7766274 11601230
8449 11601230 9628449 7509848 6088200 1274938 -6577240 -9749966 -4272938 1483278
8441 1483278 -2667894 -12478834 -13479948 -1718686 10171911 10966785 5164712 3638534
8433 3638534 8335311 13577456 16122531 16246095 13845041 10618764 11259918 15491403 14528739
8424 14528739 3598055 -7872814 -8482684 -2054044 -864171 -5628847 -6022917 84944
8416 84944 2803689 -1982799 -4995501 732121 8259864 8238280 2948836 649948 2120027
8407 2120027 986208 -5543286 -12530979 -13152694 -6028331 2266724 2530121 -5843021 -10817568
8398 -10817568 -1239470 16839824 25771343 18334997 4495794 -5158184 -11285866 -16863464
8390 -16863464 -18109700 -12472505 -6942983 -9090514 -15427179 -16901894 -11585272 -4651203
8382 -4651203 299686 3079266 3392409 1523294 -106737 -304877 -488563 82542 4408579
8373 4408579 9764989 8012160 -593641 -3392407 6563082 17740688 16591682 8448867
8365 8448867 7926590 14386735 13614691 2423309 -5232323 308643 11128307 15003332
8357 15003332 10290762 1862231 -7358793 -13732726 -10494353 3374416 17146214 19057102
8349 19057102 10052146 694207 -3004052 -4233060 -6730584 -7789368 -2538054 7628351
8341 7628351 14366110 11079530 621481 -8065011 -10364075 -9343807 -8385899 -6194890
8333 -6194890 -2208810 -797422 -4025892 -5233559 2046497 11846439 11767616 674485
8325 674485 -8592865 -5582340 6330587 16750794 19519192 14700388 5694332 -2130762
8317 -2130762 -4163143 -536908 5212232 11316344 17610747 21480408 20053132 16013440
8309 16013440 14573695 14803494 11303251 4402883 -44569 -1740729 -6484717 -13038875
8301 -13038875 -10982036 2217058 12386421 5922857 -11429020 -22402468 -19508822 -9330197
8293 -9330197 314380 7466862 11649864 11381039 7298449 2192009 -2491471 -6184775
8285 -6184775 -6417757 -997943 7884128 15498317 19282791 18815741 14030737 7339969 3933490
8276 3933490 4828081 3246428 -5657603 -14769828 -12884197 -1077564 7590694 5284107
8268 5284107 -2033311 -5087080 -2394794 2610333 8605686 15421914 20605241 21659949
8260 21659949 18731719 12017101 813094 -10881634 -13045577 -1235349 12956163 11699988
8252 11699988 -7433018 -26966729 -30146138 -19824298 -11039387 -9692092 -7812539 370632
8244 370632 7901450 6080865 -1060071 -1939498 5393496 10116242 3847200 -8430463
8236 -8430463 -16053926 -15748423 -12487841 -10883296 -10614775 -9126704 -5209159 -113272 3256247
8227 3256247 3342253 2802337 5629453 10273642 9828439 1927564 -5996176 -6109851 -1243144
8218 -1243144 -358610 -5162946 -8438506 -5488167 97234 3703618 5761311 7248887
8210 7248887 5407045 -829620 -5654027 -2912243 4748613 9569770 9995894 11245629
8202 11245629 14609181 14403274 8654674 4910766 9024238 14135724 9652557 -2215390
8194 -2215390 -9497098 -9655584 -13603826 -26198308 -34282218 -23909935 -2273430 9474317
8186 9474317 3030135 -8378996 -8963955 1360512 10856915 11247756 4865114 14479
8178 14479 1895522 6653902 5014980 -5704632 -15938448 -15280972 -6775202 -2452354
8170 -2452354 -6297242 -10647502 -9660253 -6582197 -5393402 -4554905 -2708757 -2225638 -3093768
8161 -3093768 -1237370 3024537 3036449 -3138088 -8077894 -6567611 -3291005 -3163834 -2793835
8152 -2793835 1500197 5797074 6486632 7636098 12041846 13612291 8243442 3456823
8144 3456823 5993894 8345988 772678 -10771176 -13458509 -8146179 -4984474 -3292831
8136 -3292831 6004243 19548698 21998780 9448421 -4406288 -9099433 -9107342 -10613103
8128 -10613103 -11322825 -8933782 -6633601 -4779894 724398 7191942 5060101 -6106181
8120 -6106181 -14577805 -14488561 -13163357 -15064728 -13862446 -7886151 -7067064 -14206649 -15465874
8111 -15465874 -2680535 9682985 5392437 -8582467 -14909000 -12503926 -11929323 -13729720
8103 -13729720 -11599905 -10198092 -18133690 -26919545 -19218217 1957226 13934502 7355851
8095 7355851 -2083513 -876344 2694690 -3736813 -14963011 -17050057 -8157756 950566
8087 950566 1731913 -5043870 -13127607 -16242316 -12941072 -8613699 -8920127 -11568470 -10728618
8078 -10728618 -7718635 -7880560 -8544945 -2907537 4010119 -1001876 -16029195 -21152550
8070 -21152550 -6737118 11286682 15369189 10765423 11768865 16377349 12805562 3187706
8062 3187706 1339169 9559841 15299894 11474615 4747654 1412771 -1140328 -5038294
8054 -5038294 -6105207 -2874091 -1945684 -8360475 -17313387 -20626809 -16597385 -9515883
8046 -9515883 -3574367 -571204 -480162 -1690126 -2421560 -2373546 -1219642 2868822 9970338
8037 9970338 15971621 17643321 17573598 19126026 19899666 16690627 13438948 15955186 21316054
8028 21316054 21638999 16487762 11826001 8647268 3999707 1859486 9241307 20597342
8020 20597342 21001521 8546805 -1150626 1753771 8422352 9021852 7901486 10771822
8012 10771822 11568226 5531238 2060507 8482941 12663898 885666 -15719963 -14426670
8004 -14426670 3738236 14698395 7597828 -2371249 -2333122 -1182034 -10104648 -21287472
7996 -21287472 -20563781 -10019237 -3387855 -4961881 -5764514 1551541 13468852 20833284
7988 20833284 17564333 5154616 -7837064 -12588404 -8625106 -3160374 -1388879 -2355515
7980 -2355515 -4923305 -10385991 -16537660 -16920375 -10251018 -3587689 -1554241 313336
7972 313336 5944375 9894233 5640373 -2964652 -6714423 -3914822 -726260 -915166 -1792986
7963 -1792986 617547 6802586 13089095 13683979 6300821 -3127018 -6318592 -4114830
7955 -4114830 -4888899 -10325133 -12910088 -10723067 -12118816 -19131815 -19978954 -8913420
7947 -8913420 -580319 -9802447 -27344763 -32700753 -23321768 -13197502 -8417132 -3887731
7939 -3887731 -772481 -5820761 -13317980 -9103815 4303847 7405431 -5788775 -17100164
7931 -17100164 -12437679 -1806091 80737 -3618170 -2060322 4135376 7841121 8768521
7923 8768521 9010931 4894868 -4597011 -10734777 -8292596 -5871298 -10218010 -11221875
7915 -11221875 1508851 16703138 15057477 -1186531 -12060301 -10252365 -7400842 -9807254
7907 -9807254 -8482506 1634523 10795527 11047198 9109731 13238242 18982911 18246874
7899 18246874 13506942 12424567 14460478 13169961 8462396 7126529 11561760 15298586
7891 15298586 11615990 2731199 -1894062 4141361 16528740 24242403 21636786 13916777
7883 13916777 8724269 6410089 3104777 -739305 -1991359 -2360717 -5853148 -9718502
7875 -9718502 -6850825 2348481 9401516 10358558 9933573 10921141 9101420 2636918 -2463210
7866 -2463210 -1455826 2397782 5244967 8542091 11571158 6993037 -7308043 -19186588
7858 -19186588 -15886948 -2663911 2926569 -6327208 -20072872 -25572239 -21051147 -12438914
7850 -12438914 -4643568 481215 2247092 563983 -4135519 -10529563 -14694493 -11496444
7842 -11496444 -1457709 6465773 4375856 -3966398 -7955028 -4517049 -953045 -3120130
7834 -3120130 -7831449 -9330525 -7425102 -5739616 -6066114 -7736824 -9425377 -8727238 -2901293
7825 -2901293 6886981 14391703 14681602 10408560 8466618 10535947 9916297 -342251
7817 -342251 -16973961 -26835472 -20043986 -1811869 12491990 14490781 10076980 7557046
7809 7557046 5566622 -595656 -6529869 -3716507 4578070 4676367 -7434119 -18904813
7801 -18904813 -18814538 -13691812 -15165520 -20644429 -18801891 -9889481 -6527660 -13494467
7793 -13494467 -19386773 -13062143 1246944 11501842 13478161 11866871 10712292 10129502
7785 10129502 9767663 8516446 2227946 -11239699 -24878685 -27920458 -20546969 -16146000
7777 -16146000 -23872321 -34209527 -29457928 -6970501 16031552 22611270 14182895 4375229
7769 4375229 950945 1071106 1068698 1297051 402120 -5819377 -15403743 -17951924 -8452592
7760 -8452592 2319120 25001 -13756362 -23735025 -21645555 -14952119 -13424455 -16496922
7752 -16496922 -17678193 -13549289 -4023592 8928614 18035870 14215612 21832 -7988617
7744 -7988617 870634 15614587 18274448 9228295 4614582 10391165 13926298 4729991
7736 4729991 -9592014 -15099439 -9862723 -2771966 -377452 -2130592 -4293993 -2502948
7728 -2502948 5866501 16765824 20719502 13841291 3707698 -368476 1631176 4179642
7720 4179642 5502705 6185421 3508522 -3949243 -9356516 -5046195 4662884 8211637
7712 8211637 4330025 3935163 12059073 18787421 14145913 3352298 -864336 4266887
7704 4266887 10061549 9403431 3336273 -4443446 -12209612 -17839928 -17544905 -9971162 1368156
7695 1368156 11763805 19014246 21981351 18722850 9645914 836207 -609506 4286944
7687 4286944 6104946 -966382 -9957055 -9062844 2349319 12045606 10853586 3901464
7679 3901464 1621777 4993465 6739167 4065452 1471887 750539 -2814406 -10563235
7671 -10563235 -14271929 -6647616 5986641 9162113 -2039647 -17330111 -24783041 -24182950
7663 -24182950 -22846596 -22551099 -17726951 -6650454 2843092 3199742 -2081845 -4113248
7655 -4113248 -2747683 -6686342 -18304587 -27103000 -23463440 -12293634 -5643248 -6066242
7647 -6066242 -5890665 -1060908 3698322 4706185 5720048 10506002 15121178 12812282
7639 12812282 3476798 -6088107 -9824129 -7267099 -2001264 2017984 2752172 373146
7631 373146 -3791604 -7751930 -8256910 -2463933 7239220 12597728 8015814 -1629555 -6559098
7622 -6559098 -4578577 -2197648 -3344108 -4022387 -465765 3962452 4052192 -20496 -4918466
7613 -4918466 -9251467 -11893723 -9241012 -80975 8936384 8729021 -1348672 -12626519
7605 -12626519 -17468648 -16366389 -13444135 -8816228 671480 13596438 21024397 15220511
7597 15220511 624146 -8704323 -4986590 4182586 6655973 1157755 -4864240 -9244779
7589 -9244779 -16858169 -27183922 -30940764 -23420169 -12644008 -8598214 -10932139 -12927652
7581 -12927652 -11750014 -8915315 -5872785 -4895963 -9186107 -16338791 -17475018 -9507956
7573 -9507956 -2125884 -4405025 -10498357 -8890355 -1014876 1683941 -3172464 -6163414
7565 -6163414 -3048815 -1348560 -6287768 -11687921 -10683938 -6387201 -5233125 -6606464
7557 -6606464 -5731250 -2081777 643849 -647158 -7266549 -18065011 -27133477 -27972187
7549 -27972187 -23212784 -23033871 -29193223 -29050071 -13444243 6931891 13888955 5613392
7541 5613392 -3976972 -7002798 -8669487 -11634275 -8542091 3172275 11650907 6416270
7533 6416270 -4530923 -5407057 4435460 11094768 8254474 5575058 11970501 21887041
7525 21887041 24632807 19199650 12200979 6724483 1488937 -2182968 -891122 4099037
7517 4099037 7490945 7372958 6212641 4671206 768747 -3961872 -3821297 3293393 12502913
7508 12502913 18538861 21015953 20743774 15690235 4530336 -8792004 -17568190 -17963161
7500 -17963161 -10758710 21944 8918133 12329318 11600040 10812083 11541896 12728459
7492 12728459 14487995 17040439 16893881 10871250 3586662 2611424 5746768 3449217
7484 3449217 -3820405 -3126721 10181314 21831926 18363608 6602700 1590678 4511600
7476 4511600 6692276 7802387 13207678 17377619 8119259 -12069866 -25207131 -21521124
7468 -21521124 -10197330 -3196095 -1591278 -2161166 -4590291 -6289531 -1540458 7859161
7460 7859161 11399119 5361210 -825472 -251551 289137 -6850036 -16305666 -19075513 -17509605
7451 -17509605 -19444909 -23405428 -21707172 -14861712 -11149351 -12637366 -11836005 -3487325
7443 -3487325 8050660 15011873 14545893 9580240 4884970 2787872 1239058 -2352198
7435 -2352198 -4933199 -424130 9447586 14132400 9215130 4994399 11861585 22967226
7427 22967226 22124491 6274597 -10749043 -16675477 -13018955 -7390579 -2887314 1016546
7419 1016546 3621929 3439740 -40165 -7136654 -17128585 -25581966 -26635233 -19578124
7411 -19578124 -9967691 -3327616 -875281 -1589419 -4302779 -6674617 -5852059 -1721432
7403 -1721432 2955601 5966216 6513144 3306247 -4134005 -12234397 -15932024 -15197933 -14518044
7394 -14518044 -15012687 -12574924 -6406851 -3839205 -11406288 -24177041 -29905305 -23411858
7386 -23411858 -11771336 -4089878 -724869 4093407 11935850 17557025 16605830 11092966
7378 11092966 5046681 -895618 -6506626 -7304764 527923 11568163 14609361 6264054
7370 6264054 -4727721 -8854706 -5956446 -1536087 1182466 1806641 608969 110452
7362 110452 4322024 12173817 16166335 11968003 4811190 1753641 2550471 3382994 4071077
7353 4071077 4912364 1604466 -8592535 -19610086 -23764341 -22823144 -23576921 -25896192
7345 -25896192 -24487448 -19341681 -14023568 -6267178 7573322 19849988 17237189 1230762
7337 1230762 -10022112 -4833472 8634101 17182617 19181704 19170222 16644904 10272567
7329 10272567 5676180 8128433 11766695 6200806 -7948706 -18737373 -17893495 -9241246
7321 -9241246 -1573714 1212959 1070761 574387 -437064 -3111875 -5829635 -4679236 680575
7312 680575 4598863 2841504 -364448 1351255 5522215 4337809 -1949695 -4959498
7304 -4959498 -2238163 -340201 -1166630 2585030 12564428 17377236 9105590 -2703602
7296 -2703602 -4300812 2815947 7156173 5673972 4508030 5272035 3204648 -2301987
7288 -2301987 -6264282 -6844603 -6308638 -4218328 1283965 6520550 5785021 780517 -2473003
7279 -2473003 -4326531 -8702269 -11468119 -4517719 7954220 11075567 758831 -9459998
7271 -9459998 -8500041 -2343918 -1112640 -2875393 -405149 4588918 5338528 2646770 2600215
7262 2600215 4647291 2166724 -5904258 -12630807 -12672239 -7558881 -974146 5182105 8958341
7253 8958341 7630956 862487 -7871363 -13707998 -13105252 -5765549 3788335 8401426
7245 8401426 5026308 -1977464 -6399705 -6813651 -5443512 -3874650 -3577607 -7307663 -14943787
7236 -14943787 -20214762 -16798011 -6238846 4812626 13189719 19659327 23005188 20769628
7228 20769628 15557363 13501351 15337007 15332637 10694220 5894539 5215032 6564920 5903615
7219 5903615 3284520 1268685 925586 2054149 4063427 4742514 2016707 -1435931 -170609
7210 -170609 5228686 7043246 1657723 -3899010 -1763843 5398581 8984221 6576999
7202 6576999 2920876 1394360 875850 -627951 -4655878 -12223926 -19526473 -17131992
7194 -17131992 -1046569 17748914 23300750 13329996 -154912 -7636883 -10069921 -10554544
7186 -10554544 -9140685 -8044305 -11428902 -16659344 -15983117 -10408296 -10351605 -17406810 -18632562
7177 -18632562 -7652577 1572341 -5175123 -19161345 -21265842 -10490517 -2746687 -5079436
7169 -5079436 -8961461 -8735907 -8845274 -9756162 -3661885 9508531 16504763 9506616 -1603418
7160 -1603418 -4696291 -2657515 -5121157 -11370479 -12565472 -5953496 2850520 8518100
7152 8518100 9310430 5071988 -1358725 -4230319 -2365921 -2325120 -8066738 -12748318 -8373047
7143 -8373047 1221559 5661620 2652367 -1485966 -2879497 -2740859 -1546301 4470
7135 4470 -3662002 -16295100 -29306586 -28887748 -14511379 319854 7534313 13139029
7127 13139029 22186934 26847857 18216065 2141441 -7138619 -5919814 -4288485 -10496909
7119 -10496909 -19519630 -20050726 -9117497 3761709 6799546 -1760150 -13305236 -19898465
7111 -19898465 -21576067 -20861769 -15628456 -4104836 5990399 2790988 -13292529 -26262841
7103 -26262841 -22113969 -4869464 9166313 9633339 544681 -6939867 -5957928 1288274
7095 1288274 7418214 7588731 3175670 -1947263 -5939761 -7467388 -3374814 6648212
7087 6648212 15478649 15625178 9821254 6875510 7541682 4099640 -4725465 -9553779 -5536365
7078 -5536365 -946767 -3307374 -6547252 -1715340 7171889 9550365 5565801 4660149
7070 4660149 9270054 11976488 8798556 4182010 1590754 -308737 -193160 6107123
7062 6107123 14546113 12795102 -2040809 -15339626 -13552228 -3062753 453573 -4222030
7054 -4222030 -4393488 3747342 7893175 -214903 -10401183 -9367239 -1467005 -1546033 -10882487
7045 -10882487 -14183862 -2514305 13185116 17890150 12477727 8801995 10741754 11075702
7037 11075702 5645365 110188 380136 4317988 6665243 6550397 6200156 6204932 5748372
7028 5748372 5052310 4968804 5764627 7205313 7819802 4755595 -1968266 -6242074 -2532676
7019 -2532676 4888403 6730973 3046282 3657445 11901257 18380432 16233961 12214720
7011 12214720 14313268 17747565 14154759 7237569 6361640 9524308 6724662 -1937101
7003 -1937101 -5908909 -2383066 -914431 -6955489 -13557900 -14197310 -12461963 -13016705 -12932388
6994 -12932388 -8781945 -3794271 -1095501 2264919 7519924 8305626 686803 -8134468
6986 -8134468 -10147201 -8962892 -11723940 -14641766 -9122060 1430409 4996647 597915
6978 597915 226413 8475831 14209116 8638858 -854618 -4227034 -5706388 -14864457 -27450023
6969 -27450023 -29551898 -19197049 -9827424 -9974379 -12218327 -8037976 -2397906 -4036806
6961 -4036806 -9006387 -5889110 5677136 13711598 11783210 7167222 7451306 8585497
6953 8585497 2862622 -7941037 -15238023 -15591726 -12418641 -7802392 -229244 9232212
6945 9232212 14873900 12460930 3655415 -6689346 -14503436 -17361508 -14822165 -9182233
6937 -9182233 -3989975 -1378448 -1692366 -3977429 -5035552 -1065921 6311962 9180390
6929 9180390 3697837 -2009795 2268868 13033501 16232388 6767287 -4352076 -5222094
6921 -5222094 2658098 9384484 9196784 3767975 -1077161 1917257 15490445 30236490
6913 30236490 30171191 12188352 -6633955 -8777402 2325790 9281050 4109059 -5989655
6905 -5989655 -13372458 -18155363 -20504179 -16203738 -5012798 4493491 4693916 -830825
6897 -830825 -1959436 5693706 17106650 24434005 23705967 16166180 6382626 -489125
6889 -489125 -1642576 1573819 4574136 3215204 -2096270 -6338655 -5895970 -4210410 -7783983
6880 -7783983 -15956712 -19876841 -14518699 -6310406 -3698720 -4868411 -1985008 5517246
6872 5517246 10424553 9636609 7920860 8549277 7994074 2638603 -5563918 -12909981 -17838324
6863 -17838324 -18606272 -13059144 -3834167 1991884 2110796 2283615 6509366 10018811 7579632
6854 7579632 3039968 3240312 6639043 6523234 3191585 3581453 8566754 9864241 2629925
6845 2629925 -6487806 -8713555 -4898577 -2013883 -1685667 733355 6524845 9906539
6837 9906539 6173551 -1271574 -5507909 -4595972 -1275241 3883036 13175265 24525163
6829 24525163 29276478 21837618 8753264 2740651 7822201 14936003 13335991 2456999
6821 2456999 -9347292 -14516200 -12100716 -6296425 -2377620 -3317141 -7979451 -12396779
6813 -12396779 -13506456 -10963221 -5297378 3196348 12251564 16993550 14661486 8763876
6805 8763876 5353898 5657651 5702417 3357896 1665974 3017363 3487527 -2497964 -12594089
6796 -12594089 -16704374 -9166571 2701418 6497599 -140495 -7117777 -5049102 4159318
6788 4159318 12091880 14238151 11361828 4540267 -4772093 -11422836 -10184407 -3326792
6780 -3326792 1226424 518611 -196045 3483566 8650219 10678755 9834336 8295318 5467713
6771 5467713 1237462 -269305 3876138 9139452 8943828 4278521 1249690 451336 -3394048
6762 -3394048 -10679601 -14172838 -10365304 -6320669 -9568561 -16268892 -16364861 -7951936 610036
6753 610036 2564247 -47956 -2674184 -5511245 -10443839 -14924093 -14228766 -8219255 -1062183
6744 -1062183 5264822 12468169 20542412 25809035 26116170 23411391 18526442 8436417
6736 8436417 -6496417 -16838816 -12980697 1556885 13006314 14088127 10713633 10052373
6728 10052373 9738716 4345706 -3174718 -4326395 2346316 8380305 6010047 -3075973
6720 -3075973 -11091123 -12771788 -8699901 -2438230 2962251 5845221 5277021 1095669
6712 1095669 -4974528 -9517723 -10423013 -9233903 -8476259 -7058556 -1659218 6352182 9275508
6703 9275508 1808432 -10361613 -14522900 -4139249 13742937 24960051 21438976 7745139
6695 7745139 -5089032 -11186056 -13570674 -16611616 -19113338 -18424287 -17387883 -20202826
6687 -20202826 -22765696 -15861358 5744 11393963 8445804 -1952257 -5722870 654613
6679 654613 8980950 12649270 13287130 14284966 14116438 8709681 -1519340 -8539817 -2503202
6670 -2503202 16165761 32118555 29640987 12806520 2020469 6938345 13815733 7602709
6662 7602709 -4620919 -5577447 4623405 9438326 1818180 -7572017 -9584840 -8479375
6654 -8479375 -9835962 -10111920 -5469543 -685003 -1567118 -5984157 -8797420 -9160703 -7653616
6645 -7653616 -2944881 3517922 6282185 4410094 4155618 8068653 9553673 4669275
6637 4669275 554091 3214220 4960453 -4249399 -18157246 -20056439 -5982679 10196331
6629 10196331 16392734 16170966 18818712 23895093 22350923 9811503 -6511732 -14575125
6621 -14575125 -9709571 407408 3731422 -3174143 -12270927 -14653669 -10451893 -6270081
6613 -6270081 -6678337 -11243486 -16415593 -17117206 -10269021 -284339 3370149 -1427564 -4281173
6604 -4281173 4461597 19321551 25673391 17450497 1977790 -10425153 -14228270 -8112708
6596 -8112708 4636300 14730171 13509940 2782108 -7247962 -10334073 -9370276 -9692724
6588 -9692724 -13222242 -19248750 -24918906 -24697007 -15439990 -2440070 5370016 6086895
6580 6086895 4524316 2281048 -3381042 -10122444 -9612118 348290 10574205 11802200
6572 11802200 5383065 -713254 -918363 5522625 14798514 18579380 10960981 -1568472
6564 -1568472 -4990591 3672345 11592354 9086068 3158289 3915691 7376981 3889632
6556 3889632 -3360198 -2563661 7035838 13931565 12906406 11388899 14696105 17189334
6548 17189334 12978305 5055813 -2202407 -10496678 -20258266 -23722072 -14728704 -707488
6540 -707488 4762344 -600032 -6542044 -6029438 -3335104 -4122346 -5344142 -543704 9082634
6531 9082634 15125227 12642212 5565783 507940 -1154179 -2589568 -5096997 -6134740
6523 -6134740 -4298259 -2935373 -5871471 -11016735 -12311743 -8817997 -7640279 -14370111
6515 -14370111 -23321625 -22548896 -8747090 7769989 14996575 12047753 6826328 4445728
6507 4445728 3178120 592167 -2093256 -3126604 -3353215 -3965893 -4016270 -2223094 868846
6498 868846 3817769 4943745 1460404 -7863701 -17272894 -16539042 -3527534 9930186
6490 9930186 11000616 2061345 -3282334 844767 6343642 5619336 3373212 8017840
6482 8017840 17313507 20693245 14217976 5889510 4818192 10511842 15583926 15321890
6474 15321890 10926994 5408292 784127 -548145 3752953 11553841 15479547 10634582
6466 10634582 1556219 -2929683 -993029 1255930 145034 -756872 1760905 5110196
6458 5110196 7203080 11371492 18664463 21372070 13061084 1051056 -1336685 6451508
6450 6451508 11504484 6245545 -1910599 -2382132 5573783 15312256 21216413 20935602 15270992
6441 15270992 9403883 9165238 13520511 15763692 13368313 10222474 8296726 5678131
6433 5678131 4715473 11590998 23413982 26598511 14859331 -1267415 -10725561 -17179292
6425 -17179292 -27498108 -35076259 -28832709 -12528042 -335628 3365039 5734606 9616283
6417 9616283 10719145 10030797 14024319 20745748 19951156 10452648 3816822 6154002 9194018
6408 9194018 5503788 88231 -1038523 -2467978 -9880875 -18206251 -19806253 -17166359
6400 -17166359 -16688454 -15785863 -7571111 5500421 13950496 15141169 14248877 12556394
6392 12556394 5632192 -5809863 -13163942 -10894184 -2493474 6991706 16660940 24568276
6384 24568276 24501062 13763385 -896822 -10961137 -16020438 -20124290 -21515083 -14000445
6376 -14000445 1021353 11415338 7442576 -5865289 -14171586 -10152288 11231 6248602
6368 6248602 6025795 4031776 4003125 4832111 3893793 810425 -2673412 -4582056 -4044586
6359 -4044586 -1980993 -312979 455559 1793529 3852800 3484426 -1702422 -8797729 -12614420
6350 -12614420 -12249837 -10779446 -9430110 -7048817 -5199215 -7823998 -14181195 -17585300
6342 -17585300 -13929062 -7015871 -2794857 -2696195 -5354143 -9859251 -13370135 -10355921
6334 -10355921 415895 11483982 14559899 10232663 5006929 1630707 -1745150 -4972579
6326 -4972579 -5340906 -3410289 -3251503 -5676581 -5917814 298001 11206310 20214382 20958591
6317 20958591 12521619 2014726 -589633 6194534 12334294 9449149 3048373 4078056
6309 4078056 11476274 13708550 7449691 2760001 5965832 8697702 1264178 -11743212
6301 -11743212 -18203229 -15008451 -8841676 -4539599 -1906624 -1654818 -5101074 -8341830
6293 -8341830 -5314176 2376956 6143056 2300903 -3716116 -6850834 -8968021 -12637687
6285 -12637687 -14836289 -11729133 -5425227 -1304288 -1478623 -4360972 -7496585 -7402955 -467025
6276 -467025 11185252 17672979 10753644 -6100631 -21543245 -28574138 -28194397 -23307814
6268 -23307814 -16064974 -10873886 -12238845 -17486858 -18265414 -11952220 -4949476 -1255104
6260 -1255104 4301027 14858680 21007393 12198686 -4932408 -12172580 -4471810 3268491
6252 3268491 -1112471 -9063572 -5510264 7024686 11484201 1392775 -9857418 -7952272
6244 -7952272 4042192 12207932 9784138 1495341 -6106843 -10796755 -11975859 -8906011
6236 -8906011 -3738948 -1758001 -5629826 -11436951 -12393392 -5495321 6068123 15362890
6228 15362890 16018886 6613323 -7358673 -17232676 -18515069 -13749207 -7579722 -1257858
6220 -1257858 5987293 12285876 13594769 9038753 3007844 858313 3951182 9303517
6212 9303517 12502156 10503719 3408156 -5374391 -11758161 -14532412 -15348923 -15034841 -11976474
6203 -11976474 -5378005 1949882 6462719 8405904 10551971 12606309 10392261 2353116
6195 2353116 -6042780 -8045289 -4886101 -4971204 -12435349 -20620834 -20748847 -14255967 -10564091
6186 -10564091 -12870874 -13320837 -5755237 2888959 721637 -12246659 -22711147 -19913269
6178 -19913269 -7061930 4447411 7486073 4149661 2179402 8001990 20035947 28373989
6170 28373989 25222104 15615640 11608023 14794162 12922112 -1720352 -18625645 -21576847
6162 -21576847 -9579057 3397610 6579423 1638660 -4734319 -8789260 -9595080 -8101345
6154 -8101345 -7633266 -10139633 -12192238 -10024491 -6666022 -6667468 -5818277 3401117 16022350
6145 16022350 16883736 2815297 -9728535 -6741316 4167396 6558865 -1415034 -8257508
6137 -8257508 -7988469 -4858921 -2070640 1423583 3387333 -145394 -4670560 -639076
6129 -639076 10161768 13799502 4746930 -4699792 -3325514 1731932 -2274659 -12413263
6121 -12413263 -15639152 -10621263 -8016297 -9641115 -4500961 9462066 15823983 2856077
6113 2856077 -15687275 -17627260 -3532980 5250390 -1979242 -12192879 -10465317 -237757
6105 -237757 6098299 5398571 2007239 -4165035 -15481927 -26310282 -27027688 -18207189
6097 -18207189 -10809987 -11007399 -13588454 -12537695 -9809188 -9781720 -11750663 -12640970 -12425801
6088 -12425801 -12518990 -12430709 -11858179 -12991314 -16982062 -20422421 -18874941 -12782356 -7387482
6079 -7387482 -7168880 -11216071 -13670652 -9586603 -1483482 2695362 1093618 2868738
6071 2868738 15004699 28534862 28774562 17805631 13089187 20933866 26043860 15172437
6063 15172437 -2120226 -8062922 -1853111 3593825 3013569 1763810 1121242 -3811044
6055 -3811044 -11296664 -12002136 -3616089 4710427 5433369 432516 -6449612 -14423943 -19996404
6046 -19996404 -16394243 -3963654 7174742 10104416 9355662 11168312 13146853 10002375
6038 10002375 3157088 -2547551 -6907479 -11997190 -15333697 -12584950 -5412938 -547472
6030 -547472 -1528578 -5737973 -9136615 -10478811 -11041382 -12325239 -13686876 -11955700 -5484839
6021 -5484839 1615934 3264645 -23540 -1405254 1879223 4037166 -402263 -8578731
6013 -8578731 -13835274 -13543581 -8902641 -2000036 2985246 1040127 -6344038 -10008476
$$ [...]
##END NTUPLES=NMR SPECTRUM
##END=
