##TITLE=31Pdec_LR-0155-CBz-CH2Cl2
 CD3CN, 64 sc
 16.2.2023
##JCAMPDX= 6.0         $$ Bruker NMR JCAMP-DX V2.0
##DATA TYPE= NMR SPECTRUM
##DATA CLASS= NTUPLES
##ORIGIN= UXNMR, Bruker Analytische Messtechnik GmbH
##OWNER= root
$$ XWIN-NMR		Version 3.5
$$ Thu Feb 16 16:15:43 2023 Russian Standard Time (UT+4h)  she@DPX200
##.OBSERVE FREQUENCY= 81.013821
##.OBSERVE NUCLEUS= ^31P
##.ACQUISITION MODE= SIMULTANEOUS
##.ACQUISITION SCHEME= undefined
##.AVERAGES= 64
##.DIGITISER RES= 16
##SPECTROMETER/DATA SYSTEM= spect
##.PULSE SEQUENCE= zgpg30
##.SOLVENT NAME= CD3CN
##.SHIFT REFERENCE= (INTERNAL, CD3CN, 0, 248.564)
##AUDIT TRAIL= $$ (NUMBER, WHEN, WHO, WHERE, WHAT)
$$ ##TITLE= Audit trail, XWIN-NMR		Version 3.5
$$ ##JCAMPDX= 5.01
$$ ##ORIGIN= Bruker BioSpin GmbH
$$ ##OWNER= she
$$ F:/spectra/data/she/nmr/P31/1/pdata/1/auditp.txt
$$ ##AUDIT TRAIL=  $$ (NUMBER, WHEN, WHO, WHERE, WHAT)
(   1,<2023-02-16 16:14:34.67 +0400>,<she>,<DPX200>,
      <continue with go, POWCHK disabled, PULCHK disabled
       configuration hash MD5:
       00 E9 B6 7A A2 85 ED C7 34 08 36 98 17 FE 4E 26
       data hash MD5: 32K
       D2 31 9F B4 34 E3 F6 CD 3B 1B 1F 4E F7 55 A1 F6>)
(   2,<2023-02-16 16:14:40.39 +0400>,<she>,<DPX200>,
      <Start of raw data processing
       efp BC_mod = 2 LB = 1 FT_mod = 6 PKNL = 1 PHC0 = -10963.32 PHC1 = 19.81271 SI = 64K 
       data hash MD5: 64K
       FD 14 3C 59 9F 2C C5 CA 3E 7F 7B 3E 7C 5E 9B 54>)
(   3,<2023-02-16 16:14:51.03 +0400>,<she>,<DPX200>,
      <pk PHC0 = 2.760023 PHC1 = 0 
       data hash MD5: 64K
       2E 86 B7 A2 60 29 F3 D5 A4 E8 19 C4 B3 91 37 9B>)
(   4,<2023-02-16 16:15:08.76 +0400>,<she>,<DPX200>,
      <abs ABSG = 5 
       data hash MD5: 64K
       2B 96 9F 16 B9 84 53 9B 68 33 21 F8 7F 14 1E DC>)
$$ ##END=
$$ 
$$ hash MD5
$$ 7B 56 42 69 11 54 AF 66 D1 5D 31 F3 E3 B0 4A 54
##$RELAX= 
##$RELAX= 
##$RELAX= 
##$RELAX= 
##$RELAX= 
##$RELAX= 
##$RELAX= 
##$RELAX= 
##$RELAX= 
$$ Bruker specific parameters
$$ --------------------------
##$DU= <F:/spectra>
##$EXPNO= 1
##$NAME= <P31>
##$PROCNO= 1
##$TYPE= <nmr>
##$USER= <she>
##$AMP= (0..31)
100 100 100 100 100 100 100 100 100 100 100 100 100 100 100 100 100 100 
100 100 100 100 100 100 100 100 100 100 100 100 100 100 
##$AQSEQ= 0
##$AQ_mod= 1
##$AUNM= <au_zg>
##$AUTOPOS= <>
##$BF1= 81.014009
##$BF2= 200.13
##$BF3= 200.13
##$BF4= 200.13
##$BF5= 200.13
##$BF6= 200.13
##$BF7= 200.13
##$BF8= 200.13
##$BYTORDA= 1
##$CFDGTYP= 0
##$CFRGTYP= 5
##$CHEMSTR= <none>
##$CNST= (0..31)
1 1 145 1 1 1 1 1 1 1 1 1 1 1 1 1 1 1 1 1 1 1 1 1 1 1 1 1 1 1 1 1 
##$CPDPRG= <waltz16>
##$CPDPRG1= <>
##$CPDPRG2= <waltz16>
##$CPDPRG3= <>
##$CPDPRG4= <mlev>
##$CPDPRG5= <mlev>
##$CPDPRG6= <mlev>
##$CPDPRG7= <mlev>
##$CPDPRG8= <mlev>
##$CPDPRGB= <>
##$CPDPRGT= <>
##$D= (0..31)
0 1 0 0 0 0 0 0 0 0 0 0.03 2e-05 3e-06 0 0 0 0 0 0 0 0 0 0 0 0 0 0 0 0 
0 0 
##$DATE= 1676549581
##$DBL= (0..7)
120 120 120 11 120 120 24 19 
##$DBP= (0..7)
150 150 150 150 150 150 150 150 
##$DBP07= 0
##$DBPNAM0= <>
$$ [...]
##$SUBNAM3= <"">
##$SUBNAM4= <"">
##$SUBNAM5= <"">
##$SUBNAM6= <"">
##$SUBNAM7= <"">
##$SUBNAM8= <"">
##$SUBNAM9= <"">
##$SW= 501.771253377433
##$SWIBOX= (0..15)
0 1 3 0 0 0 0 0 0 0 0 0 0 0 0 0 
##$SW_h= 40650.406504065
##$TD= 32768
##$TD0= 1
##$TE= 0
##$TE2= 300
##$TE3= 300
##$TEG= 300
##$TL= (0..7)
0 120 53 12 22 120 120 120 
##$TP= (0..7)
150 150 150 150 150 150 150 150 
##$TP07= 0
##$TPNAME0= <>
##$TPNAME1= <>
##$TPNAME2= <>
##$TPNAME3= <>
##$TPNAME4= <>
##$TPNAME5= <>
##$TPNAME6= <>
##$TPNAME7= <>
##$TPOAL= (0..7)
0.5 0.5 0.5 0.5 0.5 0.5 0.5 0.5 
##$TPOFFS= (0..7)
0 0 0 0 0 0 0 0 
##$TUNHIN= 0
##$TUNHOUT= 0
##$TUNXOUT= 0
##$USERA1= <user>
##$USERA2= <user>
##$USERA3= <user>
##$USERA4= <user>
##$USERA5= <user>
##$V9= 5
##$VALIST= <valist>
##$VCLIST= <CCCCCCCCCCCCCCC>
##$VD= 0
##$VDLIST= <DDDDDDDDDDDDDDD>
##$VPLIST= <PPPPPPPPPPPPPPP>
##$VTLIST= <TTTTTTTTTTTTTTT>
##$WBST= 1024
##$WBSW= 4
##$XGAIN= (0..3)
0 0 0 0 
##$XL= 0
##$YL= 0
##$YMAX_a= 5148
##$YMIN_a= -4939
##$ZGOPTNS= <>
##$ZL1= 120
##$ZL2= 120
##$ZL3= 120
##$ZL4= 120
##$ABSF1= 248.5645
##$ABSF2= -253.2056
##$ABSG= 5
##$ABSL= 3
##$ALPHA= 0
##$AQORDER= 0
##$ASSFAC= 0
##$ASSFACI= 0
##$ASSFACX= 0
##$ASSWID= 0
##$AUNMP= <proc_1d>
##$AZFE= 0.1
##$AZFW= 0.5
##$BCFW= 0
##$BC_mod= 2
##$BYTORDP= 0
##$COROFFS= 0
##$CY= -3
##$DATMOD= 1
##$DC= 0
##$DFILT= <>
##$DTYPP= 0
##$F1P= 0
##$F2P= 0
##$FCOR= 1
##$FTSIZE= 65536
##$FT_mod= 6
##$GAMMA= 0
##$GB= 0
##$INTBC= 1
##$INTSCL= 6.047779e-11
##$ISEN= 30
##$LB= 1
##$LEV0= 0
##$LPBIN= 0
##$MAXI= 10000
##$MC2= 0
##$MEAN= 0
##$ME_mod= 0
##$MI= 50
##$NCOEF= 0
##$NC_proc= -7
##$NLEV= 6
##$NOISF1= 182.463
##$NOISF2= 159.3651
##$NSP= 0
##$NTH_PI= 0
##$NZP= 0
##$OFFSET= 248.5645
##$PC= 4
##$PHC0= -10960.56
##$PHC1= 19.81271
##$PH_mod= 1
##$PKNL= yes
##$PPARMOD= 0
##$PSCAL= 0
##$PSIGN= 0
##$REVERSE= no
##$SF= 81.0140089999694
##$SI= 65536
##$SIGF1= 159.3651
##$SIGF2= -187.1042
##$SINO= 113.3802
##$SIOLD= 16384
##$SREGLST= <1H.CDCl3>
##$SSB= 0
##$STSI= 65536
##$STSR= 0
##$SW_p= 40650.406504065
##$SYMM= 0
##$S_DEV= 0
##$TDeff= 32768
##$TDoff= 0
##$TI= <>
##$TILT= no
##$TM1= 0
##$TM2= 0
##$TOPLEV= 0
##$USERP1= <user>
##$USERP2= <user>
##$USERP3= <user>
##$USERP4= <user>
##$USERP5= <user>
##$WDW= 1
##$XDIM= 65536
##$YMAX_p= 300714948
##$YMIN_p= -26422098
$$ End of Bruker specific parameters
$$ ---------------------------------
##NTUPLES= NMR SPECTRUM
##VAR_NAME=  FREQUENCY,     SPECTRUM/REAL,   SPECTRUM/IMAG
##SYMBOL=    X,             R,               I
##VAR_TYPE=  INDEPENDENT,   DEPENDENT,       DEPENDENT
##VAR_FORM=  AFFN,          ASDF,            ASDF
##VAR_DIM=   65536,         65536,           65536
##UNITS=     HZ,            ARBITRARY UNITS, ARBITRARY UNITS
##FACTOR=    0.620285442955139, 1,           1
##FIRST=     20137.2065510682, 0,            0
##LAST=      -20513.1999529968, 0,           0
##MIN=       -20513.1999529968, -26422098,   0
##MAX=       20137.2065510682, 300714948,    0
$$ Real data points
##PAGE= N=1
##DATA TABLE= (X++(R..R)), XYDATA
$$ [...]
42477B851348L88992j066844n35585K28387K86989J80832q0728j177803k369186
$$ 2851348 3240340 2173496 1637911 1866298 2153287 2334119 2253391 1075588 -1293598
42468a293598j684866Q22258K309433J123343n69145j33487J481890J637723L54232
$$ -1293598 -2978464 -2156206 153227 1276570 707425 573938 2055828 3693551 4047783
42459D047783l90878o25630j952966l496952k322478J411004L583688J892364
$$ 4047783 3656905 3031275 1078309 -2418643 -4741121 -3330117 253571 2145935
42451B145935r28922j575050o79898m18787m25100Q01425K379098K187530M32615
$$ 2145935 1217013 -358037 -1037935 -1456722 -1881822 -1080397 1298701 3486231 3918846
42442C918846p92275q17227p89114j309543j887867k230781k114086p12038J871923
$$ 3918846 3126571 2309344 1520230 210687 -1677180 -3907961 -6022047 -6734085 -4862162
42433d862162L275788J553476j381119j663317J243808L783729L158926N38392
$$ -4862162 -1586374 -32898 -1414017 -3077334 -1833526 1950203 5109129 5647521
42425E647521j297234j389358n70685M05221J334880J903044J616058L27424j499927
$$ 5647521 4350287 2960929 2390244 2795465 4130345 6033389 7649447 7976871 6476944
42416F476944k997534l395698k436865k74625K575926M602826L582832o76079
$$ 6476944 3479410 83712 -2353153 -2627778 -51852 4550974 8133806 7457727
42408G457727m496726l977795m37806J237331J43914N99140L962007M758977o99193
$$ 7457727 2961001 -1016794 -1454600 -217269 -73355 525785 4487792 9246769 8547576
42399H547576o753870n833111r0106J968643j170634k467605J420165M833605
$$ 8547576 1793706 -4039405 -4129511 -2160868 -3331502 -5799107 -4378942 454663
42391D54663K871715j000523j537355N8906j80901j585887r69264P86317J69129
$$ 454663 3326378 2325855 788500 847406 666505 -919382 -1888646 -1102329 -933200
42382i33200k368065k710208K16344K726799K062173k048n88930J1878o12084
$$ -933200 -3301265 -6011473 -5795129 -3068330 -1006157 -1008205 -1597135 -1585257 -2197341
42373b197341l009923m659053k917252J463815M585088L645535J66897k136898
$$ -2197341 -5207264 -9866317 -12783569 -11319754 -6734666 -3089131 -2922234 -5059132
42365e059132j829021k76189J326654K661718K573202K14653j990714n60077L221903
$$ -5059132 -6888153 -7164342 -5837688 -3175970 -602768 -388115 -2378829 -2938906 282997
42356B82997M172999J147690j049012P3204K65645l653989p084283m469597J436598
$$ 282997 4455996 5603686 4554674 4627878 4893523 1239534 -5844749 -10314346 -8877748
42347h877748L792200K060829J013712J468504o0320l067291k555712K042503
$$ -8877748 -5085548 -3024719 -2011007 -542503 -602823 -3670114 -6225826 -4183323
42339d183323M922542L017396K02698l17315j054148l859096m940007j490780
$$ -4183323 739219 3756615 3959313 3641998 2587850 -1271246 -6211253 -7702033
42331g702033K053225O35337k617540j189827L869627N370177J546260j447711
$$ -7702033 -5648808 -5013471 -7631011 -8820838 -4951211 418966 1965226 517515
42323E17515J98407K271362K55365l076486k524587R14180J764886j238356l485564
$$ 517515 715922 2987284 3242649 166163 -2358424 -1444244 320642 -917714 -4403278
42314d403278j721684J518011K177930M0405k237509k977218k025055O47226M085415
$$ -4403278 -6124962 -4606951 -2429021 -2388616 -4626125 -7603343 -9628398 -8981172 -4895757
42305d895757N283799K164977k583696l771729l19998L307782L266220R45080
$$ -4895757 388042 2553019 -30677 -3802406 -4122404 -814622 2451598 3396678
42297C396678k82210l8470M8892J14660J359045K667542J534685j621647l283109
$$ 3396678 3114468 3075998 3124890 3239550 4598595 7266137 8800822 7179175 3896066
42288C896066j722738N55433M81936j455959k287457o59928J562468J670922o15846
$$ 3896066 2173328 2728761 3210697 1754738 -532719 -1192647 369821 2040743 1424897
42279A424897k647661j930638O67724K113794J603938J427696K457673J868110
$$ 1424897 -1222764 -3153402 -2485678 -371884 1232054 2659750 5117423 6985533
42271F985533j947503m998961k611870K764548L847297j223174o031634m840168
$$ 6985533 5038030 39069 -2572801 191747 4039044 2815870 -3215764 -8055932
42263h055932J59663L180671K791789K078735L027148M217979L515533O86943
$$ -8055932 -7896269 -4715598 -1923809 154926 3182074 7400053 10915586 11602529
42255A1602529k615415m319829l627618j650910J01879J360060K017681P75321
$$ 11602529 8987114 4667285 1039667 -611243 -509364 850696 2868377 3643698
42247C643698k428358l891804l43466M673352M020994k340247n869585j442686
$$ 3643698 1215340 -2676464 -3019930 1653422 5674416 3334169 -2535416 -3978102
42239c978102N046723N492797P91109k474642k363341j818499j449610M94670
$$ -3978102 1068621 6561418 7352527 4877885 2514544 696045 -753565 -258895
42231b58895K237299K3129m376828m817872m59835K511813P11472j534292r2744
$$ -258895 1978404 2001533 -2375295 -7193167 -7653002 -5141189 -4429717 -5964009 -6056753
42222f056753K315615J605498o21206o33749N33799p29654l735244m165820q47249
$$ -6056753 -3741138 -2135640 -2756846 -3390595 -2856796 -3586450 -7321694 -11487514 -12334763
42213a2334763K678883L348911J732699k09658j486756j775234j161449n46085
$$ -12334763 -9655880 -6306969 -4574270 -4783928 -6270684 -8045918 -9207367 -9753452
42205i753452n04116M8038K074670L790023K442299j135748k607773J29296L679525
$$ -9753452 -10257568 -10209530 -8134860 -4344837 -1902538 -3038286 -5646059 -5516763 -1837238
42196a837238L521414J33315j714489L80363K964456J402440l379581n542518
$$ -1837238 1684176 1817491 103002 483365 3447821 4850261 1470680 -4071838
42188d071838k157807K471616K576265j095881k696821J27802L449466L571289
$$ -4071838 -6229645 -3758029 -1181764 -2277645 -4974466 -4846664 -1397198 2174091
42180B174091J877180J100939Q16026k21681o67615O27753J238328j069424l463298
$$ 2174091 4051271 5152210 5968236 5746555 5078940 5706693 6945021 5875597 2412299
42171B412299j863149K016180K884303K06919j607197j176244j707516l544628
$$ 2412299 549150 2565330 5449633 5656552 4049355 2873111 1165595 -2379033
42163b379033k278479K795247N179576Q66379m329688l236783J518576K165966
$$ -2379033 -4657512 -1862265 3317311 4183690 -145998 -3382781 -1864205 301761
42155C01761j440834k103217K347285N403341K456256k264607k900643m69850
$$ 301761 -1139073 -3242290 -895005 4508336 6964592 4699985 1799342 1329492
42147A329492L67156q94757j013408Q82056K199591J407081J01135J93186J250398
$$ 1329492 1696648 801891 -211517 670539 2870130 4277211 4378346 4571532 5821930
42138E821930J148782j501434n326559o441734k336218L927301N895000J662927
$$ 5821930 6970712 5469278 142719 -6299015 -8635233 -4707932 1187068 2849995
42130B849995l078872k505524J456995K495804o60497l015666j311363J640440
$$ 2849995 -228877 -2734401 -1277406 1218398 557901 -2457765 -3769128 -2128688
42122b128688K057774N54383n1576N60923N30997p39330j911400j779613l86413
$$ -2128688 -70914 483469 431893 992816 1523813 784483 -1126917 -2906530 -3292943
42113c292943J335801K024005R09042p85703p58499J108497J996084k202k935379
$$ -3292943 -1957142 66863 975905 190202 -568297 540200 2536284 2534082 -401297
42104d01297l707912k239682o86389K60631J548361K840530K455066N44459l99781
$$ -401297 -4109209 -6348891 -7035280 -6774649 -5226288 -2385758 69308 613767 213986
42095B13986Q04389K102494J252848q99084j719630k63951J934647K864643J748039
$$ 213986 1018375 3120869 4373717 3474633 1755003 1491052 3425699 6290342 8038381
42086H038381o21724k320918j737788M93779J720040M72482j375662j123523P61244
$$ 8038381 7416657 5095739 3357951 3851730 5571770 6044252 4668590 3545067 4306311
42077D306311J242262o68374k327020j609504m21739j752037m488998m267247
$$ 4306311 5548573 4880199 2553179 943675 521936 -1230101 -5719099 -9986346
42069i986346K73651M955509N204149J601211j625576k080802q19154N19936J470259
$$ -9986346 -9712695 -4757186 446963 2048174 422598 -1658204 -2477358 -1957422 -487163
42060d87163J744852R90025p1541l01917j62091q69445j509421N0327K808674
$$ -487163 1257689 2247714 2176173 1874256 1712165 842720 -666701 -616374 2192300
42051B192300K814390p14114l274613j805071K45993j348470m021897k146597
$$ 2192300 5006690 4292576 1017963 -787108 -541115 -1889585 -5911482 -8058079
42043h058079L463509O191480L710328R35056J364506J801602j030155m090154
$$ -8058079 -4594570 1596910 5307238 6242294 7606800 9408402 8378247 4288093
42035D288093k995036N25610J506455l63664j184435J02646O05651o15387q20036
$$ 4288093 1293057 1818667 3325122 2961458 1777023 1879669 2485320 1869933 1049897
42026A049897J011575J701938q78498l730835k932450N03115K264847R75674m79730
$$ 1049897 2061472 3763410 2884912 -845923 -3778373 -3275258 -1010411 -34737 -514467
42017e14467K68791J902680J999487O49047k77312l58716r46475k216471k133865
$$ -514467 -245676 1657004 3656491 4305538 4028226 3669510 2723035 506564 -1627301
42008a627301L38394K725877K039957n77331j148296J066153K135704m98040l810981
$$ -1627301 -1288907 1436970 3476927 2899596 1751300 2817453 4953157 4455117 644136
41999F44136l716472j174400r1766q02330j22451K404955L078218J50630k769743
$$ 644136 -3072336 -4246736 -4338502 -5140832 -5263283 -2858328 219890 370520 -2399223
41990b399223j918984J138520K302094J048754K28275P68630L24067k257840m173735
$$ -2399223 -4318207 -3179687 -877593 171161 399436 1168066 1492133 -765707 -4939442
41981d939442k160845K744477N849720M074852o01412l400947j989902J155053
$$ -4939442 -7100287 -4355810 1493910 5568762 4967350 1566403 -423499 731554
41973G31554J848467q09176l446463k721066L76077J771343k94808k785479j932126
$$ 731554 2580021 1770845 -1675618 -4396684 -4020607 -2249264 -2544072 -5329551 -7261677
41964g261677J357159K448439m10443l099626j244593L169353M184333K89828
$$ -7261677 -5904518 -3456079 -3866522 -6966148 -8210741 -5041388 -857055 -567227
41956e67227l500954k923011Q0650J449299J166776J862692L557810L815776K048017
$$ -567227 -4068181 -6991192 -6910542 -5461243 -4294467 -2431775 1126035 4941811 6989828
41947F989828n3707j781820l592383m474130k779126M30760K404575K888479L493233
$$ 6989828 6936121 5154301 1561918 -2912212 -5691338 -5260578 -2856003 32476 3525709
41938C525709L278010r7637m406504l902035J630857M708539O15687n183375m972820
$$ 3525709 6803719 6706082 2299578 -1602457 28400 4736939 5352626 169251 -4803569
41929d803569J34300L010042J543431J57325J269419J869572l40712k847671k613307
$$ -4803569 -4669269 -1659227 -115796 41529 1310948 3180520 2839808 -7863 -2621170
41920b621170o42726K25708l54182l82340J301850L539265M023374J464491k793207
$$ -2621170 -3263896 -3038188 -3392370 -3774710 -2472860 1066405 5089779 6554270 3761063
41911C761063n397812m075659R9546M056461N510329L872576J17691l011356k683987
$$ 3761063 -1636749 -5712408 -5612862 -1556401 3953928 7826504 7944195 4932839 2248852
41902B248852K88515J478656j246931m286856l571579n23962J023788J156492
$$ 2248852 2537367 4016023 2769092 -1517764 -5089343 -5613305 -4589517 -3433025
41894c433025K196448K938128N92096k752088k291453J055307J464381j733135
$$ -3433025 -1236577 1701551 2293647 -458441 -2749894 -1694587 -230206 -1963341
41886a963341k374493J889666M868847J701325l353281m105750j656498o36716
$$ -1963341 -4337834 -2448168 2420679 4122004 768723 -3337027 -4993525 -5630241
41878e630241j068539k87013Q28873K9370q71060Q84096K990312J716574p37677
$$ -5630241 -6698780 -6985793 -6156920 -6127550 -6998610 -6114514 -3124202 -1407628 -2145305
41869b145305M50847L781461L420535o27472k337624K0760J500266j94635j147722
$$ -2145305 -1694458 2087003 5507538 4880066 2542442 2563202 4063468 3868833 2721111
41860B721111M15795K76091l326570n003854j312982K318217L63709k969655o20009
$$ 2721111 3136906 3412997 86427 -4917427 -6230409 -3912192 -3548483 -6518138 -7138147
41851g138147M952936N281259l70012l969600j429227K268189K326408P51157
$$ -7138147 -2185211 3096048 2726036 -1243564 -2672791 -404602 1921806 2672963
41843B672963O50773N99745j201328k493945j244008l0280j375656k427359K74394
$$ 2672963 3323736 3923481 2722153 228208 -1015800 -1046080 -2421736 -4849095 -4574701
41834d574701L625247J873054l645182n343647m92879M688314M121831j93567
$$ -4574701 -949454 923600 -2721582 -8065229 -8558108 -3869794 252037 58470
41826E8470k527340j521115J19827J161878K476211L468213K311324k84903j334056
$$ 58470 -2468870 -3989985 -3870158 -2708280 -232069 3236144 5547468 5262565 3928509
41817C928509k62873o4665k553293n240603m667346q06721L574726O233335O343598
$$ 3928509 3665636 3600971 1047678 -4192925 -8860271 -9666992 -6092266 141069 6484667
41808F484667L737271m21679l234142k813268r71854q19310k072831j638356R28604
$$ 6484667 10221938 9800259 6566117 3752849 2780995 1961685 -111146 -1749502 -820898
41799h20898K018567l82634k922449j802324R34124K74514l571778m857967j115453
$$ -820898 1197669 815035 -2107414 -3909738 -2975614 -2701100 -6272878 -11130845 -12246298
41790a2246298K730838K030761j06077K023337O691879O426539j98245n188039
$$ -12246298 -9515460 -7484699 -7590776 -5567439 1124440 7550979 7352734 2164695
41782B164695k467759K970779K369591l850646o843844k192524M337038N476237
$$ 2164695 -303064 2667715 5037306 1186660 -5657184 -7849708 -3512670 1963567
41774A963567J690354j445526j425257k30813N08637J382498K324097J656418
$$ 1963567 3653921 2208395 783138 552325 1060962 2443460 4767557 6423975
41766F423975q07455k465497j456286M54335N20716q68012j198051k22418l15626
$$ 6423975 5616520 3151023 1694737 2149072 2669788 1801776 603725 381307 65681
41757F5681k024558k446506J60324K863520K075197q13300j531278L35549J090936
$$ 65681 -1958877 -4405383 -4245059 -1381539 693658 -119642 -1650920 -1315371 -224435
41748b24435m99262j261113K90239Q82671j511952l188223o03805K957270K140058
$$ -224435 -723697 -1984810 -1694571 -811900 -2323852 -5512075 -6115880 -3158610 -1018552
41739a018552j611918k266036Q75713K223228o72423l336457j998245Q36156J456448
$$ -1018552 -2630470 -4896506 -4020793 -1797565 -2469988 -5806445 -7804690 -6968534 -5512086
41730e512086P27714J184401K186121J759593L76818n49596j391391k362087j553336
$$ -5512086 -4784372 -3599971 -1413850 345743 722561 172965 -1218426 -3580513 -5133849
41721e133849J595812L476235J041495k682691k340201J692133L646722O73377
$$ -5133849 -3538037 -61802 979693 -1702998 -4043199 -2351066 1295656 1969033
41713A969033l471432l957572q13225K062283J758137r45268k741018j297013
$$ 1969033 -1502399 -5459971 -6273196 -4210913 -2452776 -3398044 -6139062 -7436075
41705g436075J985604L437181J808226k74550n82020l96814j169716r66741K045087
$$ -7436075 -5450471 -2013290 -205064 -479614 -1061634 -1458448 -2628164 -3594905 -1549818
41696a549818M774857K706364k607173m674218j260330K380915J280450k366084
$$ -1549818 3225039 5931403 3324230 -1349988 -2610318 -229403 1051047 -1315037
41688a315037l050831N9297K576485J511832p64106k50129K721920L513808k97196
$$ -1315037 -4365868 -4306571 -1730086 -218254 -982360 -1232489 1489431 5003239 4706043
41679D706043m602844l691953J441865L853199N01004l435467k785195j28549
$$ 4706043 103199 -3588754 -2146889 1706310 2207314 -1228153 -4013348 -4141897
41671d141897n96879k854665j713650K403386L767789Q18812j631128p28952M35153
$$ -4141897 -4738776 -7593441 -9307091 -6903705 -3135916 -2317104 -3948232 -4677184 -4242031
41662d242031o22996j226442J144189L819706L113017L0556j801538j275983K13361
$$ -4242031 -4865027 -6091469 -4947280 -1127574 1985443 2015999 214461 -1061522 -848161
41653h48161J557698J891899l9173l738512n979818m368403l83393K852132M021190
$$ -848161 709537 2601436 2562263 -1176249 -7156067 -11524470 -11907863 -9055731 -5034541
41644e034541L431375J710635K68246O48296J927394J431280o32524p38771J946803
$$ -5034541 -1603166 107469 375715 1024011 2951405 4382685 3750161 3011390 4958193
41635D958193L276326P13235k042621j059981J094138j99001l485937l658164
$$ 4958193 8234519 8947754 6905133 5845152 6939290 6740289 3254352 -403812
41627d03812p72351O5839k493496l658451l74136L733517L856585O05258j720974
$$ -403812 -1176163 -1110324 -3603820 -7262271 -7636407 -3902890 -46305 558953 -1162021
41618a162021r63264J345209K778772K373047Q73503k57312m34938n74144j372618
$$ -1162021 -2125285 -780076 1998696 4371743 5245246 4987934 4552996 3978852 2606234
41609B606234j715944m31943J161319Q75353o62551r47617j83721j193643l755369
$$ 2606234 890290 458347 1619666 2495019 1832468 884851 701130 -492513 -4247882
41600d247882l266176K134282O746496M161431l019074n761513j023156M000122
$$ -4247882 -7514058 -5379776 1366720 5528151 2509077 -3252436 -4275592 -275470
41592b75470K386579k754579l679054J72002K148563n39009k698641j74044L307238
$$ -275470 2111109 -643470 -4322524 -4150522 -2001959 -2540968 -5239609 -5413653 -2106415
41583b106415K606232m11126p05605J044690J69574l021056l303903K33211K240218
$$ -2106415 499817 88691 -616914 427776 597350 -2423706 -5727609 -5494398 -3254180
41574c254180J32466j680156L48046K906644J927287m35097N912K183637K135500
$$ -3254180 -3121714 -4801870 -4453824 -1547180 380107 -54990 -49078 2134559 4270059
41565D270059j2908q03479M04328R79236j42700j449987k083691k308990j443181
$$ 4270059 4257151 3453672 3858000 4837236 4694536 3244549 1160858 -1148132 -2591313
41556b591313J031707K903881J461137j998840l339801j226073J521961K239565
$$ -2591313 -1559606 1344275 2805412 806572 -2533229 -3759302 -2237341 2224
41548B224J234022J31610j68467K88439O05299l18434j964916k284287r37633
$$ 2224 1236246 1367856 1199389 1487828 2093127 1774693 -190223 -2474510 -3412143
41539c412143k45879j026488n31665K503943M183587J176026k907837k360376
$$ -3412143 -3658022 -4684510 -5216175 -2712232 1471355 2647381 -260456 -2620832
41531b620832J611208K946463N03745j038084P2581P8361k749145m516250k185136
$$ -2620832 -1009624 1936839 2440584 1402500 1475081 1553442 -1195703 -5711953 -7897089
41522g897089J717488L605414L472432K467752K34271k536183k959613m11369
$$ -7897089 -6179601 -2574187 898245 3365997 3600268 1064085 -1895528 -2306897
41514b306897J446293O9272j920139j251744N86730J12869k310516l104046p06618
$$ -2306897 -860604 -791332 -2711471 -3963215 -3376485 -3263616 -5574132 -8678178 -9384796
41505i384796K748044M264517K578598j143290l852713l091765J27477K382041
$$ -9384796 -6636752 -2372235 206363 -936927 -4789640 -7881405 -7753928 -5371887
41497e371887K187483J150029N90259Q0196j01703J226651K747280J143843l166900
$$ -5371887 -3184404 -2034375 -1444116 -1363920 -1465623 -238972 2508308 3652151 485251
41488D85251n095237k209725J332706J474114M91273K115349M287129K451852
$$ 485251 -4609986 -6819711 -5487005 -4012891 -3521618 -1406269 2880860 5332712
41480E332712k304748m338922j732198J810584L036176K251739L49113k471250
$$ 5332712 3027964 -1310958 -3043156 -1232572 1803604 4055343 4404456 1933206
41472A933206m360515k753244J080674K470511k3488k177462m76182K538858K360019
$$ 1933206 -2427309 -5180553 -4099879 -1629368 -1652856 -3830318 -4306500 -1767642 592377
41463E92377n88275j884937J74124K576233K609851J565218J823065K638927J453439
$$ 592377 4102 -1880835 -1706711 869522 3479373 5044591 6867656 9506583 10960022
41454A0960022j558829l185316j861829l9709m07594j878144j631487K17762P87663
$$ 10960022 9401193 6215877 4354048 4314339 3906745 2028601 397114 614876 1402539
41445A402539j111703l265013l059532k67100L267312N004340L152334j186666
$$ 1402539 290836 -2974177 -6033709 -6300809 -3033497 1970843 5123177 3936511
41437C936511l822055j965477J558259J655115j773077l663615j292827K175442
$$ 3936511 114456 -1851021 -292762 1362353 -410724 -4074339 -5367166 -3191724
41429c191724K969509J579985K75682p13066j887653k209196r61670K13570l05051
$$ -3191724 -222215 1357770 1633452 920386 -967267 -3176463 -4138133 -3924563 -4229614
41420d229614j377043q99673J081019K777468K858816J149777j294004k274396
$$ -4229614 -5606657 -6506330 -5425311 -2647843 210973 1360750 66746 -2207650
41412b207650p46281Q28298o25303l515840l231264M78734K743780J506808N91390
$$ -2207650 -2953931 -2125633 -2750936 -6266776 -9498040 -9019306 -6275526 -4768718 -4177328
41403d177328K396099L381388N71546k881923l150970j793808j476322n06607
$$ -4177328 -1781229 1600159 2171705 -710218 -3861188 -5654996 -7131318 -7637925
41395g637925K742725M563418J533870k506675k048919Q62292M10986k705326
$$ -7637925 -4895200 -331782 1202088 -1304587 -3353506 -2491214 -2080228 -4785554
41387d785554k786711P04572K598253J116708j33607N85802J000996L52483M42056
$$ -4785554 -7572265 -6867693 -4269440 -3152732 -3286339 -2700537 -1699541 -1347058 -905002
41378i05002P96598p57507k525245o82651L175498L360399m53941k581326j182935
$$ -905002 -108404 -865911 -3391156 -4073807 -898309 2462090 2008149 -573177 -1756112
41369a756112q45002l340098l892553Q3547L889481L185287M01800m75770J21733
$$ -1756112 -2601114 -5941212 -9833765 -9750218 -5860737 -2675450 -2273650 -2749420 -2627687
41360b627687L12959L96715K32917j625118l354236n70688N318192O467746L50669
$$ -2627687 -2314728 -1918013 -1685096 -3310214 -6664450 -7235138 -1916946 4550800 4901469
41351D901469n117178l338885J312494J887252o0184N21128K058492O5907l329152
$$ 4901469 -215709 -3554594 -2242100 -354848 -415032 106096 2164588 2230495 -1098657
41342a098657k589095J280757K479981K07978j200948m48449q9385m84011j38478
$$ -1098657 -3687752 -2406995 72986 280964 -919984 -1368433 -1457818 -1941829 -2080307
41333b080307o67444m014254o173826j816097N635354P162575J548298l062798
$$ -2080307 -2747751 -6762005 -12935831 -14751928 -9116574 -1953999 -405701 -3468499
41325c468499j956980O28987Q14566J062865L298540L991038P61752k630137k612281
$$ -3468499 -5425479 -4796492 -3981926 -2919061 379479 4370517 5132269 2502132 -110149
41316a10149j415800j848381j969153J63311J675254K10824p15333K285081N321446
$$ -110149 -1525949 -3374330 -5343483 -5180172 -3504918 -3294094 -4009427 -1724346 3597100
41307C597100K900599k327313k937196J654550M381114J469718k680897l137471
$$ 3597100 6497699 4170386 1233190 2887740 7268854 8738572 6057675 2920204
41299B920204j063136l0057k72333j496N67717j1564j211614j154917R4723L67680
$$ 2920204 1857068 1827011 1554678 1553182 2120899 2109335 897721 -257196 -162473 205207
41289B05207j198218k425740q16326K823431M780257K714720j470789l967852
$$ 205207 -993011 -3418751 -4235077 -1411646 3368611 6083331 4612542 644690
41281F44690l572339k333021j886180j267522O76673K532139J853817j238179
$$ 644690 -2927649 -5260670 -7146850 -8414372 -7737699 -5205560 -3351743 -4589922
41273d589922l715528l001338K85931L117156L173737J166490k2282J185799K964148
$$ -4589922 -8305450 -11306788 -11020857 -7903701 -4729964 -3563474 -3585756 -2399957 564191
41264E64191K486802p7141j756308r28636Q47069J560636R98328m55894k576560
$$ 564191 3050993 2973852 1217544 288908 1135977 2696613 3694941 3239047 662487
41255F62487l583451p91904M649885O685494J676026n322576o118267l32557M094415
$$ 662487 -2920964 -3712868 937017 7622511 9298537 3975961 -2142306 -2474863 1619552
41246A619552J871260k980701l595307M17737L494469J941347k166493m510807
$$ 1619552 3490812 510111 -3085196 -2667459 827010 2768357 601864 -3908943
41238c908943l442120r04484K53865o30642j473063j89303K268129K883667P81411
$$ -3908943 -7351063 -8255547 -8001682 -8632324 -10105387 -10294690 -8026561 -5142894 -4361483
41229d361483j337116r55857P95435J166893k0650m51562R40060K605646K992851
$$ -4361483 -5698599 -6654456 -5859021 -4692128 -4712778 -5164340 -4224280 -1618634 1374217
41220A374217K516647K146694J573082k1628k145447l089698j783892R18438K779802
$$ 1374217 3890864 6037558 7610640 7589012 5443565 2353867 569975 1488413 4268215
41211D268215K005710j044783l861431l971326j360171J582696K547146J289932
$$ 4268215 6273925 5229142 1367711 -2603615 -3963786 -2381090 166056 1455988
41203A455988p88717k248691k397908j138574J127585L327161L949303K103172
$$ 1455988 667271 -1581420 -3979328 -5117902 -3990317 -663156 3286147 5389319
41195E389319j237095l397478k437680L06400J303010p76909l095831k528568
$$ 5389319 4152224 754746 -1682934 -1376534 -73524 -850433 -3946264 -6474832
41187f474832j13452P71543k63609m32023J079316J644823J58429m93155J503715
$$ -6474832 -6588284 -5816741 -6080350 -6512373 -5433057 -3788234 -3629805 -4122960 -2619245
41178b619245K948776O00049k718369j916090K006632K977025q32366m349595
$$ -2619245 329531 929580 -1788789 -3704879 -1698247 1278778 446412 -3903183
41170c903183l589564r03389L50885J423060M391139O588013M007537j671431
$$ -3903183 -7492747 -8396136 -8045251 -6622191 -2231052 4356961 8364498 6693067
41162F693067m643302l013609n47682r0898R6858J820874K840814L91753l544146
$$ 6693067 2049765 -963844 -1511526 -1602424 -1505566 315308 3156122 3547875 3729
41153C729m094166k07382L511852K670153j207564k786089r5169K900081K070679
$$ 3729 -4090437 -4297819 -785967 1884186 676622 -2109467 -2204636 695445 2766124
41144B766124p16412k88666L598710M875938k18052o745895p017452r88317L733238
$$ 2766124 2049712 1761046 5359756 10235694 10017642 3271747 -3745705 -4734022 -1000784
41135a000784K155698k112025k725127Q25138L337938J249528k941695m101735
$$ -1000784 1154914 -957111 -3682238 -2857100 480838 1730366 -1211329 -5313064
41127e313064p86339L244551L903407J755338N18964J330913J447295o04756k073744
$$ -5313064 -6099403 -2854852 1048555 2803893 3322857 4653770 6101065 5496309 3422565
41118C422565o24369J219664O6486k327277j833034P75509R60814j547590k098238
$$ 3422565 2798196 4017860 4084346 1757069 -75965 699544 1660358 112768 -1985470
41109a985470M92385J378662j855371m335972j698748K472043K360424q66365
$$ -1985470 -1493085 -114423 -1969794 -6305766 -8004514 -5532471 -3172047 -4038412
41101d038412j583160J065051K599880P34566k141528l615564l388144r82553
$$ -4038412 -5621572 -4556521 -1956641 -1222075 -3363603 -6979167 -10367311 -11349864
41093a1349864L734748P536092O182109O11489l465050k953569l62308J137857
$$ -11349864 -7615116 -79024 6103085 6714574 3249524 295955 -66353 1071504
41085A071504J272273M78176j237449k042956M39425M121759L708713j063906
$$ 1071504 2343777 2821953 1584504 -458452 -19027 4102732 7811445 6747539
41077F747539l867831j337565J487965m89018m009867l120357J014396K658798
$$ 6747539 2879708 1542143 3030108 2541090 -1468777 -4589134 -3574738 -915940
41069i15940J049358L38567J478195J203125j106698k203123j264415j245253
$$ -915940 133418 471985 1950180 3153305 2046607 -156516 -1420931 -2666184
41061b666184k724437k296702J064906L581858K912188J586712J568162O98155
$$ -2666184 -5390621 -7687323 -6622417 -3040559 -128371 1458341 3026503 3724658
41053C724658j972875k590795J022678L862368O76772m849895m685538J285842
$$ 3724658 1751783 -839012 183666 4046034 4722806 -127089 -4812627 -3526785
41045c526785M722741J104053m030291l585071J480310M701270L000321q41331
$$ -3526785 1195956 2300009 -1730282 -5315353 -3835043 866227 3866548 3025217
41037C025217k966177k218120L72558K985787L557577J143545k393275l567853
$$ 3025217 59040 -2159080 -1786522 1199265 4756842 5900387 3507112 -60741
41029f0741j234450J676499J681337p47765k031562p05789O39346k83919j639656
$$ -60741 -1295191 381308 2062645 1314880 -716682 -1422471 -783125 -1067044 -2706700
41020b706700m79576K165021K641160M76663r93209j43816P22428p9612p37883
$$ -2706700 -3186276 -1021255 1619905 2096568 1103359 959543 1681971 1602359 864476
41011H64476K48611R50527m05586j795161p33423J294708J422547K22592m1349
$$ 864476 1113087 2063614 1658028 -137133 -870556 424152 1846699 2069291 2027942
41002B027942k2835j624022l187934j463620K223774L082284M05454j262523M45325
$$ 2027942 2005107 381085 -2806849 -4270469 -2046695 1035589 1441043 178520 623845
40993F23845K321913J523874L3887M19712J327894N55550p44123m89287L09885
$$ 623845 2945758 4469632 4503519 4923231 6251125 6806675 6062552 5573265 5883150
40984E883150m97803k228616k712098k016911j605115j126080O51662K635521
$$ 5883150 5385347 3156731 444633 -1572278 -3177393 -4303473 -3651811 -1016290
40976a016290K411716J23732j528107j135782M7072O67234R47256J425065J761305
$$ -1016290 1395426 1519158 -8949 -1144731 -1097659 -430425 516831 1941896 3703201
40967C703201J260659m04903k842077m506123l495058m6911K768887K516683N90406
$$ 3703201 4963860 4558957 1716880 -2789243 -6284301 -6331212 -3562325 -1045642 -455236
40958d55236n273Q70841P62518j043876k282457j330335L94611P77782p7214o28956
$$ -455236 -460509 410332 1172850 128974 -2153483 -3483818 -3089207 -2311425 -2388639 -3017595
40948c017595l71461j06561l06800m27207J41601J189061J990517K116875J603409
$$ -3017595 -3389056 -3495617 -3802417 -4229624 -4088023 -2898962 -908445 1208430 2811839
40939B811839M94175j145231k503116k136361K51148K649820K584728n7174l113903
$$ 2811839 3306014 2160783 -342333 -2478694 -2227546 422274 3007002 2949828 -164075
40930a64075m620065l852539p53934L386125N194954K315874k401368l223664
$$ -164075 -4784140 -8636679 -9390613 -6004488 -809534 1506340 -895028 -4118692
40922d118692Q55056M368532L060625l82913j192795K56811J70595j956669k976036
$$ -4118692 -3263636 1104896 4165521 3782608 2589813 2846624 3017219 1060550 -1915486
40913a915486j590646P8467N43120Q74860J937621K760799K641308K449701K743090
$$ -1915486 -3506132 -3427665 -2884545 -2009685 -72064 2688735 5330043 7779744 10522834
40904A0522834K377119J70810l032373m884469m004044j774097j219270l221690
$$ 10522834 12899953 13070763 10038390 5153921 1149877 -624220 -1843490 -5065180
40896e065180m555844j837437L008152M693513K411288J170736L465838M791910
$$ -5065180 -9621024 -11458461 -8450309 -3756796 -1345508 -174772 3291066 8082976
40888H082976J190822l574211l681832k47980J472604R01565J349262K482024
$$ 8082976 9273798 5699587 2017755 1769775 3242379 4143944 5493206 7975230
40880G975230R40501k408500l180752j326116j063085k714924k119606R95555
$$ 7975230 8915731 6507231 3326479 2000363 937278 -1777646 -3897252 -2901697
40872b901697J978878J98294O71414M074706L890027k093301n975495j736871
$$ -2901697 -922819 -724525 -53111 4021595 7911622 5818321 -157174 -1894045
40864a894045M370655L187516l290738n804710k063724J607800J127067q14737
$$ -1894045 2476610 5664126 2373388 -3431322 -5495046 -3887246 -2760179 -3574916
40856c574916r40914M02453J743409K270448J037889j586830k470630K51094L089654
$$ -3574916 -4515830 -4113377 -2369968 -99520 938369 -648461 -3119091 -2867997 221657
40847B21657J714564j997439k665668J07733J840937J136255J130907K581613
$$ 221657 1936221 -61218 -2726886 -2619153 -778216 358039 1488946 4070559
40839D070559K075523j148149k715483k54256K261285Q20666k323735k747036
$$ 4070559 6146082 4997933 2282450 2028194 4289479 5110145 2786410 39374
40831C9374r31981p27377k633801l143396m64994K786503L370003J344807r20533
$$ 39374 -892607 -1619984 -4253785 -7397181 -7862175 -5075672 -1705669 -360862 -1281395
40822a281395j954205j877788p76723J628002M220943M274271P72996l114425
$$ -1281395 -3235600 -5113388 -5890111 -4262109 -41166 4233105 5006101 1891676
40814A891676l353762m45473J423991P12272K56282J577410J781563j127806l742229
$$ 1891676 -1462086 -1907559 -483568 228704 484986 2062396 3843959 2716153 -1026076
40805a026076k011742K340162M450032L202939J143222o12516k629459l636469
$$ -1026076 -3037818 -697656 3752376 6955315 8098537 7486021 4856562 1220093
40797A220093j704670J595758K729341J420517O2403j198433l794192n779904
$$ 1220093 -484577 1111181 3840522 5261039 5323442 4125009 330817 -5449087
40789e449087l314342K437171N492156L326856j74505j319156r55037n73597O53448
$$ -5449087 -8763429 -6326258 -834102 2492754 2318249 999093 44056 -529541 123907
40780A23907K548429K437546k44900k038335p88147J053385R62384J31370P8164
$$ 123907 2672336 5109882 4864982 2826647 2038500 3091885 4054269 4185639 4263803
40771D263803l94480j857447j907470N29732K367206J310700r8972Q28897J900365
$$ 4263803 3869323 2011876 104406 634138 3001344 4312044 4213072 5041969 6942334
40762F942334L1911k969147l391636j836358j575347k567968j893129R59985L459729
$$ 6942334 6974245 4005098 613462 -1222896 -2798243 -5366211 -7259340 -6299355 -2839626
40753b839626L974302K941126J064710p01765p79684O54673Q32700j272103k424427
$$ -2839626 1134676 4075802 5140512 4438747 3659063 4313736 5146436 3874333 1449906
40744A449906l30613J752807K8050l142133k811442N78355K479572J720276Q18640
$$ 1449906 1119293 2872100 2900150 -241983 -3053425 -2475070 4502 1724778 2543418
40735B543418K43255j460360k857870j400052P34019o06204l476659k167466K307611
$$ 2543418 2786673 1326313 -1531557 -2931609 -2197590 -2803794 -6280453 -8447919 -6140308
40726f140308K712976j927681l640572J296583N641463L101038j380707m70911
$$ -6140308 -3427332 -5355013 -8995585 -7699002 -2057539 1043499 -337208 -808119
40718h08119L287265K627361j895898l607927j114920P88272K44155J00449Q54925
$$ -808119 2479146 5106507 3210609 -397318 -1512238 -723966 -479811 -379362 475563
40709D75563l83630l212642l322014J09346K763495K398163J596804J671562J77762
$$ 475563 91933 -3120709 -6442723 -6333377 -3569882 -1171719 425085 2096647 2274409
40700B274409l043848l653773r4050K743349J332579m53826J692503M427288K163949
$$ 2274409 -769439 -4423212 -4517262 -1773913 -441334 -895160 797343 5224631 7388580
40691G388580k913199l687292N41239L019431K88524k878440j458574K394170
$$ 7388580 4475381 788089 1329328 4348759 4637283 1758843 300269 2694439
40683B694439L254874K08884k715582k159961J053984L350878K167563j193287
$$ 2694439 5949313 6158197 3442615 1282654 2336638 5687516 7855079 6661792
40675F661792k644042m28687J957931N08187k886318k918356N62843J817031j558105
$$ 6661792 4017750 3589063 5546994 6055181 3168863 250507 813350 2630381 1072276
40666A072276m281804j557843L276809L923136L54127k400346k313771j649418
$$ 1072276 -3209528 -4767371 -1490562 2432574 2786701 386355 -1927416 -3576834
40658c576834j416280j08338K009881K352171N35583p15171j20533M18416l75850
$$ -3576834 -4993114 -5101452 -3091571 -739400 -203817 -918988 -1039521 -621105 -996955
40649i96955j104373n90396L14444R11993J674111K149389R66979j069538j196976
$$ -996955 -2101328 -2691724 -2377280 -1465287 208824 2358213 3325192 2255654 1058678
40640A058678P33345J326722j012972l196788k119296Q10684K291731J645542
$$ 1058678 1792023 3118745 2105773 -1091015 -3210311 -2399627 -107896 1537646
40632A537646J64822j607644l187302k841279J01957L179531L676867K262548
$$ 1537646 1702468 94824 -3092478 -5933757 -5831800 -2652269 1024598 3287146
40624C287146J392635J493908J156355r8127j570139k848943l507607k570056
$$ 3287146 4679781 6173689 7330044 7231917 5661778 2812835 -694772 -3264828
40616c264828k47196J200633L74091j005247q56830k0554k70277p64549M65827
$$ -3264828 -3512024 -2311391 -1937300 -2942547 -3799377 -3819931 -4090208 -4854757 -4388930
40607d388930K626893K904458O52000j783469k185262m54795J936678K816306
$$ -4388930 -1762037 1142421 1794421 10952 -2174310 -2629105 -692427 2123879
40599B123879P07322k913920m167788j430442K220108L129032J542206k06877
$$ 2123879 2831201 -82719 -4250507 -5680949 -3460841 -331809 1210397 1003520
40591A003520j389731j989129r34146J373809J681035j039981k349412R51503
$$ 1003520 -386211 -2375340 -3309486 -1935677 -254642 -1294623 -3644035 -2692532
40583b692532M277283J804894l286266l043039K274805M400459N86252k461278
$$ -2692532 1584751 3389645 103379 -2939660 -664855 3735604 4321856 1860578
40575A860578n05638J549980o83111k983265k92281L863397K936370j994495m312558
$$ 1860578 1354940 2904920 2221809 -761456 -1053737 2809660 5746030 3751535 -561023
40566e61023j986932R41414J531729P94057K6339p23952o87281J093555L310054
$$ -561023 -2547955 -1606541 -74812 719245 745584 21632 -665649 427906 3737960
40557C737960L647861K091689L04455j252434k773311l024990r93866J497931
$$ 3737960 7385821 9477510 9781965 8529531 5756220 2731230 1737364 3235295
40549C235295J960142R33306M75014L30271r02371k057332q32975J779959K512591
$$ 3235295 5195437 6128743 6603757 6934028 6031657 3974325 3141350 4921309 7433900
40540G433900R85645j2300O34623J114635N18929J05634J47566q12057k679353
$$ 7433900 8419545 8407245 9041868 10156503 10675432 10781066 10928632 10116575 7437222
40531G437222l237391j885270o66612m79438L66156K374775K988630M60450l179233
$$ 7437222 4199831 2314561 1647949 1168511 1534667 3909442 6898072 7358522 4179289
40522D179289m969146m292726j636942K823825P044099O755358Q72549n089031
$$ 4179289 -789857 -5082583 -6719525 -3895700 3148399 9903757 10776306 5687275
40514E687275n068356m79730K030779k4721k555144k073064k94745J81481K19597
$$ 5687275 618919 139189 2169968 2145247 -409897 -2482961 -2777706 -2596225 -2376628
40505b376628J078118P65306k260220m342745q69419N615626P157086J257639
$$ -2376628 -1298510 -533204 -2793424 -7136169 -8005588 -2389962 4767124 6024763
40497F024763n125892m883900K87839L690011K870540O87445m97451p35980K99474
$$ 6024763 898871 -3985029 -3697190 -7179 2863361 3550806 3053355 2317375 2616849
40488B616849L036265M952240K556006k793558n409767k895753Q47748J820938
$$ 2616849 5653114 10605354 13161360 10367802 4958035 2062282 2910030 4730968
40480D730968R90731Q80413J039171M2578j140755j134920r51432j531274r60153
$$ 4730968 5721699 6602112 7641283 7683861 6543106 5408186 4456754 2925480 1965327
40471A965327K231058N128828L866681m68804l425678l584445l108501k583412
$$ 1965327 4196385 9325213 13191894 12723090 9297412 5712967 2604466 21054
40463B1054j36641L671951M684363R30342l696731m087409l46897K718575J664309
$$ 21054 -115587 3556364 8240727 9171069 5474338 1386929 1040032 3758607 5422916
40454E422916j894013l677824j824802J096842J382631j119603l046300k303869
$$ 5422916 3528903 -148921 -1973723 -876881 505750 -613853 -3660153 -5964022
40446e964022n81813N8173O34003K883604N299141M661163Q01942l018474m257899
$$ -5964022 -6545835 -6487662 -5853659 -2970055 2329086 6990249 7792191 4773717 515818
40437E15818l224459j379966J13770L16620q05226j680218r53628M49679R66774
$$ 515818 -2708641 -4088607 -3974837 -3658217 -4463443 -6143661 -7097289 -6647610 -5680836
40428e680836J204126K653512M392790M016814J603941k18683l28566m02093j670022
$$ -5680836 -4476710 -1823198 2569592 6586406 8190347 7971664 7643098 7241005 5570983
40419E570983k943814k710416j253938O4064L43720k51805m81602Q56044K825069
$$ 5570983 2627169 -83247 -1337185 -1273121 -929401 -1181206 -1662808 -806764 2018305
40410B018305K698224k08850k932050k991179j781444j340157o29015J429090
$$ 2018305 4716529 4507679 1575629 -1415550 -3196994 -4537151 -5166166 -3737076
40402c737076K329812J62949j521512J046206M293567K252678k648068k412640
$$ -3737076 -1407264 -1244315 -2765827 -1719621 2573946 4826624 2178556 -234084
40394b34084L052477M927295r8339m193300j396192K882296J610713k359029k256185
$$ -234084 2818393 7745688 7647349 3454049 2057857 4940153 6550866 4191837 1935652
40385A935652J029300J775155j08494O7127K599831L033415K55624k001934j864787
$$ 1935652 2964952 4740107 4631613 4698740 7298571 10331986 10587610 8585676 6720889
40376F720889j516258k153987j937968P0660K047524K365536J327806k70410j677756
$$ 6720889 5204631 3050644 1112676 1183336 3230860 5596396 6924202 6653792 4976036
40367D976036j770580o24535l78434j929728k645795n36065J689474Q48633q22931
$$ 4976036 3205456 2580921 2202487 272759 -2373036 -2909101 -1219627 -370994 -1193925
40358a193925Q62994M533290N034507J728155j061564j567017k274990l706773
$$ -1193925 -330931 4202359 9236866 10965021 9903457 8336440 6061450 2354677
40350B354677k929084L03181J971979M85325n96103R76352K186458L10841k281644
$$ 2354677 -574407 -271226 1700753 2186078 1589975 2566327 4752785 5063626 2781982
40341B781982k343793p71176L8381K98074R26873Q65656k88451k10850J954418
$$ 2781982 438189 -332987 -294606 3468 930341 1795997 1507546 1296696 3251114
40332C251114K544489j204473n403902m085018K090349O561151N654277K161347
$$ 3251114 5795603 4591130 -812772 -4897790 -2807441 3753710 9407987 11569334
40324A1569334J17675Q2146L71242k18328j877812l663444l448013j66938L694608
$$ 11569334 11687009 11769155 12140397 11922069 10044257 6380813 2932800 2765862 6460470
40315F460470M202274R23953k481672l053226j576713k08221M89488Q66379O44675
$$ 6460470 10662744 11586697 9105025 6051799 4475086 4266865 4756353 5622732 6267407
40306F267407k02630m64979O61660J919489J646727L48950j59404K62433j0793
$$ 6267407 6064777 5599798 6261458 8180947 9827674 10176624 10017220 10279653 10268860
40297A0268860j292477j492595Q47332M025709N266329M328667L227333K954071
$$ 10268860 8976383 7483788 8331120 12356829 17623158 21951825 25179158 28133229
40289B8133229K680498K250433K897239M346488L499065j761614q603769j1473995
$$ 28133229 30813727 33064160 35961399 40307887 43806952 42045338 33441569 21967574
40281B1967574q202913k195653J489815Q29832k392294m960963m817520k235491
$$ 21967574 13764661 11569008 13058823 13888655 11496361 6535398 1717878 -517613
40273e17613Q33725K554347K365428Q07256p73482n18123K099028M295854K295845
$$ -517613 316112 2870459 5235887 6043143 5269661 4751538 6850566 11146420 13442265
40264A3442265l097012n977248k704309K842391M582547K361598M75551J6324
$$ 13442265 10345253 4368005 1663696 4506087 9088634 11450232 11925783 11942107
40256A1942107j665399m257489l489733J530889N463035M027656k26935k607123
$$ 11942107 10276708 6019219 2529486 4060375 9523410 13551066 13324131 10717008
40248A0717008k838726l226375l466950j701895J139440K240900J252930K72049
$$ 10717008 7878282 4651907 1184957 -516938 622502 2863402 4116332 4388381
40240D388381J42913n3392l32979K66844J229261Q97157n12375p98219P93000
$$ 4388381 4531294 4477902 4144923 4411767 5641028 6538185 6025810 5227591 6020591
40231F020591K196876J393865r52766k559854k209222o90425M20864M74077J70716
$$ 6020591 8217467 9611332 8658566 6098712 3889490 3199065 3619929 4094006 4264722
40222D264722K00333J5911r47600j322379Q07179M312398N424961K865113o1161
$$ 4264722 4465055 4480966 3533366 2210987 3018166 7330564 12755525 15620638 15559477
40213A5559477k46246J006314J095793R66814L238790O921409P937484M793215
$$ 15559477 15313231 16319545 17415338 18382152 21620942 28542351 36479835 41273050
40205D1273050M65159j708706j419643l54989m1893j043157k448993k160679O18519
$$ 41273050 41738209 40029503 38609860 38254871 38212978 37169821 34720828 32560149 33178668
40196C3178668L638997M320179L462696L773007N442286O293577N882673N726634
$$ 33178668 36817665 41137844 44600540 48373547 53815833 60109410 65992083 71718717
40188G1718717N210509J484013n084355r293220p567545l118683j703104m314114
$$ 71718717 76929226 78413239 73328884 64035664 56468119 53349436 51646332 47332218
40180D7332218p095595p047712m739895k138916o65965j203768l408928m855343
$$ 47332218 40236623 33188911 28449016 26310100 25644135 24440367 21031439 16176096
40172A6176096l214018L36796K099637P92835r00334p53076k98338j533578k677949
$$ 16176096 12962078 13298874 15398511 16191346 15291012 14537936 14239598 12706020 10028071
40163A0028071p79987K606492K826250l70086j599543J627829L983119K85647
$$ 10028071 9248084 11854576 14680826 14310740 12711197 14339026 18322145 18607792
40155A8607792n536583n815519j282641j5472m050352n577871L43794P123169
$$ 18607792 13071209 7255690 5973049 5957577 1907225 -3670646 -3326852 3796317
40147C796317O363024K29826k899513r52552J283137J506440J894704K717799
$$ 3796317 10159341 10389167 7489654 6537102 7820239 9326679 11221383 13939182
40139A3939182J530114j039425j577141n02988j557587l837970j843854M421236
$$ 13939182 15469296 14429871 12852730 12349742 10792155 6954185 5110331 9531567
40131I531567P047583J712088n226088n988855j926721P40208P45498R73573J521083
$$ 9531567 16579150 18291238 13065150 7076295 5149574 5889782 6635280 7608853 9129936
40122I129936L28214j385933o69123J312041P16574k302574l759899k422287j013217
$$ 9129936 9458150 8072217 7403094 8715135 9431709 7129135 3369236 946949 -66268
40113f6268o06933J001296M217467N606448K875675j588834m100037l929448k594959
$$ -66268 -673201 328095 4545562 10152010 13027685 11438851 7338814 3409366 814407
40104H14407j186364M4003J075474K178023L287239L085699N10165k719137l386316
$$ 814407 -371957 -327954 747520 2925543 6212782 9298481 9808646 7089509 3703193
40095C703193j102454J005208P35841l76030Q7301J858537K919024K461415J146013
$$ 3703193 2600739 3605947 4341788 3965758 4053059 5911596 8830620 11292035 12438048
40086A2438048n66925k467235l380493j787492J795783M378982L699889J419502
$$ 12438048 11871123 9403888 6023395 4235903 6031686 10410668 14110557 15530059
40078A5530059J497019M900739P734262O179858J700626j216656j292611r75805
$$ 15530059 17027078 21927817 29662079 35841937 37542563 36325907 35033296 34057491
40070C4057491j394169j219531q88672k809389n865700n323043r70100N94493
$$ 34057491 32663322 31443791 30555119 27745730 21880030 16556987 15586887 16181380
40062A6181380l859597p645228l963226K911794M090542j41731k079033P4908
$$ 16181380 12321783 4676555 713329 3625123 7715665 7573934 5494901 5569809
40054E569809N62590k409746l493962l44061K246327J334906N67579K217342K395328
$$ 5569809 6132399 3722653 228691 -115370 2130957 3465863 4033442 6250784 8646112
40045H646112j196990l901810j735105J851216K176042N87332J68657j97315j778440
$$ 8646112 7449122 3547312 1812207 3663423 5839465 6426797 6595454 6398139 4619699
40036D619699j504576K242971M602029J749631j604911K31577L633263J530825
$$ 4619699 3115123 5358094 9960123 11709754 10104843 10336420 13969683 15500508
40028A5500508m175799n529109j481734J597970J114500M69535O13146j022218
$$ 15500508 11324709 5795600 4313866 5911836 7026336 7495871 8109017 7086799
40020G086799k795324J34917N635404N266236k160629p205427l906927J708928
$$ 7086799 4291475 4426392 10061796 15328032 13167403 5961976 2055049 3763977
40012C763977K232937l82526r06875l19592j905043l605368j922269P96461L61363
$$ 3763977 5996914 5614388 4707513 4387921 2482878 -1122490 -3044759 -2248298 -1886935
40003a886935j350149K22153L694005L905090R96393n3908J760713K318523K69540
$$ -1886935 -3237084 -3014931 679074 4584164 5580557 5526649 7287362 9605885 9875425
39994I875425q16749M73670N78407k318380m229263j520742K930380L700014M81403
$$ 9875425 9058676 9532346 10110753 7792373 3563110 2042368 4972748 8672762 9154165
39985I154165j994836o28717K651684M153309K742683K01844j383488j517113
$$ 9154165 7159329 6530612 9182296 13335605 16078288 16280132 14896644 13379531
39977A3379531r07702k48595O8291k47875p94499j91802K020977L519322J537464
$$ 13379531 12471829 12223234 12291525 12043650 11249151 11057349 13078326 16597648 18135112
39968A8135112k617419m224437j528236J477473P61378j980673k279188M90284
$$ 18135112 15517693 11293256 9765020 11242493 12003871 10023198 7744010 8234294
39960H234294L025201L379335K587372J499867k95732k100634k001738k0677J369860
$$ 8234294 11259495 14638830 17226202 18726069 18430337 16329703 14327965 14307288 15677148
39951A5677148Q87390K05434R16768J890172J245758n40523j286628k77203O71554
$$ 15677148 16564538 16769972 17686740 19576912 20822670 20282147 18995519 18718316 19389870
39942A9389870l98949k754897l275928j81343M028701M954680J958272o80690
$$ 19389870 18990921 16236024 12960096 12778753 16807454 21762134 23720406 23039716
39934B3039716L78023K729828J808629k292064m888519l121429J030313M497757
$$ 23039716 23417739 26147567 27956196 25664132 20775613 17654184 18684497 23182254
39926B3182254O698312Q156710Q211560O114299L045312J308351K077145M892428
$$ 23182254 29880566 38037276 46248836 52363135 55408447 56716798 58793943 63686371
39918F3686371Q702845J2487778J5382708J7176964J8721445K1285074K5127681
$$ 63686371 72389216 84876994 100259702 117436666 136158111 157443185 182570866
39911A82570866K8559972K8609388K3220966J3179409J764913p322354j1482245
$$ 182570866 211130838 239740226 262961192 276140601 277905514 270583160 259100915
39904B59100915r751662l475689L920534R632027J3565507J5623969J2099347
$$ 259100915 249349253 245873564 249794098 259426125 272991632 288615601 300714948
39897C00714948p55003j8966348l1881149l3630802k9189846k5929506k4018591
$$ 300714948 299959945 280993597 249112448 215481646 186291800 160362294 136343703
39890A36343703j9902471j4665804j2167340j1616721r197255n665192n134275
$$ 136343703 116441232 101775428 89608088 77991367 68794112 63128920 57994645
39883E7994645o880113n822470j597155L88087j680576l147006j678169j337697
$$ 57994645 51114532 45292062 43694907 44082994 42402418 39255412 37577243 36239546
39875C6239546m321569n937994k748455P98185j96904k614359j109902K145346
$$ 36239546 31917977 25979983 23231528 24029713 23832809 21218450 20108548 22253894
39867B2253894J205769l098100m324117r11868K048175J584290L94863N63859
$$ 22253894 23459663 20361563 16037446 15125578 17173753 18758043 19152906 19716765
39859A9716765J05791k089560l228128j319303J238541J629130Q43019J064172
$$ 19716765 19822556 17732996 14504868 13185565 14424106 16053236 16896255 17960427
39851A7960427J552260K61569k165185l057834j681301p3484P3024m64503J4739
$$ 17960427 19512687 19774256 17609071 14551237 12869936 12796452 12869476 12404973 12419712
39842A2419712J483165K000725K92724k121821k354838K27419L084474L831583
$$ 12419712 13902877 15903602 16196326 14074505 11719667 11947086 15031560 18863143
39834A8863143L039050K486586K075434M53987k105156l603646k958508j124675
$$ 18863143 21902193 24388779 26464213 26918200 24813044 21209398 18250890 17126215
39826A7126215K65047J26232j622466l443512k907434K35286K739713J810008
$$ 17126215 17391262 17517494 15895028 12451516 9544082 9779368 12519081 14329089
39818A4329089o94987q62603J159519J228199k311737n856527n579155k139527
$$ 14329089 13634102 12771499 13931018 15159217 12847480 6990953 1411798 -727729
39810g27729J389917L540356M176731K676925o36957k773473j063814K560542
$$ -727729 662188 4202544 8379275 11056200 10419243 7645770 6581956 9142498
39802I142498L369423K92516k317554p51353K624744K554025j577363m580583
$$ 9142498 12511921 12804437 10486883 9735530 12360274 14914299 13336936 8756353
39794H756353k561700J684787K727409J23432j507843K50831K278327J312554
$$ 8756353 6194653 7879440 10606849 10730281 9222438 9473269 11751596 13064150
39786A3064150r95727j375051m45658r57471k301539j485569R75093J257962r13553
$$ 13064150 12068423 10693372 10247714 9290243 6988704 5503135 6478228 7736190 6822637
39777F822637q77928L179982N965021K601963l334298m549202n99487K167214
$$ 6822637 5944709 9124691 15089712 17691675 14357377 9808175 9208688 11375902
39769A1375902P55775o71179J185695K769690k61888n021283m935866K81238L871789
$$ 11375902 12131677 11460498 12646193 15415883 15153995 10132712 5196846 5478084 9349873
39760I349873J872912j364149p2704M296024N420614J408712k720061k367882
$$ 9349873 11222785 9858636 9785932 14081956 19502570 20911282 18191221 15823339
39752A5823339N20924Q12437k489760n055254l011598K289340N968206M881653
$$ 15823339 16344263 17156700 14666940 9611686 6600088 8889428 14857634 19739287
39744A9739287M15721l309048l234040L28714M325091N641383L627070L63385
$$ 19739287 20155008 16845960 13611920 13940634 18265725 23907108 27534178 27897563
39736B7897563j547090j392620l76142L88811R20094J228137N21940j340314k696897
$$ 27897563 26350473 24957853 24581711 24970522 25890616 27118753 27640693 26300379 23603482
39727B3603482k029967l59354K33765j18813K61117J013531J07641j778863j138678
$$ 23603482 21573515 21214161 21447926 21329113 21590230 22603761 22711402 20932539 19793861
39718A9793861K496802M539935J952825j834546k306314p35490r27744k035581
$$ 19793861 22290663 26830598 28783423 26948877 24642563 23907073 22979329 20943748
39710B0943748o58046J663445L0166m814018o180290j644534L093201L181507
$$ 20943748 20285702 21949147 21979313 17165295 10985005 9340471 12433672 15615179
39702A5615179J233196J244645J545934j095554m528813m114807k01926K542361
$$ 15615179 16848375 18093020 19638954 18543400 14014587 9899780 9697854 12240215
39694A2240215K039102N01640j75405p65015k269443l955422m210877k027618
$$ 12240215 14279317 14780957 14605552 13840537 11571094 7615672 3404795 1377177
39686A377177J782350M123503K179145k548170n211530l876680j680812j152192
$$ 1377177 3159527 7283030 9462175 6914005 1702475 -2174205 -3855017 -5007209
39678e007209m44553K017319L526785J848958K5054J333301K842858K9256m646474
$$ -5007209 -5451762 -3434443 92342 1941300 1966354 3299655 6142513 6171769 1525295
39669A525295m553945P53195M750146L695049Q64323m2291R9348n27609r44773
$$ 1525295 -3028650 -2275455 2474691 6169740 7034063 6991772 7091120 6563511 5618738
39660E618738K182P80558m28168k626195l193688r24765K832790N021163L327535
$$ 5618738 5620920 6401478 5973310 3347115 153427 -771338 2061452 7082615 10410150
39651A0410150p90613k846794j032612Q74578r08948m269514m844112k990688
$$ 10410150 9619537 6772743 5740131 6614709 5705761 1436247 -3407865 -6398553
39643f398553j934123j088963K425174O694287O431991J759686j214436L12756
$$ -6398553 -8332676 -9421639 -6996465 -302178 6129813 7889499 6675063 6987819
39635F987819K403024J725123l1778j085886k606165m246129k712142K031637
$$ 6987819 9390843 11115966 11084188 9998302 7392137 3146008 433866 2465503
39627B465503M730061K448410r90271j604060r52475j358114q54749K179072M040895
$$ 2465503 7195564 9643974 8653703 7049643 6097168 4739054 3884305 6063377 10104272
39618A0104272R90645l933983m920971j712998J140953J376572N65529j0383o44282
$$ 10104272 11094917 7160934 2239963 526965 1667918 3044490 3610019 3599636 2955354
39609B955354j088068o25149K05690K58541p14031k463175m226477l555361J380069
$$ 2955354 1867286 1242137 1447827 1706368 992337 -1470838 -5697315 -9252676 -7872607
39600g872607P007186O482234p86576o501995m017525K929704O307089M406282
$$ -7872607 -865421 5616813 4830237 -1671758 -5689283 -2759579 3547510 7953792
39592G953792J388883j57181p04013m40647M20801R0367j759303k071987L48854
$$ 7953792 9342675 9185494 8481481 8040834 8461635 8552002 6792699 4720712 5069566
39583E069566J351745j766840m085894j95467O012336O358250Q71423k842086
$$ 5069566 6421311 4654471 568577 373110 6385446 12743696 13615119 10773033
39575A0773033j571562L91071R8732j94386P53854M60005j746366k736279j218784
$$ 10773033 9201471 9592542 9691274 9496888 10250742 10710747 8964381 6228102 5009318
39566E009318J57241P6187M92225J610858N61016k731819l784838m77999L004003
$$ 5009318 5166559 5242746 5734971 7345829 7906845 5175026 1390188 912189 3916192
39557C916192K191192j603687m031313l246494m04167K426673L091648R30801
$$ 3916192 6107384 4503697 472384 -2774110 -3178277 -751604 2340044 3270845
39549C270845j386529o74968J721310J585928j207141k252150O3455K161518J630189
$$ 3270845 1884316 1209348 2930658 4516586 3309445 1057295 1120750 3282268 4912457
39540D912457M07779k45142k008593m243286k822373K226541M286468O3035m126070
$$ 4912457 5320236 5075094 3066501 -1176785 -3999158 -1772617 2513851 2576886 -1549184
39531a549184j821940L308707L780561M30803k9180L049397L577160m77108l879644
$$ -1549184 -3371124 -62417 3718144 4148947 4119767 7169164 10746324 10269216 6389572
39522F389572k971844n63611K13740O73521K120039K013714j340330m244648k366014
$$ 6389572 3417728 2854117 3067857 3741378 5861417 7875131 6534801 2290153 -75861
39513g5861K318690L885978P75029k562620k557981j072014j321192k433505j317041
$$ -75861 2242829 6128807 6903836 4341216 1783235 711221 -609971 -3043476 -4360517
39504d360517J535374K135659n95158k410436j3037L454692K924411p08562k050811
$$ -4360517 -2825143 -689484 -1284642 -3695078 -3708115 -253423 2670988 1962426 -88385
39495h8385P0810Q69903k143678m471287j382728M563590O845812L522475j441272
$$ -88385 -17575 852328 -1291350 -5762637 -7145365 -2581775 4264037 7786512 6345240
39486F345240m035126l791101k145522m47816K74473j41537n24630J24860J152801
$$ 6345240 2310114 -1480987 -3626509 -4074325 -3799852 -3941389 -4466019 -4341159 -3188358
39477c188358J574902J797969K343060K138901K97099j487696r14923J157968
$$ -3188358 -1613456 184513 2527573 4666474 4963573 3475877 2560954 3718922
39469C718922J679915N9613q87260P31132K941885K557734o23189l508696l097326
$$ 3718922 5398837 5458450 4571190 5302322 8244207 10801941 10178752 6670056 3572730
39460C572730M49551L864676L771329o6783m484134o015528l963320m01927K012369
$$ 3572730 4022281 7886957 11658286 11591503 7107369 1091841 -2871479 -3273406 -1261037
39451a261037J877078l07494k495005k640026n39571K111438L521875L090538
$$ -1261037 616041 308547 -2186458 -4826484 -5366055 -3254617 267258 3357796
39443C357796J302683l93081J8201K911006N191995L074210k630195o391209m404371
$$ 3357796 4660479 4267398 4285599 7196605 12388600 15462810 12832615 6441406 2037035
39434B037035Q80601M084641K947768m00977k582121j858086Q60900K774076K044089
$$ 2037035 2917636 7002277 9950045 9549068 6966947 5108861 5969761 8743837 10787926
39425A0787926K13336N9792J247910J045585n57573n30083J442322J690419q01771
$$ 10787926 11001262 11061054 12308964 13354549 12796976 12266893 13709215 15399634 14597863
39416A4597863j651021J517795L924459P70940m743496o264653l615058j068869
$$ 14597863 12946842 14464637 18389096 19160036 14416540 8151887 4536829 3467960
39408C467960N08081K641552K976294j566601o588264m420661K965433M912816
$$ 3467960 3976041 6617593 9593887 8027286 1439022 -2981639 -16206 4896610
39400D896610j654097o632029k139683N449099N941895N73834k008649j23808
$$ 4896610 3242513 -3389516 -5529199 -80100 5861795 6435629 4426980 4303172
39392D303172N10652j330351j89776N205586P774200K557526n109342o896885
$$ 4303172 4813824 3483473 3293697 8499283 16273483 18831009 13721667 6824782
39384F824782k821764J03291j470872l413290j361010K769944M043976J745482
$$ 6824782 4003018 4106309 2635437 -777853 -2138863 631081 4675057 6420539
39376F420539r4954R38049K156416K67393l119457l542054l66535K039528M84925
$$ 6420539 6325585 7263634 9420050 9687443 6567986 3025932 2659397 4698925 5183850
39367E183850k722492l338430q33421J735853K152638J077273K31102M48834J466241
$$ 5183850 2461358 -877072 -1710493 25360 2177998 3255271 3486373 3935207 5401448
39358E401448K355708K226630J252992N62102M98342l7656j587425k696437j988627
$$ 5401448 7757156 9983786 11236778 11798880 12297222 12259566 10672141 7975704 5987077
39349E987077o19644o23525j418986m49715K426790L705390P83636l968118n699378
$$ 5987077 5367433 4743908 3324922 2875207 5301997 9007387 9791023 5822905 123527
39340A23527l019717N70656J442491J26862m02395O73811J381603O26827j62547
$$ 123527 -2896190 -2325534 -883043 -756181 -1158576 -484765 896838 1523665 1361118
39331A361118n7663p06719l140534m530035j556253L784488N666862K293097j505290
$$ 1361118 1303455 596736 -2543798 -7073833 -8630086 -4845598 821264 3114361 1609071
39322A609071j190801J334912J276647j821030l889386k347432J001532L094701
$$ 1609071 418270 1753182 3029829 1208799 -2680587 -5028019 -4026487 -931786
39314i31786K981219J543709j43179j344493j720740j420266n70456J064265L065784
$$ -931786 2049433 3593142 3449963 2105470 384730 -1035536 -1605992 -541727 2524057
39305B524057L658511J599684j470090k436662q01315N13606n98152k077810m57263
$$ 2524057 6182568 7782252 6312162 3875500 3074185 3587791 2989639 911829 454566
39296D54566L769181N860576K688894k857790n137575k681342M90698Q01232l60906
$$ 454566 4223747 10084323 12773217 9915427 4777852 2096510 2587208 3388440 3027534
39287C027534J32941J783922J626799l88635j166966J65073O90963j152214k637424
$$ 3027534 3160475 4944397 6571196 6182561 5015595 5180668 5871631 4719417 2081993
39278B081993j242099J178144J625585O46086M42833O14508m13813j506167o08196
$$ 2081993 839894 2018038 3643623 4289709 4732542 5347050 4933237 3427070 2818874
39269B818874P84840m12736k963305k380813J605079L826195J561935j273051
$$ 2818874 3603714 3190978 227673 -2153140 -548061 3278134 4840069 3567018
39261C567018o35308J307769L54785k426211k472010O92183K591658P12385j984157
$$ 3567018 2931710 4239479 4594264 2168053 -303957 388226 2979884 3692269 1708112
39252A708112j877952K09162J013604J2276j00981K164449M446200L354953j054376
$$ 1708112 -169840 39322 1052926 1065202 964221 3128670 7574870 10929823 9875447
39243I875447n042342n471965l111070r44022k34813K70742J582254K673200K057683
$$ 9875447 4833105 -638860 -3749930 -4693952 -4928765 -4658023 -3075769 -402569 1655114
39234A655114R642j626103j350737O81681K851004L365027J793056n99890k275423
$$ 1655114 1664756 38653 -1312084 -630403 2220601 5585628 7378684 6778794 4503371
39225D503371k781813k324975r39570Q77684J696299Q80770r008O30368J720983
$$ 4503371 1721558 -603417 -1542987 -665303 1030996 1911766 1902758 2533126 4254109
39216D254109J204894l25497o49907j15697j131948l179779k565265J356736L923490
$$ 4254109 5459003 5133506 4483599 4367902 3235954 56175 -2509090 -1152354 2771136
39207B771136J825671j606669j403371J522302K171081o96566k972758j501394
$$ 2771136 4596807 2990138 1586767 3109069 5280150 4583584 1610826 109432
39199A09432J703734K625592L86880k017082j403177J661136K993829p2887m286819
$$ 109432 1813166 4438758 4825638 2808556 1405379 3066515 6060344 5987457 1700638
39190A700638l991121P06000L376186O42340k639271j210152K143746J525940
$$ 1700638 -2290483 -1584483 1791703 2434043 -205228 -1415380 728366 2254306
39182B254306k169198l180477p43371N46970k44080R92370M595074M955097J46052
$$ 2254306 85108 -3095369 -3838740 -3291770 -3535850 -2543480 2051594 7006691 7152743
39173G152743l588823j390682K493923J961216j331109j995977m56020j171539
$$ 7152743 3563920 2173238 4667161 6628377 5297268 3301291 2845271 1673732
39165A673732l691908l039702J336063L923832J634486j800134j832379J028701
$$ 1673732 -2018176 -5057878 -3721815 202017 1836503 36369 -1796010 -767309
39157g67309L395127L370859R57347k497680l688340N4388N596651N626856j473329
$$ -767309 2627818 5998677 6956024 4458344 770004 824392 6421043 12047899 10574570
39148A0574570p509411m765683K961610N609529J135380k707208j068359J433704
$$ 10574570 3065159 -1700524 1261086 6870615 8005995 5298787 4230428 5664132
39140E664132r2262k302647o9723L893368L253590j198340l061723j285396j081658
$$ 5664132 5571870 3269223 3199500 7092868 10346458 9148118 6086395 4800999 3719341
39131C719341l414379k624475K663756N153954O03132l951702r91231M782173
$$ 3719341 304962 -2319513 344243 5498197 6101329 2149627 1158396 5940569
39123E940569L560889l834932p282416k921044K296242K294530n37595j584502
$$ 5940569 9501458 5666526 -1615890 -4536934 -2240692 53838 -483757 -2068259
39115b068259n94037P14289J864602K042176K14501j617624l13058K403479J709994
$$ -2068259 -2662296 -1948007 -83405 1958771 2173272 555648 242590 2646069 4356063
39106D356063j732898k054379J382297J912902k899844o070665k494716K385679
$$ 4356063 2623165 568786 1951083 3863985 964141 -5106524 -7601240 -5215561
39098e215561J679656j967739k012960Q52506J414752j60288N44149L502619M305848
$$ -5215561 -3535905 -5503644 -7516604 -6664098 -5249346 -5409634 -4865485 -1362866 2942982
39089B942982J675925j428320l038183l113011j064618K427385L448249P0088
$$ 2942982 4618907 3190587 152404 -2960607 -4025225 -1597840 1850409 1920497
39081A920497l205744j896881R14931N2254k363668r46416K601963K337360p07090
$$ 1920497 -1285247 -3182128 -2267197 -2214943 -4578611 -5525027 -2923064 -585704 -1292794
39072a292794q8079L919693M092409r98943m155170j613891J579562J224529j8696
$$ -1292794 -1380873 2538820 6631229 5632286 1477116 -136775 1442787 2667316 2648620
39063B648620J66059q30370l655709l682881N56565L237900P95725j724344K69683
$$ 2648620 2814679 1984309 -1671400 -5354281 -4797716 -1559816 -764091 -2488435 -2218752
39054b218752K613210J10235l723893k641521J460940K105417o15326r21091K323840
$$ -2218752 394458 504693 -3219200 -5860721 -4399781 -2294364 -2909690 -3830781 -1506941
39045a506941M166886K193647m21812j147566j373131k181310j884026L22361
$$ -1506941 2659945 4853592 4431780 3284214 1911083 -270227 -2154253 -1831892
39037a831892K013353R82215j350881j836203L19531K733080K880236J158166
$$ -1831892 181461 1163676 -187205 -2023408 -1703877 1029203 3909439 5067605
39029E067605O3515J67957j078301m567681n993321j413041N075781N281025j103537
$$ 5067605 5131120 5299077 4220776 -346905 -6340226 -7753267 -2677486 2603539 1500002
39020A500002n194716j693407L842915M197178N36631j873486k373066k994826
$$ 1500002 -3694714 -5388121 -1545206 2651972 3188603 1315117 -1057949 -4052775
39012d052775k261333J980151O308065N378986M11222k378729j035769M02584
$$ -4052775 -6314108 -4333957 1974108 7353094 7764316 5385587 4349818 4752402
39004D752402q04635k676152k840207j544270L24299K259346K727788L42766l124652
$$ 4752402 3947767 1271615 -1568592 -3112862 -2788563 -529217 2198571 2541337 -583315
38995e83315m021922j380116K308060M485078M265563J802699j253743j866724
$$ -583315 -4605237 -5985353 -3677293 807785 5073348 6876047 5622304 3755580
38987C755580P30462K810311R26755k612405k977902j79402J339530k25336k110076
$$ 3755580 4486042 7296353 8223108 5610703 2632801 2453399 3792929 3567593 1457517
38978A457517k208847j686742j606949r75932O06270J579814R78238j16895n52752
$$ 1457517 -751330 -2438072 -4045021 -5020953 -4414683 -2834869 -1856631 -1973526 -2526278
38969b526278m73504k21584K91809R02011J361634J881453K197420J139282j292187
$$ -2526278 -2999782 -3221366 -2929557 -2027546 -665912 1215541 3412961 4552243 3260056
38960C260056k884786k132269m94907K40349O95992J675325J793197K49465p43928
$$ 3260056 375270 -1756999 -2251906 -2011557 -1315565 359760 2152957 2402422 1658494
38951A658494L38908J078411o51229k273618q07778J554761J315307R810P83438
$$ 1658494 1997402 3075813 2424584 150966 -656812 897949 2213256 2223066 3006504
38942C006504J627569j056500m607927l561003P47481K258384P27037J222580
$$ 3006504 4634073 3577573 -1030354 -4591357 -3843876 -1585492 -858455 364125
38934C64125L545687K151861k364228k406301L070563M862705j581334p575375
$$ 364125 3909812 6061673 3697445 1291144 4361707 9224412 7643078 67703
38926F7703m569142K430811L387488j354569l564761p39739K140897K278541J884542
$$ 67703 -4501439 -2070628 1316860 -37709 -3602470 -4342209 -2201312 77229 1961771
38917A961771J965893P10046j564050j990386l89794K04990j092805j751745o49527
$$ 1961771 3927664 4637710 3073660 1083274 693480 898470 -194335 -1946080 -2595607
38908b595607J31030n23874n98406J376838L417361K805008l3856k055468j283566
$$ -2595607 -2464577 -2988451 -3586857 -2210019 1207342 4012350 3978494 1923026 639460
38899F39460J062079K074978N12782j776159k309727j143239p6962N84237J873804
$$ 639460 1701539 3776517 4289299 2513140 203413 -939826 -1016788 -432551 1441253
38890A441253L005012J859001p73732j396041L69878N19218k428585l926843n61099
$$ 1441253 4446265 6305266 5531534 4135493 4505371 5024589 2596004 -1330839 -1891938
38881a891938L605543K956157q06886j825312R7817k00275l641732m829306j081502
$$ -1891938 1713605 4669762 3862876 2037564 2135381 1935106 -1706626 -6535932 -7617434
38872g617434K955889K822854R99404J879183M040009K886711j070664k315070
$$ -7617434 -4661545 -1838691 -839287 1039896 5079905 7966616 6895952 4580882
38864D580882J101497M142864K046243k720154m140078j261131R60882o76814
$$ 4580882 5682379 9825243 11871486 9151332 5011254 3750123 4711005 4034191
38856D034191l187630k456742M31831J196998r79239k622580j622433K7616K10462
$$ 4034191 846561 -1610181 -1178350 18648 -960591 -3583171 -5205604 -5177988 -4967526
38847d967526R6566J404987K664013J166374k327723l764942j037701L105297
$$ -4967526 -4870960 -3465973 -801960 364414 -1963309 -5728251 -6765952 -3660655
38839c660655M529985K814376J161083J423057J390106j416631m890375m494146
$$ -3660655 869330 3683706 4844789 6267846 7657952 6241321 1350946 -3143200
38831c143200k09292K579895P72815j839778q48277J577783O86745k303394k003789
$$ -3143200 -3352492 -772597 218 -1839560 -2687837 -1110054 -423309 -2726703 -4730492
38822d730492J680886K862385n17950l019182o32238K740627J961859j166521
$$ -4730492 -3049606 -187221 -705171 -3724353 -4356591 -1615964 345895 -820626
38814h20626j639052M21047R58186n36034o46713J301073J682287j235310l929821
$$ -820626 -2459678 -2038631 -1080445 -1616479 -2263192 -962119 720168 -515142 -4444963
38805d444963k586729J462776L667906K120019o79099j489721n5154J364989J222782
$$ -4444963 -7031692 -5568916 -1901010 219009 -460090 -1949811 -2004965 -639976 582806
38796E82806K89637l6689J91908O9151l34482j94731L66154L28929n24850j349653
$$ 582806 872443 835754 1027662 1096813 762331 567600 933754 1262683 737833 -611820
38786f11820j614740j416580o19565Q45693K061972K062595J413162J278694J395877
$$ -611820 -2226560 -3643140 -4262705 -3417012 -1355040 707555 2120717 3399411 4795288
38777D795288P63484k56280n69225m28505o86428q11936j57890j21388j908842
$$ 4795288 5558772 5302492 4733267 4304762 3618334 2806398 2648508 2527120 618278
38768F18278l186160q48994L349108M197624K78185m246134n522240l744108o44276
$$ 618278 -2567882 -3416876 -67768 4129856 4408041 161907 -5360333 -9104441 -9748717
38759i748717K513868L838258K061103l26835M04536K928245K108842k443088
$$ -9748717 -7234849 -3396591 -1335488 -1662323 -1257787 1670458 3779300 1336212
38751A336212m783487j690830K366127K427018J19098k32981J625502K968189
$$ 1336212 -3447275 -5138105 -2771978 -344960 -225862 -458843 1166659 4134848
38743D134848K784813J968896J328492J745354L523792M126428M19221n366851
$$ 4134848 6919661 8888557 10217049 11962403 15486195 19612623 20031844 14664993
38735A4664993o771280k297166J851187R74729j793002j878578k87872J68514
$$ 14664993 7893713 5596547 7447734 8422463 6629461 4750883 4463011 4631525
38727D631525L19794J280376N10379l329528n870823l027136K117175L771272
$$ 4631525 4951319 6231695 6742074 3412546 -2458277 -5485413 -3368238 403034
38719D03034J475635j265582k837666l071695p23394L475652N043311K115068
$$ 403034 1878669 613087 -2224579 -5296274 -6019668 -2544016 2499295 4614363
38711D614363n88676N94432J646997j766409n506532l388911J899846L018291
$$ 4614363 4025687 4620119 6267116 4500707 -1005825 -4394736 -2494890 523401
38703E23401p6577j346474L82967O92575j447032k518182j651357j120555m04420
$$ 523401 446824 -899650 -516683 175892 -1271140 -3789322 -5440679 -6561234 -6965654
38694f965654K551533N083035K792184j975480k746663O05124K275226Q39586
$$ -6965654 -4414121 668914 3461098 1485618 -1261045 -655921 1619305 2458891
38686B458891L95109J611162Q44185j439557p89092J852321O90884l583246l384060
$$ 2458891 2854000 4465162 5309347 3869790 3080698 4933019 5623903 2040657 -1343403
38677a343403K323778M864265J80388m111828j607776K585705J490120k077151
$$ -1343403 980375 5844640 6025028 1913200 305424 2891129 4381249 2304098
38669B304098j634108J508857J445496j852583l164019p50589K021000K385439
$$ 2304098 669990 2178847 3624343 1771760 -1392259 -2142848 -121848 2263591
38661B263591O88146j490389k314235o32077J649953R00635k505314l606600l61671
$$ 2263591 2951737 1461348 -852887 -1484964 164989 1065624 -1439690 -5046290 -5407961
38652e407961K768417J829559o53621n22655J446216K024658R47210k50205j553026
$$ -5407961 -2639544 -809985 -1463606 -1986261 -540045 1484613 2431823 2181618 628592
38643F28592k890706k486356k32185Q19625l11979L9515L675567O019119L057730
$$ 628592 -2262114 -4748470 -4980655 -4161030 -4473009 -4433494 -757927 5261192 8318922
38634H318922j466145j739197P38205J77992l378269m195026n33240K662458J816583
$$ 8318922 6852777 5113580 5851785 6029777 2651508 -1543518 -2076758 585700 2402283
38625B402283l64939k39022J029525J64405k502886l361834q51483K215832K409420
$$ 2402283 2037344 1798322 2827847 2992252 489366 -2872468 -3723951 -1508119 901301
38616I01301Q6690j650655j588036j292330j108657J018352M730711N362245P27469
$$ 901301 987991 -662664 -2250700 -3543030 -4651687 -3633335 1097376 6459621 7187090
38607G187090l926077l067879K90244l53907l745893l021667K048298M262310
$$ 7187090 3261013 193134 483378 129471 -3616422 -6638089 -4589791 -327481
38599c27481J082206j816614j014892j57661j403762j202588J536074J946593
$$ -327481 754725 -1061889 -2076781 -2234442 -3638204 -4840792 -3304718 -1358125
38591a358125j505005k864167R93223M362820K728535K65126J021752J301116
$$ -1358125 -2863130 -5727297 -4734074 -371254 2357281 2622407 3644159 4945275
38583D945275j916414l648589l28738J953959k002534n976593k868223K121476
$$ 4945275 3028861 -619728 -948466 1005493 -997041 -6973634 -9841857 -7720381
38575g720381Q33301k563439O92114O771780M997331k915916n151089J88287L108404
$$ -7720381 -6887080 -9450519 -8758405 -1986625 3010706 94790 -5056299 -4868012 -1759608
38566a759608N1187j445519J499904J936243k414623l778457J184831M669415
$$ -1759608 -1708421 -3153940 -1654036 282207 -2132416 -5910873 -4726042 -56627
38558e6627J748198j200115Q12560J989068k503634o001407j391883N925222O381830
$$ -56627 1691571 491456 1304016 3293084 789450 -5211957 -6603840 -678618 5703212
38549E703212Q55971k895413k855786k223787r42292K693828N448889L208397
$$ 5703212 6559183 3663770 807984 -1415803 -2358095 335733 5784622 8993019
38541H993019j042491j610794J87287r44644m034059l617252k09451L64723k181146
$$ 8993019 7950528 6339734 6527021 5582377 1548318 -2068934 -2278385 -1913662 -4094808
38532d094808j817228K603523M522484Q33846k466042j39000L724883K596424
$$ -4094808 -5912036 -3308513 1213971 2047817 -418225 -557225 3167658 5764082
38524E764082k057887l458393J71634L884718L646271O39418k340168m526493
$$ 5764082 3706195 247802 419436 4304154 7950425 8589843 6249675 1723182
38516A723182n758872m621160n49816L685394M280911J173248j615289j087342
$$ 1723182 -4035690 -8656850 -9206666 -5521272 -1240361 -67113 -1682402 -2769744
38508b769744J165845J839537N64693n68938q36631j172133j171257N83432K794579
$$ -2769744 -1603899 235638 800331 231393 -605238 -1777371 -2948628 -2365196 429383
38499D29383J950011j974864m130484j573390K046346J955863n30609o38090J905016
$$ 429383 2379394 404530 -3725954 -5299344 -3252998 -1297135 -1827744 -2465834 -560818
38490e60818K570834n06136l497552k541548J148404L574603K842329J27455k303132
$$ -560818 2010016 1503880 -1993672 -4535220 -3386816 187787 3030116 3157571 854439
38481H54439k519721M8305L482230M368642J331320l073547m993818l255585J6121
$$ 854439 -1665282 -1616977 1865253 6233895 7565215 4491668 -502150 -3757735 -3741614
38472c741614K027446J693082p6128j497104j401601j59409Q79329R68586O19056
$$ -3741614 -1714168 -21086 -97214 -1594318 -2995919 -3155328 -2275999 -1307413 -688357
38463f88357N53421P00072O75626N80275N53424Q7002j138521j983718q28592
$$ -688357 -134936 565136 1240762 1821037 2374461 2461463 1322942 -660776 -1489368
38454a489368J803529L054368J299455j190989r48571J767767K970218M11667
$$ -1489368 314161 3368529 4667984 3476995 2528424 4296191 7266409 7678076
38446G678076l134279l608917j038496J082078R38722K62733P91913J424360L33991
$$ 7678076 4543797 934880 -103616 978462 1917184 2179917 2971830 4396190 4730181
38437D730181j699673k022766K16555K653585K340578q92827m084884m056000
$$ 4730181 3030508 1007742 1224297 3877882 6218460 5325633 1240749 -2815251
38429b815251o89751K751642K930203N8165k399990j910301J15237M19276j544985
$$ -2815251 -3505002 -753360 2176843 2235008 -164982 -2075283 -1960046 -1540770 -3085755
38420c085755k755609p81640K696677L973418K130749k00826r03860q91770j503336
$$ -3085755 -5841364 -6623004 -3926327 47091 2177840 1977014 1073154 181384 -1321952
38411a321952j623795K80720K644725K353067l82018j712503M75490L436895L229658
$$ -1321952 -2945747 -2665027 -20302 2332765 1950747 238244 713734 4150629 7380287
38402G380287l44198l960867m653851k232663J107547K618567J386987o03363
$$ 7380287 7036089 3075222 -1578629 -3811292 -2703745 -85178 1301809 698446
38394F98446r52110k67349r26065k414888j363692K558858M697447K056627j597412
$$ 698446 -253664 -521013 -1447078 -3861966 -5225658 -2666800 2030647 4087274 2489862
38385B489862j094107K392239L544662J159834q53981l15267L38632j148645l233886
$$ 2489862 1395755 3787994 7332656 8492490 7638509 7323242 7661874 6513229 3279343
38376C279343l267192r76734J879879L209969J605704k060391m245982k593177
$$ 3279343 12151 -964583 915296 4125265 5730969 3670578 -575404 -3168581
38368c168581M16138R74471J55713J815969M625896K606869m604836q699305l954633
$$ -3168581 -2752443 -1777972 -1622259 193710 4819606 7426475 2821639 -5877666 -9832299
38359i832299M026842O259393K663736j8036M98362L32774j953834k580913L76966
$$ -9832299 -5805457 453936 3117672 3099636 3597998 3930772 1976938 -603975 -227009
38350b27009L426763L410856J700710K42208j766179m317792m341715p98244K038746
$$ -227009 3199754 6610610 8311320 8553528 6787349 2469557 -1872158 -2670402 -631656
38341f31656Q64851p98552J476379M463094J816215m407452n264465J005086N145949
$$ -631656 233195 -565357 911022 5374116 7190331 2782879 -2481586 -1476500 3669449
38332C669449R34826m922917l407827K596388L405780j771742m199671k33615
$$ 3669449 4604275 -318642 -3726469 -1130081 2275699 503957 -3695714 -3929329
38324c929329L305557R59823k847840k032672J202936J023182k019509k575714
$$ -3929329 -623772 336051 -2511789 -4544461 -3341525 -2318343 -4337852 -6913566
38316f913566L34585K487267J993037J446891K019732J033930k677296n481926
$$ -6913566 -6578981 -4091714 -2098677 -651786 1367946 2401876 -275420 -5757346
38308e757346l854483L41533K416485J084678n59854K67713K666793L822347K664571
$$ -5757346 -9611829 -9270296 -6853811 -5769133 -6328987 -6061274 -3394481 427866 3092437
38299C092437N96549r31602j978660k581019j403455J924536M210814J829205
$$ 3092437 3688986 2757384 778724 -1802295 -3205750 -1281214 2929600 4758805
38291D758805l325914m885576n60208M230625M011701Q00297j09221J187578L69551
$$ 4758805 1432891 -3452685 -4012893 217732 4229433 5029730 4920509 6108087 6477638
38282F477638k732720l293289K25236K807896M53116l573565l670959q5431J903752
$$ 6477638 3744918 451629 676865 3484761 3937877 364312 -3306647 -3392078 -1488326
38273a488326l03823l523008l651945q19997J588626J515259K17467p4576Q88153
$$ -1488326 -1792149 -5315157 -8967102 -9787099 -8198473 -6683214 -6465747 -6540323 -5652170
38264e652170J569640J139153M72775N21843Q99428P51801J85511O6088Q34239
$$ -5652170 -4082530 -2943377 -2470602 -1948759 -1049331 -297530 -112019 -45931 788308
38255G88308J928355K109959O34266j294590j179403J232318K441490j19206l276185
$$ 788308 2716663 4826622 5460888 4166298 2986895 4219213 6660703 6541497 3265312
38246C265312k201855J340202O32279n024858p613830k112161N298508O093724
$$ 3265312 1063457 2403659 3035938 -1988920 -9602750 -11714911 -6416403 -322679
38238c22679J427702j312273k25330L75321j085849j532694l341O72022m01204
$$ -322679 1105023 -207250 -432580 -57259 -1143108 -2675802 -2679143 -2007121 -2408325
38229b408325q85743l60321q88619j664444P06172N100650N416349j54471n196819
$$ -2408325 -3294068 -3654389 -4543008 -6207452 -5501280 -400630 5015719 4861248 -335571
38220c35571l993496N25791J945777l65958j807940k2718K629376L313134K080352
$$ -335571 -4329067 -3803276 -1857499 -2223457 -4031397 -4054115 -1424739 1888395 3968747
38211C968747Q01170N76508N82804p83925l289356m132114j366557K754033M193930
$$ 3968747 4769917 5346425 5929229 5145304 1855948 -2276166 -3642723 -888690 3305240
38202C305240K345762J36165o25032r23226j724291k628336l347667l613268k062421
$$ 3305240 5651002 5787167 5162135 4238909 2514618 -113718 -3461385 -7074653 -9137074
38193i137074J547123L939353K205395q66323l61437K488877J738531l127454
$$ -9137074 -7589951 -3650598 -1445203 -2311526 -2672963 -184086 1554445 -1573009
38185a573009n287263r55269M657678N059824R05487k860839l795235k344408
$$ -1573009 -6860272 -7815541 -3157863 1901961 2807448 -53391 -3848626 -6193034
38177f193034N71052K918244K022554j289892k512641l0662K163540J118405k98511
$$ -6193034 -5621982 -2703738 -681184 -1971076 -4483717 -4514379 -2350839 -1232434 -1530945
38168a530945J089280K966993J769013r95962j509944J16508J021715P24362P78445
$$ -1530945 -441665 2525328 4294341 3298379 1788435 1904943 2926658 3651020 4429465
38159D429465J192074R63665M01191k06130j926132m268653l947399M3724L377553
$$ 4429465 5621539 6585204 6986395 6780265 4854133 585480 -3361919 -3318195 59358
38150E9358K325658n73485j178373o17399k063088l538213m62367N844890Q549995
$$ 59358 2385016 1811531 633158 15759 -2047329 -5585542 -6047909 -203019 8346976
38141H346976M507148j959726n119567l692546j85356K246254J855854k68814
$$ 8346976 12854124 10894398 5774831 2082285 1896929 4143183 5999037 5730223
38133E730223j031033N99510J797215L20781j663638j280361J81929K7225p65220
$$ 5730223 4699190 5298700 7095915 7416696 5753058 4472697 4654626 4681851 3916631
38124C916631J07850J103350n68161k837393j280101L021057M303723R96451k234171
$$ 3916631 4024481 5127831 4559670 1722277 442176 3463233 7766956 8763407 6529236
38115F529236k136623p12162N8919J457436L481866K544160k515759o428581m086295
$$ 6529236 4392613 3680451 3739370 5196806 8678672 11222832 8707073 2278492 -1807803
38106a807803J663591L620107L16796k305607J87835M343635L852939j423983
$$ -1807803 -144212 3475895 3792691 1487084 1674919 6018554 9871493 8447510
38098H447510n129008l112269J142756J937479o07153j788009j71600P54643q52399
$$ 8447510 3318502 206233 1348989 3286468 2679315 891306 719706 1474349 621950
38089F21950k124437q81056O15273J46714m38591Q72930K163171J238043j56502
$$ 621950 -1502487 -2383543 -1768270 -1621556 -2060147 -1187217 975954 2213997 2057495
38080B057495P8580J32028j682687k234877J257537M455033J361949n109527n760229
$$ 2057495 2136075 2268103 585416 -1649461 -391924 4063109 5425058 315531 -5444698
38071e444698J433393P756929N633635j908631o509421m760746j38037K387705
$$ -5444698 -4011305 3745624 9379259 7470628 961207 -3799539 -3937576 -1549871
38063a549871R35839k479001m027768j814188K066830M094998L300099J343987
$$ -1549871 -614032 -3093033 -7120801 -8934989 -6868159 -2773161 526938 1870925
38055A870925j53594n60381J21945O89422m51385k168911j027782K910910M364760
$$ 1870925 1717331 1156950 1278895 1968317 1516932 -651979 -1679761 1231149 5595909
38046E595909L49955m485933m571679j536808j27150Q6823K110018L989680J846856
$$ 5595909 5945864 1459931 -3111748 -4648556 -4775706 -4688883 -2578865 1410815 3257671
38037C257671j840488j447066J735137J416072k528633m048266j894611p96856
$$ 3257671 1417183 -29883 1705254 3121326 592693 -3455573 -5350184 -6147040
38029f147040j098902K092010P465926O551879j823242p088632k667198L912892
$$ -6147040 -7245942 -5153932 2311994 8863873 7040631 -48001 -2715199 1197693
38021A197693L523100j271135l426464l385865m522338l973713J476743O030421
$$ 1197693 4720793 3449658 23194 -3362671 -7885009 -11858722 -10381979 -4351558
38013d351558K536253m398956m349671K244634M996174O24576k667365L14439
$$ -4351558 -1815305 -6214261 -10563932 -8319298 -3323124 -2698548 -5365913 -5051474
38005e051474L900037K354420p50398J54765K911713J960287k037520l553361
$$ -5051474 -1151437 1202983 452585 607350 3519063 5479350 3441830 -111531
37997a11531j026818J488073J083881l03215J39467J727076J660986p49680l090442
$$ -111531 -1138349 349724 1433605 1130390 1269857 2996933 4657919 3908239 817797
37988H17797l009835j033263O80253J506918K507966L567839K865121J96426j677354
$$ 817797 -2192038 -3225301 -2545048 -1038130 1469836 5037675 7902796 8099222 6421868
37979F421868r38819K39180q28454k657083j741477J657901L594021K239078N1113
$$ 6421868 5483049 5722229 4893775 2236692 495215 2153116 5747137 7986215 8037328
37970H037328n42058l22229p40312j039104p2825Q89671l50815l362185n095014
$$ 8037328 7495270 7173041 6432729 5393625 5320800 6210471 5859656 2497471 -2597543
37961b597543l541902k5116K445379K214469J14391j715975j661271K84561K605229
$$ -2597543 -6139445 -6164561 -3719182 -1504713 -1390322 -3106297 -4767568 -4483007 -1877778
37952a877778L419045K061216k28932j430976o85705J073456K298105K109805
$$ -1877778 1541267 3602483 3373551 1942575 1256870 2330326 4628431 6738236
37944F738236N58035j464148k470110j719797n62444r51114k214194j457198J697260
$$ 6738236 7296271 5832123 3362013 1642216 1079772 128658 -2085536 -3542734 -1845474
37935a845474L366988P43328l097700l054456P75964L561520K823587J015787
$$ -1845474 1521514 2264842 -832858 -3887314 -3111350 450170 3273757 4289544
37927D289544P05030J089827N33015o99824j799983k895746l653270k671355J75936
$$ 4289544 4994574 6084401 6617416 5917592 4117609 1221863 -2431407 -5102762 -4926826
37918d926826K624238K620498O40940j395644k055699q36022J511137K783114
$$ -4926826 -2302588 317910 958850 -436794 -2492493 -3328515 -1817378 965736
37910I65736J457022p85380r23254R33459J702130K47035j070410o03285J03939
$$ 965736 2422758 1637378 714124 1647583 3349713 3596748 2526338 1923053 2026992
37901B026992n52629j624280j780278j449117j190683l91851R61301J640328J486171
$$ 2026992 1474363 -149917 -1930195 -3379312 -4569995 -4961846 -4000545 -2360217 -874046
37892h74046J637260J456736j226488n221557n427837r154N596427N525694J341368
$$ -874046 763214 2219950 993462 -4228095 -9655932 -9665086 -4068659 1457035 2798403
37883B798403j146733n46054m95069k665157m174176k724035l49874j60075j667299
$$ 2798403 1651670 1105616 610547 -2054610 -6228786 -8952821 -9302695 -9462770 -11130069
37874a1130069j533109J652971M994105M541490N38539k231906n04725K760449
$$ -11130069 -12663178 -11010207 -6016102 -1474612 -936073 -3167979 -3672704 -912255
37866i12255K406184j288913k983857n02217J891720L34584k685434k449436R10281
$$ -912255 1493929 205016 -2778841 -3281058 -1389338 -1054754 -3740188 -6189624 -5279343
37857e279343L177350K222520j707q89058K5294J312702R96680j631921m385861
$$ -5279343 -2101993 120527 118820 -770238 -744944 567758 1564438 -67483 -4453344
37848d453344l795227L03358L595443K534409r40239k120510L46672L386790L799903
$$ -4453344 -8248571 -7945213 -4349770 -1815361 -2755600 -4876110 -4529438 -1142648 2657255
37839B657255J484716j466860l257677l630444l271137k345882k91907K393763
$$ 2657255 4141971 2675111 -582566 -4213010 -7484147 -9830029 -10121936 -7728173
37831g728173L493250J952267J75583Q56083K578275J912434q43223k029723o10096
$$ -7728173 -4234923 -2282656 -2107073 -1250990 1327285 3239719 2396496 366773 -243323
37822b43323N71471N457m13332N19089J407613J517227J756317J517755r04061
$$ -243323 328148 333605 -79727 439362 1846975 3364202 5120519 6638274 5734213
37813E734213l844204l302479L96111K476130J566929J460842L201887K515704
$$ 5734213 1890009 -1412470 -1016359 1459771 3026700 4487542 7689429 10205133
37805A0205133j811173m274508j630888J381585K37254k145226j840376r08180
$$ 10205133 8393960 4119452 2488564 3870149 4107403 1962177 121801 -786379
37797g86379j753995j202193K585499L810833j811622p405301m156171M328602
$$ -786379 -2540374 -3742567 -1157068 2653765 842143 -6563158 -10719329 -6390727
37789f390727P252589L001869m44372M25734J124986n59680j189710K84148L42249
$$ -6390727 861862 3863731 3419359 3845093 4970079 4410399 3220689 3504837 3847086
37780C847086j619097j890397o9615j42958k366506j991436J883324L937104J656502
$$ 3847086 2227989 337592 267977 125019 -2241487 -4232923 -2349599 1587505 3244007
37771C244007o38241K07131J153417n03717j971613m50296J569224P46758j559118
$$ 3244007 2605766 2812897 3966314 3462597 1490984 1040688 2609912 3356670 1797552
37762A797552k015624l27334J491719K082395R05685j788136l855635l101082
$$ 1797552 -218072 -545406 946313 3028708 3934393 2146257 -1709378 -4810460
37754d810460q09734K4891o3364J847666M590402L308152k322915n983388l258829
$$ -4810460 -5620194 -5595303 -5658667 -3811001 779401 4087553 1764638 -4218750 -7477579
37745g477579K459080N134027L120297j067774m231534l949033j82691L210985
$$ -7477579 -5018499 115528 3235825 2168051 -2063483 -6012516 -6195207 -2984222
37737b984222K169761j641664k659304M13282L094184K432516N45346k47626m99388
$$ -2984222 -814461 -2456125 -5115429 -4702147 -1607963 824553 1369899 1122273 622885
37728F22885n57350L11082N86582k111695n297845l604384K116342M639488J444692
$$ 622885 65535 376617 963199 -1148496 -6446341 -10050725 -7934383 -3294895 -1850203
37719a850203j403619M68746L043246J761687q11993l96354J740174K286669J747323
$$ -1850203 -3253822 -2785076 258170 2019857 1207864 811510 2551684 4838353 6585676
37710F585676J660072M05355l175743n819387m160956J66931L348160L952634
$$ 6585676 8245748 8651103 5475360 -344027 -4504983 -4338052 -989892 2962742
37702B962742K173780j176647k807763M26291M922691L195065l969067o522436
$$ 2962742 5136522 3959875 1152112 1578403 6501094 9696159 5727092 -795344
37694g95344m75765N045357K248556l171482k692106Q16666j52837l751401l002578
$$ -795344 -1271109 3774248 6022804 2851322 159216 975882 823045 -2928356 -5930934
37685e930934J017479J824900k94271j16884J434838m13173l112807L2652O468254
$$ -5930934 -4913455 -3088555 -3382826 -3499710 -2064872 -2478045 -5590852 -5558200 910054
37676I10054O408248j157437o254653l463807J416927K690112K116731J791560
$$ 910054 7318302 6160865 -93788 -3557595 -2140668 549444 2666175 4457735
37668D457735j90981l061988j872751L034272M128776j063200m809431j709857
$$ 4457735 4266754 1204766 -667985 2366287 6495063 5431863 622432 -1087425
37660a087425K450556J060558k264516j017228K554170K076884j515340k256227
$$ -1087425 1363131 2423689 159173 -858055 1696115 3772999 2257659 1432
37652A432K15285R40658j074705j866226l27333K14682j226185j282862J553193
$$ 1432 216717 1157375 82670 -1783556 -2110889 -1896207 -3122392 -4405254 -2852061
37643b852061L834592K313793j425893l460362k309901K31856J626206J072130
$$ -2852061 982531 3296324 1870431 -1589931 -3899832 -3667976 -2041770 -969640
37635i69640Q1785N08296J822893J693509j90919j155974K13345J490402L60537
$$ -969640 -887855 -379559 1443334 3136843 2945924 1789950 2003295 3493697 3854234
37626C854234j369356q02683J078817J121459p36317j764305j198718p83486q56378
$$ 3854234 2484878 1682195 2761012 3882471 3146154 1381849 183131 -600355 -1456733
37617a456733R4269J657651J321086r14682j639805M50738J794386n29364l525963
$$ -1456733 -1362464 295187 1616273 701591 -938214 -487476 1306910 777546 -2748417
37608b748417k262793K596920N362532L097808j097202l328649l708904l972378
$$ -2748417 -5011210 -2414290 2948242 6046050 4948848 1620199 -2088705 -6061083
37600f061083l464896p44998K594039L322271J318376l47624j32184L74608J7673
$$ -6061083 -9525979 -10270977 -7676938 -4354667 -3036291 -3383915 -3516099 -3141491 -3123818
37591c123818j25534L67856j7276j335012q16174K576165N263557L844910J32421
$$ -3123818 -3249352 -2881496 -2898772 -4233784 -5049958 -2473793 2789764 6634674 6767095
37582F767095k072969k676873l586345l644506n69388L282062K957516j126761
$$ 6767095 4694126 2017253 -1569092 -5213598 -5782986 -2500924 456592 -670169
37574f70169k959469J16398L527758K641197q61739k528539j262545J010816K760583
$$ -670169 -3629638 -3513240 14518 2655715 1793976 -734563 -1997108 -986292 1774291
37565A774291L156826J494054j198471k205751q45673K28585p36745j878643j343874
$$ 1774291 4931117 6425171 5226700 3020949 2175276 2403861 1667116 -211527 -1555401
37556a555401n70363j255309j903809n37345J522856J769034M54208m71302m42957
$$ -1555401 -2125764 -3381073 -5284882 -5822227 -4299371 -2530337 -2076129 -2547431 -2990388
37547b990388L17693K157610M021520K963340j088457l222747l21757L229422
$$ -2990388 -2672695 -515085 3506435 6469775 5381318 2158571 1836814 5066236
37539E066236J741949k731390l808280j145284o1048j536434o52786L775483N839719
$$ 5066236 6808185 4076795 268515 -876769 -937817 -2474251 -3127037 648446 6488165
37530F488165J847184l627549m866566k649753o51076P91109K593729K864802
$$ 6488165 8335349 4707800 -158766 -2808519 -3459595 -2668486 -74757 2790045
37522B790045J19191k583470j754354P65810R63822p14299q78500N19386O36991
$$ 2790045 2909236 325766 -1428588 -662778 301044 -413255 -1291755 -772369 -135378
37513a35378o95802j001483j28396k98410j449160j232742L65369R47573K82431
$$ -135378 -831180 -1832663 -1961059 -2259469 -3708629 -4941371 -4576002 -3628429 -3345998
37504c345998M18044J173559L45148j344571p40367J622054J511113j516712k507432
$$ -3345998 -2927954 -1754395 -1409247 -2753818 -3494185 -1872131 -361018 -1877730 -4385162
37495d385162P54863L832081K969055P39484M62632L50218j910716l506201j148187
$$ -4385162 -3630299 201782 3170837 3910321 4372953 4723171 2812455 -693746 -1841933
37486a841933K387943K393220o3282o42946N21038L2851j594931p21807K244058
$$ -1841933 546010 2939230 2875948 2233002 2754040 2786891 1191960 470153 2714211
37477B714211K965609M19609k022646k865812l857979m787255l110475L57798
$$ 2714211 5679820 6099429 4076783 1210971 -2647008 -7434263 -10544738 -10186940
37469a0186940J515886M503Q6012K907875M158167J712770n69026L52291J922583
$$ -10186940 -8671054 -8666551 -8580539 -5672664 -1514497 198273 -370753 -18462 1904121
37460A904121J358457K22362K9098j196283l915958m140636k07385K775270O21662
$$ 1904121 3262578 3484940 3514038 2317755 -1598203 -5738839 -5946224 -3170954 -2549292
37451b549292k733479j752463J539134J743701l55401l944K416649K352663k68144
$$ -2549292 -5282771 -7035234 -5496100 -3752399 -4107800 -4111744 -1695095 657568 389424
37442C89424r81267J058198J991421M51052p94515p43200j315134k115332m34991
$$ 389424 -591843 466355 2457776 2908828 2114313 1371113 55979 -2059353 -2494344
37433b494344K754054L235763R61609L36302J773624L50239m594533o175574o05906
$$ -2494344 259710 3495473 4457082 4793384 6567008 6917247 2322714 -3852860 -4458766
37424d458766N648331M995586l59489k862620r38180P35932k59001j770510k210189
$$ -4458766 1189565 6185151 5825662 2963042 2024862 2760794 2501793 731283 -1478906
37415a478906k325609k045322l39646J632153J401657m58184o12754J868227M038347
$$ -1478906 -3804515 -5849837 -6189483 -4557330 -3155673 -3613857 -4226611 -2358384 1679963
37406A679963L568610J643906K68636o16596j789262k558099j762686P1140J142723
$$ 1679963 5248573 6892479 7161115 6544519 4755257 2197158 434472 505612 1648335
37397A648335P01888l8777M52501J846766J959359n84874m019934m915171k301078
$$ 1648335 2350223 2311446 2763947 4610713 6570072 5985198 1965264 -2949907 -5250985
37388e250985Q69256J165376j321953l302843j969297K322106O420996O958080
$$ -5250985 -4381729 -3216353 -4538306 -7841149 -9810446 -7488340 -1067344 5890736
37380E890736L334843j420188l562341k473080m35608J065826K419266K969360
$$ 5890736 9225579 7805391 4243050 1769970 1334362 2400188 4819454 7788814
37372G788814M97179m343267o306746j948568M239069M555509j504103o169898
$$ 7788814 8285993 3942726 -2364020 -4312588 -73519 4481990 2977887 -3192011
37364c192011l727415K322919M848981K436735m76428q50061n5213K49009R51945
$$ -3192011 -6919426 -4596507 252474 2689209 2212781 1362720 1307507 1556516 2508461
37355B508461K448751K177875j607044n577863m770466J66076L247201J529226
$$ 2508461 4957212 7135087 5528043 -49820 -4820286 -4654210 -1407009 122217
37347A22217r42975J22693K492708J509661j736291j878613J751583L517603K73016
$$ 122217 -820758 -698065 1794643 3304304 1568013 -310600 1440983 4958586 5231602
37338E231602l528969k629076J213953K379961j62248k150761q59923J640023
$$ 5231602 1702633 -926443 287510 2667471 2505223 354462 -505461 1134562
37330A134562K430527J474029K49732p51923j613364j724647n73684Q93975R54607
$$ 1134562 3565089 5039118 5288850 4536927 2923563 1198916 625232 1519207 2473814
37321B473814q57910k908108k846104j12559K812243K468538j401285m489218
$$ 2473814 1615904 -1292204 -4138308 -4250867 -1438624 1029914 -371371 -4860589
37313d860589k383038L663605P322764M410046k037796n398132l188908Q35043
$$ -4860589 -7243627 -3580022 3742742 8152788 6114992 716860 -2472048 -1637005
37305a637005K155574P63272k09604N67254J242037Q6954j833265k121413j47882
$$ -1637005 518569 1281841 1072237 1639491 2881528 2968482 1135217 -986196 -1134078
$$ [...]
##END NTUPLES=NMR SPECTRUM
##END=
