##TITLE=31Pdec_LR-0155-CBZ-C2-Et2O
 DMSO-d6, 24 sc
 11.4.2023
##JCAMPDX= 6.0         $$ Bruker NMR JCAMP-DX V2.0
##DATA TYPE= NMR SPECTRUM
##DATA CLASS= NTUPLES
##ORIGIN= UXNMR, Bruker Analytische Messtechnik GmbH
##OWNER= root
$$ XWIN-NMR		Version 3.5
$$ Tue Apr 11 16:34:27 2023 Russian Standard Time (UT+4h)  she@DPX200
##.OBSERVE FREQUENCY= 81.013821
##.OBSERVE NUCLEUS= ^31P
##.ACQUISITION MODE= SIMULTANEOUS
##.ACQUISITION SCHEME= undefined
##.AVERAGES= 24
##.DIGITISER RES= 16
##SPECTROMETER/DATA SYSTEM= spect
##.PULSE SEQUENCE= zgpg30
##.SOLVENT NAME= DMSO
##.SHIFT REFERENCE= (INTERNAL, DMSO, 0, 248.564)
##AUDIT TRAIL= $$ (NUMBER, WHEN, WHO, WHERE, WHAT)
$$ ##TITLE= Audit trail, XWIN-NMR		Version 3.5
$$ ##JCAMPDX= 5.01
$$ ##ORIGIN= Bruker BioSpin GmbH
$$ ##OWNER= she
$$ F:/spectra/data/she/nmr/P31/1/pdata/1/auditp.txt
$$ ##AUDIT TRAIL=  $$ (NUMBER, WHEN, WHO, WHERE, WHAT)
(   1,<2023-04-11 16:33:26.04 +0400>,<she>,<DPX200>,
      <created by zg, POWCHK disabled, PULCHK disabled
       configuration hash MD5:
       00 E9 B6 7A A2 85 ED C7 34 08 36 98 17 FE 4E 26
       data hash MD5: 32K
       20 2E D7 0E ED 3B C8 76 94 9D CC AE 84 83 E1 AE>)
(   2,<2023-04-11 16:33:29.95 +0400>,<she>,<DPX200>,
      <Start of raw data processing
       efp BC_mod = 2 LB = 1 FT_mod = 6 PKNL = 1 PHC0 = -11212.48 PHC1 = 557.0854 SI = 64K 
       data hash MD5: 64K
       DD 7B 1B 5E F7 D7 1B 59 EB 5A 8E A8 6B 4C 6C 83>)
(   3,<2023-04-11 16:33:44.65 +0400>,<she>,<DPX200>,
      <pk PHC0 = 21.1041 PHC1 = 0 
       data hash MD5: 64K
       32 49 F1 77 C5 59 A9 8F 6A 7F 5B 37 F2 C6 AD A5>)
$$ ##END=
$$ 
$$ hash MD5
$$ 72 DB C5 CF A7 12 AB 58 85 C4 4D 11 A5 23 69 03
##$RELAX= 
##$RELAX= 
##$RELAX= 
##$RELAX= 
##$RELAX= 
##$RELAX= 
##$RELAX= 
##$RELAX= 
##$RELAX= 
$$ Bruker specific parameters
$$ --------------------------
##$DU= <F:/spectra>
##$EXPNO= 1
##$NAME= <P31>
##$PROCNO= 1
##$TYPE= <nmr>
##$USER= <she>
##$AMP= (0..31)
100 100 100 100 100 100 100 100 100 100 100 100 100 100 100 100 100 100 
100 100 100 100 100 100 100 100 100 100 100 100 100 100 
##$AQSEQ= 0
##$AQ_mod= 1
##$AUNM= <au_zg>
##$AUTOPOS= <>
##$BF1= 81.014009
##$BF2= 200.13
##$BF3= 200.13
##$BF4= 200.13
##$BF5= 200.13
##$BF6= 200.13
##$BF7= 200.13
##$BF8= 200.13
##$BYTORDA= 1
##$CFDGTYP= 0
##$CFRGTYP= 5
##$CHEMSTR= <none>
##$CNST= (0..31)
1 1 145 1 1 1 1 1 1 1 1 1 1 1 1 1 1 1 1 1 1 1 1 1 1 1 1 1 1 1 1 1 
##$CPDPRG= <waltz16>
##$CPDPRG1= <>
##$CPDPRG2= <waltz16>
##$CPDPRG3= <>
##$CPDPRG4= <mlev>
##$CPDPRG5= <mlev>
##$CPDPRG6= <mlev>
##$CPDPRG7= <mlev>
##$CPDPRG8= <mlev>
##$CPDPRGB= <>
##$CPDPRGT= <>
##$D= (0..31)
0 1 0 0 0 0 0 0 0 0 0 0.03 2e-05 3e-06 0 0 0 0 0 0 0 0 0 0 0 0 0 0 0 0 
0 0 
##$DATE= 1681216405
##$DBL= (0..7)
120 120 120 11 120 120 24 19 
##$DBP= (0..7)
150 150 150 150 150 150 150 150 
##$DBP07= 0
##$DBPNAM0= <>
##$DBPNAM1= <>
##$DBPNAM2= <>
##$DBPNAM3= <>
##$DBPNAM4= <>
##$DBPNAM5= <>
##$DBPNAM6= <>
##$DBPNAM7= <>
##$DBPOAL= (0..7)
0.5 0.5 0.5 0.5 0.5 0.5 0.5 0.5 
$$ [...]
##$SUBNAM2= <"">
##$SUBNAM3= <"">
##$SUBNAM4= <"">
##$SUBNAM5= <"">
##$SUBNAM6= <"">
##$SUBNAM7= <"">
##$SUBNAM8= <"">
##$SUBNAM9= <"">
##$SW= 501.771253377433
##$SWIBOX= (0..15)
0 1 3 0 0 0 0 0 0 0 0 0 0 0 0 0 
##$SW_h= 40650.406504065
##$TD= 32768
##$TD0= 1
##$TE= 0
##$TE2= 300
##$TE3= 300
##$TEG= 300
##$TL= (0..7)
0 120 53 12 22 120 120 120 
##$TP= (0..7)
150 150 150 150 150 150 150 150 
##$TP07= 0
##$TPNAME0= <>
##$TPNAME1= <>
##$TPNAME2= <>
##$TPNAME3= <>
##$TPNAME4= <>
##$TPNAME5= <>
##$TPNAME6= <>
##$TPNAME7= <>
##$TPOAL= (0..7)
0.5 0.5 0.5 0.5 0.5 0.5 0.5 0.5 
##$TPOFFS= (0..7)
0 0 0 0 0 0 0 0 
##$TUNHIN= 0
##$TUNHOUT= 0
##$TUNXOUT= 0
##$USERA1= <user>
##$USERA2= <user>
##$USERA3= <user>
##$USERA4= <user>
##$USERA5= <user>
##$V9= 5
##$VALIST= <valist>
##$VCLIST= <CCCCCCCCCCCCCCC>
##$VD= 0
##$VDLIST= <DDDDDDDDDDDDDDD>
##$VPLIST= <PPPPPPPPPPPPPPP>
##$VTLIST= <TTTTTTTTTTTTTTT>
##$WBST= 1024
##$WBSW= 4
##$XGAIN= (0..3)
0 0 0 0 
##$XL= 0
##$YL= 0
##$YMAX_a= 1854
##$YMIN_a= -2288
##$ZGOPTNS= <>
##$ZL1= 120
##$ZL2= 120
##$ZL3= 120
##$ZL4= 120
##$ABSF1= 0
##$ABSF2= 0
##$ABSG= 0
##$ABSL= 0
##$ALPHA= 0
##$AQORDER= 0
##$ASSFAC= 0
##$ASSFACI= 0
##$ASSFACX= 0
##$ASSWID= 0
##$AUNMP= <proc_1d>
##$AZFE= 0.1
##$AZFW= 0.5
##$BCFW= 0
##$BC_mod= 2
##$BYTORDP= 0
##$COROFFS= 0
##$CY= -3
##$DATMOD= 1
##$DC= 0
##$DFILT= <>
##$DTYPP= 0
##$F1P= 0
##$F2P= 0
##$FCOR= 1
##$FTSIZE= 65536
##$FT_mod= 6
##$GAMMA= 0
##$GB= 0
##$INTBC= 1
##$INTSCL= 6.047779e-11
##$ISEN= 30
##$LB= 1
##$LEV0= 0
##$LPBIN= 0
##$MAXI= 10000
##$MC2= 0
##$MEAN= 0
##$ME_mod= 0
##$MI= 50
##$NCOEF= 0
##$NC_proc= -8
##$NLEV= 6
##$NOISF1= 182.463
##$NOISF2= 159.3651
##$NSP= 0
##$NTH_PI= 0
##$NZP= 0
##$OFFSET= 248.5645
##$PC= 4
##$PHC0= -11191.38
##$PHC1= 557.0854
##$PH_mod= 1
##$PKNL= yes
##$PPARMOD= 0
##$PSCAL= 0
##$PSIGN= 0
##$REVERSE= no
##$SF= 81.0140089999694
##$SI= 65536
##$SIGF1= 159.3651
##$SIGF2= -187.1042
##$SINO= 113.3802
##$SIOLD= 16384
##$SREGLST= <1H.CDCl3>
##$SSB= 0
##$STSI= 65536
##$STSR= 0
##$SW_p= 40650.406504065
##$SYMM= 0
##$S_DEV= 0
##$TDeff= 32768
##$TDoff= 0
##$TI= <>
##$TILT= no
##$TM1= 0
##$TM2= 0
##$TOPLEV= 0
##$USERP1= <user>
##$USERP2= <user>
##$USERP3= <user>
##$USERP4= <user>
##$USERP5= <user>
##$WDW= 1
##$XDIM= 65536
##$YMAX_p= 425292533
##$YMIN_p= -29861967
$$ End of Bruker specific parameters
$$ ---------------------------------
##NTUPLES= NMR SPECTRUM
##VAR_NAME=  FREQUENCY,     SPECTRUM/REAL,   SPECTRUM/IMAG
##SYMBOL=    X,             R,               I
##VAR_TYPE=  INDEPENDENT,   DEPENDENT,       DEPENDENT
##VAR_FORM=  AFFN,          ASDF,            ASDF
##VAR_DIM=   65536,         65536,           65536
##UNITS=     HZ,            ARBITRARY UNITS, ARBITRARY UNITS
##FACTOR=    0.620285442955139, 1,           1
##FIRST=     20137.2065510682, 0,            0
##LAST=      -20513.1999529968, 0,           0
##MIN=       -20513.1999529968, -29861967,   0
##MAX=       20137.2065510682, 425292533,    0
$$ Real data points
##PAGE= N=1
##DATA TABLE= (X++(R..R)), XYDATA
$$ [...]
43815 -59666 -1261350 244185 4160329 7198012 6656971 2951929 -1067622 -2881848 -2649601
43806 -2649601 -2472414 -3096176 -2856642 -962607 333760 -931237 -2994967 -3264141 -2698836
43797 -2698836 -3433857 -3606007 569188 7978517 12819714 12081082 8335548 4680709 1735071
43788 1735071 377679 2029519 4493943 2923921 -2519006 -5145700 -1102915 4691514
43780 4691514 6012203 4181614 4422320 6893687 7158301 3787505 158658 -791031 606207
43771 606207 2901175 5125663 6415861 6514965 6096233 4959848 1679932 -3128188 -5953540
43762 -5953540 -5425388 -4924043 -6530742 -5960129 1163011 10656662 13878195 9440619 4370422
43753 4370422 3407557 3516514 596463 -3991436 -6348141 -5482550 -3166122 -1112771 -260106
43744 -260106 -625634 -667991 1052912 3120050 2864499 989937 1213598 4581627 7754287
43735 7754287 8172552 7325908 7156114 6685964 4642744 2643909 2997656 5049129 6052821
43726 6052821 4711045 2400819 1673009 3954789 7454989 7654536 2231971 -4675884
43718 -4675884 -6245464 -1283824 4689445 7206855 7544587 8286328 8724705 7419299 5555537
43709 5555537 4470477 2897574 84224 -1031786 2485436 8580452 12377066 11883940
43701 11883940 8557810 3895325 -1269953 -5499175 -8066951 -10444837 -13514082 -14695036
43693 -14695036 -11189131 -4942018 -888976 -1003124 -3262050 -5464190 -6491442 -4856453
43685 -4856453 -314093 3458004 2321886 -1889201 -2899879 1309406 5992284 7193514
43677 7193514 6901394 8086555 9183406 7382657 3962253 1894207 588362 -2148903
43669 -2148903 -4434705 -2050904 3921610 6438214 1493663 -6092923 -8699588 -5081909
43661 -5081909 -497194 650795 -979837 -2209992 -1019606 2579854 6787766 8519628
43653 8519628 6024021 1848147 696238 2952610 3187923 -2208893 -8503150 -8112559
43645 -8112559 -1587341 2297891 -1393559 -6875773 -6180550 -412934 2666975 100212
43637 100212 -3250840 -3264587 -2289591 -3906942 -6515053 -6020070 -2269880 1318613 3250236
43628 3250236 5003931 6876403 6837811 4522749 2856785 3791707 5111034 3843796 832386
43619 832386 -750223 5108 1409798 2337503 2631799 1086052 -3303168 -7867743 -7899206
43610 -7899206 -2981605 1754459 2429789 1146786 1677897 3802665 5172759 5852021 6785442
43601 6785442 5874406 580656 -6333651 -8724527 -5215515 -1032374 -725145 -3080887
43593 -3080887 -4574322 -3952314 -1537412 2368091 5951163 5895404 1725209 -2270337 -2149150
43584 -2149150 734112 2469955 2170129 1830476 2366621 3087629 4058832 5753583 6871041
43575 6871041 5535881 2624644 1258709 2813323 5653790 7866386 8928866 8420170
43567 8420170 5507612 725317 -3453257 -4977531 -4201681 -2759930 -1312225 705001
43559 705001 3378787 5230331 4566169 2092793 1059564 3229076 5324941 2187089
43551 2187089 -5928671 -12182799 -11065345 -4822605 473308 2670231 3791929 4536828
43543 4536828 3275813 334948 -1254862 -368192 507266 -381383 -1187956 233838 2896540
43534 2896540 4681614 5603773 6789754 7816704 7361059 5478759 3355758 1740684
43526 1740684 1265538 3008838 6551624 8583871 6269758 1672859 -204479 1694841
43518 1694841 2670054 -1017377 -6372400 -7635990 -4472135 -2231541 -3788039 -5295808
43510 -5295808 -2570166 1516325 444770 -6064549 -10476099 -7208854 2860 3365513
43502 3365513 756542 -3516537 -5854322 -6670224 -6724645 -4962715 -1833745 -848364 -3574202
43493 -3574202 -5590500 -1519822 6699242 10830932 6708803 2325 -984872 4077244
43485 4077244 7887536 5855264 1751757 1206031 3114776 1548431 -5007450 -10798817
43477 -10798817 -10269844 -4936035 -603049 -49425 -1199419 -1369656 -467553 169402 121245
43468 121245 348308 2005946 4928250 7211844 7163660 5914393 6447862 9170027 10630930
43459 10630930 8523622 5726146 6330894 9244876 9637437 6234759 2983553 2898659 4332574
43450 4332574 4845962 5005321 5917621 6071063 3696807 243600 -1515713 -1507518 -1780569
43441 -1780569 -2999410 -4100244 -4477212 -3912500 -1339283 3246989 6287585 3727661
43433 3727661 -2971042 -7255260 -5094897 549958 4031072 3046905 -971778 -5398249
43425 -5398249 -7044828 -3222889 4402263 9096827 6279767 366608 -65296 6165021
43417 6165021 11001026 8207750 1490659 -1478251 674558 3081284 2681153 1177002
43409 1177002 230534 -1624791 -5735662 -10125848 -11640096 -9798345 -7085134 -6222573
43401 -6222573 -7793998 -9755583 -9152664 -5300886 -1018043 634679 265882 838515 3041777
43392 3041777 4790634 5230666 5745557 6241640 4325973 51449 -2313897 -203906 2848547
43383 2848547 2510373 633281 2195439 6831431 8776316 5331519 357571 -1928709
43375 -1928709 -2191400 -2883812 -3769405 -3640575 -3790514 -6073859 -8736414 -7724045 -2281065
43366 -2281065 3429566 5066067 2710234 -78937 -455767 1582964 4515207 7402689
43358 7402689 10369121 13549219 16080486 16317196 13194693 7571985 2096868 -766575
43350 -766575 -846481 -89724 -140849 -749568 -998824 -1095260 -1750507 -2526651 -2463978 -2012400
43340 -2012400 -2384641 -2920200 -1311041 2782175 6279707 5988064 1996185 -2967529 -6077958
43331 -6077958 -5825571 -2927488 -644574 -1997228 -5727050 -7508820 -6118801 -5010049
43323 -5010049 -6034644 -5838641 -1992902 1287878 -1141980 -6540820 -7420863 -2585678
43315 -2585678 1349712 29357 -3175416 -3706870 -2405957 -2421895 -3685473 -4111719 -3539122
43306 -3539122 -3032669 -2097934 424476 3919216 6793479 8539766 9036369 7242837 2936479
43297 2936479 -1296127 -2289182 -213846 1735051 1530721 526851 1199858 3888204 6392200
43288 6392200 6468623 4333678 2357438 2146632 2701616 2332618 1561268 2412027 5097155
43279 5097155 7377880 7488950 5827554 3245151 -334198 -4459997 -6912551 -5582646
43271 -5582646 -1144994 3251648 5027656 4485985 3938191 4631903 5303019 4699459 4410633
43262 4410633 6404227 8053953 4161486 -4289626 -8573058 -3611191 3654031 3421214
43254 3421214 -2885533 -5378122 -688317 4584686 5538504 4938045 5346425 4078843 39771
43245 39771 -2087889 482276 3307617 2235879 8974 -283927 -1942064 -7719530 -11754979
43236 -11754979 -6994032 3008918 8322727 6266943 2465130 127981 -2850872 -6559476
43228 -6559476 -7591319 -5877574 -5178528 -5383660 -1913022 5183363 9057506 6189518
43220 6189518 1934895 1985265 4272123 4149105 2599779 3558353 6306278 6384063 2830611
43211 2830611 -358837 -74534 2088569 2571827 406190 -1795820 -864774 3151230 6701032
43202 6701032 6784008 4195601 1334383 -1505810 -4846790 -6612620 -4230362 355674
43194 355674 2440766 1605519 2003553 4642219 4954053 486758 -4269027 -4422969 -1708908
43185 -1708908 -683585 -1430875 -823072 1523687 3559718 5413981 8570615 11030223
43177 11030223 8453695 1130326 -4442978 -3182514 1967623 3560208 -1295809 -7789580
43169 -7789580 -9683722 -6772957 -4044213 -4099557 -3913822 -842847 1786573 -588277 -5620292
43160 -5620292 -6429294 -1826495 2048873 1540136 519648 2770285 5412044 4455794 1987826
43151 1987826 2376329 4868459 5503408 3778410 2025121 277907 -2815955 -5581546
43143 -5581546 -5156971 -2557273 -856948 272001 2701295 3917736 -435528 -8236527
43135 -8236527 -11907064 -8812596 -4220499 -2253766 -560228 3063716 5213104 2875387
43127 2875387 71076 2715190 9453206 13016323 9752078 3437179 -294781 62809
43119 62809 1872307 1939431 -583990 -3850106 -5639212 -5961053 -6289197 -6401428 -4324446
43110 -4324446 -111966 3063826 3182177 2213271 2670761 3787031 3748447 3545732 5226546
43101 5226546 7646023 7526394 4333173 908898 -685642 -945982 -368810 1724999 4899773
43092 4899773 6887260 6530045 5268326 4416448 3277593 1713647 2126192 5939011 9766137
43083 9766137 8904043 4331220 2169491 5172289 8770215 7999164 4741704 4134226 6304257
43074 6304257 6769651 4071429 1465455 575419 -916571 -3394811 -2821196 2393675 6978937
43065 6978937 5915482 1933871 498405 685099 -2321224 -7562156 -8498018 -3093842
43057 -3093842 2864625 4028294 1706856 155886 1262730 4496810 7870267 7603734
43049 7603734 1249602 -7378338 -10833291 -7175464 -2064648 -316544 -421321 604241
43041 604241 2362055 3838862 5753377 6970499 3905025 -2767509 -6195476 -2649015
43033 -2649015 2377490 2414557 -604749 -1058048 873434 1195264 12898 469629 2462385
43024 2462385 4029258 6295216 10190210 11104851 4682887 -4167905 -6461595 -2061040
43016 -2061040 1182100 371553 213253 2381830 2276209 -1354449 -3011766 -234533 1769056
43007 1769056 -527090 -2987253 -2018690 -1126025 -3514216 -5177814 -2221939 855670
42999 855670 -2059811 -8006645 -9075881 -4537451 -1031968 -1862463 -3379944 -2308157
42991 -2308157 -417698 -419768 -1830759 -2872258 -3511865 -4725085 -6058551 -5204809 -330156
42982 -330156 6779525 10795907 8204841 2109095 -1338022 -854977 -166322 -419402 1521412
42973 1521412 5793258 7356545 4404931 2381877 4974713 7344996 4202391 -1056007
42965 -1056007 -2239386 -510600 -803529 -2119618 -199000 2768086 450277 -6497231
42957 -6497231 -10553516 -8889375 -6526356 -7004066 -7860100 -7160712 -6987155 -7763228 -5858329
42948 -5858329 -227523 4064903 2483101 -2902170 -6665667 -5921718 -1297156 4408743
42940 4408743 7335611 5839145 3053207 2428744 1665290 -3339426 -9455674 -8920653 -1607446
42931 -1607446 3792928 3037806 1890470 4614848 6046883 1308517 -4556472 -4470967 -607623
42922 -607623 653564 81999 2677907 6656747 5054552 -2559044 -8719698 -8910927 -6227377
42913 -6227377 -4192917 -1953131 1354554 3443807 2846906 1592984 1502548 1415579 141249
42904 141249 -1020100 -543814 1242290 3703738 6754748 8971555 7935417 4194209
42896 4194209 2078376 4402586 8573366 10186595 8546928 6005137 3300986 -949138
42888 -949138 -5921072 -7145860 -1868376 5645314 7593030 2318663 -2558682 507850
42880 507850 8621676 11821408 6372384 -745127 -2385027 -691608 -1647740 -4436555
42872 -4436555 -2758403 4546743 10682648 9923238 4540633 514740 -78602 387207 -47219
42863 -47219 -573599 102833 1076775 -160143 -4467993 -9187729 -10847437 -9710269 -9458317
42854 -9458317 -11455277 -12105327 -8191410 -2234949 906068 844333 884698 1654949 401026
42845 401026 -3371601 -6514626 -7506993 -8366973 -9556868 -7805070 -2135602 2093499 -302877
42836 -302877 -6218414 -7427911 -1159772 6630093 8821226 4616630 -1286168 -4185840
42828 -4185840 -2680152 1522465 5350726 6629213 5605154 4008484 2652858 1011621
42820 1011621 -791817 -1347814 -286743 413292 -748132 -1810645 260044 4417137
42812 4417137 5710477 1687560 -3984520 -6264494 -5026474 -4004208 -5030626 -6623284
42804 -6623284 -7583508 -8408498 -9020931 -8627665 -8268495 -9596261 -10247250 -5338179 3855561
42795 3855561 7846961 543389 -10731104 -13253495 -5256939 2881376 4122717 3574718
42787 3574718 8130476 13968547 11565586 549762 -8148499 -6201817 2033767 6548780
42779 6548780 4470272 1103045 548861 1108450 391605 -444771 -23178 20632 -1280468
42770 -1280468 -764878 4019946 8976257 7970094 2074060 -1558747 -91726 1807637
42762 1807637 418152 -1477409 -124513 3421123 6361365 8443718 9744749 8525615
42754 8525615 5036030 3260838 4909333 5995678 3806470 2458467 5796866 9408053
42746 9408053 7100885 1904345 2070116 7789350 10761481 7121811 2322191 1601052
42738 1601052 3365778 4687707 6457313 9414149 10499947 7055560 848003 -4832663
42730 -4832663 -8491394 -8969319 -5099699 717032 2901880 -427548 -4668474 -5382840
42722 -5382840 -3792571 -2805889 -1756359 1027994 3776032 3741260 2004271 1873782 3752486
42713 3752486 4793128 2857465 -1474089 -5954926 -8177669 -7318089 -5479375 -5485765 -6501410
42704 -6501410 -4496483 1609677 7256039 7719336 3803067 91813 -193592 3074079
42696 3074079 7757794 10101407 7024686 -122209 -5969250 -6679273 -3210626 1253261
42688 1253261 3951289 2291196 -4568897 -12381125 -14467038 -9646147 -3345171 490028
42680 490028 3114086 4908839 2764167 -2601925 -3951527 2055203 8175936 7167697
42672 7167697 3062931 3604248 6574705 3698849 -4824391 -10195520 -8546489 -4730715
42664 -4730715 -2363523 307141 3202411 2429326 -1712178 -3080068 464991 3143804
42656 3143804 1150214 -824606 1930765 5519880 3648222 -1983742 -4134939 -553768
42648 -553768 3754785 4000541 883184 -1692193 -1302483 936460 1927218 560082 -285214
42639 -285214 2251624 5752776 5119979 494132 -2309885 -432117 2342455 2627013 2299509
42630 2299509 2903216 1293376 -3821096 -6453431 -1617811 4799600 2831770 -6458535
42622 -6458535 -11242776 -5081701 4931305 8673786 5148595 523989 -777448 1487588
42614 1487588 6255800 11467536 13148288 8653867 726919 -4824538 -5599923 -4279528
42606 -4279528 -3893043 -4269074 -4092253 -3879970 -4742800 -5508196 -3703745 404567 2920811
42597 2920811 698041 -4570107 -8021818 -6814587 -2405721 1827466 3671854 2842595
42589 2842595 357052 -2124216 -3172036 -2274617 564445 5138368 9831986 11275633
42581 11275633 7686193 2213967 19741 1696276 2813308 779201 -1797237 -2556046
42573 -2556046 -3837605 -7786360 -10567941 -7074826 315953 3882013 1541163 -460019
42565 -460019 2448342 6402029 6031800 3317105 4020766 7903903 8763995 4273785 88307
42556 88307 1758659 6514905 6916302 1182145 -3955132 -1582664 6595166 11868837 8480366
42547 8480366 -29725 -5468382 -4618435 -1919062 -2486611 -5333245 -5627272 -1836886 2609919
42538 2609919 4448305 4031848 2879639 1011228 -1246306 -1453282 1787291 5258874
42530 5258874 4210240 -1115154 -5222166 -4333764 -813102 693555 -874012 -2936817
42522 -2936817 -3392718 -2409107 -789069 1219719 3231476 4349108 4162019 3535700 3926370
42513 3926370 5805278 7719262 7406932 4585683 2008786 2103553 2838807 -419388 -8017550
42504 -8017550 -13812253 -12133718 -4915047 933258 1853649 188085 -751764 -528296 -237429
42495 -237429 -651713 -2648056 -6641877 -10373183 -9951922 -4903903 -7022 21778 -3838063
42486 -3838063 -6635679 -5637700 -2616253 -565557 -284814 -427817 497443 2626930 4588179
42477 4588179 4770494 3035882 786045 -870877 -2093103 -2908049 -2103981 1172436 5485338
42468 5485338 8277075 8686632 7910236 6958555 5486263 3081444 472223 -1178350 -1476216
42459 -1476216 -770025 596282 2460682 4429033 5737566 5795370 4897320 4161671 4424845
42450 4424845 5280392 5635519 5141646 4459059 4093267 3785856 3301094 2955119 2904573 2660291
42440 2660291 1788691 401849 -1336870 -3129907 -3580887 -978619 3739890 6462456
42432 6462456 4447630 341701 -948409 1026389 1765975 -1290431 -4569288 -3213890
42424 -3213890 2050621 5894913 5483361 3615509 4229037 7143078 8815719 7131916
42416 7131916 3713590 1544153 1553441 2199056 1985801 1545157 2667004 5507127 7716625
42407 7716625 6983603 3821556 808869 -638608 -1354217 -2104368 -1881714 339671 3400563
42398 3400563 5261096 5928672 7072806 8637672 8061375 4022143 -723042 -2100025
42390 -2100025 393227 3336047 3716315 1845102 -336131 -2025984 -3441720 -4097705
42382 -4097705 -2945963 -205123 2277019 3004836 2426040 2015550 2371318 2976574 3500892
42373 3500892 4236259 4935520 4254759 1380389 -2222436 -3986025 -3386974 -2655796 -3560361
42364 -3560361 -4664880 -3426645 -523587 167545 -3264172 -7530629 -7869188 -3892975
42356 -3892975 463960 2292291 2248768 1429092 -989783 -4964454 -7212061 -5065023 -1311723
42347 -1311723 -1309789 -5517330 -8908105 -8484177 -7082120 -7709854 -8243961 -5426790 -1183932
42338 -1183932 -253206 -2708926 -3551640 -143149 3858551 3442386 -1355382 -5423477 -3764511
42329 -3764511 3633800 11104241 12124464 6345196 520448 161768 2167776 -277136
42321 -277136 -6829847 -9714260 -5036732 1485791 2852677 -19058 -1360910 697336
42313 697336 3032327 3378625 3001608 3776721 5522831 6535835 5468065 2980475 1747251
42304 1747251 3267033 4716254 1896615 -4183014 -7546530 -5498162 -2297279 -2246207
42296 -2246207 -3734937 -3634273 -3075079 -4272421 -5594082 -5051124 -5133102 -8252277 -10517289
42287 -10517289 -6792592 331896 3789877 2679860 2169528 3781639 3958087 2402447
42279 2402447 3258747 6487117 6513862 2147293 -289364 2532475 4976111 1761458 -3696028
42270 -3696028 -5869025 -5794794 -6746227 -6665760 -2357379 2690640 2449407 -2025898 -4477132
42261 -4477132 -3462016 -3136615 -4415549 -2773856 3561411 9321166 8896771 3388920
42253 3388920 -1526833 -2202334 315498 2472718 1972503 300435 1143530 5076799 7476428
42244 7476428 4371168 -1279408 -3086718 -256444 1501963 -1326822 -5011548 -4310760
42236 -4310760 162842 3198879 1855919 -1487969 -2564326 -284039 1814504 -692219
42228 -692219 -7489165 -12624279 -10851112 -4088434 804436 429195 -1765137 -990257 2813541
42219 2813541 5870398 5477249 2292569 -1064487 -2316348 -1269421 -179175 -1442379
42211 -1442379 -4219008 -4704188 -960515 3783034 4490714 480049 -3688832 -3737497 -357354
42202 -357354 2602947 3291898 3370422 4689479 6530225 6990530 5518661 2756515 -747290
42193 -747290 -3833237 -3930032 406314 6412780 9213695 7391066 4287967 3488387 5256386
42184 5256386 7639248 8481292 6076663 906325 -2744605 -492003 5776480 9125710
42176 9125710 6660583 3004386 2447646 2557939 -628746 -5588321 -8386247 -9018036 -9146382
42167 -9146382 -6765006 335755 7833027 8636581 2899855 -2113513 -2181531 -43880 1091625
42158 1091625 1635624 2060206 1126829 -715434 -1348231 -1574885 -4151905 -7097438 -4467849
42149 -4467849 3914584 10129808 8921292 4525369 2721718 2416108 565477 -287784
42141 -287784 3552118 8868747 9251682 4786056 1434322 2097085 4339023 5939532 6682908
42132 6682908 5196525 6552 -6152750 -8716241 -8284147 -9533139 -12460958 -11053276
42124 -11053276 -2975663 5205097 6295096 1776576 -1373386 -374396 1105960 -932953
42116 -932953 -6129251 -11000391 -12344633 -9268713 -3542147 1728011 4543311 5194860
42108 5194860 4992829 4615962 3966804 2707631 546628 -2236398 -4452037 -5051748 -4303796
42099 -4303796 -2798756 136731 5131690 10145557 11584111 8554382 3921477 621588
42091 621588 -893277 -1038060 316239 2310130 2694988 873132 -651879 172075 1723173
42082 1723173 1188774 -1219634 -2851715 -2359526 -661734 960613 1608413 394108 -2453278
42073 -2453278 -4651551 -4210015 -2369944 -2146357 -4236779 -6436002 -6818721 -5293337 -2237847
42064 -2237847 1815950 4911134 4786145 2100908 172830 552074 1326269 1108786 1877034
42055 1877034 5312595 8516574 7004222 1369763 -2632919 -1402701 2129181 3060406
42047 3060406 1039232 -366504 539873 1700340 1375586 874317 1608413 2091811 696359
42038 696359 -356229 2384684 7265553 8022571 1949245 -6081148 -9929205 -9217656 -7169415
42029 -7169415 -4674246 -803730 2911365 3774383 2742334 3122472 4662131 3930736 908411
42020 908411 -286933 1429846 1878230 -951112 -2719389 259200 4659061 5388049 3139716
42011 3139716 1565519 478751 -2035301 -3302020 1219056 9673962 14811694 13614472
42003 13614472 10151908 8149618 6510798 3788263 1664615 1430931 1312865 -93795
41995 -93795 -1228521 -624419 710021 1936811 4127110 7415494 9699364 10049223 9991721
41986 9991721 9650170 6743242 1830244 -29064 3509839 7334377 5824940 1092198
41978 1092198 -778098 1044943 2279236 1168810 107129 91733 -898328 -3352812 -4761556
41969 -4761556 -3889986 -2785096 -3259347 -4268736 -3684975 -385402 5373816 10978399 11483535
41960 11483535 4514439 -4725618 -7651247 -2601336 3088694 2847779 -1493381 -4300037
41952 -4300037 -4281892 -3993246 -3892809 -1931917 1349840 1855762 -2464952 -8030005 -9845916
41943 -9845916 -7697967 -5616979 -5636735 -5036687 -1196300 3273999 3500556 -342874 -2631858
41934 -2631858 -79703 3986432 5313951 4883087 5715290 6674295 4575240 872566 537837
41925 537837 4187034 6733757 5160043 2756191 3411928 5785003 6040165 3429998 340616
41916 340616 -1065790 34145 3292687 6344233 5898567 1974317 -894539 856808
41908 856808 4796591 5578601 1833723 -2652144 -3973980 -1956596 823271 2049162
41900 2049162 1676824 1872740 4414667 7622140 7392886 2464020 -3114956 -4626978 -2342577
41891 -2342577 -283960 -459567 -1054222 -133920 1486015 1876600 828880 -48032 473931
41882 473931 1593973 1255280 -1227511 -3702708 -3365461 -328813 2408112 2721009 1334455
41873 1334455 -312700 -1860383 -2657350 -1101874 2725219 5730936 5262261 2346893
41865 2346893 -429390 -2405875 -3867570 -3627936 -859982 1992705 1726877 -779731
41857 -779731 -1639678 464063 3185930 4779098 5625858 5296397 2427617 -1247067 -1222478
41848 -1222478 2970617 5374802 1704855 -3453156 -2483579 3952067 7179689 2603884
41840 2603884 -3842291 -4012456 1679909 5949656 5022946 2394667 1894638 1668911 -2098383
41831 -2098383 -8234431 -11259953 -8491444 -3050756 774373 2115105 2032381 273772
41823 273772 -3628394 -7406962 -7481303 -3674837 -220375 -1145669 -5988796 -10780713 -12157839
41814 -12157839 -9742579 -5389676 -1237171 1578460 3136991 4307271 6103721 8793766
41806 8793766 11004454 10341194 6314358 2430161 3168342 8096857 11343956 8637255
41798 8637255 2679019 -971088 -1323051 -1661005 -3068071 -2796754 541982 4475871 6673558
41789 6673558 7579042 7365048 4333579 -952797 -3787539 -1317676 2682207 3308639 2018857
41780 2018857 3356703 6300751 5505445 889345 -1039508 2913310 7905669 9091309
41772 9091309 8110303 7269965 3242502 -6821800 -16948974 -18006790 -10342842 -3383870
41764 -3383870 -2540531 -3504673 -867036 4283506 8029598 9118875 7400301 1859304
41756 1859304 -5644565 -8974844 -4904723 1393409 2845739 -101140 -1617783 52304
41748 52304 1164844 -129139 -904602 882375 2625819 931284 -3973083 -9233953 -12195526
41739 -12195526 -11234230 -6524137 -1182418 820682 -797298 -2194361 -460754 2956520
41731 2956520 4808679 3950597 1639391 -279773 -592803 320358 350868 -1702668 -3382029
41722 -3382029 -1039883 4639065 8663455 8178934 5711751 4588674 4403075 3212063
41714 3212063 1327890 110963 -889408 -2718936 -4428488 -4352415 -2923819 -1892037
41706 -1892037 -1551647 -732204 1145053 3514871 5297984 5030636 1938612 -1873120 -2439012
41697 -2439012 938843 3703813 1634399 -3465171 -6425590 -5349746 -2444828 335175
41689 335175 2811453 4440365 4360287 3635935 4243134 5659127 5523318 3820681 3057214
41680 3057214 3733750 3189847 218370 -2522391 -2643622 -1671225 -2102940 -3152268 -2297971
41671 -2297971 521911 3268161 5320451 7470202 8870044 7560362 4605718 4018550
41663 4018550 6658130 7561274 2748772 -3712784 -4288630 958682 3453860 -1954100
41655 -1954100 -9324316 -9837663 -3835063 714676 -308978 -3224025 -3780829 -2485524
41647 -2485524 -1473158 -1203301 -2233167 -5678751 -9515042 -8830275 -2814435 2555481
41639 2555481 2390522 -291234 155368 3263417 4198341 2018240 517312 1516195 2514794
41630 2514794 1402637 -755540 -2305929 -2884642 -2210367 -184145 1418581 465718 -1881086
41621 -1881086 -2064253 767131 3499628 3628281 2230815 1302883 667479 -942383 -3368474
41612 -3368474 -4973991 -4491571 -2537275 -1512797 -3165559 -5715701 -5291215 -1484359
41604 -1484359 1218906 -101090 -2149659 -1049032 729296 -1132194 -3744342 -135331
41596 -135331 8615349 12498336 6344913 -2561366 -4591886 271025 5320249 7304057
41588 7304057 8136578 9248385 9613581 8386738 5684891 1652696 -2413239 -3491818
41580 -3491818 -285180 4175641 6103431 5708173 5810094 7317145 8847022 9438354 8946945
41571 8946945 6998747 3932439 1401614 16059 -1636181 -3604622 -3160022 367622
41563 367622 2748193 929613 -1350994 702482 4492867 3892530 -282844 -1327852
41555 -1327852 2063444 3737989 901687 -1125952 1510370 4227516 1801517 -2792957
41547 -2792957 -3529262 -1004048 -525373 -3524854 -7177957 -10389316 -13807235 -15366440
41539 -15366440 -12340602 -7204514 -5008541 -5058832 -2014138 4152686 6805139 3418661
41531 3418661 127200 1477924 2641942 -2208158 -9302625 -10390889 -5010514 -88590
41523 -88590 900038 879112 1758753 1562226 160384 1135308 5387272 8334533 6511308
41514 6511308 2596643 851432 1270317 1283830 25915 -2045724 -4820813 -6947223 -5496183
41505 -5496183 -325630 3938307 3567096 785230 -425107 -1009426 -4802214 -11303759
41497 -11303759 -15296379 -13623330 -8465502 -3482444 91937 2858443 5277206 7095230
41489 7095230 7432772 5576627 2686943 1532236 3035401 4676839 4202032 2927178
41481 2927178 2911882 3060473 1273987 -1487917 -3007191 -3904137 -5795837 -6984313 -4835726
41472 -4835726 -1415353 -1363819 -4350863 -5179990 -2004804 1066108 901941 -446986 -554975
41463 -554975 -673355 -2170434 -3145247 -1817740 -5410 -132836 -1409857 -1666621 -609946
41454 -609946 1060775 3326776 5402857 5138910 2238249 -271286 -123580 901734 141682
41445 141682 -1744429 -2297147 -1078074 526177 1659233 1846078 130431 -3242517 -5568050
41436 -5568050 -4327380 -264697 3627234 5106791 3714282 483589 -2339984 -3094382
41428 -3094382 -2970232 -4280750 -6090468 -4950080 -1009738 765985 -2261147 -6088147
41420 -6088147 -6029306 -3328016 -1993133 -2167407 -1131323 1200005 2291675 1372003 -2621
41411 -2621 -881667 -1212569 -307698 1906003 3314528 2310955 791797 1514618 3865569
41402 3865569 5198465 4762500 3194921 -33573 -5102288 -9451348 -10623912 -9955040
41394 -9955040 -9812883 -9128721 -5835635 -1669767 366612 1449548 4254461 6482406
41386 6482406 3735297 -1786984 -2869572 1638807 4809639 2774946 398437 2098368
41378 2098368 3958070 598111 -5375951 -7499690 -5843819 -6397401 -11116505 -14828155
41370 -14828155 -12852107 -6983630 -2257748 -970046 -1656909 -1936255 -694582 1543265
41362 1543265 3290186 3486026 2545892 1639373 1035242 -30955 -1694486 -2609725 -1611540
41353 -1611540 53453 -688539 -5181288 -10745695 -13178761 -11337011 -7795581 -5037979
41345 -5037979 -3065678 -1275424 -133701 484410 2228825 5538081 8158565 8613986
41337 8613986 8711236 9778341 9136211 4335060 -1321063 -2385480 1002681 4246307 6062067
41328 6062067 8891500 11630364 9205592 1514397 -3953335 -2109814 2702316 3986202
41320 3986202 2387127 2366243 3538364 1761292 -2946256 -5671578 -3736372 163741
41312 163741 2377962 2106465 222336 -2596501 -5648246 -8021177 -8995750 -7693705 -3479695
41303 -3479695 1807895 4020231 1646621 -1309543 -586889 2105810 2152161 -341579 -1204081
41294 -1204081 87393 -638718 -4488635 -6648872 -3998728 -382398 -408187 -2194657 -1027813
41285 -1027813 2820616 5251425 5542043 6795045 9449162 9678225 5523239 416116
41277 416116 -1287900 745220 3915191 5918809 5347433 1901218 -1998403 -2360392 1293709
41268 1293709 4167819 1967283 -3462825 -6783282 -5562871 -1279812 4063473 8741297
41260 8741297 10186751 7255757 3168132 2308866 4298717 5129928 3932728 3935347 6154949
41251 6154949 7225797 5234887 2975565 2953129 3498992 2714046 2115588 3011113 3248973
41242 3248973 1507542 987233 4102316 6844087 4006258 -2279612 -5016074 -1942242
41234 -1942242 2923245 6291176 8311862 8653580 5872053 1374457 -1275508 -1794296
41226 -1794296 -2895588 -4042882 -1260567 5370339 9883601 8578626 4765619 2603399
41218 2603399 1409400 -405272 -829483 1578608 3006368 -786261 -7550010 -11526196
41210 -11526196 -11439614 -10503860 -9761044 -6780124 -1105227 3816510 5492706 5647529 6901875
41201 6901875 8568265 7602659 2736152 -3476960 -6520778 -3832316 2677231 8339230
41193 8339230 10373706 10045344 9721427 9295398 7038632 3010567 -286306 -640512 1635080
41184 1635080 4248096 5080966 3915050 2270318 1371624 786118 -25082 221418 2806188
41175 2806188 5678414 4995722 587155 -3238600 -3625368 -2804974 -3867337 -5883731 -5992417
41166 -5992417 -3996956 -1777059 197311 2588431 4571888 4625500 3362856 2780451 3006220
41157 3006220 2443025 1156456 1626334 5426648 10715319 13763569 12506103 8646211
41149 8646211 6318154 7725913 10019477 8264933 1995405 -3588265 -4082202 -883266
41141 -883266 1983565 3099858 3083030 1596762 -1351536 -3008224 -907413 2461746 1861495
41132 1861495 -3789984 -9773454 -10977016 -6620453 71058 4615614 4268620 578200
41124 578200 -1677377 -29951 2602240 2507692 437911 -1062953 -2870555 -6870734 -10319646
41115 -10319646 -8786956 -4104219 -2708606 -5384935 -5569349 -36968 5454529 5004255
41107 5004255 1311525 613517 3198559 4454688 2519129 -522514 -3300857 -5859532
41099 -5859532 -6551009 -3125418 2859094 6674943 6083410 3272286 795434 -1313947
41091 -1313947 -3565248 -4918421 -4103046 -1343345 2302299 6037529 8931095 9592321
41083 9592321 7372809 3604910 965739 1242430 3448161 4429460 2259519 -1010015
41075 -1010015 -1419610 1709264 4479143 3292481 -829903 -4264456 -5321813 -4831309
41067 -4831309 -3732952 -2373061 -1147548 215225 2834514 6077680 6482532 2166448
41059 2166448 -3222285 -4505626 -1707379 1302574 3717474 7829558 12111166 10922662
41051 10922662 3620612 -2156863 -607941 3727000 2865189 -3077639 -7485559 -7803357
41043 -7803357 -7496853 -8348559 -7968654 -5826374 -5057758 -6164782 -5041265 -343531 2881765
41034 2881765 1134984 -1073659 1765365 6635679 6268336 909656 -1495329 2847503
41026 2847503 8285750 8437191 4740971 2867127 4389099 6047449 5362214 3295446
41018 3295446 1762754 1150872 683645 -114016 -764069 -507545 131113 -916240 -4427574
41009 -4427574 -7174884 -4694350 2363280 7303259 4763574 -2818724 -8287957 -7961345
41001 -7961345 -4394556 -1855305 -1704957 -2506472 -2688169 -2199405 -2248105 -3638598 -5086095
40992 -5086095 -3896859 711147 5650210 6780305 3562244 -408711 -1651844 -433667
40984 -433667 243461 -1568348 -4628593 -5976275 -4203568 -1021937 784280 847375 1713837
40975 1713837 5241839 9354154 9758562 5006044 -1365235 -4554243 -3709854 -2085189
40967 -2085189 -1856375 -688103 4620715 12148165 15785654 12903754 7768395 5193226
40959 5193226 3904028 -190500 -6411518 -9778633 -8322859 -5093544 -2663764 -536233
40951 -536233 949814 -730941 -5284084 -7637586 -4311335 1462832 4169281 2857139
40943 2857139 549575 -616747 -472263 762909 1973644 892754 -2822191 -6046267
40935 -6046267 -6179761 -4549741 -3546920 -3167606 -2938346 -3735087 -4428850 -952081 6657742
40926 6657742 10580468 4847141 -4792205 -7955510 -4034729 -1231714 -2742639 -3495461
40918 -3495461 -1232893 -817524 -4313547 -5776888 -914035 5398391 6864497 4873722
40910 4873722 3837763 2852259 -1029290 -5161010 -4370380 411137 3320351 2328537 795423
40901 795423 773285 543745 -823518 -1662205 -1526344 -2507539 -5366576 -7757315 -7576995
40892 -7576995 -5320238 -2184542 1524340 5173316 7378071 7741734 7098626 5571022
40884 5571022 2501230 -1304291 -3663060 -4034643 -4128741 -4715827 -4344521 -2495886 -1471829
40875 -1471829 -3035128 -5055197 -4123217 -632690 1293743 -1082226 -6174740 -10589235
40867 -10589235 -12617398 -12279494 -9611546 -4847275 243059 3214273 3604286 3208062
40859 3208062 2975857 1249014 -3401829 -8814303 -10967955 -8836792 -5394477 -3635745
40851 -3635745 -3766992 -4831519 -6584071 -8267957 -7762975 -4389151 -1311708 -2416168
40843 -2416168 -7017148 -10248570 -9276483 -6765991 -6658095 -8294127 -7434611 -2944972 574308
40834 574308 -1227146 -5800471 -6376813 -1042161 4722803 6041100 5264901 7129249 10326193
40825 10326193 9306418 3662613 -148031 2092570 6511050 7138399 3928705 1449721
40817 1449721 2351600 5615485 9273975 11371018 9666130 3961142 -1966950 -3925386
40809 -3925386 -2374922 -1078911 -1298427 -809276 1114068 1442357 -2249157 -7733771 -10560201
40800 -10560201 -9227018 -6148552 -4040273 -2838575 -440896 4203958 9312172 11793427
40792 11793427 10292956 6072433 1092042 -3381830 -5950309 -4983162 -1071848 1921739
40784 1921739 713989 -3032708 -4544818 -2102634 1002289 1296351 -238311 182571
40776 182571 4001669 8405627 9489625 6419728 2012337 -645792 -1491029 -2643783
40768 -2643783 -4653928 -5294179 -2854930 1084629 3875547 5488756 7559697 9291193
40760 9291193 7353409 928002 -5449763 -6143323 -711889 5737471 8349262 7193818
40752 7193818 5678606 5615431 5493367 3623419 1126472 369506 1525215 2746808 3378249
40743 3378249 4536649 6202142 6541583 5387039 5578999 8559876 11009809 9055805
40735 9055805 4280890 1837842 3190371 4678892 3715864 2435541 3480573 5414137
40727 5414137 4947842 1721451 -1764648 -3731105 -4127731 -2863384 294855 3963932
40719 3963932 5587869 4367365 2137907 600053 -830800 -3307230 -5835956 -5835569 -2227811
40710 -2227811 2985121 6172970 4751003 -725454 -6174865 -6739087 -1706518 3910105
40702 3910105 4892086 2507408 2704563 7345536 11153043 9295376 4103214 720951
40694 720951 -665485 -3316998 -6681287 -6583183 -2529910 953954 1471368 1927379 4529014
40685 4529014 6561083 5144969 2079455 527808 315191 -18720 269673 1689841 1502450
40676 1502450 -2394271 -6657376 -6196756 -1407605 2659487 3493607 3178454 3616247 3918225
40667 3918225 3004596 1415938 -5031 -688067 209523 2286799 2521105 -1357902 -6567288
40658 -6567288 -7811817 -3955251 1279100 4950268 7195515 7755449 4880797 -755782
40650 -755782 -5032820 -5477544 -4448262 -5193486 -7246281 -7773798 -5560194 -1892562 1031145
40641 1031145 1485652 -351171 -1601033 790060 6084562 10306962 11093881 9510740
40633 9510740 6821982 2903314 -1029183 -1824690 1243791 4561836 5125801 4760793 6651945
40624 6651945 10101716 12020356 11834285 11301313 10407410 7159127 1623207 -2938168 -3871463
40615 -3871463 -1946086 480122 2300632 3504667 3546270 1596590 -1752976 -4463202
40607 -4463202 -5292720 -5089776 -4916706 -3897507 -812547 2677029 3228482 787301 -884514
40598 -884514 -186070 -576239 -4676270 -9058678 -9136851 -6245926 -4640318 -3956449 -1063435
40589 -1063435 2255832 1103846 -3210683 -3820998 408436 2673652 45045 -1266762
40581 -1266762 2850721 6336479 2920753 -3018033 -3901926 -1637849 -3370848 -8317915
40573 -8317915 -9046908 -4407646 -1207780 -2554477 -3736761 -1598886 273840 -1209631
40565 -1209631 -3249557 -2690524 -1232534 -1339114 -1743422 -763700 14020 -1019749 -2205178
40556 -2205178 -2047883 -2505784 -5118255 -6915444 -4366825 688648 3079298 1013454
40548 1013454 -2618363 -4606580 -4047813 -1529360 1373015 2327016 528154 -1615539
40540 -1615539 -1144771 1711369 4383435 5617216 5985149 5526794 3542989 599869 -1704270
40531 -1704270 -3141948 -4803514 -6323295 -5465585 -1491178 2830431 4021048 1877820
40523 1877820 -504082 -380915 1771053 3037737 1288974 -2568711 -5541368 -5539575 -3083085
40514 -3083085 -206517 1488505 1464812 58110 -1436122 -1319918 572622 1932945 477311
40505 477311 -2585859 -3283336 100115 4132337 3971649 -626812 -5030712 -5742901 -4504479
40496 -4504479 -4831072 -6277259 -5199462 -902055 2600732 2383548 892204 1575376 2757583
40487 2757583 102347 -5707927 -8471503 -4610093 2201528 6445647 7365350 7494678
40479 7494678 7453192 5869223 3073333 1239573 1100109 1407513 1591220 2250725 2911659
40470 2911659 2089227 192278 -262837 1648294 3731067 4121277 3905075 4415139 3963527
40461 3963527 -29886 -6529965 -11050268 -10407082 -5767467 -1128414 66828 -2451391
40453 -2451391 -5009662 -2862837 4021005 9063328 5949999 -3119148 -9721584 -9837602
40445 -9837602 -7575816 -6876728 -4970236 1722042 9407564 10795353 5455850 289649
40437 289649 -108156 2186384 4306209 6850019 10032768 10898955 7869881 4085226 2617903
40428 2617903 1833229 -626206 -2528443 -521527 3352058 3790995 -163531 -4464877
40420 -4464877 -6413902 -6882680 -6302881 -3509804 437085 1931224 26630 -1968548
40412 -1968548 -1863735 -1618314 -2751135 -2706911 745507 4565580 4093992 -55442 -2937337
40403 -2937337 -2468373 -1619780 -2845928 -3885732 -1155715 4540812 8064656 5750606
40395 5750606 -121037 -3496423 -1038678 4466662 7789392 7296945 5651892 5039487
40387 5039487 4408353 2335184 41499 -526868 32346 -363146 -1828275 -2477110 -1539921
40378 -1539921 -342413 -55710 -391590 -946086 -2133895 -4023612 -5478962 -5278673 -3336406
40369 -3336406 -374803 2685704 4488884 3492470 -382990 -4749006 -6463051 -4502889
40361 -4502889 -650203 2529838 3697155 2854736 656867 -1691387 -2737173 -2218711
40353 -2218711 -1827876 -3130531 -4837251 -4016049 -563810 1735156 223280 -2494955
40345 -2494955 -2031420 1348163 3035611 763056 -2394090 -2691094 -378972 2067233
40337 2067233 3866619 5622130 6736566 5865603 3421504 1527703 1673217 3842742
40329 3842742 7325946 10705226 11682598 9030187 4702643 2169201 2435110 3295719 2683590
40320 2683590 1058242 77716 566675 2493569 5446745 8194015 9097658 8157965 7588452
40311 7588452 8964169 10573093 9325110 5117917 1443088 942835 1844574 326148
40303 326148 -4095729 -7275975 -5165526 1269116 6979821 8335257 6532545 5334692
40295 5334692 6509624 8450294 8929768 8022832 7579211 8213977 7971190 4759570 -411289
40286 -411289 -3958197 -3835147 -1902036 -1316762 -2606425 -3644357 -2751512 -157184 3120244
40277 3120244 5800094 5872122 2189571 -2596634 -3224097 2075391 8319060 9010171 3796692
40268 3796692 -1536610 -2475608 -485456 532672 39943 770067 3688684 5802002 4176368
40259 4176368 449597 -963948 1010486 2356564 -330884 -4594420 -5355211 -2382418
40251 -2382418 -887234 -4016796 -8318574 -8886626 -6283422 -4994385 -6358494 -6858474
40243 -6858474 -3777360 705498 2570849 926470 -1978690 -4344170 -6163366 -7254980
40235 -7254980 -6189524 -2288905 2408518 4617412 3188167 105159 -1880963 -1635791
40227 -1635791 388748 3084038 4812449 4075598 1525917 216094 2018599 4636198
40219 4636198 4370803 1273969 -1191304 -1561886 -2178362 -4567587 -6231568 -4286476 -89569
40210 -89569 2398090 1694463 -76107 -511218 560567 1692594 1626403 628164 514262
40201 514262 2498560 4761763 3962807 -23481 -3160308 -2638246 -905938 -1922278 -5318804
40192 -5318804 -7333403 -6370808 -4414719 -3335564 -2807092 -2047160 -1099052 16850 1439330
40183 1439330 2490761 2278003 1398277 1515021 3166472 5194266 6113621 5121160 2536521
40174 2536521 169477 -140895 628578 -436633 -2927003 -2101542 3710573 8295698 5239571
40165 5239571 -2209875 -5322439 -2496255 -358332 -2183116 -3297504 -350988 2569014
40157 2569014 1424218 -625129 923023 3922793 3542742 515977 -857241 -328778
40149 -328778 -973909 -2554738 -2076410 -302632 -1267656 -4762633 -5403307 -910487 3948672
40140 3948672 4223094 1306643 -373575 120360 329785 -1108405 -3140611 -4372376 -4166811
40131 -4166811 -2477379 -315375 491836 -443983 -969990 907995 4070749 5658043 4739893
40122 4739893 2968466 2073555 2508059 4361454 7561261 10672426 11335670 8999379 5928291
40113 5928291 4295608 3471958 1892301 635933 2495131 7190881 10256336 8330203
40105 8330203 3665294 1246708 2692907 5365460 6602416 5984508 3678869 -158754
40097 -158754 -3416511 -2464711 3421644 9851102 11470200 7394619 1273576 -2880032
40089 -2880032 -3579507 -1647075 1307360 4365199 7755583 11325975 12969057 10507080
40081 10507080 5321054 1556897 837608 505610 -1530566 -3384963 -2929648 -1766311
40073 -1766311 -2083221 -2177796 674702 4689441 5597808 3304118 1713008 2172343 2213139
40064 2213139 1437227 3179495 8189822 11671858 10052872 6738534 6905492 9460795
40056 9460795 9084094 4802352 1366739 1855038 3567307 2970341 1054258 993620 2758435
40047 2758435 3392360 2017790 1411648 3771160 7219175 8230315 6280541 4076631
40039 4076631 3509427 3423982 1980594 -359375 -1329814 412308 3837548 6319937 5639447
40030 5639447 2203106 -530084 610386 4186486 5177969 1553934 -2409818 -1563790
40022 -1563790 3277020 6913829 6942944 5830929 6145378 7421872 8517155 9725053 10976183
40013 10976183 10558479 7617924 4161099 2652073 2752436 2085184 -473227 -3522629
40005 -3522629 -4715716 -2895462 772288 3389828 2819433 -60355 -2272046 -1860285
39997 -1860285 787638 4178153 6617604 6410788 3583260 1398291 3315566 7878617
39989 7878617 9715302 6744444 3033242 2588076 3857143 3580297 2990593 5542380 9947780
39980 9947780 10580192 5363197 -841217 -2268436 1113510 4573860 4230720 257733
39972 257733 -4096679 -5465244 -3202812 86104 1610878 1904171 3858917 8324639
39964 8324639 12696887 14444647 13966853 12887930 11463728 9264915 6967738 5674430
39956 5674430 5340844 5352536 5779243 6633673 6902260 6028888 5467926 6810969 9131206
39947 9131206 10445646 11210593 13530083 16857520 17690958 14621214 10827479 9840317 11165719
39938 11165719 12002196 11093630 8710026 5072337 1638340 1878890 7016372 12233906
39930 12233906 11365363 5115393 401900 1134599 4001522 4609296 3345531 2673949 2331743
39921 2331743 558682 -2251577 -4140924 -4197587 -2426279 894964 3583777 1967632
39913 1967632 -4059816 -8773693 -6928727 -513829 4279159 4996813 3954107 3044345
39905 3044345 2142471 1841727 3124124 4489050 3716772 2252022 3261205 5490292 4393176
39896 4393176 53131 -1806930 1308668 4341288 2376359 -2156846 -4001386 -2861264
39888 -2861264 -2003320 -1889703 -304320 2517387 3768081 3077767 3523769 6624503 9371590
39879 9371590 7940192 2739713 -1873318 -2525202 -286410 1283906 818680 282964 1098804
39870 1098804 1486876 -294319 -2156582 -1024897 1793198 2237915 88870 -690059 1346009
39861 1346009 2893999 1645434 -510651 -1814167 -3251130 -4417388 -1907421 4615850
39853 4615850 9452132 8290576 4506988 3366602 3887502 2057764 -1131625 -1329116
39845 -1329116 1493430 3533611 4339142 6918888 10555196 9942835 3192860 -4404488
39837 -4404488 -6853701 -4053778 -165157 1531471 540580 -1591196 -2527801 -1255255
39829 -1255255 740103 1939594 3511774 6895140 9723683 8054332 2621153 -1164419
39821 -1164419 -309587 2246689 2488133 563560 -457911 1280169 5046928 8582958
39813 8582958 9469351 6850347 2587183 -211892 -9810 2229498 3936847 2171890
39805 2171890 -3780470 -9557345 -8564533 -440824 6692120 6321605 2192686 1433487 2790939
39796 2790939 -361693 -7356124 -10104927 -6146861 -2177238 -1980322 -281294 6585326
39788 6585326 12357853 10013759 2888010 -798616 120403 767612 -317526 -483480 283133
39779 283133 -570853 -2135224 -1103097 1151951 -514469 -5934250 -8115619 -3377238
39771 -3377238 2773305 3703480 1059514 1158600 4763572 6235876 2619305 -1936567 -3019816
39762 -3019816 -2956071 -6652714 -12497107 -13009951 -5576953 2578195 3399753 -1816559 -5712475
39753 -5712475 -5602783 -5201126 -6645920 -7077875 -4294895 -536978 1391964 1630037 1088083
39744 1088083 -314145 -1579173 -811109 866705 -137740 -3672176 -5101302 -3078439
39736 -3078439 -2460327 -5959164 -8630141 -5652279 -426448 1211986 524309 2526149
39728 2526149 6324207 6660017 3523102 2270281 4153820 4213676 -46567 -4443484 -4809457
39719 -4809457 -2597432 -1374169 -2018860 -3615861 -5373333 -5665097 -2650249 2189961
39711 2189961 4311408 1836663 -1736601 -2184692 720217 4421023 6577908 5501094
39703 5501094 828978 -4324391 -4980596 -398442 4073917 3635740 -21741 -2071277
39695 -2071277 -1335662 -265411 43566 703817 1420924 45495 -3509170 -6235002 -6384799
39686 -6384799 -6083874 -7393588 -7974719 -3980993 3480865 8541466 8198706 6370011 7909968
39677 7909968 11268169 10906592 5793272 1074402 875665 3492309 5139543 4929976 4119702
39668 4119702 3427746 3332738 4380495 5082407 2456981 -2762777 -4604055 925385 9540086
39659 9540086 13417527 10381292 4731316 918553 509686 3593264 8241681 9429425
39651 9429425 3607630 -5381694 -9409935 -5731444 248476 2402186 400622 -1891145
39643 -1891145 -1140049 3209255 8661510 11202043 9482867 7025601 7491931 9010543
39635 9010543 7177111 2611716 494004 2782693 6193631 8217475 9487430 9324179
39627 9324179 5230754 -1029751 -3007970 1429966 5996560 4660005 -437722 -3928584
39619 -3928584 -5367078 -7173987 -8209810 -5537584 -623020 1974625 1374694 999912
39611 999912 2747473 4840712 5547807 5183382 3959395 1138503 -2911643 -6282271 -7666760
39602 -7666760 -7049972 -4386899 174551 4761131 6862407 6439094 5928167 6575695 6759483
39593 6759483 5065452 3336364 4593735 8218123 9438037 5178309 -782248 -1373208
39585 -1373208 4470226 9356656 6780040 48316 -2348954 1421602 4827481 3142785
39577 3142785 -590532 -1801602 -1353818 -2809640 -6502848 -9991246 -11766035 -11448654
39569 -11448654 -8884262 -5926186 -6249504 -10044257 -11666755 -6477019 2231721 7197061
39561 7197061 6224415 3093110 1043453 12769 -340590 554319 2016183 2331597 1490415
39552 1490415 878467 482561 -715350 -2061668 -2058872 -1326484 -1466443 -1640278 10306
39543 10306 2132120 1771384 217168 2265768 8500292 13127957 11683238 6669620 2848903
39534 2848903 802969 -1323614 -2844883 -1586225 1807886 4608184 6131631 7547873
39526 7547873 8208934 6024550 1751955 -736227 425242 2737999 3499387 3428696 4138981
39517 4138981 4670639 3517354 2274421 3701775 6896072 8008544 5844876 3235159
39509 3235159 2225115 1524018 8318 -915175 -524477 -925138 -3309242 -5205980 -4460865
39500 -4460865 -2852404 -2425602 -1723762 156927 -332718 -5279525 -9055756 -5426136 1583010
39491 1583010 2704097 -1805772 -2481688 3337820 6638664 1553879 -5141655 -5304804
39483 -5304804 -1429632 -68458 -540485 1524404 4963145 5891949 5598599 7522934 9741899
39474 9741899 8285903 4959639 4104086 4320323 1383681 -3017636 -3718942 -1282809 -336932
39465 -336932 -448931 2313415 5878255 4035270 -2106210 -4469867 -1080918 1044946
39457 1044946 -1636287 -3643194 -1129725 1009308 -2153805 -7305487 -8819575 -6800039
39449 -6800039 -4077086 -720145 3407157 5471249 3800647 1041172 -539351 -2246454
39441 -2246454 -4075767 -2273891 3889197 8441921 6792818 2464014 772925 993622
39433 993622 308210 253245 2708917 4160828 1123601 -2625229 -1625880 1904973 2099239
39424 2099239 -189524 402884 3284846 2982215 66796 1391070 8113316 12523597
39416 12523597 9706987 4477376 2832651 3354648 1870819 -872405 -1595363 -692469
39408 -692469 -843985 -1925124 -1916783 -1145686 -1382430 -1796601 291493 5015684 9675652
39399 9675652 12796168 15336440 17322505 16267691 10686702 3445566 -475861 828524
39391 828524 4729154 7667035 8588856 8215921 6655153 3660810 600333 -172269 1548832
39382 1548832 3028752 1793423 -1547976 -4319339 -4560257 -2397774 238673 1125171
39374 1125171 232091 355845 3330496 6319996 5208334 1608758 1932619 7943061 13016424
39365 13016424 10988849 4583826 747398 909279 1116016 -190648 -266876 2375490 5525177
39356 5525177 7091065 7461313 7267691 6132640 4505289 3904263 4444856 4386708 2752935
39347 2752935 560163 -639427 306590 4078689 9439495 12527946 10457986 5403820
39339 5403820 2262150 2348569 2425404 210363 -2289899 -1901809 1676042 5973543 8235916
39330 8235916 7351727 4732660 3212180 3679186 3529458 280525 -4387341 -6686486 -5790548
39321 -5790548 -3904587 -2074032 753864 4785990 8699486 11812192 14138688 14882213
39313 14882213 13951549 13975402 16967028 19885949 18084299 12704474 9571375 10678241
39305 10678241 12280172 12082996 12361121 14422690 16131865 17350799 21588326 28684123
39297 28684123 31896530 27113862 19732361 16655320 15952477 11387013 4191772 2427505
39289 2427505 8927331 16796280 18408548 13817544 8379999 5943411 6564635 8347837
39281 8347837 9377896 8923682 7786091 6949611 6094224 4403029 2242248 729919 273745
39272 273745 836144 2667212 5085083 5551617 2217857 -2949915 -5614717 -3716296 725836
39263 725836 4257273 5102286 3842977 2282756 1799501 2304129 2968288 3808046 5492065
39254 5492065 7747636 9689636 11679904 14448633 16189992 13851621 8413202 5246382
39246 5246382 7144131 10403071 10466010 8210692 7527112 9672302 13390264 17581151 20144148
39237 20144148 17532972 10110565 4742255 6431146 10113794 7391277 -590447 -4671861
39229 -4671861 -1414935 3021834 3770856 3560211 5200370 5691751 2711603 615234 4014863
39220 4014863 9908087 12266254 11208349 11488767 13911021 14416445 11273201 7766662
39212 7766662 6926306 7657022 7450657 6200661 5941042 8136009 11887742 14425029 13929844
39203 13929844 12169603 12668463 15624283 17281447 15860217 14767566 16936410 19184522
39195 19184522 16714088 11071660 8241180 9642143 10785302 9438073 9267105 13040405
39187 13040405 17258386 17312788 14482935 13469359 14989142 15314755 12693423 10037318
39179 10037318 10118225 11207399 9765413 6012216 4201308 6941698 11179127 11578629
39171 11578629 7231327 2690389 1880672 3672197 5352421 7737233 13021107 19053349
39163 19053349 20861693 18386352 17543053 21457477 25466802 24444368 20895437 20625222
39155 20625222 23226609 23140006 19230273 16843304 19398881 23763969 26122665 27289373
39147 27289373 29110628 30092010 28660282 27332740 29111971 32242299 33334473 33804539
39139 33804539 37701980 43837239 46164316 43328081 42320014 49439989 61420741 69446656
39131 69446656 69949072 67666012 68818204 74834051 83475679 93423844 105675879 121023654
39123 121023654 137954377 154140748 169683898 187697965 211265370 240763112 274481200
39116 274481200 310084353 344292999 373249604 395495385 412730569 424676546 425292533
39109 425292533 408868569 379153496 346891986 317547968 287198430 252539783 218676584
39102 218676584 192505515 173110001 154348410 134047999 115027477 98917556 84749553
39095 84749553 73033088 65844712 62507988 59713706 56483105 54878664 55108484 54025120
39087 54025120 49749996 44205131 39551893 35275993 30522232 26628946 25378680 26525290
39079 26525290 28523764 30299075 31393318 31820466 32410904 33857811 35086380 34116064
39071 34116064 30706744 26617969 23445485 21920968 22710463 25502126 27726034 26822616
39063 26822616 23565016 20671692 18868602 17307432 16776313 18437680 20095990 18577945
39055 18577945 15778166 16941101 22189898 25499578 23668549 20370133 18840766 16732967
39047 16732967 12086284 8746725 10788013 15915908 19509450 21365281 23216456 23312691
39039 23312691 19527763 14983472 14169763 15415946 13661713 9450954 8489188 12418203
39031 12418203 16485258 17321257 17271605 19228934 21915738 22574636 21058056 19439523 19740162
39022 19740162 22622469 26269111 27044924 23832374 20496243 20706750 22083715 20141034
39014 20141034 16353437 16003524 18558070 17645267 11963443 8562557 11892608 16494045
39006 16494045 15597323 11427183 10822809 14385275 16448018 13947301 9496138 6379631
38998 6379631 5483923 6979981 10557970 13618892 13084631 9739501 7672262 8832239
38990 8832239 11064694 12102993 12294795 12061929 9740804 4448114 -804476 -1821944
38982 -1821944 1400738 4569197 4707134 3603225 4517658 7501760 10191541 11891032
38974 11891032 13697823 14812878 12556753 7309709 3563686 3399175 2523586 -3049034
38966 -3049034 -9227239 -8412203 -733968 5462261 5070559 2219709 2585846 5064155 4930819
38957 4930819 1557754 -1464575 -1981916 -1139666 -354487 519142 2031859 4017013 5571062
38948 5571062 5364576 2809591 -486233 -1769878 -309455 1940090 3181565 3317070
38940 3317070 2420866 458219 -752302 1424366 6001806 8336643 6549508 4559444
38932 4559444 6003587 8550953 8103145 5984527 7129202 12067426 15347748 12682416
38924 12682416 6482930 2939251 5072171 9554158 10209649 4920260 -1334804 -1987515
38916 -1987515 2753699 6002301 3434936 -1223578 -2089472 992845 3732495 3946776
38908 3946776 3067931 2563902 2236129 1483849 104014 -1311502 -786361 2897230 6426487
38899 6426487 4223825 -3237484 -7930208 -4779619 920066 1629099 -1267139 -1084691
38891 -1084691 2581967 3802778 600141 -2508959 -2614040 -2057100 -2775746 -3114170 -1865148
38882 -1865148 -312227 1060210 3153009 4823733 3871514 1919877 2736561 5059159
38874 5059159 3399573 -2693541 -6971587 -6374755 -5609737 -8297150 -10291573 -6974625
38866 -6974625 -1762172 -1264401 -5474721 -8481109 -6807570 -2275086 1962398 4385262
38858 4385262 5210945 6084827 8159399 9190198 5740451 -255530 -1960288 2413311
38850 2413311 5549974 1679751 -3819507 -2055217 5810809 10347893 7634574 3552952
38842 3552952 3987029 7598168 10091509 10087021 8249630 4787552 616615 -1687285 -508421
38833 -508421 2677768 5105921 5515056 4602235 3857479 4164103 4698485 3736995 1474921
38824 1474921 673883 2860244 5500860 5400182 3601377 4030277 8001696 12831655 15422251
38815 15422251 14704857 11115332 6280395 2833788 2072539 2137467 660262 -1572949 -1963473
38806 -1963473 -157018 1894108 3119680 3946754 4573502 5190006 6755906 8843531 8380157
38797 8380157 3967603 -321021 273613 4100695 5764724 4813774 5865574 10005618
38789 10005618 12338208 9612713 4628772 973690 -1285034 -2150534 621623 6693260
38781 6693260 10579920 8368351 3705210 2764247 5810271 8012945 6702146 3575371
38773 3575371 808766 -1096024 -1809934 -573494 2619750 6847941 10811769 12531291
38765 12531291 9990147 3706262 -2606545 -5313221 -3594524 1450609 7774981 11663008
38757 11663008 9865324 4596162 2603587 6388425 10289727 9004278 5735430 6525386
38749 6525386 10101127 10308080 6739783 5354490 8453136 11215506 9694150 5995826
38741 5995826 3411047 2063938 1958198 4963298 10394528 13217305 10515907 6153325
38733 6153325 5305263 7531904 8942818 8301511 7047900 5653006 3880912 2820941
38725 2820941 3149188 3259173 2394670 3187380 7174841 10373018 8181703 2668278 -493492
38716 -493492 -772508 -2148042 -4392874 -2305283 4898404 10296609 8553522 3064196
38708 3064196 193829 966910 2509981 3930546 6237886 8932833 10689479 11583002
38700 11583002 11546885 8987166 4106497 834842 1684973 3450107 2398616 988453
38692 988453 3865078 9110806 10020039 5335085 1275153 2240528 5313086 6068443 4747513
38683 4747513 3805909 3419231 2595495 1799937 1667126 1441579 973178 1988866 5280031
38674 5280031 8801943 10494013 10771023 10372608 8233684 3841759 -382306 -1564257
38666 -1564257 173037 2587935 4085121 4032043 2206588 -326632 -1522857 -978565 -369489
38657 -369489 -365329 87090 370346 -1935264 -5695498 -5366293 751578 5707238 2618836
38648 2618836 -4968238 -7533566 -2536906 3448896 4901849 3184029 1474671 -84675
38640 -84675 -1976232 -2665785 -1083125 1225050 2319241 1866088 -25288 -3132070 -5396035
38631 -5396035 -4010875 498582 4165814 4763243 4162840 4254635 3762547 1178336 -1866170
38622 -1866170 -2610869 -750618 1948976 4051802 4857062 3959188 1913181 53336 -1296975
38613 -1296975 -2798451 -3626790 -1508316 3347685 6792834 5385213 855524 -2074113
38605 -2074113 -1090129 2164400 4706676 4773836 2808231 1168970 1774942 3213202 1997699
38596 1997699 -2160389 -4722091 -2128785 2740006 3834501 -306473 -4902164 -4843004
38588 -4843004 93140 6017227 8839257 6999817 2072737 -2465805 -3973681 -2830219
38580 -2830219 -1596128 -1955921 -2994835 -2572004 61789 3247436 4441491 2742471
38572 2742471 -109347 -1236215 1012420 5902454 10629694 11757914 7914125 1976834
38564 1976834 -942271 857893 3446072 2336385 -1913538 -5467127 -6688635 -6556958
38556 -6556958 -5108244 -1701121 1721334 2091205 51543 -1059519 -1201785 -3498828
38548 -3498828 -7398379 -7961681 -4114391 -1457465 -3240784 -4363553 522650 7811850
38540 7811850 10057477 6791566 3629873 2938031 2306491 1195653 2085647 4674753 5291730
38531 5291730 3298028 2463940 4384948 5787545 4464697 2915839 3314548 3352055 627855
38522 627855 -2429624 -2001398 1328520 4102722 5330080 6258987 6220679 3284432 -948730
38513 -948730 -1643337 2665808 7150068 6646456 2171617 -1224813 -1585484 -1764900 -4289864
38504 -4289864 -7860089 -10132865 -11218220 -12220562 -12172057 -9154470 -3718545 1249260
38496 1249260 3746431 3775586 2040535 -53990 -37241 2785354 4793691 2315098 -1843076
38487 -1843076 -1120911 4727781 8094916 4592348 -86931 1269218 6764219 8845502
38479 8845502 4917393 -1320046 -6480490 -9278691 -7709804 -1232353 4955964 4518121
38471 4518121 -944972 -3745753 -1458069 464174 -1182065 -2029518 1557481 5367860
38463 5367860 3651919 -2000244 -5391184 -4234078 -990103 2471300 6086775 8753925
38455 8753925 8864906 7466820 7360816 9067043 10401832 9796567 7616676 4634508 1550944
38446 1550944 -426895 -814210 -1154190 -2814761 -4077903 -2083503 2494718 5477459
38438 5477459 4335736 930881 -1589765 -2410706 -2461709 -2163944 -1499680 -1272683 -2443880
38429 -2443880 -4311357 -4820246 -3204872 -1305165 -1236300 -2264255 -1570702 1501167 3782611
38420 3782611 2429453 -615820 -839091 2519263 5224793 3886608 439702 -799542
38412 -799542 1317427 4053667 4514341 2441830 -85462 -633910 1256787 3098259 1968592
38403 1968592 -1351550 -2459519 1259904 7025888 10076356 9110865 6386934 3809572
38395 3809572 1359445 -1284700 -3799091 -5655231 -5982133 -3785722 18178 2003956
38387 2003956 50986 -3176436 -3344868 -462276 1352843 -1957 -2169705 -2658820
38379 -2658820 -2121605 -1789769 -779909 1688947 3707857 3006364 476725 -1084124 -808848
38370 -808848 -93316 108817 -62429 -1050394 -3683129 -6866298 -7590603 -4369719 404113
38361 404113 2468248 -261170 -5736359 -9329671 -7557899 -1246098 4899219 6639176
38353 6639176 4177258 1238307 681527 2143807 3547576 3221390 543516 -3533371
38345 -3533371 -6118863 -4662185 -654021 1000615 -2052365 -6135675 -6256519 -2767085
38337 -2767085 -324461 -907651 -1394503 1202685 5206835 6775557 4881397 1752503
38329 1752503 -473982 -1566181 -2139257 -2440796 -2334137 -1606432 -206772 1475438 2884669
38320 2884669 4099119 5722921 7602313 8415370 7139362 4362636 1713598 580968
38312 580968 1528342 3865294 5378260 3796885 -638641 -5125092 -7485462 -8128280 -8104251
38303 -8104251 -7049846 -4643763 -2524418 -2536727 -3901768 -4277994 -3178771 -2253042 -2287134
38294 -2287134 -1873024 644245 5241041 10286577 13417934 12719166 8508222 3796002
38286 3796002 1609695 2030359 3021691 3480833 3757351 3797160 3051807 2209504 2794980
38277 2794980 4642601 5686576 4785990 3063629 1914145 1274831 487441 -488835 -1344515
38268 -1344515 -1940917 -2360639 -3198707 -5198320 -7297078 -6215405 -555355 5360834 5237734
38259 5237734 -984852 -5994121 -3736102 3482871 8445259 7445715 3086051 92911
38251 92911 592544 3156036 5111845 5644807 6509110 8937160 10644690 8153259 2030176
38242 2030176 -2897016 -3166226 74887 4008863 7145227 8294996 6235791 2571101
38234 2571101 1563059 4323316 6158823 2885232 -2965024 -5855598 -4692291 -2483919
38226 -2483919 -717351 1219192 2445926 1499002 184929 1463209 3697255 2424370
38218 2424370 -1728381 -2898523 486867 2129349 -2650104 -9024078 -9269315 -3753498
38210 -3753498 253988 -1069828 -4470885 -6052223 -6244088 -7006963 -7769760 -6335884 -2141313
38201 -2141313 2778093 5345474 3899902 154638 -1867132 -563798 318682 -3920028
38193 -3920028 -11853590 -16466608 -13579981 -6622971 -1449806 554677 1581606 2077350
38185 2077350 150554 -4256655 -8029146 -8468980 -6038735 -2790094 131689 2456510
38177 2456510 3708692 3577280 2948753 3468782 5717917 8195421 8775328 7455436 6710474
38168 6710474 7879368 8250494 4510680 -1045737 -1876058 3376122 7077119 2203387
38160 2203387 -7528827 -12404283 -9477814 -4434996 -1592825 819367 4249756 5757957
38152 5757957 3560192 1028985 1364687 2756798 2424628 1186247 396094 -1201854 -3517728
38143 -3517728 -2640447 2896385 7897061 8047688 7180870 10463455 14581288 12783241 6716894
38134 6716894 4267114 6978264 8650028 6235152 3174621 1193432 -2202890 -6289195
38126 -6289195 -6011615 -1110217 1907234 216297 -942609 1826200 3930733 1538976
38118 1538976 -1199271 346198 3394844 3866400 4129869 7475586 10343668 7896656
38110 7896656 2956189 1407162 2249024 358579 -3554652 -4029888 -260463 3379529
38102 3379529 5129815 6698385 7129662 3454564 -2421104 -4642259 -1943608 1091180
38094 1091180 1837354 2359591 3638450 3512042 1716597 995946 1651195 668464 -2088809
38085 -2088809 -2425977 1431576 5743879 6858648 5094281 1505014 -3872659 -8665902
38077 -8665902 -8804537 -5201835 -4201811 -8024921 -10247256 -5136990 3307304 6851996
38069 6851996 4026674 214414 -961611 -1005678 -2112693 -3807454 -4399170 -3221874 -1303754
38060 -1303754 -893370 -3143773 -5479246 -3750216 1501558 4072714 39041 -6225999
38052 -6225999 -7562061 -3464752 139286 -274137 -1343670 2009997 9611934 15649139
38044 15649139 14544957 6826875 -903808 -2451058 1831775 6738541 9227325 10575843
38036 10575843 11439003 9369314 3719072 -961535 -349310 3384784 4829707 3024261
38028 3024261 1476779 1546005 718085 -1986525 -3377463 -904002 2964635 3809602 1227570
38019 1227570 -721300 1167848 5253322 7052892 4413902 -306551 -3148242 -2507150
38011 -2507150 363535 3545199 5781539 6619688 7095553 9499889 14195031 17427759
38003 17427759 15392457 10190917 7895986 9993769 10996901 6592988 282383 -1311589
37995 -1311589 2920362 7956648 8950529 5313006 -38865 -2933419 -804803 4259049
37987 4259049 6541229 2912691 -3265832 -6296131 -4444391 -140662 3873833 5960721
37979 5960721 5214438 2760435 1912823 4264844 7247005 8194488 8570805 10790173 13173726
37970 13173726 12311925 8718081 5589448 3299470 65889 -2721965 -1207050 4646177
37962 4646177 10243494 12371041 11730510 9353647 5291644 1401396 478268 1689851
37954 1689851 1714876 1106067 3768198 8787962 9495919 3687494 -1774461 -1096162 1560407
37945 1560407 -845117 -6932515 -9448246 -6160138 -1511211 916974 1394430 616444
37937 616444 -784276 -81570 4252684 7607647 3964476 -4189941 -7476861 -2638363
37929 -2638363 2805948 1723902 -3135788 -5034023 -3274416 -1922365 -2239640 -2271024 -1901950
37920 -1901950 -2734061 -3776563 -2309482 1019883 2460536 926845 -683701 -907423
37912 -907423 -2455652 -7518089 -13291022 -14776605 -10596348 -4072710 607239 1844722
37904 1844722 840870 -358326 -849202 -1138718 -1574333 -1350200 114999 1744361 2173546
37895 2173546 1775061 1582687 1020588 -1034933 -3564736 -4504994 -4188910 -4547710 -4931303
37886 -4931303 -2555051 2042426 3993664 362878 -6101258 -11364924 -14444069 -14966565
37878 -14966565 -10922705 -2988219 2714212 1551785 -2435052 -1985515 2570534 4429089
37870 4429089 1594907 -186569 2749701 6051685 4696406 923701 234894 3024970
37862 3024970 5123753 4825735 4676084 6446397 8099432 6823996 2941595 -549748
37854 -549748 -1689514 -1875983 -3910458 -7777205 -9725390 -6801162 -1025138 3029037
37846 3029037 3719915 2664396 721071 -2342137 -4402162 -2025801 3824672 7670036
37838 7670036 6970244 5243452 5395513 4850657 1051811 -2741853 -2213291 844866 1630813
37829 1630813 82848 -285766 567343 -286935 -2052600 -782913 2894793 3431744 -383423
37820 -383423 -2247526 2194292 8126925 8339223 3299078 -518739 109676 2527704 3572588
37811 3572588 2912914 1196963 -1030923 -1999296 216916 4256341 6087495 4448202
37803 4448202 2967184 4875426 7918403 7433209 3222747 -52065 607457 3054325
37795 3054325 4375149 5563343 8906944 12806955 13233027 9961166 7245442 7388742
37787 7388742 7683377 5836504 4544759 6985838 10639364 10460650 6879559 5333572
37779 5333572 7631733 9126713 6305096 2374526 1969884 3950945 3805942 1111741
37771 1111741 -108917 1979036 4304955 3627860 710457 -1538952 -1664821 -147971
37763 -147971 1630740 1671053 -1401516 -5928834 -7931443 -5852990 -2755055 -1935795 -2475500
37754 -2475500 -1813499 -742562 -1986907 -4878732 -5941846 -4791399 -4695588 -6288102 -5807294
37745 -5807294 -1877507 1004807 -544519 -2873791 -1280622 1980759 1917152 87957
37737 87957 1939822 5958190 4328367 -3874054 -8760993 -3423159 5254246 5923246 -1675216
37728 -1675216 -7634278 -6135319 -1659526 -731729 -3411239 -5086201 -2964077 1649068
37720 1649068 5673477 7133463 6497553 5851963 6292177 6451719 4618987 1797314 1009537
37711 1009537 3354885 6182021 6031044 2817453 98557 696435 2726377 1732795 -2622151
37702 -2622151 -4478410 958648 9741499 12760546 6827918 -1960663 -6671240 -6996751
37694 -6996751 -6435464 -6141393 -4817457 -2183878 486717 1927431 1279187 -1319501 -3559225
37685 -3559225 -2905526 -522183 72062 -1007915 31002 3295385 3616556 -624146 -3211091
37676 -3211091 583670 6027696 6352544 3245375 2756513 4639407 3801492 -157964 -3041213
37667 -3041213 -4115327 -5916511 -6941734 -3140490 3061232 3883252 -2036899 -6952721
37659 -6952721 -5527136 -1726157 -1092088 -2814032 -3453286 -3121499 -3679169 -4633921 -4352059
37650 -4352059 -2553143 485572 4312395 6864911 6149297 3813603 2981650 2752755 136933
37641 136933 -2924862 -1412083 3364866 4188087 -376256 -3144641 -275711 2649799
37633 2649799 1028207 -923744 1266639 4022546 3268068 2906839 7215440 11068989
37625 11068989 7397491 -356216 -3297817 -1174815 -1069154 -4129235 -4284917 81985
37617 81985 3393270 3023623 2925124 4937831 5003058 1273380 -1406659 903204 5130639
37608 5130639 6663148 5948168 5625855 5161461 2475020 -1780891 -4999761 -5897179 -4772376
37599 -4772376 -2308207 217968 1281990 834820 61001 -780392 -1969725 -2056472 599177
37590 599177 3790385 3024787 -1764224 -5102840 -3432582 42148 470082 -1826095 -2747126
37581 -2747126 -640799 1905577 1761128 -1346482 -4959733 -6425437 -5379792 -3655239
37573 -3655239 -2475863 -1094955 620850 615540 -1574064 -2033735 1952482 5533689 1831917
37564 1831917 -6599955 -9282679 -2474100 5101685 4868610 -20102 -1131601 2678656
37556 2678656 5867375 5854140 5055293 4878224 4011640 2260779 812844 -984717 -4203973
37547 -4203973 -6095997 -2566673 4711275 8831831 6541648 2073767 665956 2584063
37539 2584063 5415810 8006003 9416669 7653135 2806146 -1089096 -588992 2588439
37531 2588439 4376556 3994262 3773120 4815417 6139036 7434154 9462953 11707153
37523 11707153 12292312 10593538 7932810 5619318 4029472 3290514 2962220 1613420
37515 1613420 -1020007 -2182652 712348 5610654 8084684 7877145 8796124 11437113
37507 11437113 11221994 6000848 519071 -492746 766321 32990 -1143909 1302890
37499 1302890 5380428 5132950 667517 -1430204 1252282 3179894 454909 -2459748
37491 -2459748 14523 5681986 8098476 5623918 1911521 -403283 -1632925 -1823979
37483 -1823979 -19497 3335856 6318910 7708336 7200784 4567033 861436 -1076609
37475 -1076609 -188238 171253 -3427635 -8463053 -8720190 -2867386 2811744 1836118 -4453150
37466 -4453150 -8214987 -4139128 3971636 6822591 522037 -7755781 -7858133 383618
37458 383618 6833189 4597648 -1507133 -3086124 373104 3154297 2603979 807315
37450 807315 -722862 -2024293 -1633385 1640113 4525652 2533939 -2688220 -4665606
37442 -4665606 -1105417 3544579 5111058 4164579 2454782 -253684 -4093573 -7564548
37434 -7564548 -9249448 -8120262 -2648678 6244163 12314826 9813205 2090289 -1936187
37426 -1936187 -388212 -273070 -5164440 -9134600 -6790581 -2003829 -1214917 -3911287
37418 -3911287 -5703085 -6086020 -6856688 -6566735 -3103493 712005 372435 -2970167 -4087010
37409 -4087010 -1728134 127388 -1076137 -3057042 -2485457 867145 4133874 3902425
37401 3902425 -379847 -4518878 -3454648 1658831 3948485 593512 -2737892 -1140106
37393 -1140106 1044600 -2769002 -9901890 -11684654 -6364724 -896209 -113623 -1521162
37385 -1521162 -1727994 -1226681 -932006 116237 1372655 224340 -3004188 -4249499 -2160020
37376 -2160020 -641665 -2242364 -3494407 -423013 4866411 7071964 4817083 1212726
37368 1212726 -1196165 -2708391 -4326555 -5998299 -7077370 -7058173 -5823474 -3772250
37360 -3772250 -1432964 967933 2803593 2607035 33853 -2307370 -1331190 2356273
37352 2356273 5221891 5649543 5218513 5083400 4445654 3424222 4043999 6831278 9310218
37343 9310218 9549817 8573087 7542124 5265144 781752 -3736640 -5210201 -3551592
37335 -3551592 -1464829 -1392894 -3973934 -8140767 -11329934 -10860746 -6526341 -992638 3066064
37326 3066064 5101173 5771357 5750738 5866436 6361503 5649831 2225521 -1879113 -2685368
37317 -2685368 -127979 1203440 -1419606 -5300379 -7147977 -7487983 -7611668 -6274239
37309 -6274239 -3184516 -1999433 -5060788 -8138619 -5894871 -502704 1181512 -2001117
37301 -2001117 -4389911 -3104546 -2239548 -5230668 -8615181 -7253678 -2182025 940483
37293 940483 -442766 -3185818 -3265797 -680774 1099773 -417942 -3548808 -4248324 -1389478
37284 -1389478 1240365 -67565 -3361644 -3581772 -249196 1410221 -1805231 -6042257
37276 -6042257 -5705847 -1087269 2562527 2120021 -419774 -1530620 45785 3227858
37268 3227858 6045854 6631782 4527881 1759486 1313826 3748437 6283337 6152981 4132861
37259 4132861 3525606 5746830 8236711 7569330 3822985 453128 -96169 1030126 1600500
37250 1600500 1598572 2234404 2784671 958027 -3417527 -7186308 -7159373 -3358758 1411194
37241 1411194 3914998 2247310 -2912907 -8102177 -9831461 -8448637 -7648473 -9313759
37233 -9313759 -10962097 -9820844 -7160122 -5974522 -5976272 -4260927 -487514 2081974 1395230
37224 1395230 -507180 -752890 680632 2327232 4176609 6775702 8657821 7615965
37216 7615965 4513606 3127717 5211642 7754606 6754905 2457224 -1058226 -1020742 1224094
37207 1224094 2804137 2965518 3089402 4107573 5176700 4686042 1842425 -2437045 -5640117
37198 -5640117 -5323703 -1685325 1971564 2553518 742949 -47541 1800358 4182822 4213773
37189 4213773 1590514 -1645922 -3364087 -2507424 718563 4685973 7287449 8049009
37181 8049009 8430495 9207249 8929006 6390593 3291796 2353053 3491388 4024493 2418511
37172 2418511 -174845 -2001109 -2348426 -1197521 626777 879086 -2136866 -6559059
37164 -6559059 -8355898 -6445936 -3849564 -2659208 -807798 4043184 9901881 12609039
37156 12609039 11115335 7912793 5319222 3941653 3905980 4877545 5345764 4291582 2989671
37147 2989671 2910346 2970956 1749811 1060617 3302629 6085558 4560439 -500788 -2450297
37138 -2450297 1691113 6880506 8143233 7685437 9575034 12020237 10758033 6842267
37130 6842267 4592761 3838622 1093028 -2436441 -1409633 4281918 7839458 5464784
37122 5464784 1487197 502775 579337 -1317677 -2664048 -147 3806047 3505462 293822
37113 293822 -19498 3345273 5044927 2612201 170873 1222765 3230255 2515900 298950
37104 298950 -27178 1165502 632896 -2146416 -3924837 -2281139 1332797 3683934 3262180
37095 3262180 1139854 -632227 -919931 -236621 64364 -650720 -1558393 -1240772 687731
37086 687731 2771739 2920087 1088904 224500 2785688 6394535 5871080 846707 -2237493
37077 -2237493 1148057 6311512 5890038 1411873 1327248 7545019 11754121 7915754 1209932
37068 1209932 -514431 1579883 899066 -3094458 -4567020 -1196825 2684739 3269604
37060 3269604 1692462 209746 -836718 -734632 2120997 6322111 7155504 2819998
37052 2819998 -2353046 -3488287 -1173298 748503 904505 917687 1848063 2990856 3476173
37043 3476173 2980774 1472602 -272132 -827046 -151249 -309443 -2622922 -5202738 -5100086
37034 -5100086 -2313943 -146662 -1760112 -7081171 -12558295 -13721611 -9237726 -2811222
37026 -2811222 558695 542352 1310513 4615441 6360399 2549408 -4046254 -6721682 -3020002
37017 -3020002 3223742 7294516 7943094 6601041 5136844 4635509 4370292 2235615 -1947010
37008 -1947010 -4626052 -2736139 1326381 2542339 593853 18587 2548903 4132779
37000 4132779 1691318 -1614942 -1491446 396464 -939163 -5618229 -8115854 -4941941
36992 -4941941 818530 3919176 2969411 285288 -2040346 -3481714 -3457704 -914883 3844553
36983 3844553 8283813 9566636 7111538 2902119 -353466 -1069964 607715 3210344
36975 3210344 4999481 5234265 4435196 3092074 742608 -2595799 -4700504 -2943979
36967 -2943979 1812976 5371600 5354213 3946805 3679150 2939140 -999480 -6014078 -6601548
36958 -6601548 -1635598 3415084 3599084 498442 -1085145 262207 2194592 3089762
36950 3089762 3597250 4095924 3425399 810891 -2488341 -3980628 -1811854 3639992 9086610
36941 9086610 10183987 5801482 13353 -1948957 498438 3364575 3681994 2570934
36933 2570934 2303502 3032178 3798328 4324970 3759176 -55312 -6938317 -11594559 -8604524
36924 -8604524 -127858 5568630 4354576 866301 811138 3026983 3204651 1912775 3021570
36915 3021570 5775221 5170844 829403 -1055264 2920241 7763192 7481849 3219204
36907 3219204 -501916 -3375276 -7417739 -10523869 -8581247 -2950982 442622 -402237
36899 -402237 -1640894 -722644 76475 -1348281 -3417658 -4268303 -4385324 -4118068 -2758339
36890 -2758339 -1649385 -3552737 -7019680 -6613347 -1494599 1760287 -1126666 -5115377
36882 -5115377 -3969580 -457140 -1357014 -5730489 -6400556 -1839268 1760242 1004929 119228
36873 119228 2756902 5600554 3974416 -941866 -4565376 -5229961 -4400746 -3198656 -2171205
36864 -2171205 -2522038 -4289318 -4734088 -1555418 3246811 5356247 3314289 -518279
36856 -518279 -3468697 -4785602 -4838659 -4340548 -4449059 -5873205 -7621975 -7957218 -6762728
36847 -6762728 -5817460 -6415625 -7552687 -6923713 -3532625 816340 2946590 1817930 246064
36838 246064 1787344 5900947 8142319 5994814 2519504 2503775 6363123 9844961 9021661
36829 9021661 3863101 -2396942 -5682644 -3664292 1924228 5924343 4765874 544858
36821 544858 -1968622 -1767761 -2039276 -4131192 -4900920 -1777627 2736913 4373128 2848683
36812 2848683 1478946 2356550 4620866 6564208 6813466 4238267 -492388 -3872109
36804 -3872109 -3128253 -433300 -152916 -2133278 -2038576 938236 1824394 -2128163 -5984092
36795 -5984092 -3996311 1596564 4005638 2088170 1268541 4680889 9042242 10342375
36787 10342375 8721893 5925867 2180577 -2050281 -4722640 -5176810 -5575647 -7057440
36779 -7057440 -7369152 -4957927 -2516020 -3139061 -5294730 -5281969 -2957646 -1188656 -857209
36770 -857209 -463356 -53964 -1302566 -3475004 -3435180 -723871 1031555 -539795 -2881261
36761 -2881261 -2328253 791139 3310669 3852244 3756775 4135216 4249297 2889407 -68754
36752 -68754 -3561175 -5862629 -5509799 -2843734 -483531 -897447 -3148105 -3369767 565720
36743 565720 5878817 7921757 5903280 3437569 3020013 2682076 81698 -2561812 -1251150
36734 -1251150 3208793 5807745 4767983 3728008 4945758 5122882 1246046 -3485585
36726 -3485585 -4067497 -1161936 799558 955922 1910026 3254547 1283981 -4093896 -7737585
36717 -7737585 -6565505 -3975860 -4514713 -7704001 -9736964 -8533606 -4881094 -971032
36709 -971032 459091 -1797779 -4589653 -2831627 3295444 7273754 5205820 1919578
36701 1919578 3855787 9149959 10508485 6326174 2625040 3489503 5416821 3482159
36693 3482159 -1261605 -3823831 -2220233 711591 1431976 -502142 -2371889 -944098
36685 -944098 4268273 9928459 12040092 10364970 8116285 7167733 6277748 5185485 7030533
36676 7030533 13436517 19555325 18688534 11459402 5636453 5744399 7512522 5286019
36668 5286019 662990 -766099 1645310 3782464 4814375 8415500 14706644 17540109
36660 17540109 13512930 8402871 9392668 14677068 16980318 14918421 13595216 14470747
36652 14470747 12599374 6112842 1268555 3564554 9054639 10029637 6051474 3566524
36644 3566524 6126348 10490416 12342772 11200526 8850587 6645231 5580650 6294987
36636 6294987 7804283 8175026 6967519 5145534 2737302 -682966 -3114986 -1359536
36628 -1359536 3539626 5606837 1280329 -5165810 -6720148 -2469975 2112721 2922575
36620 2922575 1581161 1607351 3526049 5374542 5825398 4813865 2339574 -1359055 -4853686
36611 -4853686 -6334053 -5449531 -3413728 -1387721 360981 1835336 2886007 3633593
36603 3633593 4554079 5826300 7017288 7506770 6865056 4991847 2495599 811592 1189233
36594 1189233 3437453 6075414 7479497 6503115 2929831 -1450262 -3202421 -803141
36586 -803141 2644013 2862959 522700 592019 4759901 8370985 7230333 3843458 3189086
36577 3189086 5056370 5307594 3204905 2159376 3239916 3182715 228955 -2554618 -1970200
36568 -1970200 859660 3058595 3934142 3922597 2512990 109393 -510848 2133664 4973862
36559 4973862 4209320 1017080 -64885 2426681 5670956 7376975 8013940 7956138 6267583
36550 6267583 3550918 2534106 3916161 4600583 2428493 46212 1083390 4609008
36542 4609008 6997423 7740364 8894147 9284348 4836010 -3632397 -8325107 -4129774
36534 -4129774 3515712 5479103 1118719 -2281663 -1053057 722559 -458263 -1888865
36526 -1888865 -465458 1612839 1380989 824285 2923914 5484611 4579699 1653670 1162257
36517 1162257 2721946 1974044 -1287434 -2384215 257362 2672457 2417275 2036257 3062979
36508 3062979 2298268 -2249034 -6391369 -5220821 -449785 1962808 -410646 -4588245
36500 -4588245 -6610583 -4945031 -757867 2820361 2992192 725029 241887 3489100
36492 3489100 7406163 8622607 8104060 8382706 8780719 6976441 3587694 1450880 1167884
36483 1167884 717733 -772987 -1657808 -246143 3210901 6724814 7501330 3858784 -2140915
36474 -2140915 -5433309 -3406473 663272 1787959 -433798 -2212603 -1299227 483834
36466 483834 443692 -1391313 -2522443 -1100204 1463644 1661560 -1212641 -2726529 939821
36457 939821 5873782 4338822 -3442434 -7856271 -3275787 3699538 4665110 2105898
36449 2105898 4036263 10072366 12109267 7629791 3168561 3432257 5197429 4728168
36441 4728168 4123318 6121232 8004690 5688954 742311 -1217969 2243273 8003367
36433 8003367 11509680 11027261 8122762 5317292 3325817 662250 -3471689 -6843932
36425 -6843932 -6473578 -2652133 1321314 2975653 2322544 516063 -818392 155881 3223624
36416 3223624 5051377 3266027 362341 28097 971605 -912860 -4957953 -5918735 -2403192
36407 -2403192 625891 -144344 -1067769 2405191 8298996 10792109 8156631 4370293
36399 4370293 3567021 5525048 6855718 5494386 3494798 4645611 8931669 11423688
36391 11423688 8721160 4162088 3038922 4696248 4449402 2206882 2873240 7507722
36383 7507722 10413593 7378739 1605840 -1368105 -329404 2661275 5855877 7614254
36375 7614254 6375224 3471080 2479311 3655090 3082471 -437334 -2529771 -356388
36367 -356388 2497703 2319465 1507293 3340599 4927993 1775958 -3667764 -4972458 -1682957
36358 -1682957 536888 -444181 28900 5510083 12562485 15292566 12462999 7789815
36350 7789815 5145354 5208815 5860848 4897470 2554592 1047545 1358865 1895406 1343155
36341 1343155 1090295 3051682 6584684 9547587 11112758 11506076 10249844 7003388
36333 7003388 3421320 2140304 4151312 8122791 11445489 11526785 8009788 4447374
36325 4447374 5188730 9512514 12047654 10644782 9899975 13966338 19776340 21651368
36317 21651368 19571985 17831190 17478072 15571410 11342198 7939427 7346282 7603396
36309 7603396 6352606 4354427 4160558 6644793 9442524 8724364 3642577 -1036706
36301 -1036706 289358 5789121 7057074 771007 -5466468 -3547746 3344021 5803924
36293 5803924 1992935 -1248648 89024 2422779 2190911 1192214 2026102 3787534 5004801
36284 5004801 6467742 8495556 8954107 6506799 3151020 1566167 2136863 3848600
36276 3848600 5866451 7190711 6795233 4820157 2076660 -1154977 -3778562 -2784449
36268 -2784449 3076213 9725871 12029370 10666934 9997035 10054507 6870665 997126 -1336630
36259 -1336630 2204593 5813433 4393616 1128433 1834250 6188436 9440816 9705011
36251 9705011 8743180 7549979 5603724 3498942 2776272 3613357 5028394 6476407 7401001
36242 7401001 6634032 4204643 2307514 2556787 3656567 3588367 2768958 3304236 6112268
36233 6112268 9933915 12181177 10489452 5272336 785694 966762 4035654 4640046
36225 4640046 1727033 -177726 1216853 2096808 -699950 -3978167 -3301678 195357
36217 195357 2649771 3726635 5058386 5210093 1758653 -3177732 -4836527 -2563079
36209 -2563079 -4987 871435 1418684 2273140 2208083 1275193 1062012 1476601 1013894
36200 1013894 410350 2046545 5180744 5861027 2702129 -1032866 -2512696 -2798390 -3312283
36191 -3312283 -2402165 1638716 6583896 8598882 7419658 6345657 7373442 8743445
36183 8743445 7772016 4372745 721896 -1682365 -3198870 -4144465 -3300904 80239 3575861
36174 3575861 3464321 -161906 -2716602 -956747 2876716 4755859 4393978 4250057 4855794
36165 4855794 4684711 3750995 3645378 4101793 3015237 324533 -1271308 -230606 2020811
36156 2020811 4060239 6472708 9576839 11533698 10446811 6915806 3284392 1413656
36148 1413656 1747687 3284379 4137594 3510117 3062227 4568425 6589667 6073149 3203813
36139 3203813 1384199 1739938 1323046 -1577862 -3953926 -2593426 810508 2252911
36131 2252911 948537 -1013431 -2689809 -4219370 -4002699 -236227 4730406 5597473
36123 5597473 763305 -5334389 -7763323 -6229709 -3246988 -38656 3194975 4849129
36115 4849129 3066813 -796458 -2485879 410628 5464674 8201734 7145863 4966169
36107 4966169 4686022 5865963 5428856 1916843 -2353382 -3985691 -2364465 312759
36099 312759 2152629 2985705 2762946 762727 -2429351 -3865259 -1187297 3929776 7074890
36090 7074890 5764850 1411944 -3100376 -5981994 -6574811 -5042930 -3054594 -2958180 -4801656
36081 -4801656 -5560064 -2936817 1348304 4017913 4845557 6239853 8719880 9726713
36073 9726713 7428017 3175156 -705891 -3370092 -4779168 -4874809 -4724881 -6271088 -9263127
36064 -9263127 -10472060 -7839234 -3484061 -580911 622115 1247181 737736 -1131305
36056 -1131305 -1402100 2223278 5972626 3961849 -2470525 -5383622 -1567685 2913724
36048 2913724 2511829 516340 2521507 6320490 5151846 -1266001 -5984115 -4978946
36040 -4978946 -1847431 -1168585 -2432380 -2646018 -874949 2085312 5305104 6874799
36032 6874799 4387914 -1502241 -6420523 -7218767 -5454731 -4207605 -3864944 -3158053 -2037009
36023 -2037009 -1043672 297239 2095709 2854845 1894872 1186274 2327326 3587563 2733052
36014 2733052 955689 714234 1120340 -798150 -4828491 -7077279 -4895381 217953
36006 217953 4432215 4318937 -1066207 -8256768 -10922619 -6486221 58621 2198127
35998 2198127 85651 -1309008 -283987 745465 1265064 3137697 5052093 3254642
35990 3254642 -1002962 -1558261 2899962 5819520 2706337 -2289149 -3688863 -2544291
35982 -2544291 -2114420 -1289275 1766875 3982257 1863092 -1725323 -1584284 1601927 3157041
35973 3157041 2326006 2232061 3605246 4423589 4504256 4917828 4179702 582045 -3027088
35964 -3027088 -2514193 722433 1956599 707059 -172119 -1452493 -6164359 -11827876
35956 -11827876 -12015992 -6414195 -1646384 -710752 650671 4770870 6967130 3359491
35948 3359491 -2619074 -5599364 -5018946 -3018240 -485691 1533959 1129404 -839252
35940 -839252 -979310 457415 -868386 -5070239 -5724486 215062 6437946 6149846 1453724
35931 1453724 -1318882 -548621 1822290 5457889 9725884 11016246 7981355 5363758
35923 5363758 6672737 7598226 3488301 -1323870 -4612 4724381 4616601 -37386
35915 -37386 -568506 5704308 11012395 9129342 3397802 -434778 -2381256 -5269807 -8902646
35906 -8902646 -11063569 -10881569 -8535453 -4560200 -991786 2949 -359670 1116672 4102210
35897 4102210 4969839 3372081 3470533 6667285 8273443 4684737 -397180 -1010713 2648231
35888 2648231 4978003 2676231 -1802452 -4040637 -2438430 856658 2521460 1570222
35880 1570222 461102 1954487 5184126 6463784 3929666 -555557 -4311811 -6612877
35872 -6612877 -7999729 -8543140 -7613052 -4731058 -768103 1610517 575751 -928135
35864 -928135 2742023 11195788 15250274 8021010 -4113447 -8367806 -2105597 4914017
35856 4914017 5035548 1344813 -421034 -587877 -1541509 -1472971 1752574 4648294 2260707
35847 2260707 -3904948 -7482276 -5732274 -2099264 -728953 -1784741 -2174332 1022739
35839 1022739 7250742 11665693 9638821 3202541 -86205 3279753 7888281 7227744
35831 7227744 2852815 1276134 4218562 7154593 6554584 3657548 1038165 -265284
35823 -265284 343994 3182347 6312479 6461768 3090441 -755627 -2448546 -2452703 -2347989
35814 -2347989 -2541442 -3043307 -4410883 -6346527 -6834642 -4435169 -685603 1455989 1430744
35805 1430744 1761564 4269363 6896361 6001049 1574351 -2063686 -1842331 -44106 -510068
35796 -510068 -2442705 -1620607 2581255 5535183 3912111 228812 -1246181 -68709
35788 -68709 1595053 3326284 6333463 10273499 13198660 14141522 13436632 11085328 7148713
35779 7148713 3479759 2781623 5563747 9453369 11653388 10956113 7491194 1964730
35771 1964730 -4179104 -8472438 -8316601 -3201258 3622453 7066603 5410519 2643445
35763 2643445 3507919 7136819 8606382 6229086 3315187 2308930 1708118 384802
35755 384802 418639 2944635 5296580 5665634 6816255 11031156 14695974 12991082 7765922
35746 7765922 5367370 7650295 10196385 9193095 5482737 1661991 -601177 -65882
35738 -65882 3159843 5647249 3548007 -1751810 -4711715 -3275600 -1324435 -1962517 -2689573
35729 -2689573 -226941 3329423 3326296 -140086 -1951044 850223 5009192 5665614 2814823
35720 2814823 781138 1847190 3211044 1697941 -687842 877793 6600102 10782886
35712 10782886 9233033 4452546 1043009 -931321 -4310147 -8587147 -9712076 -5987588
35704 -5987588 -709563 1606796 -498226 -4710644 -6547431 -2561760 5636245 11491088
35696 11491088 10246732 4497535 219413 -989973 -1686899 -2205171 -194657 3329369
35688 3329369 3515538 -730016 -3876503 -1555445 3005110 4064290 1772396 1346789
35680 1346789 5432937 10908180 12867842 9426437 2965651 -1810382 -1782240 1412278
35672 1412278 3086229 1140309 -1813675 -3059196 -3960597 -7072467 -10934212 -11144044
35664 -11144044 -6431538 -864268 773819 -1952139 -5653125 -7600089 -8254086 -9195388
35656 -9195388 -9922967 -8493620 -5237241 -3301278 -4076882 -4594708 -2140945 812047 256442
35647 256442 -2348905 -1871287 2010404 3886933 1318668 -1387988 -496155 1764593 2674901
35638 2674901 4384463 8742291 11527162 8398432 3448179 4486376 11123555 14897353
35630 14897353 11493379 5725794 2666539 614684 -3445709 -6768129 -4477596 2387716
35622 2387716 7409687 6784147 3191301 1479530 3117153 5738251 6589880 5212385
35614 5212385 2915263 449476 -2780684 -6805884 -9618698 -9180005 -6397986 -4270264
35606 -4270264 -4022524 -3885772 -2062015 771788 2552160 2146193 149887 -1470959 -458832
35597 -458832 3483416 7321952 7314347 3455018 -392285 -1268697 -158256 387412 -425118
35588 -425118 -1827199 -3138924 -3788623 -3198231 -2037420 -2155263 -3835360 -4579467 -2313690
35579 -2313690 1436490 3396558 2615556 924721 137495 559464 1665615 2565443 2239995
35570 2239995 750170 -380056 -326769 -596570 -2825868 -5870830 -7120424 -6113825 -4851984
35561 -4851984 -5007305 -6713251 -9343327 -11253833 -9687562 -3900212 2077286 3073408
35553 3073408 -825101 -4801370 -6146321 -6426627 -6320328 -3527153 1763535 4331005
35545 4331005 1020858 -3408236 -2613712 1749850 2537107 -1942714 -5560132 -3608868
35537 -3608868 1074634 3317103 2526890 1438962 1085357 468918 -351802 -3936 1738082
35528 1738082 3471424 4291365 4974548 6711729 9387272 11494298 11791661 10909742 10530075
35519 10530075 10467186 7931916 1458177 -5442130 -7297625 -3430720 1098422 2089445
35511 2089445 996095 1566037 4114955 5612030 4224591 1366924 -549266 -714830
35503 -714830 -106220 44810 -196861 527187 2715061 4177120 2009443 -3236819 -7277805
35494 -7277805 -7077732 -4454170 -3250452 -4262236 -4813339 -2743467 866547 3033698
35486 3033698 2103035 -441262 -1370056 633223 3144896 3077356 1111856 933307 3967307
35477 3967307 7465186 8610739 7939610 7408229 7531029 7987171 8710701 8713450 6321095
35468 6321095 2527396 1429082 4788226 8690797 8619605 5561643 3635391 3643339 2979084
35459 2979084 712620 -1281840 -1748195 -1002540 1082691 4544949 7100943 5918594
35451 5918594 1574012 -2767271 -5570146 -7056819 -6142733 -1693084 3367931 4067654
35443 4067654 318136 -2641895 -1823383 12967 -104177 -1095381 -1458953 -2546411 -4872790
35434 -4872790 -5126529 -994317 3977647 4779716 2224175 1338310 3515174 4768976 2044411
35425 2044411 -2546287 -4899735 -3593186 -46387 3990472 7451220 9397047 9043010
35417 9043010 6655631 3833112 2297019 2257393 2437271 2022812 1793459 2480615 2927953
35408 2927953 1410604 -1767776 -4667689 -6184549 -6261640 -4395791 -597176 2536364
35400 2536364 1998438 -978244 -1848020 736158 2845028 1294066 -1698829 -2162036 359372
35391 359372 3809623 7070045 9317991 8571680 4782905 2575631 6420235 13519540
35383 13519540 15740436 9398044 -220228 -5343897 -4110961 -821526 320166 -544796
35375 -544796 -683946 1018083 2846200 3018674 2115172 1534983 721340 -1717022 -4490598
35366 -4490598 -4383015 -1398764 29312 -2964525 -7061521 -6909404 -2194391 2401898
35358 2401898 3514426 2632407 3261977 6399063 9244791 7977363 2280448 -3123555
35350 -3123555 -3352986 157962 1148523 -2553817 -5596451 -3098992 1894913 3042671
35342 3042671 -333508 -3858575 -5473537 -6581490 -6923946 -4327386 33651 1664140
35334 1664140 -553388 -2385394 -679799 2416744 3562993 2686530 1273448 -217560
35326 -217560 -1026427 370544 2974547 2906463 -868751 -3746999 -1765462 2323874 3281183
35317 3281183 1262742 786050 3154592 4815896 3176445 -382178 -3872032 -7024137
35309 -7024137 -9130132 -8347231 -5010905 -2537454 -2872358 -3616690 -1955778 943923 2149376
35300 2149376 1482198 605252 -774688 -3842096 -6508745 -4797556 848595 4831536
35292 4831536 3827246 1297838 1949591 4901861 5947108 4231919 2467290 1896968
35284 1896968 1620086 2384158 6070443 10672621 10733740 4920574 -989426 -1570917 1191645
35275 1191645 1694790 -1138521 -3448247 -2575472 293041 2967951 4325656 3770043 1682391
35266 1682391 381558 1801632 4148309 3759611 657187 -807231 2021449 6075994
35258 6075994 6338665 1831433 -3990238 -7535184 -7749354 -5137425 -438323 4950589
35250 4950589 8746036 9609327 8914895 9042464 9592958 7476251 2301644 -788536 2722582
35241 2722582 9033705 9532202 2580836 -3754768 -3246500 -123893 -1380204 -5251930
35233 -5251930 -4563609 739461 2624713 -2698506 -8849749 -8539762 -2922952 2227621
35225 2227621 5082667 7440302 8601843 5272825 -2373576 -8888566 -9433486 -5162947
35217 -5162947 -1127895 -164606 -828987 -1290729 -2990331 -8280013 -15189002 -17818925 -13445794
35208 -13445794 -6597954 -3475376 -4258339 -4263441 -1465802 1130072 593046 -2169716 -4455301
35199 -4455301 -4545123 -1856221 2688629 5808746 4493799 351018 -1756509 -349144
35191 -349144 745597 -1503454 -4715287 -4690036 -862648 3934635 6826820 6269272 2540879
35182 2540879 -1387406 -1946542 517142 2076650 1365409 1586392 4343329 6048558 4116561
35173 4116561 2405525 5344870 9860023 9105145 2399293 -4508186 -8046555 -9634181
35165 -9634181 -10149203 -7935973 -3434672 -50678 1432634 4093271 8316955 9241808
35157 9241808 4089039 -2459585 -4397467 -2491695 -1740654 -3266616 -3683494 -1383934
35149 -1383934 1253164 1982913 1188929 -198516 -2034859 -3540028 -3405661 -2203860 -2165794
35140 -2165794 -3561651 -3719390 -1022171 2278411 3079055 1648956 730846 1342345 1665734
35131 1665734 66501 -2560556 -4018124 -3379405 -1757096 -932604 -1598138 -2910724 -3682585
35122 -3682585 -3735213 -3667890 -3598628 -3115477 -2478182 -2497718 -2738058 -1414823 1816039 4461438
35112 4461438 4228562 2253300 1259644 1416723 537896 -1902406 -3634458 -2902770 -636958
35103 -636958 1281234 1915852 1008563 -956832 -1834697 580422 5052639 7392755 5603607
35094 5603607 2166935 49173 -740509 -914986 653533 4525261 8125942 8577553 6349582
35085 6349582 3548796 662025 -2172060 -2980235 -671473 1812288 808409 -2917553
35077 -2917553 -5739532 -6213507 -4951157 -1678927 2994677 4994476 1519339 -3221721
35069 -3221721 -3190666 -112505 -631886 -4579227 -4879021 -315034 1257942 -3951181 -8708406
35060 -8708406 -6784234 -3470409 -6094897 -10888658 -9120259 -2015623 963801 -2898288
35052 -2898288 -6449830 -5008741 -2426299 -2412675 -2044800 1865645 6172001 6219189 3205854
35043 3205854 1820604 2964366 3360685 1420123 -453354 85297 1578998 541265
35035 541265 -3777194 -7801043 -7731184 -4670541 -3617372 -6622574 -9408827 -6923735 -152220
35026 -152220 5663827 8017043 8496948 7948078 4829110 -748412 -5310217 -6191158 -4668881
35017 -4668881 -3321746 -2677588 -2099396 -1752179 -1785280 -1271793 179023 1040448 -190708
35008 -190708 -2610334 -3960017 -3390568 -1910217 -560544 691795 2220849 3465902
35000 3465902 2689905 -1456374 -7667715 -12109666 -12035230 -8762999 -5726716 -4261441 -3164020
34991 -3164020 -1765406 -793934 -79755 1732791 4204692 4417019 978121 -3088165 -3378843
34982 -3378843 856550 6083690 8211616 6059212 1960053 -184048 1789625 6093087
34974 6093087 8555717 6740211 1839949 -3327488 -6656530 -6924490 -3903590 341028
34966 341028 2069880 -201001 -3352628 -3239910 -112943 1649704 -613516 -4361391
34958 -4361391 -5337711 -3071807 -981457 -1326801 -2242252 -835045 2416477 4363344 3491759
34949 3491759 1124277 -1471886 -4165483 -5455919 -2506465 3903064 7544315 3628925
34941 3628925 -4306546 -8530741 -7013292 -4467319 -3697096 -1575605 4193308 9272219
34933 9272219 7899215 1193239 -4270449 -5191439 -4507238 -5181250 -5175204 -1207508 4901648
34924 4901648 7424389 4269052 -89036 -843875 883300 1101240 -16523 961705 3453167
34915 3453167 2692814 -1459113 -2017947 4655741 11669223 11073904 5968526 5313881 9645106
34906 9645106 11136288 7101650 3648798 4293805 4385363 471482 -3369380 -3666359 -4434997
34897 -4434997 -9489455 -14127588 -11898115 -5112948 -1040899 -914773 -328197 1643542
34889 1643542 1429877 -1694661 -4191423 -4273863 -3512315 -2515908 -576649 595415 -1419160
34880 -1419160 -4214966 -2693861 2655789 5522507 2921691 -1121723 -2360522 -1010096
34872 -1010096 1924919 6674133 10429410 7534973 -1788598 -8355074 -4839077 4363569
34864 4363569 9317342 7228726 3361213 1717786 881028 -1510856 -5409406 -9908708
34856 -9908708 -14192168 -16424051 -14836304 -10318126 -5502388 -1489335 2116441 4597787
34848 4597787 4558166 2676413 1037231 -212252 -2569713 -5548783 -6608599 -5268021
34840 -5268021 -4096615 -4454962 -4110210 -815370 3836390 5982573 3764976 -1128576
34832 -1128576 -5265139 -6289632 -5085798 -5178844 -8350219 -11083532 -8066880 324895
34824 324895 7329533 8103201 5458757 4703491 5708345 4152368 -815770 -4709956 -3889572
34815 -3889572 33674 3133159 3665671 2160778 -567887 -3409408 -4409746 -2451822
34807 -2451822 831157 2250405 169067 -4198010 -8092184 -9191751 -7045316 -3512252
34799 -3512252 -1319658 -1336835 -1756172 -741984 901094 950374 -960499 -2944387 -3637064
34790 -3637064 -3679200 -4122624 -5004766 -6176912 -7967345 -9907108 -10140322 -7644109 -4212514
34781 -4212514 -2625220 -3280947 -4199889 -4125003 -3965772 -5017107 -7258249 -9816420 -11863727
34772 -11863727 -12707554 -12216622 -11410819 -11215523 -10442939 -7025584 -1981038 299849 -2447646
34763 -2447646 -6580158 -6754048 -2514435 2128345 4666405 6166067 7472404 7140549
34755 7140549 4498190 1751107 1006302 1261004 373727 -1515576 -2548003 -2091728 -1335964
34746 -1335964 -1570336 -3135037 -5385407 -6838813 -6439361 -5358741 -5795824 -7050522 -5316789
34737 -5316789 658476 6352353 6994495 4208807 3233719 4908940 5064247 1700001 -1964930
34728 -1964930 -2566350 -429258 3124582 7993336 12385012 11741725 4472344 -3741622
34720 -3741622 -5611023 -1241282 2283124 238104 -4227595 -4997288 -959678 3017502
34712 3017502 2648970 4547 1153936 7869781 13794233 11354103 1586183 -6478974
34704 -6478974 -6753646 -2527593 -91699 85789 1887175 5747732 7371757 4194594
34696 4194594 -992180 -4001472 -3862735 -1993436 937837 5119919 9384785 10948772
34688 10948772 8206792 3188722 96344 866735 3120230 3624216 2704385 3052123 4923179
34679 4923179 5823728 5213454 5632078 7708129 8042336 4694863 1159975 1323946 3491149
34670 3491149 3619364 2063050 2248826 4154537 4309137 1956232 303950 1026910 1724194
34661 1724194 -59847 -3611211 -6842993 -8663859 -8964474 -8470045 -8540261 -9040669 -7554876
34652 -7554876 -3516519 -1173978 -4092300 -8458045 -7731884 -3176792 -2601773 -7665428
34644 -7665428 -10204898 -4609196 3079072 3745721 -2145720 -6469360 -4753903 343298
34636 343298 5040460 8188214 9238632 7141377 2300927 -3006652 -6753675 -8285504
34628 -8285504 -7899858 -6813855 -6633157 -7291687 -6580629 -3275253 495054 1731137 425513
34619 425513 -649630 701678 4001261 6533658 5425872 612400 -4132399 -4997255
34611 -4997255 -2886523 -1806471 -2742181 -2823712 -887010 684190 872587 1847065 3849063
34602 3849063 3509226 273373 -848517 2896176 6466511 4455304 -388344 -1981524
34594 -1981524 -501657 -528205 -2345883 -2115501 791224 3271702 4432227 5897615 7009073
34585 7009073 5850962 4287273 5499161 7041027 3431367 -4086168 -7772998 -4685591
34577 -4685591 -560945 -408129 -2304282 -3415147 -5146757 -8090405 -8067617 -2565507 3533847
34568 3533847 4029436 -337221 -4650926 -7491110 -10370189 -12131642 -10075939 -5823613
34560 -5823613 -4350946 -6618920 -7855238 -4573051 409476 2054162 -268505 -2710769
34552 -2710769 -2435001 -691914 22981 -112986 812623 2277488 1100620 -3409143 -6956487
34543 -6956487 -5590189 -1361026 799674 155267 -154534 589918 -67170 -2028439 -1655281
34534 -1655281 1917544 4461127 2998651 97399 -823475 -307383 123058 1760286 5547294
34525 5547294 8264979 6324703 1493480 -1125003 418659 3735492 6093173 6357262
34517 6357262 4036841 -332883 -4263949 -5345461 -3952831 -2257205 -1442745 -1468581 -2228402
34508 -2228402 -3200970 -3333765 -2747132 -2714153 -2645005 6987 4667729 5918510 523654
34499 523654 -6524334 -7451466 -1591105 4575076 6238002 4655174 3015603 2261284 1848052
34490 1848052 1552005 1608982 2711220 5351891 7574051 5399600 -1539914 -7117740 -5801622
34481 -5801622 -783066 417283 -2669372 -3253013 897909 2901057 -2524389 -9988029
34473 -9988029 -10560842 -4243486 613637 -1103116 -5669925 -6926204 -4055744 -1162661
34465 -1162661 -1408332 -3732759 -5037712 -4223846 -3169113 -3795948 -5362183 -5700739 -4273014
34456 -4273014 -2342943 -621446 1271822 3177725 4417420 5479821 7256145 8346141
34448 8346141 6061857 1086984 -1918614 -241533 2923415 2766659 -946353 -4563741
34440 -4563741 -5741720 -5018190 -3300643 -980989 670481 203831 -1446874 -1524577 729268
34431 729268 2902396 2885819 1557263 875338 1113212 1573118 2582564 4666036 6463475
34422 6463475 5782112 2858293 553352 638442 1576526 987905 -1159304 -3186868 -4390844
$$ [...]
##END NTUPLES=NMR SPECTRUM
##END=
