##TITLE=31Pdec_LR-0155-CBZ-B-IPS
 H2O, 24 sc
 22.3.2023
##JCAMPDX= 6.0         $$ Bruker NMR JCAMP-DX V2.0
##DATA TYPE= NMR SPECTRUM
##DATA CLASS= NTUPLES
##ORIGIN= UXNMR, Bruker Analytische Messtechnik GmbH
##OWNER= root
$$ XWIN-NMR		Version 3.5
$$ Wed Mar 22 14:03:02 2023 Russian Standard Time (UT+4h)  she@DPX200
##.OBSERVE FREQUENCY= 81.013821
##.OBSERVE NUCLEUS= ^31P
##.ACQUISITION MODE= SIMULTANEOUS
##.ACQUISITION SCHEME= undefined
##.AVERAGES= 24
##.DIGITISER RES= 16
##SPECTROMETER/DATA SYSTEM= spect
##.PULSE SEQUENCE= zgpg30
##.SOLVENT NAME= CDCl3
##.SHIFT REFERENCE= (INTERNAL, CDCl3, 0, 248.564)
##AUDIT TRAIL= $$ (NUMBER, WHEN, WHO, WHERE, WHAT)
$$ ##TITLE= Audit trail, XWIN-NMR		Version 3.5
$$ ##JCAMPDX= 5.01
$$ ##ORIGIN= Bruker BioSpin GmbH
$$ ##OWNER= she
$$ F:/spectra/data/she/nmr/P31/1/pdata/1/auditp.txt
$$ ##AUDIT TRAIL=  $$ (NUMBER, WHEN, WHO, WHERE, WHAT)
(   1,<2023-03-22 14:00:45.46 +0400>,<she>,<DPX200>,
      <created by zg, POWCHK disabled, PULCHK disabled
       configuration hash MD5:
       00 E9 B6 7A A2 85 ED C7 34 08 36 98 17 FE 4E 26
       data hash MD5: 32K
       41 44 BB A2 4B 1C D3 7C 56 50 AC A4 85 AF FD 6C>)
(   2,<2023-03-22 14:01:21.10 +0400>,<she>,<DPX200>,
      <Start of raw data processing
       efp BC_mod = 2 LB = 1 FT_mod = 6 PKNL = 1 PHC0 = -8920.872 PHC1 = -3941.325 SI = 64K 
       data hash MD5: 64K
       DE 0C 76 5C 1F 0D 9E 97 AA 76 B5 EE 75 EB 52 39>)
(   3,<2023-03-22 14:02:21.34 +0400>,<she>,<DPX200>,
      <pk PHC0 = -1680.561 PHC1 = 3935.01 
       data hash MD5: 64K
       0F 1E D3 A6 9C 53 7B 40 A0 88 96 FD 63 4F C1 57>)
$$ ##END=
$$ 
$$ hash MD5
$$ 5C 53 25 DD 5B C3 19 62 BF 8F 7D F0 1B 20 03 34
##$RELAX= 
##$RELAX= 
##$RELAX= 
##$RELAX= 
##$RELAX= 
##$RELAX= 
##$RELAX= 
##$RELAX= 
##$RELAX= 
$$ Bruker specific parameters
$$ --------------------------
##$DU= <F:/spectra>
##$EXPNO= 1
##$NAME= <P31>
##$PROCNO= 1
##$TYPE= <nmr>
##$USER= <she>
##$AMP= (0..31)
100 100 100 100 100 100 100 100 100 100 100 100 100 100 100 100 100 100 
100 100 100 100 100 100 100 100 100 100 100 100 100 100 
##$AQSEQ= 0
##$AQ_mod= 1
##$AUNM= <au_zg>
##$AUTOPOS= <>
##$BF1= 81.014009
##$BF2= 200.13
##$BF3= 200.13
##$BF4= 200.13
##$BF5= 200.13
##$BF6= 200.13
##$BF7= 200.13
##$BF8= 200.13
##$BYTORDA= 1
##$CFDGTYP= 0
##$CFRGTYP= 5
##$CHEMSTR= <none>
##$CNST= (0..31)
1 1 145 1 1 1 1 1 1 1 1 1 1 1 1 1 1 1 1 1 1 1 1 1 1 1 1 1 1 1 1 1 
##$CPDPRG= <waltz16>
##$CPDPRG1= <>
##$CPDPRG2= <waltz16>
##$CPDPRG3= <>
##$CPDPRG4= <mlev>
##$CPDPRG5= <mlev>
##$CPDPRG6= <mlev>
##$CPDPRG7= <mlev>
##$CPDPRG8= <mlev>
##$CPDPRGB= <>
##$CPDPRGT= <>
##$D= (0..31)
0 1 0 0 0 0 0 0 0 0 0 0.03 2e-05 3e-06 0 0 0 0 0 0 0 0 0 0 0 0 0 0 0 0 
0 0 
##$DATE= 1679479244
##$DBL= (0..7)
120 120 120 11 120 120 24 19 
##$DBP= (0..7)
150 150 150 150 150 150 150 150 
##$DBP07= 0
##$DBPNAM0= <>
##$DBPNAM1= <>
##$DBPNAM2= <>
##$DBPNAM3= <>
##$DBPNAM4= <>
##$DBPNAM5= <>
##$DBPNAM6= <>
##$DBPNAM7= <>
##$DBPOAL= (0..7)
0.5 0.5 0.5 0.5 0.5 0.5 0.5 0.5 
$$ [...]
##$SUBNAM2= <"">
##$SUBNAM3= <"">
##$SUBNAM4= <"">
##$SUBNAM5= <"">
##$SUBNAM6= <"">
##$SUBNAM7= <"">
##$SUBNAM8= <"">
##$SUBNAM9= <"">
##$SW= 501.771253377433
##$SWIBOX= (0..15)
0 1 3 0 0 0 0 0 0 0 0 0 0 0 0 0 
##$SW_h= 40650.406504065
##$TD= 32768
##$TD0= 1
##$TE= 0
##$TE2= 300
##$TE3= 300
##$TEG= 300
##$TL= (0..7)
0 120 53 12 22 120 120 120 
##$TP= (0..7)
150 150 150 150 150 150 150 150 
##$TP07= 0
##$TPNAME0= <>
##$TPNAME1= <>
##$TPNAME2= <>
##$TPNAME3= <>
##$TPNAME4= <>
##$TPNAME5= <>
##$TPNAME6= <>
##$TPNAME7= <>
##$TPOAL= (0..7)
0.5 0.5 0.5 0.5 0.5 0.5 0.5 0.5 
##$TPOFFS= (0..7)
0 0 0 0 0 0 0 0 
##$TUNHIN= 0
##$TUNHOUT= 0
##$TUNXOUT= 0
##$USERA1= <user>
##$USERA2= <user>
##$USERA3= <user>
##$USERA4= <user>
##$USERA5= <user>
##$V9= 5
##$VALIST= <valist>
##$VCLIST= <CCCCCCCCCCCCCCC>
##$VD= 0
##$VDLIST= <DDDDDDDDDDDDDDD>
##$VPLIST= <PPPPPPPPPPPPPPP>
##$VTLIST= <TTTTTTTTTTTTTTT>
##$WBST= 1024
##$WBSW= 4
##$XGAIN= (0..3)
0 0 0 0 
##$XL= 0
##$YL= 0
##$YMAX_a= 2227
##$YMIN_a= -2720
##$ZGOPTNS= <>
##$ZL1= 120
##$ZL2= 120
##$ZL3= 120
##$ZL4= 120
##$ABSF1= 0
##$ABSF2= 0
##$ABSG= 0
##$ABSL= 0
##$ALPHA= 0
##$AQORDER= 0
##$ASSFAC= 0
##$ASSFACI= 0
##$ASSFACX= 0
##$ASSWID= 0
##$AUNMP= <proc_1d>
##$AZFE= 0.1
##$AZFW= 0.5
##$BCFW= 0
##$BC_mod= 2
##$BYTORDP= 0
##$COROFFS= 0
##$CY= -3
##$DATMOD= 1
##$DC= 0
##$DFILT= <>
##$DTYPP= 0
##$F1P= 0
##$F2P= 0
##$FCOR= 1
##$FTSIZE= 65536
##$FT_mod= 6
##$GAMMA= 0
##$GB= 0
##$INTBC= 1
##$INTSCL= 6.047779e-11
##$ISEN= 30
##$LB= 1
##$LEV0= 0
##$LPBIN= 0
##$MAXI= 10000
##$MC2= 0
##$MEAN= 0
##$ME_mod= 0
##$MI= 50
##$NCOEF= 0
##$NC_proc= -9
##$NLEV= 6
##$NOISF1= 182.463
##$NOISF2= 159.3651
##$NSP= 0
##$NTH_PI= 0
##$NZP= 0
##$OFFSET= 248.5645
##$PC= 4
##$PHC0= -10601.43
##$PHC1= -6.314941
##$PH_mod= 1
##$PKNL= yes
##$PPARMOD= 0
##$PSCAL= 0
##$PSIGN= 0
##$REVERSE= no
##$SF= 81.0140089999694
##$SI= 65536
##$SIGF1= 159.3651
##$SIGF2= -187.1042
##$SINO= 113.3802
##$SIOLD= 16384
##$SREGLST= <1H.CDCl3>
##$SSB= 0
##$STSI= 65536
##$STSR= 0
##$SW_p= 40650.406504065
##$SYMM= 0
##$S_DEV= 0
##$TDeff= 32768
##$TDoff= 0
##$TI= <>
##$TILT= no
##$TM1= 0
##$TM2= 0
##$TOPLEV= 0
##$USERP1= <user>
##$USERP2= <user>
##$USERP3= <user>
##$USERP4= <user>
##$USERP5= <user>
##$WDW= 1
##$XDIM= 65536
##$YMAX_p= 332206310
##$YMIN_p= -116951469
$$ End of Bruker specific parameters
$$ ---------------------------------
##NTUPLES= NMR SPECTRUM
##VAR_NAME=  FREQUENCY,     SPECTRUM/REAL,   SPECTRUM/IMAG
##SYMBOL=    X,             R,               I
##VAR_TYPE=  INDEPENDENT,   DEPENDENT,       DEPENDENT
##VAR_FORM=  AFFN,          ASDF,            ASDF
##VAR_DIM=   65536,         65536,           65536
##UNITS=     HZ,            ARBITRARY UNITS, ARBITRARY UNITS
##FACTOR=    0.620285442955139, 1,           1
##FIRST=     20137.2065510682, 0,            0
##LAST=      -20513.1999529968, 0,           0
##MIN=       -20513.1999529968, -116951469,  0
##MAX=       20137.2065510682, 332206310,    0
$$ Real data points
##PAGE= N=1
##DATA TABLE= (X++(R..R)), XYDATA
$$ [...]
41976A507487l533899K802654J871106n824069r807439o276767j935183j78470
41968b1374580L588538R429350Q877920k41111p042985l836242J718105L82973
41960h498032k804560J519933R208076Q494502q46870p686673o685996k869352
41952a0168972o0734L294381O283009M621613n99590k809225m99316P86463j253926
41943d06297k037591Q25525K888686N19917l461192m772335k859811P40645M072565
41934d489888M127819J64480k680638J99754L945016M70629p001550o864452J880926
41925a0247904O157365r32644q728628n656725L511335P012065M101664K263610
41917b519862K486606l57900n441511o120663j785606P44151j249970k489451
$$ y = [1507487, -2026412, 776242, 2647348, -3176721, -12984160, -19260927, -21196110, -21374580, -17786042, -8356692, 521228, 280117, -6762868, -10599110, -8881005, -8498032, -11302592, -9782659, -574583, 7919919, 7073049, -613624, -7299620, -10168972, -10229706, -6935325, -652316, 3969297, 3369707, 560482, 61166, 847629, -406297, -2443888, -1618363, 1270323, 1790240, -1670952, -6443287, -9303098, -8562453, -4489888, -362069, -197589, -2878227, -2678473, 1266543, 1737172, -5264378, -12128830, -10247904, -4090539, -5023183, -13751811, -19408536, -15897201, -8885136, -4783472, -2519862, -33256, -391156, -5832667, -11953330, -13738936, -12994785, -14244755, -16734206]
41909a6734206N17494L808237L558854K773243N560433R011756O332137l022395
41901A1805553j0778232q865378R44321Q657417P450429J017533k479636j391512
41893F360495j002294l842636n774817l474854K34800K000293L316848N514006
41885C331841M549799k553850r743605q236721O78944O953882O064274M171790
41877E216354O680784Q846407L119530q157784j3708505p042125N073142J0055071
41869A0082874L758114n447225p343053j748226L317584L519384K718628M604764
41861A3462844O059447L084340j616047l176849l422596p563346j3179287j1156821
41853a7508315K02443R762206P208543l234403q888769n203629O55088J935624
$$ y = [-16734206, -16216712, -12408475, -8849621, -6076378, -515945, 8495811, 14827948, 11805553, 1027321, -7838057, -6893736, 1763681, 9214110, 10231643, 7752007, 6360495, 5358201, 1515565, -4259252, -7734106, -7499306, -5499013, -2182165, 3331841, 7881640, 5327790, -4415815, -12652536, -11973592, -5019710, 1044564, 5216354, 11897138, 20743545, 23863075, 15705291, 1996786, -5045339, 27803, 10082874, 13840988, 8393763, 1050710, -697516, 2620068, 6139452, 8858080, 13462844, 19522291, 22606631, 20990584, 17813735, 14391139, 6827793, -6351494, -17508315, -17305872, -7543666, -335123, -3569526, -12458295, -17661924, -17006836, -15071212]
41845a5071212P54033K125895N405165O285537L983600J314514o92884k978912
41837A125736l954006p41884M327430M696579p56997n287607m675851l068648
41829h335248l619856j382754O291977R974801R21822j1454839r756895N168419
41821a2192573J4131980P712623j982454l048770p41243l185933n199571J87670
41813d318271N758015J074506q802775j1332640p261150o972423r753278m164926
41805d5772942J0585447J9960230J4521911K058437n098433m267453K5975L325043
41797d661785K416659k657832n321360P59949J0393232J1773805L995988j401570
41789A5297086Q78282J944511m934158j1723052q061855K318563P155371K323164
$$ y = [-15071212, -14317179, -12191284, -6786119, -500582, 3483018, 4797532, 4104648, 1125736, -2828270, -3570154, 757276, 5453855, 4696858, -590749, -5266600, -8335248, -11955104, -13337858, -7045881, 2928920, 3850742, -7604097, -17360992, -12192573, 1939407, 9652030, 7669576, 4620806, 3879563, 693630, -4505941, -4318271, 1439744, 2514250, -6288525, -17621165, -24882315, -31854738, -41608016, -45772942, -35187495, -15227265, -705354, 1353083, -3745350, -8012803, -7986828, -4661785, -2245126, -4902958, -10224318, -9464369, 928863, 12702668, 16698656, 15297086, 16175368, 18119879, 13185721, 1462669, -6599186, -4280623, 2874748, 5197912]
41781E197912n255085p884081l851261L374227P937386O078154O98659j732816
41773D563095l7641R76872n76156j182567Q2278n85481l324327l152085j93226
41764c429238j242757o613336o654350J976302Q166900L632122k649661J017338
41756e796680R390821R027506J56452m850651j470706K449377J082336k827477
41748G160978n853795p485890n567478J772673R061332P954323r4379m544952
41740B402812p41685M137334K475218l660377p035167m778394k58760J871755
41732e587264N86805j148721j330887k701697p138899p975768K648859J7646818
41724e000754J9018806L437544j0231130q063776o97860k346555n681629K579241
$$ y = [5197912, -57173, -7941254, -11792515, -8418288, -480902, 5597252, 6295911, 4563095, 4525454, 5502326, 4926170, 3743603, 3825881, 3240400, -83927, -3236012, -3429238, -4671995, -11285331, -17939681, -15963379, -7796479, -4164357, -6814018, -5796680, 3594141, 12621647, 12778099, 7927448, 6456742, 8906119, 9988455, 7160978, 1307183, -6178707, -11746185, -9973512, -912180, 7042143, 6947764, 2402812, 1661127, 5798461, 8273679, 4613302, -2421865, -7200259, -7459019, -5587264, -5000459, -6149180, -7480067, -10181764, -17320663, -25296431, -22647572, -5000754, 14018052, 17455596, 7224466, -839310, -1537170, -3883725, -9565354, -6986113]
41716f986113J3562656Q662646o980706j0490681J077292O712084k041607q187763
41708d672192q78036O189324P82216o224516j456393P198982N325220l670265
41700B594340o830886l637428k512122l160383J156115Q373477R084358J294007
41692F361478o937280q162037k024455N889028P465457l3152o839543p05945J3124251
41683H137802J5230722P06962j1394729o638074L557097K790069m272407m415870
41675C701572q54247m766310j1506090p511203M446148Q446638J489724l563413
41667a0117181m54931L599662L986641M412027N375370K785505r43457L73331
41659I016967K708688l214058j2492662r487091O365839J6143056Q584341m675538
$$ y = [-6986113, 6576543, 15239189, 8258483, -2232198, -1154906, 5557178, 3515571, -4672192, -5550228, 639096, 1421312, -4803204, -6259597, 939385, 6264605, 2594340, -4236546, -7873974, -10386096, -13546479, -12390364, -4016887, 5067471, 6361478, -575802, -8737839, -10762294, -4873266, 2592191, 2559039, -4280504, -4986449, 8137802, 23368524, 24075486, 12680757, 6042683, 9599780, 12389849, 8117442, 3701572, 2847325, -1918985, -13425075, -20936278, -16490130, -8043492, -6553768, -10117181, -10572112, -6972450, -2985809, 1426218, 6801588, 9587093, 8643636, 9016967, 11725655, 8511597, -3981065, -13468156, -7102317, 9040739, 17625080, 12949542]
41651A2949542q432665l989911j190172k395212l739950l684421k496431L69917
41643a2609303L347283L320312J563672J890007K242703k332787p893376m691399
41635a5162888N931322J0545324L286509n916800p266416k993739J576232O217546
41627c782910R050035M197141o428421j0676072l381456M988363M929544J836544
41619G32768L932735O968389K363482p290283j2079879q854102k472302K331751
41611a4367441L293702L940l389488r31151N374353O680013K173248J703005P616361
41602H156542P325698o044760j8347740j3294807L128638J1886778P535297R01746
41594A247392o8452K200332M077276M671304J901718m746510r061585n148457
$$ y = [12949542, 4516877, 526966, -663206, -3058418, -6798368, -10482789, -12979220, -12609303, -9262020, -5941708, -4378036, -2488029, -245326, -2578113, -10471489, -15162888, -9231566, 1313758, 4600267, -1316533, -8582949, -11576688, -10000456, -3782910, 5267125, 9464266, 3035845, -7640227, -11021683, -6033320, -1103776, 732768, 4665503, 11633892, 13997374, 6707091, -5372788, -14226890, -16699192, -14367441, -11073739, -11069799, -14459287, -15390438, -10016085, -3336072, -1162824, 540181, 8156542, 15482240, 9437480, -8910260, -22205067, -19076429, -7189651, 345646, 1247392, 1178940, 3379272, 7456548, 12127852, 14029570, 9283060, 221475, -4926982]
41586d926982K355213L914785j373731o139831n877261j923610L465471P582216
41578b923730O525322Q30510k818205j597406j420934n220105n728704J150908
41570a1202344O449160L091289m80605M040702P065735k736678j4483022r400857
41562a7656620P148670J2050682O86575p634650k102553N531023M354940j65660
41554B212407j348455k378425m191017l24596P869879Q187892j812789q324622
41546a09726m146199p040k923117k508261P484209J2813035J822913j1162426
41538A263388o570794Q157001R780194m330697j3854371p533724L494253O497871
41530c096879L578744K396514L754711M064985J547756l586929r079721j0257239
$$ y = [-4926982, -2571769, 1343016, -30715, -6170546, -12047807, -13971417, -10505946, -2923730, 3601592, 4432102, 1613897, 16491, -1404443, -6624548, -12353252, -11202344, -4753184, -1661895, -2142500, 1898202, 8963937, 6227259, -8255763, -17656620, -10507950, 1542732, 2229307, -5405343, -7507896, -1976873, 2378067, 2212407, 863952, -1514473, -5705490, -6030086, 1839793, 10027685, 8214896, -109726, -4255925, -4262965, -7186082, -9694343, -2210134, 10602901, 12425814, 1263388, -5307406, 2849595, 12629789, 8299092, -5555279, -13089003, -9594750, -3096879, 481865, 2878379, 6633090, 10698075, 12245831, 8658902, -420819, -10678058]
41522a0678058n598041p93329m07510P73067Q608178J5615262Q940679q297553
41514H162695j7325833q469916O454210J1615462O588771J312162j08639j620898
41506F608014n358564p973184o705195l593791j942109j149715K555790R754885
41498g803869J4198985R167581k308986q837257n107493O78862r77806o757570
41490g747553o640380k59364L107239K8901k319093R56513M682526L338219M57990
41481d395002J989375N968082N877320J175387k236579j097217J364640J336448
41473I982454k54750l87601Q49936P93885o74631l1088L956603O091656R44532
41464B1270996p905204j0681621m400272L487943O862740Q417426J0245310O004869
$$ y = [-10678058, -16276099, -17069428, -17476938, -16703871, -8095693, 7519569, 16460248, 8162695, -9163138, -17633054, -11178844, 436618, 7025389, 8337551, 8228912, 6608014, 1249450, -6723734, -13428929, -17022720, -18964829, -20114544, -17558754, -7803869, 6395116, 15562697, 13253711, 4416454, -691039, -12177, -989983, -7747553, -14387933, -14647297, -11540058, -11511157, -13830250, -12873737, -8191211, -4852992, -4395002, -2405627, 3562455, 9439775, 10615162, 8378583, 7281366, 8646006, 9982454, 9727704, 9340103, 10190039, 10983924, 10309293, 10278205, 14234808, 20326464, 21270996, 13365792, 2684171, -1716101, 1771842, 8634582, 17052008, 27297318, 33302187]
41456C3302187p481404j7839692j0578517P431452J3384918l30640j5365283j3718112
41448a1195091j064220N854276L708562J404485J770317p87212o500470p797118
41440a4606471k349313K450988J484405n72462J777654N596609M878516J95226
41432a144848k946877k527995j228766m23834J851030O100421Q361365M457587
41424A2498083l966878r866078p933779m27233N318471M937540R31375j780938
41416b89437j750435p27619J57892R28094Q69101m50343j029243J059220L492995
41407B260225K281732j380940j851094K132893M772821K108499j725305j463354
41399G135477P94011l9203k676526j732965K292146L177545m42763k403507P10441
$$ y = [33302187, 25820783, 7981091, -2597426, 4834026, 18218944, 17888304, 2523021, -11195091, -12259311, -6405035, -2696473, -1291988, 478329, -308883, -6809353, -14606471, -16955784, -14504796, -13020391, -13592853, -11815199, -6218590, -1340074, -1144848, -4091725, -6619720, -7848486, -8272320, -6421290, -320869, 8040496, 12498083, 8531205, -1334873, -9268652, -9695885, -4377414, 560126, 1491501, -289437, -2039872, -2767491, -2609599, -1681505, -812404, -1262747, -2291990, -1232770, 2260225, 4541957, 3161017, 1309923, 3442816, 8215637, 10324136, 8598831, 7135477, 7929488, 7890285, 5213759, 3480794, 5772940, 8950485, 8507722, 6104215, 6814656]
41390F814656L625956Q29207m681549o223180k954566Q39288L126688N126617
41382F503117O441843M756299M43330k939309l352299k138302p94782J062951
41374I982848L733500N612280M212116j557591r287762j2905901p602003L067211
41366d745302Q642083M074934k930002k203765M293803N471743k315016r796492
41358D91986p630681J970086R275359P789966j169320j0137938j0347371j0157
41350i768070J0908023J0055669j514837r656064n611852L564568P015506M106118
41342I099061J61141l908200q956268j0587038m896660K458152L099156m54094
41334a3984750J484679R167878J1630520L501666o415894p660590j560447K917541
$$ y = [6814656, 10440612, 11269819, 6588270, 365090, -2589476, -1750188, 1376500, 6503117, 12944960, 17701259, 18144589, 15205280, 11852981, 9714679, 8919897, 9982848, 13716348, 19328628, 23540744, 21983153, 12695391, -210510, -7812513, -4745302, 3896781, 7971715, 5041713, 2837948, 7131751, 12603494, 10288478, 491986, -7138695, -5168609, 4106750, 11896716, 10727396, 589458, -9757913, -9768070, 1139953, 11195622, 9680785, 24721, -5587131, -2022563, 4992943, 9099061, 9260202, 5352002, -3604266, -14191304, -19087964, -16629812, -13530656, -13984750, -12500071, -3332193, 8298327, 11799993, 5384099, -2276491, -3836938, -919397]
41326i19397J512814k021625k106596K405035O763844M759191l176008q113955
41318h96697l432070M858475N601669j298125n358703k202296J227162O21308
41310h79277J441303O285989O936942j551746q724554l003861Q643925R182634
41302A8331355l384150j3208513r316453J312557O280017K980204l096264p149950
41294g251197p246029l404842J410012L473393L472480M834095O119217J941302
41286C348431o428319r267582j786220P536895Q039063J088744l376006r03046
41278a748040L514378L633506j539394q486542j2143758r192339j686807M171555
41270b3477441N262831M464196L889008N79694o061722q342220l1025J1617790
$$ y = [-919397, 593417, -1428208, -3534804, -1129769, 5634075, 10393266, 7217258, -896697, -4328767, 529708, 6131377, 4833252, -525451, -2727747, -1500585, -879277, 562026, 6848015, 13784957, 12233211, 3508657, 504796, 9148721, 18331355, 14947205, 1738692, -7577761, -6265204, 14813, 2995017, -101247, -7251197, -14497226, -17902068, -16492056, -13018663, -9546183, -4712088, 1407129, 3348431, -3079888, -12347470, -14133690, -6596795, 1442268, 2531012, -844994, -1748040, 1766338, 5399844, 3860450, -4626092, -16769850, -25962189, -27648996, -23477441, -18214610, -13750414, -9861406, -9281712, -15343434, -23685654, -23716679, -12098889]
41262a2098889J3333611M128619l829777l288997m45424k088897m150012J40851
41254h298915P557095Q713749J785104m865453l858014K145814L956637l238454
41246C897563j3339687j4692333l410465J0540229J4352435P697914J026067l97744
41238E673979j855123o642954q369591j931963O278441P632067M410638M220149
41230I415643O128762L213952l749933o685506m057762l044452o104247o315578
41222a1199121j33163N078239K350042l845365m839293k16139M087453N564730
41214c152617N567961L212362l096026r116215p515812J486566Q260373N279109
41206I25701l388369p149181j495359P250443R694655L999945k828031m234089
$$ y = [-12098889, 1234722, 5363341, 1533564, -1755433, -2200857, -4289754, -8439766, -8298915, -741820, 7971929, 9757033, 4891580, 1033566, 3179380, 7136017, 3897563, -9442124, -24134457, -27544922, -17004693, -2652258, 5045656, 6071723, 5673979, 3818856, -2824098, -11193689, -13125652, -6847211, 784856, 5195494, 9415643, 15544405, 18758357, 15008424, 8322918, 4265156, 1220704, -4883543, -11199121, -11332284, -6254045, -3904003, -7749368, -12588661, -12804800, -8717347, -3152617, 2415344, 5627706, 2531680, -6584535, -14100347, -12613781, -4353408, 925701, -2462668, -9611849, -11107208, -3856765, 5837890, 9837835, 7009804, 2775715]
41198B775715k074357k451159n438695m544713K472755Q330952N865433j598434
41190C337497m988993j657936L105280M867388L982682J388403k910158o472194
41182F51969n867179k945910l325901o501179m707331M134142R793176L537546
41174e230667o945456o517097N514940J3457681P148841m324188o277915J993347
41166a180514R062358Q097376L102689r3344j010546j509306j866769k129232
41158A2472712k957512l135052p1508N283147P689037M063858k407208o741159
41150A4196315p729858o916644n228370l277096k070408o76627L655750R787422
41142A740484J0622264J669756j0526200j4160724o177626M189401O600030P29176
$$ y = [2775715, 701358, -1749801, -7188496, -11733209, -9260454, -929502, 4935931, 3337497, -1651496, -3309432, -204152, 4663236, 8645918, 10034321, 7124163, 651969, -5215210, -8161120, -11487021, -17988200, -22695531, -18561389, -8768213, -5230667, -12176123, -18693220, -13178280, 279401, 7428242, 3104054, -3173861, -1180514, 7881844, 15979220, 19081909, 18988565, 17978019, 16468713, 14601944, 12472712, 9515200, 6380148, 6308640, 11591787, 19280824, 23344682, 20937474, 14196315, 6466457, -450187, -5678557, -8955653, -11026061, -11702688, -8046938, 1740484, 12362748, 14032504, 3506304, -10654420, -16832046, -12642645, -6042615, -5313439]
41134e313439m933202l167453M045081P312116O48681r583692j0522285O19919
41126b0894274J1360574R925978P95751l161821M74838K854605j95697l090931
41118a930977k516908k878597n855017n381999R52411N363668K438447o44190
41110a0453162L925285R988860O602759l370087p203465k587216K35820k463266
41102e324472j479093P363556J2455394L625542r810082j1097344p53095M854132
41094a65462j118113o324020L50830J0877539J0252699q16323p343258k062829
41086C651063N786364N973559J272438N6093K545914K696618n00180k522383k695512
41077A6263974n350545j0584831j1723401n101848L705140P236680N035575J435649
$$ y = [-5313439, -10246641, -13414094, -9369013, -2056897, -1408216, -10991908, -21514193, -20894274, -9533700, 392278, 1188029, -1973792, -1498954, 1355651, 1159954, -1930977, -4447885, -7326482, -13181499, -18563498, -17611087, -12247419, -9808972, -10453162, -6527877, 3460983, 10063742, 6693655, -509810, -3097026, -2861206, -5324472, -6803565, 559991, 13015385, 16640927, 6830845, -4266499, -5019594, -165462, -1283575, -7607595, -7256765, 3620774, 13873473, 13057150, 5713892, 3651063, 9437427, 15410986, 16683424, 16739517, 19285431, 21982049, 21481869, 18959486, 16263974, 10913429, 328598, -11394803, -16496651, -12791511, -5554831, -519256, 916393]
41069I16393j228990k773878k014344J483183M609056M364367K787618L680278
41061A1823683N710742M019121j407949m441254j522498K955618K869938j418045
41053A8589356m681906m502619l085449k100627m01940J827422J169377l330576
41045C483038o057994j866853M574562L660108m168471o659550K611549J2729152
41037H305541R809511k563277q279900k352087K581093l822009j4203821j4720534
41029b5245483m069293O766856R603407O164262J836991q09886j633853p90225
41021h177224J102964K415146J216796l039274p649735p540349r08671O506824
41013a6073523O823603j4157o054652n598823n19286N243618R877054J0647884
$$ y = [916393, -312597, -3086475, -5100819, -3617636, 991420, 5355787, 8143405, 11823683, 17534425, 21553546, 20145597, 15704343, 14181845, 17137463, 20007401, 18589356, 13907450, 9404831, 6319382, 4218755, 3816815, 5644237, 6813614, 3483038, -2574956, -4441809, 132753, 3792861, -375610, -7035160, -4423611, 8305541, 18115052, 15551775, 7271875, 4919788, 7500881, 3678872, -10524949, -25245483, -29314776, -22547920, -12944513, -6780251, -4943260, -5753146, -7386999, -8177224, -7074260, -4659114, -3442318, -6481592, -14131327, -21671676, -22580347, -16073523, -9249920, -9264077, -15318729, -20917552, -21436838, -16193220, -6316166, 4331718]
41005D331718M480770m605581o519584Q29713O034747P3974r440260r462662j306013
40996a5583178K459154k001550n616455k722145P95744n14390k123771J654245
40988b3652346P106466P116004K913281J835905N366825P060469L109756j614308
40980I242052j306884J740679J098881l162112m530103j304099j36288m202697
40972b560571n413530L236777J3102656R517287n823782j5388014j0440574j527579
40964a5297330M25575m07533L226799O725711K764524l993104m446936m79516
40956a1481810K47589q31131K708267P698448N457902k065244m693931j349456
40948d309366n70207l927462l660628J833610M666823K100823M71049J474737
$$ y = [4331718, 8812488, 4206907, -2312677, -1482964, 4551783, 4625757, -4814503, -14277165, -15583178, -13124024, -15125574, -20742029, -23464174, -22668430, -23182820, -25306591, -23652346, -16545880, -9429876, -6516595, -4680690, 686135, 7746604, 10856360, 9242052, 7935168, 9675847, 10774728, 7612616, 3082513, 1778414, 1642126, -2560571, -7974101, -4737324, 8365332, 17882619, 12058837, -3329177, -13769751, -15297330, -14871755, -15279288, -12052489, -5326778, -2562254, -6555358, -11002294, -11481810, -11234221, -12065352, -9357085, -1658637, 3799265, 1734021, -2959910, -4309366, -4879573, -8807035, -12467663, -10634053, -5967230, -3866407, -3395358, -1920621]
40940a920621j016686o444761n084306L883811P144465j337284q232867j437085
40932a4445334R949252R795004n48792o588019l353743P65281J09175j298917
40924e616093Q92701M818498O505244M386937l58746m054417l067736P63676J149146
40915E419210l148764n665474k958166m90879k357853l625101l62287J611380
40907a1577934k226766l954283M497209J5008802J3730255L110295k081723J738993
40899A8244848L783896p33081l718906q56861O80775l052433m660290K42248L279342
40890A3209538k427124q881458n333027M117338O959393J288757l381101j840428
40882C711888J371396K056141J917509K164464r8800n563559q932363n771142
$$ y = [-1920621, -2937307, -9382068, -14466374, -10582563, -3438098, -4775382, -13008249, -14445334, -4496082, 5298922, 4750130, -1837889, -5191632, -4426351, -4317176, -5616093, -4723392, 95106, 6600350, 10987287, 10628541, 6574124, 3506388, 4270064, 5419210, 2270446, -3395028, -6353194, -6844073, -9201926, -12827027, -13189314, -11577934, -13804700, -17758983, -13261774, 1747028, 15477283, 18587578, 16505855, 18244848, 22028744, 21295663, 17576757, 16719896, 17400671, 14348238, 9687948, 9930196, 13209538, 10782414, 1900956, -3432071, 685267, 7644660, 8933417, 5552316, 3711888, 5083284, 7139425, 9056934, 11221398, 11122598, 5559039, -3373324, -9144466]
40874i144466N93193L061199l20009m677384m614924K98442N928607P488199L256533
40865A869390l684340p224228l706031L562997P168468M144974o28875j646244
40857a43889l12527r68862k098976J260796O731253N463849l016375o514304K173727
40848B574692J1750352P295839o985511j3097640n410531K862874J608616j941172
40840a342481K119225R002935P139221l221520j0275933p236558K43610L177389
40832c94112m89854n310295m396533L377686J0250983O840983m784276j0718553
40824e623971l152733P374881O289030l388545n847504K592864P805218R26115
40816F975355o826141j783409J0057153J1544598n7400r848585p653856r37918
$$ y = [-9144466, -8551273, -5490074, -5810083, -10487467, -15102391, -14803949, -8875342, -1387143, 1869390, -1814950, -9039178, -12745209, -9182212, -2013744, 2131230, 1502355, -143889, -456416, -1425278, -3524254, -2263458, 4467795, 9931644, 6915269, 400965, 2574692, 14325044, 21620883, 14635372, 1537732, -3872799, -1009925, 598691, -1342481, 776744, 9779679, 16918900, 13697380, 3421447, -3815111, -3571501, -394112, -883966, -6194261, -10590794, -7213108, 3037875, 9878858, 5094582, -5623971, -8776704, -1401823, 4887207, 1498662, -4348842, -1755978, 6049240, 6975355, 149214, -1634195, 8422958, 19967556, 19910156, 10061571, 2407715, 1469797]
40808A469797j062994o575458p601146j137715O068883P858777N046792J443321
40800E510257r79379j523675L63245L192128L149509j422438o632147p006720
40792e349220k653030L79546j935166n671529l865655L423129P892989L718600
40784d060336l714103l950320M594675J1743197Q295359k306604q584916n221017
40776c204065J518520K597114l095849q599738p574713r42538N092436O122365
40768h086468L507153J522135J964587K709002J031000k908379n817852l919203
40760i998025L119632R896720R147894O52813o026314k406329O757224Q645591
40752A9789206k3131q303160o643968P22145M203484K439370J26577j906675n448414
$$ y = [1469797, 406803, -6168655, -13769801, -14907516, -8838633, -979856, 4066936, 5510257, 4530878, 3007203, 3370448, 6562576, 9712085, 8289647, 1657500, -5349220, -8002250, -7622704, -9557870, -15229399, -19095054, -15671925, -7778936, -4060336, -7774439, -11724759, -7130084, 4613113, 12908472, 10601868, 2016952, -3204065, -1685545, 911569, -2184280, -10784018, -18358731, -19301269, -14208833, -8086468, -4579315, -3057180, -1092593, 1616409, 2647409, -260970, -6078822, -9998025, -6878393, 3018327, 12166221, 12819034, 6792720, 4386391, 11143615, 19789206, 19766075, 11462915, 4818947, 5541092, 9744576, 12183946, 12310523, 10403848, 4955434]
40743D955434p552851m065431J533527K243676p60436l51607L291903K713288
40735B007503k466420l223667L090368O459093K02454p260267n477676J677936
40727d990676L152545j768754m371203j760307K8430k169986l742655j015017
40719a6637623L085609M797205M770528M627867L285437M1311k295059r00784
40711G74491K364967K800355j102025n544804n875896k174930R18822L54348j223911
40702h708583J54374K850838J498307l928440o274673j006295O708886Q542349
40694a63237L367875k785783m589188j601890L071680M966815J551817l524984
40686B93105k719855N043127J0206516M446834o461818r055833m52506P687449
$$ y = [4955434, -2597417, -6662848, -5129321, -2885645, -3646081, -3997688, -705785, 2007503, -458917, -3682584, -592216, 5866877, 6069331, -1190936, -6668612, -4990676, -1838131, -3606885, -7978088, -9738395, -9709965, -11879951, -15622606, -16637623, -13552014, -8754809, -3984281, 643586, 3929023, 3970334, 1675275, 774491, 3139458, 5939813, 4837788, -707016, -6582912, -8757842, -7839020, -7484672, -8708583, -8554209, -5703371, -4205064, -8133504, -14408177, -15414472, -8705586, -163237, 3204638, 418855, -4170333, -5772223, -2700543, 2266272, 3818089, 293105, -2426750, 2616377, 12822893, 17269727, 10807909, 1752076, 1299570, 8987019]
40678H987019N133251l942694q123160m337654n49834l555964r288490q613102
40670b4290628p51445M655906J239835l911727n07501Q032628Q335731j790710
40662h987911q100609j018522R376051Q640246r53409o372518m186390j450514
40654a3053576j21373M651717J1059186J0023654Q81508n338665k927273M9060
40646E224238l575215p967188n294374L53590N47031k254347J076815R324772
40638b564678J0163852j288183j2772260r893063M234905J1864933L042867j1391218
40630h602845j3290763J70423J4013636J4995323N737823l334679p838319q795341
40622f944742n228967L056149R292685O478124j549280n123189k937630j144044
$$ y = [8987019, 14120270, 10177576, 2054416, -2283238, -2833072, -6389036, -15677526, -24290628, -25042073, -20386167, -19146332, -23058059, -23565560, -15532932, -7197201, -8987911, -17088520, -18107042, -8730991, -90745, -1044154, -7416672, -11603062, -13053576, -13174949, -8523232, 2535954, 12559608, 13441116, 8102451, 5175178, 5224238, 1649023, -6318165, -11612539, -11258949, -10711918, -12966265, -11889450, -2564678, 7599174, 6310991, -6461269, -16354332, -12119427, -254494, 2788373, -8602845, -21893608, -21723185, -7709549, 7285774, 13023597, 9688918, 1850599, -6944742, -12173709, -9117560, 175125, 6653249, 5103969, -19220, -2956850, -4100894]
40614d100894m17070L605662P614577L042907o593408o569878N248686J1428413
40606A3258995J033670j2221990j0631421J352920P059164L907655K351980M793359
40598A0904332L893275o05628j180154J310193j945367q983567o403734P018283
40590D007633J3110368O26824j5446115j4304635Q79167Q935548J663327o880831
40582g408714l123362P320651R877053J853716n399780l297949K377549J40676
40574B339840j0365234j6427608q866206N147702J1436867P250246K335344K872846
40566d276203M079749R39316l404952m996855o254266q947459p524978J807572
40558b8578076J1305096J1117950M364549J822214M306561K734284m566798p983608
$$ y = [-4100894, -4517964, -912302, 6702275, 9745182, 3151774, -3418104, 1830582, 13258995, 14292665, 2070675, -8560746, -7207826, -148662, 3758993, 6110973, 10904332, 14797607, 14191979, 13011825, 14322018, 12376651, 3393084, -3010650, 4007633, 17118001, 17744825, 2298710, -12005925, -11126758, -2191210, -527883, -7408714, -10532076, -3211425, 6665628, 8519344, 3119564, -178385, 2199164, 2339840, -8025394, -24453002, -33319208, -28171506, -16734639, -9484393, -7149049, -4276203, -196454, 742862, -2662090, -7658945, -13913211, -22860670, -30385648, -28578076, -17272980, -6155030, -1790481, 31733, 4338294, 7072578, 2505780, -5477828]
40550e477828l175090J038621k715207q583908p832440j886284L374216Q230679
40542a7027241J4274303J5860993P841808k813124n020238l72423J58773n301749
40534G601102p417474k669342Q63102j797730m376943j344339K795065K787107
40526c559452J618320K966272L343825l76345l612820k592731k306310o483352
40518a1002593p533251J642881J2205031R861253k572926q027086n22810O840898
40510H91397K449984p898244j1240085m264160N825723J0609793O533852k478075
40502D30185o137564J849595J2904923J1286677m814426j9021885j7589103n270466
40494b6362064M779519P563092N662165R64020l841922k380788O634040J2570656
$$ y = [-5477828, -8652918, -7614297, -10329504, -18913412, -26745852, -28632136, -25257920, -17027241, -2752938, 13108055, 20949863, 18136739, 13116501, 12744078, 12902851, 7601102, 183628, -2485714, -1622612, -3420342, -7797285, -9141624, -6346559, -3559452, -1941132, 1025140, 4368965, 3992620, 379800, -2212931, -4519241, -11002593, -18535844, -16892963, -4687932, 5173321, 2600395, -5426691, -5949501, 891397, 3341381, -4556863, -15796948, -20061108, -14235385, -3625592, 2908260, 430185, -5707379, -3857784, 9047139, 20333816, 15519390, -3502495, -21091598, -26362064, -21582545, -14019453, -8357288, -7393268, -11235190, -13615978, -6981938, 5588718]
40486E588718N147939r511083j5200173o570923N662756J0080859O200791J5111
40478A413995l845190l333228J063367N133758M494367P62545j71685L353476
40470H871405O681514N717969J052468n081849j0584608j1797998o286658J277191
40462a0150566K531866k868045n727762j114026L568687M76293n106418k362440
40454b0752411P186326J0359746J912984o946385m593164M733199Q475273M094055
40446D469623J423K76472m03769m461088m898952K489416Q956756M303684o716879
40437D016686j0250269l326020L200933K100533j077945L78942L695032L239417
40429A977309p7394k387692l691985n001039m079432k8026K978495K449852K725423
$$ y = [5588718, 10736657, 1225574, -13974599, -20545522, -14882766, -4801907, 1398884, 1413995, -2431195, -5764423, -4701056, 432702, 4927069, 5689614, 5517929, 8871405, 15552919, 21270888, 22323356, 17241507, 6656899, -5141099, -11427757, -10150566, -7618700, -10486745, -16214507, -17328533, -13759846, -13283553, -18389971, -20752411, -13566085, -3206339, -1293355, -8239740, -12832904, -8099705, 375568, 4469623, 4471046, 4747518, 4343749, -117339, -5016291, -2526875, 6429881, 10733565, 4016686, -6233583, -9559603, -6358670, -4258137, -5336082, -4957140, -1262108, 1977309, 1899915, -487777, -4179762, -9180801, -13260233, -13288259, -10309764, -7859912, -5134489]
40420e134489O866750R044868L072681o106756q476948l432911N83173j174750
40412d758382n538547q014147o038513J578148J0578675J0594164j750026j3210322
40404a6558950r304482M168305R171503K770155n93001N061082Q217304K086967
40396E018883k932110J376555O050955J590145n234014n168194l424556o693539
40388i415875n860101Q533799K3126485J6918998m825594j5273579m757750P874126
40380A6320509O584490j016399k405067l86057k723825o533988n890925l796311
40372A52427m587486l858667K697356Q957537Q031158M137382L495443J680690
40364B0705840o866062j4200137r089248L025507O590054J77806k659058K762629
$$ y = [-5134489, 1732261, 10777129, 13849810, 7743054, -733894, -4166805, -3583632, -4758382, -10296929, -18311076, -24349589, -22771441, -12192766, -1598602, -3348628, -16558950, -25863432, -21695127, -12523624, -9753469, -10346470, -5285388, 2931916, 5018883, 2086773, 3463328, 9514283, 11104428, 5870414, 702220, -2722336, -9415875, -15275976, -6742177, 16384308, 33303306, 28477712, 13204133, 8446383, 16320509, 22904999, 21888600, 19483533, 19097476, 16373651, 9839663, 3948738, 152427, -4435059, -8293726, -5596370, 3361167, 11392325, 15529707, 19025150, 20705840, 13839778, -360359, -9449607, -6424100, 165954, 343760, -2315298, 447331]
40356D47331M915573k855617r827267n002535N489762Q363568K225484l574994
40348A81305l958525k495562l107636m964990n200553j992274M284996R941634
40340g311605R813583L101943m381566o137707j610024M181056N449134N3324
40332C158138p521620q283215J031288J0694344Q501742k337453n972371K646776
40324A917629R055971J171947j1453841j1819795o72030O499622L232814j974441
40316d042124k717080k932852n039733l033569N976857J3196062R365124j423568
40308I349117o898070k255722N996269J0024515Q428358L925074j714246p956806
40300A8898489j2744773j2363785n326704M572229J1077363J1435716P524015
$$ y = [447331, 5362904, 2507287, -7319980, -12322515, -6832753, 1530815, 3756299, 181305, -3777220, -6272782, -9380418, -14345408, -19545961, -21538235, -17253239, -7311605, 2501978, 5603921, 1222355, -4915352, -6525376, -2344320, 3104814, 3158138, -4363482, -12646697, -11615409, -921065, 7580677, 5243224, -729147, 1917629, 10973600, 12145547, 691706, -11128089, -11800119, -5300497, -2067683, -4042124, -6759204, -9692056, -14731789, -17765358, -11788501, 1407561, 10772685, 9349117, 2451047, 195325, 6191594, 16216109, 24644467, 28569541, 26855295, 18898489, 6153716, -6210069, -11536773, -6964544, 4112819, 15548535, 23072550]
40293B3072550J520870n424653r642982o307882K139620N197816k084788j0063174
40285a592623o840951M491058J0259186N433791j722096l784525k593709j959030
40277A691101j516830q91700j838997l087476m59719M946591O153456J016257
40269F012683l887245l509069j072790q48357j587096j221290q70577k13618L516743
40260c680616Q104143O727193K15455j383207M376357N626614m472721j3433139
40252B080079p487134N861446R174325J970053j503360K340661K378873n380207
40244I434736j0505586o896923k125175j787781J7859O379468Q204205M7429p065762
40235d297530j726569Q534152Q445956j223072o471723k917694J92710j319756
$$ y = [23072550, 24593420, 19168767, 9525785, 3217903, 5357523, 10555339, 8470551, -1592623, -8433574, -3942516, 6316670, 11750461, 10028365, 6243840, 3650131, 1691101, 174271, -717429, -2556426, -5643902, -6103621, -1157030, 4996426, 6012683, 2125438, -1383631, -2456421, -3304778, -4891874, -6113164, -6983741, -7197359, -3680616, 4423527, 11150720, 11366175, 9982968, 14359325, 19985939, 15513218, 2080079, -5407055, 454391, 9628716, 11598769, 10095409, 12436070, 14814943, 9434736, -1070850, -7967773, -10092948, -11880729, -11862870, -5483402, 2720803, 2768232, -4297530, -6024099, 2510053, 10956009, 9732937, 3261214, 343520, 536230, -783526]
40227g83526K01057Q154378J2695220N519472o508917j1283059p733766l192155
40219b931296j25643M123801P181836K526004q067148j2752611m989795O187167
40211h847685P498671j033870o832188k010152O879577Q603115J951954l940376
40203B269046k549551J888740J394419m070069o780248k673428L136068M965312
40195b419711N241944Q622209J1210035M696704q638310j4864960o568608N968209
40187C247512Q169810m49564q853339j0378822o942037o79861P852485J3382705
40179E348889Q702753l268054r430711l351630N229155L664956o420501j2074418
40171a1599561o106659N191237J0733197O373973k363983o538387k489916M553825
$$ y = [-783526, -582469, 7571909, 20267129, 25786601, 19277684, 7994625, 260859, -2931296, -3056939, 1066862, 8248698, 10774702, 2707554, -10045057, -15034852, -8847685, -1349014, -2382884, -9215072, -11225224, -4345647, 4257468, 6209422, 2269046, -280505, 1608235, 3002654, -1067415, -7847663, -10521091, -7385023, -2419711, 2822233, 11444442, 22654477, 27351181, 18712871, 3847911, -2720697, 3247512, 11417322, 10967758, 2114419, -8264403, -15206440, -15886301, -8033816, 5348889, 14051642, 10783588, 1352877, -1998753, 3230402, 6895358, 474857, -11599561, -17706220, -12514983, -1781786, 4592187, 2228204, -4310183, -6800099, -2246274]
40163b246274O241946Q24111m919986m350229J047417M349789K086303k007097
40155A025980k091694K137801M212064j079528q960064q382669L194090J3944498
40147D000478J1937269Q18437o298623n261560l502997n499519o703118l786403
40139a4296036m43908P43729K802398O182879N097667k246989p861195m979748
40131a5001203J927926M611755K369633l24108j562937j103193K402812O859074
40123A79759N423058l299280r687312n501293L464978N502319n32534n392344
40115i842649l135643L101283O972034M524286l425570r770739o227712N378170
40107a2426540J2738748R038185J826443k17563L5912k475188l175786K340817
$$ y = [-2246274, 3995672, 4819783, -100203, -4450432, -3403015, 946774, 3033077, 1025980, -1065714, 1072087, 5284151, 4204623, -4755441, -13138110, -9944020, 4000478, 15937747, 16756184, 10457561, 5196001, 1693004, -3806515, -10509633, -14296036, -14739944, -13996215, -11193817, -5010938, 86729, -2160260, -10021455, -15001203, -13073277, -8461522, -6091889, -6415997, -7978934, -9082127, -6679315, 179759, 5602817, 2303537, -7383775, -12885068, -9420090, -3917771, -4450305, -9842649, -12978292, -9877009, -2904975, 1619311, -1806259, -11576998, -17804710, -12426540, 312208, 9350393, 11176836, 10959273, 10995185, 8519997, 5344211, 7685028]
40099G685028N754437j702616j1335931q101782M849109J0269934L263505m092874
40091F588810m245448k374290j456570K945588Q948776O486375m764961j1067824
40083A060456n250152K553862K332031j224526k50910K603196J757304m52522
40075C128739l0279N32666j127590j249324J519696R24729n202867p781616n66315
40066i852161P877900O902143P2742k556377q05628p61636j310418K529171P322354
40057I418090N383367j504631m715666l055549k622599m118141k561067Q50825
40049b925371q12416o605220o760172J418406P908639N202093n45295k35365L910901
40040E56200K942612m171825q587186l932520N150385Q806034L756784l262417
$$ y = [7685028, 13439465, 11736849, 400918, -7700864, -2851755, 7418179, 10681684, 6588810, 2343362, -30928, -1487498, 1458090, 10406866, 16893241, 12128280, 1060456, -4189696, -1635834, 696197, -528329, -779239, 1823957, 3581261, 3128739, 3098460, 3631126, 2503536, 1254212, 2773908, 3698637, -1504230, -9285846, -9852161, -1974261, 4927882, 5000624, 2444247, 1638619, 876983, -433435, 2095736, 9418090, 14801457, 13296826, 8581160, 5525611, 2903012, -1215129, -3776196, -2925371, -3737787, -10343007, -17103179, -15684773, -7776134, -2574041, -3119336, -3354701, 556200, 3498812, -673013, -9260199, -13192719, -8042334, 763700, 4520484, 1258067]
40032A258067m309449l70794P72962l211760m709122K313118J1240686J0358457
40024A3342165n43090r002026o253100K262838N680230J474698l819915m264189
40016a122389l70087L454504L807430P30627k541444k312117J545847M681715
40008G874086L207331p80338j336228K815342N231052L88584p131846p554921
40000B713062K25076O236062L396706k575685k394308K885612M345335j337203
39992A3494657q236175r700424m279218N193276J2193908Q926883m023053j3286044
39984B83810p699029M600619N995077m749530j0907042l917226M912943M565793
39976f914585M57173J215463L534624J852902O05358L593376K714550p336672
$$ y = [1258067, -3051382, -3422176, -2649214, -5860974, -10570096, -8256978, 2983708, 13342165, 12799075, 3797049, -2456051, -193213, 5487017, 6961715, 3141800, -1122389, -1492476, 1962028, 5769458, 6500085, 3958641, 1646524, 3192371, 7874086, 11081417, 10301079, 8964851, 11780193, 17011245, 17399829, 10267983, 2713062, 2938138, 9174200, 12570906, 9995221, 7600913, 10486525, 14831860, 13494657, 5258482, -4441942, -8721160, -3527884, 8666024, 17592907, 13569854, 283810, -7415219, -2814600, 3180477, -1569053, -12476095, -16393321, -11480378, -6914585, -6457412, -5241949, -1707325, 145577, 750935, 4344311, 7058861, -277811]
39968b77811j3639390k786589J3799776J3457792k650789j0734101j361056P978633
39960C786465L496283l743834O64347R796709Q403933j646225o388486l280456
39952A1088736k524427p135367p646879Q97481R490042Q162011j83770n239171
39944F908656l453192n21975j710890m925465m426727J091678O245157N284248
39936D491490m12263l545008m52035L484237J210059n186545o315246J178923
39928e546388Q799538P434464o973l321709k26113J074656m175985q920176n029339
39919i918025L675409O681651J816362l174811l127768j256094j224674j096925
39911g624875J591954M618041M736407K472429K51586q11575k72554J761850K788748
$$ y = [-277811, -13917201, -16703790, -2904014, 10553778, 7902989, -2831112, -4192168, 3786465, 7282748, 3538914, 4203261, 13999970, 22403903, 20757678, 14369192, 11088736, 8564309, 1428942, -6217937, -5320456, 4169586, 12331597, 12147827, 6908656, 3455464, 2933489, 1222599, -3702866, -8129593, -7037915, -792758, 4491490, 4079227, 534219, 82184, 3566421, 4776480, -410065, -6725311, -5546388, 3253150, 10687614, 10680641, 7358932, 7132819, 8207475, 4031490, -4888686, -9918025, -6242616, 439035, 2255397, -919414, -4047182, -5303276, -6527950, -7624875, -6032921, -1414880, 3321527, 5793956, 6045542, 5233967, 4961413, 6723263, 9512011]
39902I512011M00335k472808o07144L927938K539724o659597j4198244j2295554
39894a9853339m940609O41351M708891R663040J1244010M903960l756643n134428
39886b523767L18477L550628R22857k061377n38695M083215Q337685R888566O738966
39877B8716555q28675q125973j0871280j0226795q334375l100258N770188J0578745
39869C578132M976731m339642n984636q74778J053191j383157k06459M868128
39861A687510M897177o30197r68283N747463O210376n234363j3413133n169774
39853f873224P937205O518469o336722j0633198j019682P022124L676198j346820
39845a055650J856602N959906p0837j0270101q679372O198722J7034211J0276529
$$ y = [9512011, 9912346, 7439538, 6832394, 10760332, 13300056, 6640459, -7557785, -19853339, -24793948, -24152597, -19443706, -9780666, 1463344, 6367304, 2610661, -2523767, -2205290, 1345338, 2268195, 206818, -331877, 3751338, 12089023, 21977589, 28716555, 27887880, 19761907, 8890627, -1336168, -9670543, -12770801, -7000613, 3578132, 8554863, 4215221, -1769415, -2644193, -1591002, -2974159, -3180618, 1687510, 6584687, 5954490, 4986207, 10733670, 16944046, 11709683, -1703450, -6873224, 1063981, 7582450, 1245728, -9387470, -10407152, -3385028, 291170, -1055650, 800952, 6760858, 6690021, -3580080, -12259452, -6060730, 10973481, 21250010]
39837B1250010o330302j4547866q380188J386911L703114J60973j492646P7744
39829d172250N97353L6474K719278P226138N441906m336165j1579044p688582
39821a1754892N89126J237161l988134k501896P819556J3623487O730714k397685
39813I357437o70713P484142P956486o73514o461967m378657k818939o990540
39805B803735r427483l817385L169384L038202p27202n27958J361154j206598
39797e334151m313329l1651P247889N804197l136700o066876L94047M337164J17032
39788i82378j934220M690347R382082K674005o169766m426408K235987j39257
39780E330392r289182j0154662K45323Q283793M808428l392852n732690l40468
$$ y = [21250010, 14919708, 371842, -8008346, -6621435, -2918321, -2757348, -4249994, -4172250, -3574897, -3538423, -819145, 6406993, 11848899, 7512734, -4066310, -11754892, -11165766, -9928605, -13916739, -16418635, -8599079, 5024408, 11755122, 9357437, 8686724, 16170866, 24127352, 23453838, 16991871, 12613214, 9794275, 2803735, -6623748, -10441133, -7271749, -4233547, -4960749, -5488707, -4127553, -5334151, -9647480, -9679131, -2431242, 3372955, 236255, -5830621, -5436574, -1099410, -982378, -2916598, 1773749, 11155831, 13829836, 7660070, 3233662, 5469649, 5330392, -3958790, -14113452, -13868129, -5584336, -775908, -4168760, -9901450, -10241918]
39772a0241918P972670J3273547J0598531N15018p934421o443762J055441M001916
39764A2797022N80559j836190r8481J434944P16786N91873J252758K20166l08034
39755A5351403L203314N568687j358305j2662210j4263516m908017R04610l646961
39747a1810995p070653P0196Q916155P161487j645136n425082j349450M702654
39739f450824Q886195R222155K039519j0513078j5912617n765847J0080251J5134925
39731F720679P798891J49211j070837o0776l76403o2027Q92787j027314m959209
39722H005002n146924o32851K326801o3625l975814m895586l354159j142166K128432
39713f750890N441593M828509m57101m438691j783853M059951N020936m33658
$$ y = [-10241918, -2269248, 11004299, 21602830, 22117848, 14183427, 7739665, 8795106, 12797022, 13377581, 11541391, 11442910, 12877854, 13594640, 14186513, 15439271, 15659437, 15351403, 18554717, 24123404, 22765099, 10102889, -4160627, -9068644, -8164034, -11810995, -18881648, -18811452, -9895297, -2733810, -4378946, -9804028, -11153478, -6450824, 2435371, 11657526, 13697045, 3183967, -12728650, -18494497, -8414246, 6720679, 14519570, 14668781, 13597944, 13537168, 13160765, 13098738, 13991525, 12964211, 8005002, 2858078, 2225227, 4552028, 4488403, 512589, -4382997, -7737156, -8879322, -6750890, -1309297, 3519212, 3062111, -1376580, -3160433, 899518, 5920454, 5486796]
39705E486796n322390m273888r76957j900271n433919l294251O595748J4960209
39697E841077J2903331L823553k287272k626309k068762k398533n17433K614934
39689A5284586J319355m037966n068320J747876Q752070Q529885L434961j693251
39681B8269196p619423j4405934j5510116p480356J350288K091687p13748K241271
39673a1777135P511190M051025o236459q654275J222250R427661N005103l134928
39665b585568q19464Q971529J0974768J062925q085297n991017J782618L757606
39657I068100j287410n491125m725747k005462L05881L096868M414569m07746
39649B967928q966797j0678310j619829P279407N410315j082403N87723Q410873
$$ y = [5486796, 164406, -4109482, -5086439, -6986710, -12420629, -15714880, -9119132, 5841077, 18744408, 22567961, 20280689, 17654380, 15585618, 13187085, 12669652, 15284586, 16603941, 12565975, 7497655, 9245531, 17997601, 26527486, 29962447, 28269196, 20649773, 6243839, -9266277, -16746633, -15396345, -13304658, -14018406, -11777135, -4265945, -214920, -6451379, -15105654, -13883404, -4455743, 549360, -2585568, -3405032, 5566497, 16541265, 17604190, 9518893, 3527876, 5310494, 9068100, 7780690, 2289565, -2436182, -4441644, -4135763, -1038895, 3375674, 2967928, -5998869, -16677179, -18297008, -11017601, -5607286, -6689689, -6101966, 2308907]
39641B308907Q565151j651114r370699p033687k655316l700415m673412Q12244
39633a7398341P347046P104100K770444J230609J990818J345981R28398K651211
39625G970266K080433l366771o514346j324055M912805K135121n339207n200888
39617d646642L131184Q381864N022623j402414n397834o263564k707667N595302
39609A712852J1567467P458906k088918n187440o59922J540178j725402k177244
39601A0440477L780802P888712M040046k333553m688484m582656m404719j084565
39593I056060N780834Q572694K448609n770913p303838l725516j856071j870592
39585E331267J066582O811342R846789P546744K940155q0314l63456P09940O02015
$$ y = [2308907, 10874058, 9222944, -147755, -7181442, -9836758, -13537173, -18210585, -17398341, -10051295, -2947195, -176751, 1053858, 3044676, 4390657, 5319055, 7970266, 10050699, 6683928, 169582, -1154473, 3758332, 5893453, 554246, -4646642, -1515458, 6866406, 11889029, 10486615, 5088781, -1174783, -3882450, 1712852, 13280319, 20739225, 18650307, 13462867, 12802945, 14343123, 12617721, 10440477, 14221279, 22109991, 26150037, 23816484, 19128000, 14545344, 10140625, 9056060, 14836894, 23409588, 25858197, 20087284, 12783446, 9057930, 7201859, 5331267, 6397849, 13209191, 23055980, 30602724, 33542879, 33462565, 33099109, 33809049, 34411064]
39576C4411064j554506k479065J509465P382361P192023q46812q569335q432851
39568B8612344k760939J339774J484013J84824k86916J089233M699418Q153746
39560D2515497P103706J742798j371791K208601Q345901J0313755P580183M333670
39552H2772320K712946K288619L813737Q855391J6715237K4463845K8830823K7319439
39544A97772357K0662736J4574431J3896128J4193004O423441p750689j4467404
39537B45304004o706524M600112O762590L807774O991047J3348129Q856640q283230
39529B74680542k2625685k3217208j7788277j8934857k5855939k8221828k2338159
39522A15698589j4739182j1578284j1396247r243706l852102J120255J739580
$$ y = [34411064, 32856558, 30377493, 31886958, 39269319, 46461342, 45614530, 37045195, 28612344, 25851405, 27191179, 28675192, 28860016, 28573100, 29662333, 34361751, 42515497, 49619203, 51362001, 49990210, 52198811, 60544712, 70858467, 78438650, 82772320, 85485266, 87773885, 91587622, 100443013, 117158250, 141622095, 170452918, 197772357, 218435093, 233009524, 246905652, 261098656, 267522097, 259771408, 245304004, 238597480, 243197592, 249960182, 253767956, 260759003, 274107132, 282963772, 274680542, 252054857, 228837649, 211049372, 192114515, 166258576, 138036748, 115698589, 100959407, 89381123, 77984876, 68741170, 64889068, 66009323, 67748903]
39515F7748903j616692n167259p041874r254288j2694484j3296433p288036J793544
39507A3183381O463361M733069J004564j520100l053834k345746K503138P056273
39499B8024106L155182p848191j3120754n461165N470078O734052J6684l744332
39491A3225660k188662k086999m676518l457610K454208N120069J387045j353689
39483H423504J941568N372004K823518j673025j858043L21477K72957o42749q22081
39474A4159130m871298j3427998j4287006J645449K0602483J9606526q43138j5732673
39466F851475j0321086J950422L496864k508279l214520J532676L079023J507452
39458B374027L463994O815951K586300q364191j3660903o643201M606939Q588889
$$ y = [67748903, 66132211, 60964952, 53923078, 44668790, 31974306, 18677873, 11389837, 13183381, 19646742, 24379811, 25384375, 23864275, 20810441, 18464695, 20967833, 28024106, 31179288, 23331097, 10210343, 4749178, 10219256, 16953308, 16969992, 13225660, 11036998, 8949999, 4273481, 815871, 3270079, 8390148, 9777193, 8423504, 10365072, 15737076, 18560594, 16887569, 15029526, 15351003, 15623960, 14981211, 14159130, 9287832, -4140166, -18427172, -16781723, 3820760, 23427286, 22584148, 6851475, -3469611, -1519189, 1977675, -530604, -3745124, -2212448, 866575, 2374027, 5838021, 12653972, 15240272, 6876081, -6784822, -13428023, -8821084, -232195]
39450b32195L759621k298738k504498K936157P129150M190480k595244l959694
39442F425039J907010N443858O9462o904975n663782N32010J713041j900709j746299
39433a25345L076751M769693J385341n24011R21127j61678m472809m085102L016530
39424C800497O503582r04672j0714625r622705K763887J4489416J5598964O442157
39416B8356501m942435r466241m143073M270057N808177r04919p354430o503371
39408E120266k90807N253001O580380L124655k677824m845854J72802O518163
39400A8954782N443216j235016l821140j273928k678075r320707r545481J421760
39392b054589J0117124M282233p113173o508663O521576J5528501R933047l831503
$$ y = [-232195, 3527426, 1228688, -1275810, 1660347, 8789497, 12979977, 10384733, 6425039, 8332049, 13775907, 13845369, 6940394, 1276612, 1808622, 3521663, 1620954, -125345, 2951406, 7721099, 9106440, 8582429, 9503556, 9341878, 4869069, 783967, 3800497, 10304079, 9399407, -1315218, -10937923, -8174036, 6315380, 21914344, 28356501, 23414066, 13947825, 9804752, 14074809, 19882986, 18978067, 11623637, 5120266, 4829459, 10082460, 16662840, 19787495, 17109671, 12263817, 12436619, 18954782, 24397998, 23162982, 19341842, 18067914, 15389839, 6069132, -3476349, -2054589, 8062535, 12344768, 5231595, -1277068, 5244508, 20773009, 30706056, 26874553]
39384B6874553j2749043j0333047l47195O735309L382777n006831n256993M404212
39376G703742R410964L97403j0810759q364618L452305P979676J865803l342129
39368H292387k041761j54660l13782J900936M894779K30304j0750411j4269047
39360a2211255m419333P013727Q572336M916027N352199P111217J796432q140729
39352I990621j1465554m347447N138433Q353290M954080L49104n49412L041225
39344A5464340O844111M916961l206789j0350553r740795l462356O68821o64927
39336D68813l222776k297458R72051K144080K53637o65681K559099O757826N524749
39327A2494340j949601q349184o694791J129382P222003P078194K802642j497801
$$ y = [26874553, 14125510, 3792463, 3445268, 10180577, 13563354, 8556523, 3299530, 7703742, 17114706, 17512109, 6701350, -1663268, 1789037, 9768713, 11634516, 8292387, 6250626, 6095966, 5782184, 7683120, 12577899, 12808203, 2057792, -12211255, -16630588, -9616861, -1044525, 3871502, 9223701, 16334918, 18131350, 9990621, -1474933, -5822380, -683947, 7669343, 12623423, 12972527, 12423115, 15464340, 22308451, 27225412, 24018623, 13668070, 3927275, 464919, 1133740, 468813, -2753963, -5051421, -4079370, -1935290, -1681653, -2347334, 211765, 6969591, 12494340, 10544739, 2195555, -4499236, -3369854, 3852149, 10930343, 13732985, 12235184]
39319A2235184l675343l594676k633663k773956l795519k723880J584716N767103
39311C89966O825427O372228O192217L857916j685459m787952j083475L122938
39303A9203806q28996q787002q386688J376042P400745J889167p086680r014514
39295d234120m480299O22256M984870Q788514Q535827K766415k994262l948115
39287A0041086l143830m386619m174864J461218P326021N198061l452222r075758
39279b06907o679639j10566M682075M832543P96154l500401k936050K150513N139559
39270D167281L112815K024293N996398Q283744J804304p393329q517249l539980
39262E938277l258109p993023o737863L203798J0093438N792700k606062n499728
$$ y = [12235184, 8559841, 4965165, 2331502, -442454, -4237973, -6961853, -5377137, 389966, 7215393, 13587621, 19779838, 23637754, 21952295, 17164343, 16080868, 19203806, 18374810, 9587808, 1201120, 2577162, 9977907, 11867074, 4780394, -4234120, -8714419, -8092163, -3107293, 5681221, 14217048, 16983463, 13989201, 10041086, 6897256, 2510637, -1664227, -203009, 7123012, 12321073, 8868851, -206907, -6886546, -6997112, -2315037, 2517506, 3313660, -186741, -3122791, -972278, 4167281, 7280096, 9304389, 15300787, 23584531, 25388835, 17995506, 9478257, 5938277, 2680168, -5312855, -12050718, -8846920, 1246518, 7039218, 4433156, -1066572]
39254a066572m289067m500457m493788o9269N912826P181428L331585j412196
39246E94490m854418o172192k972648M296387Q844251N501383q60209j833952
39238B543092K275302M033589P77462k720178k838068j129319N61632K502456
39230F005968L715450J943571j882294l980588l281974k202705j782309r48069
39222b412950m94408k147563l542696o07794M257522L759231k407470n134103
39214h730231O19294P530175P024654J928409K86002J941502Q19966k592198j879461
39205F948112K455635J953268n026083q015346j52206R624889R100563J129044
39197A8017876j985648Q16052j775880j1987523j5020230j056717J6334341J6962324
$$ y = [-1066572, -5355639, -9856096, -14349884, -14419153, -8506327, -1324899, 2006686, 594490, -4259928, -10432120, -13404768, -9108381, -264130, 5237253, 4377044, 2543092, 4818394, 8851983, 9629445, 6909267, 4071199, 2941880, 3503512, 6005968, 9721418, 11664989, 9782695, 5802107, 2520133, 317428, -1464881, -2412950, -2907358, -5054921, -8597617, -9205411, -4947889, -1188658, -3596128, -8730231, -8110937, -580762, 6443892, 8372301, 8658303, 10599805, 11419771, 8827573, 6948112, 9403747, 11357015, 6330932, -1684414, -1836620, 7788269, 16888832, 18017876, 16032228, 16848280, 15072400, 3084877, -11935353, -12992070, 3342271, 20304595]
39189B0304595K416974p532752m216679J283452O01557Q40507O867368Q097237
39181B8662259l058481j3208359o558357P891653Q561657m298316r405990K85262
39173H871328P328966Q38084n661351O40589R373810O008446l073462l341833
39165B0984577K566431K344892k499285j645505J983408k919497j2365422j0660223
39157b210624K145869Q545214K567110j276088N319076R637900N70263j1632552
39149A3666168j1535952j125017O814806P362713L586410k559713q042064o080875
39141B086476L375334Q785422L081957m377352k989997J940664N55976k897296
39133I561184Q47450O226478J099813r633111q974882M142827J1893877N729067
$$ y = [20304595, 22721569, 15188817, 10972138, 12255590, 12857147, 13697654, 20565022, 28662259, 25603778, 12395419, 5837062, 13728715, 22290372, 17992056, 8586066, 8871328, 16200294, 17038378, 11377027, 12017616, 21391426, 27399872, 24326410, 20984577, 23551008, 25895900, 23396615, 21751110, 23734518, 20815021, 8449599, -2210624, -64755, 8480459, 11047569, 9771481, 15090557, 24728457, 25298720, 13666168, 2130216, 1005199, 7820005, 15182718, 18769128, 16209415, 8167351, 2086476, 5461810, 14247232, 17329189, 12951837, 9961840, 11902504, 12458480, 9561184, 10408634, 16635112, 17734925, 8101814, -873068, 3269759, 15163636, 20892703]
39125B0892703j607885J200725O655895L827129k820982k381455L977032N769700
39117C5512862n20535q055846r885174n138511K701067P874953N150332m301539
39109B3337609j1932387j0830492l445625K856704M680340L465959J032401j300189
39101G864320j691890k5210Q72295l29977l75885L316608O833470M188602l477582
39092A7174751q108676m799068K238941N453480L096320P5025M39066J861875
39084A7431714n40280o316062r132821n072075J928838N337480L808426N61255
39076H006475k181010l973234l691129j098706Q58229K48642O98810N817011J0752226
39067A5437314O819724n154294j3486796r627192K258464J1407503J1122216K386957
$$ y = [20892703, 19284818, 20485543, 27141438, 30968567, 28147585, 25766130, 29743162, 35512862, 34992327, 26936481, 17051307, 11912796, 14613863, 22488816, 27639148, 23337609, 11405222, 574730, -2870895, -14191, 4666149, 8132108, 9164509, 7864320, 6172430, 6147220, 7019515, 6689538, 6313653, 9630261, 16463731, 20652333, 17174751, 9066075, 4267007, 6505948, 11959428, 15055748, 15130773, 15569839, 17431714, 16891434, 10575372, 1442551, -3629524, -1700686, 3636794, 7445220, 8006475, 5825465, 1852231, -1838898, -2937604, -2079375, -1830733, -1131923, 4685088, 15437314, 22257038, 17102744, 3615948, -6011244, -3752780, 7654723, 18776939, 21163896]
39059B1163896p812252j0973109n100307J801949J878467p45720L242254J1344005
39051A4799183J1149617P57916o318280j965880L996742N59889o986092p356406
39043H636689j650637J075402k10272K56494K530975K034048j89092Q4760N61181
39034A3129548l196444o792736l152176K911850P98493o202703l923411P747519
39026A319940J0843448k451172j4216412n954430J3107840J8481476M363311j0840918
39018A4653083j1382504k163105L108964P32305k120324M93567O238319Q169261
39010A7729566K582604o581772j0863585n812417L925295R364729O415226r95393
39002A5764253n916229m633858J026655N497988M202102j640490n673705l621360
$$ y = [21163896, 13351644, 2378535, -2721772, -919823, 958644, 212924, 3455178, 14799183, 25948800, 26706716, 20388436, 18422556, 22419298, 22979187, 15993095, 8636689, 6986052, 8061454, 7851182, 8107676, 10638651, 12672699, 12483607, 12568367, 13129548, 9933104, 3140368, -11808, 2900042, 3698535, -2504168, -6427579, 1319940, 12163388, 9712216, -4504196, -10458626, 2649214, 21130690, 25494001, 14653083, 3270579, 1107474, 4216438, 4948743, 2828419, 3321986, 9560305, 17729566, 20312170, 13730398, 2866813, -2945604, 979691, 10344420, 16759646, 15764253, 9848024, 5214166, 6240821, 11738809, 15940911, 14300421, 8626716, 5005356]
38994E005356J335572K686540r80315m647142l799387J12371J817172j869141
38986c38974q521059j1426627n552974N801073J2031458O559618m044057p345300
38978a2836842j264403L821422J302935j550615L925991J2242924J1205182J584062
38970A8430656l253764J714562N791691J295352l179898J679830P545252K27453
38962C0251134j5751708k0962940r291618L672631M439287r69592r88199K984011
38954f616994L118655Q32091K897876P171017N324970j944541m657350N39284
38946F665008M875649J074965o055369p343549j804562L551883L551060L39403
38938D854488o39897J750647K135131m203909j2585475j2449841j933488P319993
$$ y = [5005356, 6340928, 9027468, 8047153, 3400011, -399376, -287005, 1530167, -338974, -8860033, -20286660, -25839634, -20038561, -8007103, -1447485, -5491542, -12836842, -14101245, -10279823, -8976888, -10527503, -6601512, 5641412, 16846594, 18430656, 15176892, 16891454, 22683145, 23978497, 20798599, 22478429, 30023681, 30251134, 14499426, -6463514, -15755132, -12082501, -7643214, -8612806, -9601005, -6616994, -3498339, -2666248, 231628, 7402645, 12727615, 10783074, 6125724, 6665008, 11540657, 12615622, 6560253, -783296, -2587858, 964025, 4515085, 4854488, 4214591, 5965238, 8100369, 3896460, -8689015, -21138856, -23072344, -15752351]
38930a5752351N321677k283902l476012J932914M095023L83333j681907Q11889
38922a0649336J269537l104338m941226M79181O103751M063221k199442m234629
38914a3213281o70568L895871O315182M871770j942840j0009399r742526M52688
38906b0043103P854987K266099p328757n120084P116678J2372667M090070n476249
38898d267692n388812n16739N41272L16646N559706J2813774J1629412L5126j1564594
38889I158099j2708454m196184M019808L791048l120480p410214l019821N541034
38881g945164R084258N672540J973444K522419L617891O79415l583552l176984
38873H844267J931685N529101L372909k028879n303121m759983l957040o502749
$$ y = [-15752351, -10430674, -12714576, -16190588, -14257674, -10162651, -9779318, -11461225, -10649336, -9379799, -12484137, -17425363, -16946182, -10842431, -6779210, -8978652, -13213281, -13883849, -9987978, -3672796, 1198974, -743866, -10753265, -20495791, -20043103, -12188116, -9922017, -17250774, -22370858, -15254180, -2881513, 1208557, -4267692, -9656504, -10173243, -9631971, -9315325, -3755619, 9058155, 20687567, 20722693, 9158099, -3550355, -7746539, -3726731, 64317, -3056163, -10466377, -13486198, -7945164, 1139094, 6811634, 8785078, 11307497, 14925388, 15604803, 12021251, 8844267, 10775952, 16305053, 19677962, 17649083, 12345962, 7585979, 3628939, -2873810]
38865b873810r759425o529824M576909J3921192J1737941K222075j479045L460199
38857A5276212N472139k352669r853741n047278O407198Q810928n78960q778476
38849I355353p009171j383388p20120l998101n290893l484788r89791J639128
38841a1881771L953975L146867p50985j421002N159108J1968298Q908921j850866
38833A7232545p507583k860439K239599j726984r034712p288718L514986J0291035
38825D859729N160933m522556p578968l282657R07385Q80245j123265k310569
38817g009723j945368O99017N306281P815094M234694k602503n460473k507959
38809a470940Q07779P59079O9643J339585J986427k65549k083361L45579M657478
$$ y = [-2873810, -12633235, -19163059, -14586150, -664958, 11072983, 13295058, 11816013, 15276212, 20748351, 18395682, 8541941, 3494663, 9901861, 18712789, 18133829, 9355353, 2346182, 962794, 242674, -3755427, -9046320, -12531108, -13520899, -11881771, -7927796, -4780929, -5531914, -6952916, -1793808, 10174490, 19083411, 17232545, 9724962, 6864523, 9104122, 7377138, -1657574, -8946292, -5431306, 4859729, 10020662, 5498106, -2080862, -5363519, -4456134, -3575889, -4699154, -7009723, -8955091, -8256074, -2949793, 4865301, 9099995, 6497492, 1037019, -1470940, -663161, 95918, 165561, 1505146, 3491573, 3226024, 1142663, 1488242, 6145720]
38800F145720N610531K298645j941737m141894k912513J441808M674578J123345
38792A2298483p154176r300389l4725J0283589Q548282k138513o778390j92251
38784E531910O664505L619214n511806j0550402q171589k784347P67972J379399
38776i055144J461645M314861R191041R816464K290491p035024q016306l30146
38768B637882O654224P285485M608458J634834k709704o829743n529789L31304
38760H082951K357602k594939o649931l047339L913128O456784L562080j281842
38752A0798494n152391m415283K981411R960522N750297o277017r459533J52256
38744D338756M558154p060532j6531835l388350J9490630K1689131N63600j5669911
$$ y = [6145720, 11756251, 14054896, 12113159, 7971265, 5058752, 6500560, 11175138, 12298483, 5144307, -4156082, -4190807, 6092782, 14641064, 12502551, 5724161, 5531910, 12196415, 15815629, 10303823, -246579, -8418168, -11202515, -10434543, -9055144, -7593499, -3278638, 5912403, 15728867, 18019358, 10984334, 2968028, 2637882, 9292106, 16577591, 21186049, 22820883, 20111179, 13281436, 7751647, 8082951, 10440553, 7845614, 1195683, -1851656, 2061472, 8518256, 12080336, 10798494, 5646103, 1230820, 4212231, 14172753, 19923050, 13646033, 4186500, 4338756, 8896910, 1836378, -14695457, -18083807, 1406823, 23095954, 23659554, 7989643]
38736G989643j0562278O86830M43797n669934m348016K354776M257118J033542
38728c814522r29788j108589k195345j825520K063111L775022j358990o074412
38720a1469033o80186R924985J0923125r73389j1893577r407351J971492Q637155
38712b966779N495778j44184p3071M943568P880237M449910l246295r974123j0900496
38703d535455l710665P516030J1615370J511207j2810883j2821296K833683J3414356
38695C012347N439918o586485l517600O785415K975315j1899953j3061413M633176
38687a2219280J6004157N025752j0623402r258985K373734N542506J232175L061307
38679A137964R816197Q230580k149230q048400m875797j667768l326026m290678
$$ y = [7989643, -2572635, -1885805, -1442008, -7111942, -11459958, -9105182, -4848064, -3814522, -4744310, -5852899, -8048244, -9873764, -7810653, -4035631, -5394621, -11469033, -12149219, -2224234, 8698891, 7725502, -4168075, -13575426, -11603934, -2966779, 2528999, 2384815, 2311744, 7255312, 15135549, 19585459, 16339164, 6365041, -4535455, -8246120, -730090, 10885280, 12396487, -414396, -13235692, -10402009, 3012347, 8452265, 1865780, -1651820, 5133595, 8108910, -3791043, -16852456, -12219280, 3784877, 8810629, -1812773, -11071758, -8698024, -3155518, -1923343, 1137964, 10954161, 19184741, 17035511, 8987111, 4111314, 2443546, -882480, -5173158]
38671e173158j670711j03913o08332K631566J0415178J4143460P959398k558697
38663B5034791p990083o119570k669663l990727r511774j0630298r30445J1548482
38655e259287J1011687l049851j1642791l807389N528970j73423j0451762m884739
38647b2728585J0758774J1967498l825891j2466174k798178O867431J960768m740433
38639a5004790J581269J0964365P211874l404879m078812L231471L087330n190504
38631a602676o791664K425302R265230N487646l19513J116036N190186K762889
38623A7533436m935636q799082m785790J871203M027766O57105k786807j391025
38615A391170K678030L113433q81546k788804Q12642L835824N9618o009466n128265
$$ y = [-5173158, -6843869, -6947782, -7556114, -4924548, 5490630, 19634090, 27593488, 25034791, 17044708, 10925138, 8255475, 4264748, -5247026, -15877324, -16807769, -5259287, 5752400, 2702549, -8940242, -12747631, -7218661, -7392084, -17843846, -22728585, -11969811, -2313, -3828204, -16294378, -19092556, -12225125, -10264357, -15004790, -13423521, -2459156, 4752718, 1347839, -2730973, 500498, 3587828, -1602676, -8394340, -5969038, 3296192, 8783838, 8464325, 9580361, 14770547, 17533436, 12597800, 3798718, -987072, 884131, 4911897, 5569002, 2782195, 1391170, 4069200, 7182633, 6301087, 3512283, 4324925, 8160749, 8220367, 2210901, -2917364]
38606b917364K610549P800544N251941j33175k276244k083407l587829o346004
38598a680989n770426L4790O578902P349453J434586n180162p287295o635922
38590a1157063o725503m776889L566997J2946141J2063770Q37212p208911m442952
38582d897198L64474j454790l265155L735908J2021212P958845n069681j0422731
38574a029116l323531L914956K766484q97279n71404P69829r3152K85014L068469
38565D890270K251117m016902p134602j145032O631126O736128J676325m25350
38557I463080L07272j789853o052090o701010l307901p27781l00842M49840R08100
38548g751185j444142l952823j302191N125714Q377172O432877L572502J141148
$$ y = [-2917364, -306815, 7493729, 12745670, 12612495, 10336251, 8252844, 4665015, -1680989, -7451415, -7416625, -837723, 6511730, 7946316, 2766154, -4521141, -11157063, -17882566, -22659455, -19092458, -6146317, 5917453, 6754665, -454246, -4897198, -4532724, -5987514, -9252669, -5516761, 6504451, 14463296, 9393615, -1029116, -4352647, -437691, 2328793, 1431514, 860110, 1629939, 1536787, 1821801, 4890270, 7141387, 3124485, -4010117, -5155149, 1475977, 8212105, 9888430, 9463080, 9770352, 7980499, 1928409, -4772601, -8080502, -8808283, -9109125, -8659285, -7751185, -9195327, -13148150, -14450341, -9324627, -947455, 5485422, 9057924, 10199072]
38540A0199072l862219r320326p059086M029241J2472672Q509508k260238o816135
38532E892489k100225L236691K416037j732358l180043q90564J680769J912626
38524G235422N24610j59353O26850R24921j050706l043415n41914O270005J0630933
38515B1417353P172353q16420n592291m313675l71059K573562L170407M86585
38507B3726815m901266q176900m359451L981732Q239979M272962l334556q376184
38499A1073131q985340n610024J42691K631315l755001j3632722j2548428L311221
38491b7373157J7762909J4650332J65598o960278k219584K619169J825467K626591
38483C097047P221013N624496n512982j2318520l571680J0900176J4954401R371968
$$ y = [10199072, 6336853, -2983473, -10042559, -6013318, 6459354, 14968862, 12708624, 5892489, 3792264, 7028955, 9444992, 7712634, 4532591, 3642027, 5322796, 7235422, 7760032, 7600679, 8227529, 9152450, 8101744, 5058329, 4516415, 10786420, 21417353, 28589706, 27773286, 22180995, 17867320, 17496261, 20069823, 23240230, 23726815, 18825549, 10648649, 6289198, 10270930, 18510909, 22783871, 19449315, 11073131, 2087791, -3522233, -3379542, -748227, -4503228, -18135950, -30684378, -27373157, -9610248, 5040084, 5205682, -1754596, -3974180, -1355011, 470456, 3097047, 10318060, 15942556, 10429574, -1888946, -5460626, 5439550, 20393951, 29765919]
38475B9765919N408187L216686n291589j6074780j5090893k085899O166312J287786
38467G301729m988196k169456K030245k306619p926647k469822Q931150J0080421
38459H482805r80984r335958o102042O14550J035815k458405k815922l99204k39557
38450a2198902k515490k334793K983914J0142318J2417655N527690o590781j3003386
38442e571775p441485K551766M701562r07760k971465K390052N854499J726777
38434C32171j953168J951029O495989L367646j193119K449914P811738J405738
38426B0667938j2222903j3902039L87405J2251202R106833J669742L359510Q129663
38418B9447351K974962q841970j3007017o176231J914067M553877L052927j356164
$$ y = [29765919, 35174106, 38390792, 33099203, 17024423, 1933530, -152369, 6013943, 7301729, 2313533, 144077, 2174322, -132297, -8058944, -10528766, -1597616, 8482805, 7501821, -1834137, -7936179, -7321629, -6285814, -8744219, -11560141, -11959345, -12198902, -14714392, -17049185, -14065271, -3922953, 8494702, 14022392, 7431611, -5571775, -13013260, -10461494, -5759932, -6667692, -9639157, -7249105, -1394606, 332171, -1620997, 330032, 6826021, 10193667, 9000548, 11450462, 19262200, 20667938, 8445035, -5457004, -5069599, 7181603, 16288436, 17958178, 21317688, 29447351, 32422313, 23580343, 10573326, 4397095, 6311162, 10865039, 13917966, 12561802]
38410A2561802p490261q227147J767885J2998289J0142491m577482j1912706l566836
38402A696035N247915p86300j4113312j6395065m949021N877846O015826O16049
38394a6790027m65095M545159R338359P841387R90064l571814J24202P747252
38386I759487Q493454o58795r898885r257059q62361N956992O334105J300142
38378A1167080o685813j2951808j0740057K9116Q763795P194943J350450R87123
38370h85171K842512k329657r989063n985835Q746163J5407969M838263q522294
38362D122887r107001j907884L28334j276255J642239N813846J936114n654090
38354d101810l367679P943089J1435867P1647j1962846j0433121k67852N298740
$$ y = [12561802, 5071541, -3155606, -1387721, 11610568, 21753059, 17175577, 5262871, 1696035, 6943950, 6157650, -7955662, -24350727, -29299748, -23421902, -17406076, -16790027, -17255122, -12709963, -3371604, 4469783, 5459847, 1888033, 2012235, 9759487, 18252941, 17594146, 7695261, -1561798, -2424159, 3532833, 9866938, 11167080, 4481267, -8470541, -19210598, -19181482, -10417687, -3222744, -1872294, -885171, 1957341, -372316, -10361379, -16347214, -7601051, 7806918, 12645181, 4122887, -4984114, -6891998, -6563664, -7839919, -6197680, -383834, 1552280, -4101810, -7469489, 473600, 11909467, 11981114, 18268, -10414853, -10682705, -5383965]
38346e383965L897608J817100Q09778j229229j456887M233715J0859105Q811183
38338B2358408j114052p334148m240640K8330l007565q887264p345624J913064
38330g629491Q660616O544235Q21916m82519K333172K994354j59212j946627O64616
38321A1801060L005026j72805n883738o712148j765208K291736J374361j083748
38313B854536j222144p32310k160322l389202j566843J319916J790172P18411
38305b387786Q74047J437963K50462j051311J01425J463938n57653l436448j529186
38296d834549M210684O686348K960831k695338o263451p386815n070523J758688
38288a0634125P871032M830049o016750j1946605n228529O074783R370533L466071
$$ y = [-5383965, -1486357, 330743, 1140521, -88708, -1545595, 2688120, 13547225, 22358408, 21244356, 13910208, 9669568, 9697898, 6690333, -2196931, -9542555, -7629491, 1031125, 7575360, 8397276, 7914757, 10247929, 13242283, 13083071, 11136444, 11801060, 14806086, 14633281, 8749543, 2037395, 272187, 2563923, 3938284, 2854536, 1632392, 900082, -1260240, -4649442, -6216285, -4896369, -3106197, -2387786, -1513739, -75776, 174686, -876625, -775200, 688738, 131085, -3305363, -4834549, -623865, 6062483, 9023314, 6327976, 64525, -7322290, -12392813, -10634125, -2763093, 2066956, -3949794, -15896399, -21124928, -15050145, -5679612, -2213541]
38280b213541l020291m237234j529822J471524K462008J019688q88417j109208
38272h045293j213867l617800m457438K350048J1786618R797752n152549j4632295
38264a3184824m985118J1047083J1774400k087423j0471392m449022M576313O503563
38256a276420N319515N721880L289507l910550p110477k39050Q273099P431230
38248A7498734J37535k728479M43400J469813l072023o914464m779532j96673
38240A858311M28583l127683n312673k396086L219885O461886N509818K736607
38232I378648N91212q28569j845271k139874k663840m639485n194192L99995R224523
38223B283147J0728662J948866n035330K16854R368093O974365n511867j1928254
$$ y = [-2213541, -5233832, -9471066, -11000888, -9529364, -7067356, -6047668, -6936085, -8045293, -9259160, -12876960, -17334398, -14984350, -3197732, 6600020, 1447471, -13184824, -18169942, -7122859, 4651541, 2564118, -7907274, -12356296, -7779983, -1276420, 4043095, 9764975, 13054482, 9143932, 2033455, 1794405, 10067504, 17498734, 17636269, 14907790, 15351190, 16821003, 13748980, 6834516, 2054984, 1858311, 2286894, -840789, -6153462, -8549548, -5329663, 1132223, 6642041, 9378648, 9969860, 9141291, 7296020, 5156146, 2492306, -2147179, -7341371, -6941376, 2283147, 13011809, 14960675, 9925345, 10142199, 19510292, 26484657, 20972790, 9044536]
38215I044536o078853J125566J057410r89354J455223M570981K463680l000780
38207I648409o954686q129735o135049l99333M617081K503382l451454k457172
38199a0758557N986127Q927227N05280p464873l963659M443505N730887O84499
38191D090436k300765j753199j180298l47366J085919r10661n705854l754186
38183a0775974P666077J4794415O765870n575288o086464P92852n86000q788387
38175a792899p928169L896862J0611282M512021l321965l569328j669788l630995
38167b892979m574990Q9724M608858K670500k257726l708942j534385J112709
38159f487231K710668J252428m672498r231856l279913J0605465J7055697Q108767
$$ y = [9044536, 2965683, 4091249, 5148659, 4159305, 5614528, 10185509, 12649189, 9648409, 2693723, -5436012, -11571061, -11970394, -7353313, -4849931, -8301385, -10758557, -4772430, 4154797, 4660077, -2804796, -6768455, -2324950, 3405937, 4090436, 1789671, 36472, -1143826, -1491192, -405273, -1315934, -7021788, -10775974, -3109897, 11684518, 18450388, 12875100, 6788636, 7581488, 6995488, -1792899, -9721068, -5824206, 4787076, 9299097, 5977132, 2407804, 738016, -2892979, -7467969, -7378245, -2769387, -98887, -2356613, -6065555, -7599940, -6487231, -3776563, -2524135, -7196633, -16428489, -19708402, -9102937, 7952760, 16061527]
38151A6061527m849019o939313O41378N937725M586972K135562J088779l200410
38143A5463201j1830075j5986771p098403R686244J8511481J1159073k453192
38136A7451558p252883k956687k026735q404159j0939169k677660O591421O560868
38128c653446L076345N554371Q423113J595574q775743q965424j612933n52647
38120d910790m987552j298424R438638R886914l143790j0504796j595963Q440304
38112A324541M148866o944047j0086230n718196j810362J738796O537161O293564
38104d515907j777570p695390m233069J66795k585340m365103L474488J1516939
38096a0014157P592611o78949J135691Q076948M578620p052521j0178226k793176
$$ y = [16061527, 11212508, 4273195, 4914573, 10852298, 15439270, 17574832, 18663611, 15463201, 3633126, -12353645, -19452048, -9765804, 8745677, 19904750, 17451558, 10198675, 7241988, 5215253, -3188906, -14128075, -16805735, -10214314, -3653446, -577101, 4977270, 13400383, 14995957, 6220214, -2745210, -4358143, -4910790, -9898342, -11196766, -1758128, 8128786, 4984996, -5519800, -7115763, 1324541, 5473407, -1470640, -11556870, -17275066, -19085428, -17346632, -10809471, -4515907, -6293477, -13988867, -18221936, -18055141, -20640481, -25005584, -21531096, -10014157, -2421546, -3100495, -1964804, 6112144, 10690764, 3638243, -6539983, -9333159]
38088i333159L99524m784021n454911L807004J0789036O813588K9367o35289P44310
38079B375449j615698l427902L52680M958916M044941L61127j75504J549759J066918
38070I490686j974313n113318p038744o094015p81655M730087L096131l836002
38062g521143l861893P579545J6688325Q600879j0202616j8591389q383417O240120
38054i451589R194491K228109j977454O33116K382786j308539m050037M78793
38046a870324P074678O220000j212622n534537l412216j584085l897461m980199
38038i196766j283178J402873j524060l970139Q92229P898531P260354p531m320255
38029b847942k144253J541735L386552M621977M869840J965573k229412l484433
$$ y = [-9333159, -8933635, -13717656, -19172567, -15365563, -4576527, 2237061, 2266428, 1631139, 2375449, 759751, -2668151, -2315471, 2643445, 6688386, 7049513, 6874009, 8423768, 9490686, 7516373, 2403055, -4635689, -10729704, -11511359, -6781272, -3685141, -7521143, -11383036, -3803491, 12884834, 21485713, 11283097, -7308292, -15691709, -9451589, -257098, 1971011, -6443, 626673, 3009459, 1700920, -2349117, -1870324, 5204354, 11424354, 10211732, 4677195, 1264979, -319106, -4216567, -9196766, -10479944, -9077071, -10601131, -14571270, -13679041, -5780510, 1479844, 1472313, -2847942, -4992195, -3450460, -63908, 4558069, 9427909, 11393482, 9164070, 5679637]
38021E679637k073016j216502m80531K087768L742182R64097k942865k567503
38013C193267J58645O1733j327482J7214N88174m470493q988690l687567O284590
38004h170609P582589R22941o49657M109586K574560o183601n965485P723996
37996A944320J5120869K421545j4306201j3139020Q27422O662870O21726l538234
37988c384703p12456P47076j622721m90794M256411K663550o895069j1958055
37980a7396761m737263N880639P923375K143265k382238q58320M781503R881802
37972E236002R151188Q11368p908749o545749L447755P646299j304092j1154552
37964f20530o844847O809903J1529165K105097o941140l597414N204095O376698
$$ y = [5679637, 3606621, 2390119, 1909588, 3997356, 7739538, 8703635, 5760770, 3193267, 3351912, 3413645, 2086163, 2103377, 2691551, -1778942, -10767632, -14455199, -8170609, -588020, 334921, -314736, 3794850, 6369410, 185809, -5779676, 1944320, 17065189, 19486734, 5180533, -7958487, -7131065, -468195, 153531, -3384703, -4097159, -3350083, -4972804, -5463598, -1207187, 1456363, -5438706, -17396761, -22134024, -16253385, -8330010, -6186745, -8568983, -9427303, -4645800, 5236002, 14387190, 15198558, 7289809, 744060, 4191815, 11838114, 10534022, -620530, -7465377, -655474, 10873691, 12978788, 6037648, 2440234, 7644329, 14021027]
37956A4021027M19834k146222Q04172K32693p800991j3787664p761047O104864
37948i913334J4276452J0164571K85179m719414j227160N073176N845026q18194
37940A8966302p856193p590200j697937J544069m90741k307430j358945k406896
37932c197971o519689n901126K409865P553767R01148p602251l890697N990748
37924a0256206M330394q341272j2401276n48944J0852724R104932L821183O268755
37916B830290Q208440j466817j2715187p786183Q884520J5629215O239708k912663
37908A6911323q31394K646686k983803r958473o120431L402755L515169o634819
37900e2987j1593108k572963J0127387J2544416N210004j632379m032797n549805
$$ y = [14021027, 14440861, 12294639, 13098811, 13331504, 5530513, -8257151, -16018198, -9913334, 4363118, 14527689, 14812868, 10093454, 8866294, 13939470, 19784496, 18966302, 11110109, 3519909, 1821972, 3366041, 2875300, 567870, -791075, -3197971, -9717660, -15618786, -13208921, -5655154, -4754006, -12356257, -16246954, -10256206, -5925812, -14267084, -26668360, -27217304, -16364580, -7259648, -3438465, 2830290, 11038730, 9571913, -3143274, -10929457, -2044937, 13584278, 19823986, 16911323, 16079929, 18726615, 15742812, 5784339, -336092, 3066663, 6581832, -52987, -11646095, -14219058, -4091671, 8452745, 13662749, 12030370, 7997573, 2447768]
37892B447768n913799k95438Q872878J0661784J239092q696270q909119l719060
37884d312164k460886l423593J308860R945938J2543690O521195j051055n678728
37876A3393257q719757r311167m823288Q38633J350391O152M631178J1145245
37868H510644P882114k915965o148462K15398O47654r291351j1753900L102154
37860i751714J6592896R774905n340467n546122N686570O086391o746826j1963419
37852a207786r23694R448099N068877m731170n249444J077128K543045j997948
37844D027107l791532L35927L979210K212709r41123J065583O876149P902472
37836B1666502O44646o539495m726849J287962m8233p367354p588449R44354L480237
$$ y = [2447768, -3466031, -3761469, 5111409, 15773193, 17012285, 8316015, -593104, -4312164, -6773050, -10196643, -8887783, 1058155, 13601845, 20123040, 19071985, 13393257, 4673500, -4637667, -9460955, -8622322, -7271931, -7265779, -2634601, 8510644, 16392758, 13476793, 7328331, 7543729, 8191383, -1099968, -12853868, -9751714, 6841182, 16616087, 11275620, 5729498, 11416068, 17502459, 10755633, -1207786, -2131480, 7316619, 12385496, 7654326, 2404882, 3482010, 6025055, 4027107, 235575, 571502, 4550712, 6763421, 5822298, 6887881, 13764030, 21666502, 22311148, 15771653, 11044804, 12332766, 12284533, 4917179, -2671270, -1726916, 1753321]
37827A753321n350032q816173M894709J9275569J2713351o819304j2991169k33405
37819D426867J1663600R584696J199054l822928n880551n778638j686923R51990
37811A0657167n890410j5411641j1662403L884056J1229981K938248m226245K436516
37803f044731J1670421R116970N44941p99872L749363M461093R06927j328800
37795B2276312l234483p815390r978026m098120M031185M931963J23298k082736
37787D154003n15682J81826K88160L139449N942705L367937j967543k681502J318905
37778A3228258L186113L73708k837565l124976r42272L241235Q234575Q911530
37770C0270606J307667r380838j3095700p870704k134324k594737n295991j755250
$$ y = [1753321, -3596711, -12412884, -7518175, 11757394, 24470745, 17651441, 4660272, 4426867, 16090467, 25675163, 26874217, 23051289, 17170738, 11392100, 9705177, 10657167, 4766757, -10644884, -22307287, -18423231, -7193250, -4255002, -8481247, -6044731, 5625690, 14742660, 15287601, 14487729, 18237092, 22698185, 23605112, 22276312, 19041829, 11226439, 1248413, -2849707, 1181478, 6113441, 6236739, 4154003, 3638321, 3820147, 4108307, 7247756, 13190461, 16558398, 14590855, 11909353, 13228258, 16414371, 16788079, 13950514, 10825538, 9883266, 13124501, 21359076, 30270606, 31578273, 22197435, 9101735, 1231031, -903293, -3498030, -8794021, -10549271]
37762a0549271Q944469J7639691J5189983L478276o464762q034068o286455p966371
37754E951492r980476n912809L63799n80341o695416n703097M891246J3138683
37746d526919J2045058Q950392R071927N160867o207691j2717995m731706O310681
37738A3354614M106308o962670r975113k702279K087234L96277J542195P868198
37730I714764Q700551J00772n428193K026636J2969949J1468614k193476j2401964
37722B4957653r019203J569643O998288M190035L56843J127198K879549m38896
37714C2621110o573324p360727j355747L495120K110432l09202K391502P268541
37706C2287705P513356K584507k824216n609008m823108j58899M947792L982614
$$ y = [-10549271, -1604802, 16034889, 31224872, 34703148, 28238386, 20204318, 13917863, 5951492, -4028984, -9941793, -9577994, -10158335, -16853751, -22556848, -17665602, -4526919, 7518139, 16468531, 25540458, 30701325, 24493634, 11775639, 7043933, 13354614, 17460922, 10498252, 523139, -2179140, -91906, 304371, 1846566, 9714764, 18415315, 18516087, 13087894, 15114530, 28084479, 39553093, 37359617, 24957653, 15938450, 17508093, 24506381, 28696416, 29053259, 30180457, 33060006, 32621110, 26047786, 18687059, 17331312, 20826432, 22936864, 22627662, 25019164, 32287705, 39801061, 42385568, 39561352, 33952344, 29129236, 28970337, 33918129, 37900743]
37698C7900743l361490q359561n619504j464942k655054m189560J630371R977323
37690B3858326R222046j101464r368323q001008r21994M750349O047948L296599
37682B7782479j002953k636924l20518J803900O89152m79281J434665L593340
37674C0863860L368932L663610N204861J986713o667178r201977R56809J1011306
37666D1186936O986555k457252N26965J1964890J1080787n048092j5702879r626043
37658C8911867j281280m742407j0893736m269464J1359882J9112504J2709694
37651F0907060J326564m935527m340376j83390M456909Q113958R888427P723743
37643H2957368k0791r019536r958605r27094O846395M257904j029458K832464
$$ y = [37900743, 34539253, 26179692, 20560188, 19095246, 16440192, 12250632, 13881003, 23858326, 33080372, 31978908, 22610585, 14609577, 13687583, 18437932, 24485880, 27782479, 26779526, 24142602, 23822084, 25625984, 26315136, 25835855, 27270520, 30863860, 34232792, 37896402, 43101263, 45087976, 38420798, 29218821, 30175630, 41186936, 48173491, 45716239, 46243204, 58208094, 69288881, 64240789, 48537910, 38911867, 37630587, 32888180, 21994444, 17724980, 29084862, 48197366, 60907060, 62233624, 57298097, 52957721, 52774331, 57231240, 65345198, 75233625, 82957368, 82936577, 73917041, 63958436, 63031342, 69877737, 74135641, 73106183, 75938647]
37635G5938647J0841972Q731188k224382o755688j279708K243460M54000M887747
37627I2837236J7550100K1770344Q849604n031289k961402P162120P362902k172019
37619A45367596o653950p60517O912415R482964Q589061P440770O998826P800038
37611A85177203R110210Q626395O804488O764574P443601M371009j94516K017816
37603B30120780J0593762J4027221P390662J00940n10489r0700l511562m231228
37595B53889386J929511N731371l24135p933336p219237l317224m744525o810837
37587B31200974k266817K329722j903536p939258m574911J886804k312154j2860028
37579B03560796j3114373k294563K980599m778496j5015352j8083354j5756566
$$ y = [75938647, 86780619, 95511807, 93287425, 86531737, 85252029, 87495489, 87949489, 92837236, 110387336, 132157680, 141007284, 135975995, 133014593, 140176713, 147539615, 145367596, 138713646, 137953129, 144865544, 154348508, 162937569, 170378339, 177377165, 185177203, 194287413, 202913808, 209718296, 216482870, 223926471, 228297480, 228102964, 230120780, 240714542, 254741763, 262132425, 262233365, 261722876, 261632176, 258120614, 253889386, 255818897, 261550268, 261226133, 253292797, 246073560, 242756336, 238011811, 231200974, 228934157, 231263879, 229360343, 221421085, 216846174, 218732978, 216420824, 203560796, 190446423, 188151860, 191132459, 186353963, 171338611, 153255257, 137498691]
37572A37498691j1108468m309184n44497o325415j5469447j3984461j584246O639883
37564I0812856K988500l449016l938027j695675j238379j60293K316612J075687
37556H6712265m503386p298031n023252m517688q025805p516063L41166N625291
37548E5794497O25908o591899m582829L507855N560239r03134o534864m908452
37540D1967321m32459l74224m782270p140428l416949K009120J769272l544437
37532B6054946n041011J097275O494209L045423m011738m687818l31529M79712
37524B3099469j972910k52812M324876K387765o065369r652669l891067K418090
37516A0395373K933327K172197L137375L20837p790673j1756290n476080K915592
$$ y = [137498691, 126390223, 122081039, 121536542, 115211127, 99741680, 85757219, 84172973, 90812856, 93801356, 90352340, 86414313, 84718638, 83480259, 83319966, 85636578, 86712265, 82208879, 74910848, 69887596, 65369908, 57344103, 49828040, 50169206, 55794497, 56420405, 49828506, 45245677, 48753532, 54313771, 53410637, 46875773, 41967321, 41534862, 41160638, 36378368, 29237940, 25820991, 27830111, 29599383, 26054946, 21013935, 22111210, 28605419, 31650842, 27639104, 22951286, 22619757, 23099469, 21126559, 20873747, 25198623, 27586388, 21521019, 11868350, 7977283, 10395373, 13328700, 15500897, 18638272, 18959109, 11168436, -587854, -6063934, -3148342]
37508c148342L383685j535825l315194q53786J396725K587777M535851O076013
37500I126904N021170K330039m1524j623223j375579J652519M362254L001928
37492B2454488Q09126L340579O217364l44910j3077568j6167580m940213N844777
37484D136063M572769j161144n58287K789608J491003l97843L118996N978954
37476A9970119O35498o229892m052328K918489L178549j750467j256535M138561
37468A7551994L603769m151770q042784k800247M127975N982231M608772K604064
37460B3484004j209375n650696o325082l534219k512466m053658l342432M77525
37452b666399K246063Q0940j639761o34192l2803j093004l96775K956676M625456
$$ y = [-3148342, 235343, -1300482, -4615676, -5469462, -4072737, -1484960, 3050891, 9126904, 14148074, 16478113, 16436589, 14813366, 13437787, 15090306, 19452560, 22454488, 23263614, 26604193, 32821557, 32476647, 19399079, 3231499, -1708714, 4136063, 8708832, 7547688, 6989401, 9779009, 11270012, 10872169, 13991165, 19970119, 20605617, 14375725, 10323397, 13241886, 16420435, 14669968, 13413433, 17551994, 21155763, 17003993, 8961209, 6160962, 10288937, 16271168, 20879940, 23484004, 22274629, 16623933, 10298851, 6764632, 4252166, 198508, -3143924, -2666399, -420336, -339396, -1979157, -2613349, -2646152, -3739156, -4135931, -1179255, 3446201]
37443C446201K522815L62711N39566q9136l364545m512500J129380R555946J1477625
37434B1068063L504484p442259j1584420o835585n43057N3600k702035o36499
37426e117708P505409J2987917R078862L47450m002649j223890M653321Q637129
37418C2865841O655567k777379j3748154j5745093p046883J016809l27201m749209
37410c855702k286902M221345N367628J830928J690015M548150K053400o387414
37402G181448j1103004o569207K227081Q809540J1020257P580399j183442q507736
37394I455336o777560J142146N118780K303508j044825j855767l519175o317200
37386a494757n764343k023959k86522l85888K820884P268831M194365o290676
$$ y = [3446201, 5969016, 6331727, 6871293, 6782157, 3417612, -1094888, 34492, 9590438, 21068063, 24572547, 17130288, 5545868, -1289717, -1832774, -1779174, -4481209, -5117708, 2387701, 15375618, 24454480, 24801930, 20799281, 19575391, 24228712, 32865841, 39521408, 36744029, 22995875, 7250782, 203899, 1220708, 893507, -3855702, -6142604, -1921259, 3446369, 5277297, 6967312, 11515462, 13568862, 7181448, -3921556, -10490763, -8263682, 545858, 11566115, 19146514, 17963072, 9455336, 2677776, 3819922, 8938702, 11242210, 10197385, 8341618, 4822443, -1494757, -7259100, -9283059, -9569581, -9955469, -7134585, 134246, 4328611, -1962065]
37378a962065j2464041p992305r5562L632073M938852O588252O088264L498059
37370B231527M117076P364166M582528n549391j1699410p666374k637587m169785
37362a3427250m263893M822211J3013393O987029o134774p546815M771410J3623800
37354A1845111Q378217k262127n882432k038223K099199K471974j15653l019650
37346A1476416l530847j626112j376558n375307q947550n542302L128689Q652657
37338c140914P265183L347172J423262R14432q0567j252102j928031k349104k080963
37329B118368n46588P56892J31116n77363J833293O012797O505361P58492p633448
37320I358920j3081306j2526331o126686K988928R242486Q287572J555688m743603
$$ y = [-1962065, -14426106, -22418411, -22513973, -18881900, -13943048, -7354796, -1266532, 2231527, 6348603, 13712769, 18295297, 12745906, 1046496, -6619878, -9257465, -13427250, -17691143, -12868932, 144461, 7131490, 996716, -6550099, -1778689, 11845111, 20223328, 17961201, 12078769, 10040546, 12139745, 14611719, 14496066, 11476416, 7945569, 6319457, 4942899, -432408, -9379958, -14922260, -11793571, -3140914, 4124269, 7471441, 8894703, 9809135, 9728568, 8476466, 6548435, 4199331, 2118368, 1571780, 2328672, 2459788, 1882425, 3715718, 9728515, 16233876, 16992368, 9358920, -3722386, -16248717, -22375403, -19386475, -10143989, -1856417, -300729, -5044332]
37312e044332n891671k613005J283638L576619N137152P206351Q120956M595471
37304A6371179k647861p225572m665196M67787M71966l600546l244848L528437
37296e44654P918382L544073l864087n516584j923526L67864n11293j292572m68681
37287b291078R43440L181763O392478P484119L791464j728775l945176k815792
37279A1012443k671938n357447q124754p786808m117094L14547K378561J700662
37271a2651828J436917L100500K654116k758035o861172k200901N519388L600518
37263h160497o257237p890620L634883J2846959Q468796K29770n43646q1631o215910
37254c969133r417267J54811J0195616M166588q774144p426900N314258Q070534
$$ y = [-5044332, -10936003, -13549008, -12265370, -8688751, -3551599, 3654752, 11775708, 16371179, 13723318, 6497746, 1832550, 2300337, 2772303, -828243, -4073091, -544654, 7373728, 10917801, 7053714, 1537130, -386396, -18532, -529825, -1822397, -2291078, -1347638, 1834125, 8226603, 15710722, 19502186, 17773411, 13828235, 11012443, 8340505, 2983058, -5141696, -12928504, -17045598, -16731051, -14352490, -12651828, -11214911, -8114411, -5460295, -8218330, -15079502, -17280403, -11761015, -8160497, -14417734, -22308354, -18673471, -5826512, 2642284, 2872054, 2328408, 2246777, -3969133, -13386400, -13231589, -3035973, 1130615, -7643529, -15070429, -9756171, -1685637]
37246a685637j083413k666957P035754Q276262n516689j3565254k840553R592696
37238b453791N625039n641466p095153j490611n02858k102419J146739M257212
37230h257308l69521o146022l374042K927293L431867K263010O585880R248759
37222F309916J449801p164285k542415P926811O580591m000606o144305J488484
37214C903992L649776j712940q27322O398143K553347j4137746k0168585l033175
37206b3374510J6517497J4595164k734113j3599494j1500933m543779L179521
37199b1460647J0861788J1540725J414528q417174n670684L915922O247193J209913
37191c58436o29820K132474K300577K91718K187712M386477j506356r882253o820332
$$ y = [-1685637, -2769050, -5436007, 1599747, 9876009, 4359320, -9205934, -12046487, -2453791, 3171248, -2470218, -9565371, -11055982, -11558840, -13661259, -12514520, -8257308, -8626829, -14772851, -18146893, -15219600, -11787733, -9524723, -2938843, 6309916, 7759717, 595432, -1946983, 5979828, 12560419, 8559813, 2415508, 3903992, 7553768, 5840828, 5013506, 11411649, 13964996, -172750, -20341335, -23374510, -6857013, 7738151, 5004038, -8595456, -20096389, -24640168, -21460647, -10598859, 941866, 2356394, -6060780, -11731464, -7815542, -1568349, -358436, -988256, 1144218, 3444795, 3736513, 5924225, 10310702, 8804346, -1077907, -7898239]
37182g898239M697931O317428m913490r451595K270324J2130810L670326r810370
37174b986875o356387R032484J2898395M57415r093862l608365P000120J0328839
37166A7671764P404249K728723m971427j3063599j0513527N022269J6627953Q428223
37158B9334628j0608495j7463204o138554O487268O159606j322260l192699Q02623
37150D058913J050372n289536j0083325o857710j35412J805754o29420N99550
37142a5480814P717163J1799726N658353l511237l188540N051077O656212l276451
37134A1425489j0939797m501780P147572P663353k512163q873540n601980q42361
37126g035207J8327J414760N081078M251180l607220r464436n638818K470691
$$ y = [-7898239, -3200308, 3117120, -1796370, -11247965, -8977641, 3153169, 6823495, -2986875, -9343262, -310778, 12587617, 13045032, 3951170, 342805, 7342925, 17671764, 25076013, 27804736, 22833309, 9769710, -743817, 4278452, 20906405, 29334628, 18726133, 1262929, -4875625, 1611643, 7771249, 6448989, 3256290, 4058913, 5109285, -180251, -10263576, -17121286, -17256698, -15450944, -16080364, -15480814, -7763651, 4036075, 9694428, 6183191, 2994651, 8045728, 14701940, 11425489, 485692, -4016088, 3131484, 10794837, 8282674, -590866, -6192846, -7035207, -7016880, -5602120, -521042, 3730138, 122918, -9341518, -14980336, -12509645]
37118a2509645N060355J545472j759344k064000j159535j78807N97748K5793j163202
37109a1605165K91418M197717N105399O96463l382361j955494J722220J766018
37101c163785j536182l987755l767241p38211N086619R959547P969932R56877
37093A0779801j419358K795301K718180o619141j2460420m179592O333716J719781
37085c31732j1544464j1814289L246281J3143977O884491l003523m275820k222500
37077i917579l784231k867078N573289J1547650M970347o110604p182107M06623
$$ y = [-12509645, -7449290, -5903818, -7663162, -9727162, -10886697, -11065504, -10467756, -10441963, -11605165, -11313747, -7116030, -2010631, -1314168, -4696529, -6652023, -4929803, -3163785, -4699967, -8687722, -12454963, -13193174, -8106555, 1852992, 9822924, 10779801, 9360443, 12155744, 14873924, 8254783, -4205637, -8385229, -2051513, -331732, -11876196, -23690485, -20444204, -7300227, -415736, -3419259, -7695079, -9917579, -13701810, -16568888, -10995599, 552051, 5522398, -588206, -7770313, -7363690]
$$ [...]
##END NTUPLES=NMR SPECTRUM
##END=
