##TITLE=31Pdec_LR-0155-Bz-EtOAc
 CD3CN, 128 sc
 16.2.2023
##JCAMPDX= 6.0         $$ Bruker NMR JCAMP-DX V2.0
##DATA TYPE= NMR SPECTRUM
##DATA CLASS= NTUPLES
##ORIGIN= UXNMR, Bruker Analytische Messtechnik GmbH
##OWNER= root
$$ XWIN-NMR		Version 3.5
$$ Thu Feb 16 14:27:18 2023 Russian Standard Time (UT+4h)  she@DPX200
##.OBSERVE FREQUENCY= 81.013821
##.OBSERVE NUCLEUS= ^31P
##.ACQUISITION MODE= SIMULTANEOUS
##.ACQUISITION SCHEME= undefined
##.AVERAGES= 128
##.DIGITISER RES= 16
##SPECTROMETER/DATA SYSTEM= spect
##.PULSE SEQUENCE= zgpg30
##.SOLVENT NAME= CDCl3
##.SHIFT REFERENCE= (INTERNAL, CDCl3, 0, 248.564)
##AUDIT TRAIL= $$ (NUMBER, WHEN, WHO, WHERE, WHAT)
$$ ##TITLE= Audit trail, XWIN-NMR		Version 3.5
$$ ##JCAMPDX= 5.01
$$ ##ORIGIN= Bruker BioSpin GmbH
$$ ##OWNER= she
$$ F:/spectra/data/she/nmr/P31/1/pdata/1/auditp.txt
$$ ##AUDIT TRAIL=  $$ (NUMBER, WHEN, WHO, WHERE, WHAT)
(   1,<2023-02-16 14:25:28.82 +0400>,<she>,<DPX200>,
      <continue with go, POWCHK disabled, PULCHK disabled
       configuration hash MD5:
       00 E9 B6 7A A2 85 ED C7 34 08 36 98 17 FE 4E 26
       data hash MD5: 32K
       E9 5D 2E F2 F4 22 2F 58 9A 33 96 36 D3 3F 9B 51>)
(   2,<2023-02-16 14:26:31.40 +0400>,<she>,<DPX200>,
      <Start of raw data processing
       efp BC_mod = 2 LB = 1 FT_mod = 6 PKNL = 1 PHC0 = -10961.99 PHC1 = 16.21271 SI = 64K 
       data hash MD5: 64K
       AD 60 8F 93 09 AF 2C 8F 4D A0 8C 15 2D F4 31 ED>)
(   3,<2023-02-16 14:26:45.25 +0400>,<she>,<DPX200>,
      <pk PHC0 = -3.493565 PHC1 = 0 
       data hash MD5: 64K
       DE FC A7 2B D2 0D F5 62 22 F0 4D BE A0 25 7E 43>)
(   4,<2023-02-16 14:26:50.71 +0400>,<she>,<DPX200>,
      <abs ABSG = 5 
       data hash MD5: 64K
       FA 36 0B 65 2D EC 6D 55 0A 0B 8E DD 63 65 32 D0>)
$$ ##END=
$$ 
$$ hash MD5
$$ C9 AB 8A ED E3 E6 3C 0A 3D 99 FC 91 31 69 C5 9A
##$RELAX= 
##$RELAX= 
##$RELAX= 
##$RELAX= 
##$RELAX= 
##$RELAX= 
##$RELAX= 
##$RELAX= 
##$RELAX= 
$$ Bruker specific parameters
$$ --------------------------
##$DU= <F:/spectra>
##$EXPNO= 1
##$NAME= <P31>
##$PROCNO= 1
##$TYPE= <nmr>
##$USER= <she>
##$AMP= (0..31)
100 100 100 100 100 100 100 100 100 100 100 100 100 100 100 100 100 100 
100 100 100 100 100 100 100 100 100 100 100 100 100 100 
##$AQSEQ= 0
##$AQ_mod= 1
##$AUNM= <au_zg>
##$AUTOPOS= <>
##$BF1= 81.014009
##$BF2= 200.13
##$BF3= 200.13
##$BF4= 200.13
##$BF5= 200.13
##$BF6= 200.13
##$BF7= 200.13
##$BF8= 200.13
##$BYTORDA= 1
##$CFDGTYP= 0
##$CFRGTYP= 5
##$CHEMSTR= <none>
##$CNST= (0..31)
1 1 145 1 1 1 1 1 1 1 1 1 1 1 1 1 1 1 1 1 1 1 1 1 1 1 1 1 1 1 1 1 
##$CPDPRG= <waltz16>
##$CPDPRG1= <>
##$CPDPRG2= <waltz16>
##$CPDPRG3= <>
##$CPDPRG4= <mlev>
##$CPDPRG5= <mlev>
##$CPDPRG6= <mlev>
##$CPDPRG7= <mlev>
##$CPDPRG8= <mlev>
##$CPDPRGB= <>
##$CPDPRGT= <>
##$D= (0..31)
0 1 0 0 0 0 0 0 0 0 0 0.03 2e-05 3e-06 0 0 0 0 0 0 0 0 0 0 0 0 0 0 0 0 
0 0 
##$DATE= 1676542924
##$DBL= (0..7)
120 120 120 11 120 120 24 19 
##$DBP= (0..7)
150 150 150 150 150 150 150 150 
##$DBP07= 0
##$DBPNAM0= <>
$$ [...]
##$SUBNAM3= <"">
##$SUBNAM4= <"">
##$SUBNAM5= <"">
##$SUBNAM6= <"">
##$SUBNAM7= <"">
##$SUBNAM8= <"">
##$SUBNAM9= <"">
##$SW= 501.771253377433
##$SWIBOX= (0..15)
0 1 3 0 0 0 0 0 0 0 0 0 0 0 0 0 
##$SW_h= 40650.406504065
##$TD= 32768
##$TD0= 1
##$TE= 0
##$TE2= 300
##$TE3= 300
##$TEG= 300
##$TL= (0..7)
0 120 53 12 22 120 120 120 
##$TP= (0..7)
150 150 150 150 150 150 150 150 
##$TP07= 0
##$TPNAME0= <>
##$TPNAME1= <>
##$TPNAME2= <>
##$TPNAME3= <>
##$TPNAME4= <>
##$TPNAME5= <>
##$TPNAME6= <>
##$TPNAME7= <>
##$TPOAL= (0..7)
0.5 0.5 0.5 0.5 0.5 0.5 0.5 0.5 
##$TPOFFS= (0..7)
0 0 0 0 0 0 0 0 
##$TUNHIN= 0
##$TUNHOUT= 0
##$TUNXOUT= 0
##$USERA1= <user>
##$USERA2= <user>
##$USERA3= <user>
##$USERA4= <user>
##$USERA5= <user>
##$V9= 5
##$VALIST= <valist>
##$VCLIST= <CCCCCCCCCCCCCCC>
##$VD= 0
##$VDLIST= <DDDDDDDDDDDDDDD>
##$VPLIST= <PPPPPPPPPPPPPPP>
##$VTLIST= <TTTTTTTTTTTTTTT>
##$WBST= 1024
##$WBSW= 4
##$XGAIN= (0..3)
0 0 0 0 
##$XL= 0
##$YL= 0
##$YMAX_a= 7870
##$YMIN_a= -8746
##$ZGOPTNS= <>
##$ZL1= 120
##$ZL2= 120
##$ZL3= 120
##$ZL4= 120
##$ABSF1= 248.5645
##$ABSF2= -253.2056
##$ABSG= 5
##$ABSL= 3
##$ALPHA= 0
##$AQORDER= 0
##$ASSFAC= 0
##$ASSFACI= 0
##$ASSFACX= 0
##$ASSWID= 0
##$AUNMP= <proc_1d>
##$AZFE= 0.1
##$AZFW= 0.5
##$BCFW= 0
##$BC_mod= 2
##$BYTORDP= 0
##$COROFFS= 0
##$CY= -3
##$DATMOD= 1
##$DC= 0
##$DFILT= <>
##$DTYPP= 0
##$F1P= 0
##$F2P= 0
##$FCOR= 1
##$FTSIZE= 65536
##$FT_mod= 6
##$GAMMA= 0
##$GB= 0
##$INTBC= 1
##$INTSCL= 6.047779e-11
##$ISEN= 30
##$LB= 1
##$LEV0= 0
##$LPBIN= 0
##$MAXI= 10000
##$MC2= 0
##$MEAN= 0
##$ME_mod= 0
##$MI= 50
##$NCOEF= 0
##$NC_proc= -9
##$NLEV= 6
##$NOISF1= 182.463
##$NOISF2= 159.3651
##$NSP= 0
##$NTH_PI= 0
##$NZP= 0
##$OFFSET= 248.5645
##$PC= 4
##$PHC0= -10965.48
##$PHC1= 16.21271
##$PH_mod= 1
##$PKNL= yes
##$PPARMOD= 0
##$PSCAL= 0
##$PSIGN= 0
##$REVERSE= no
##$SF= 81.0140089999694
##$SI= 65536
##$SIGF1= 159.3651
##$SIGF2= -187.1042
##$SINO= 113.3802
##$SIOLD= 16384
##$SREGLST= <1H.CDCl3>
##$SSB= 0
##$STSI= 65536
##$STSR= 0
##$SW_p= 40650.406504065
##$SYMM= 0
##$S_DEV= 0
##$TDeff= 32768
##$TDoff= 0
##$TI= <>
##$TILT= no
##$TM1= 0
##$TM2= 0
##$TOPLEV= 0
##$USERP1= <user>
##$USERP2= <user>
##$USERP3= <user>
##$USERP4= <user>
##$USERP5= <user>
##$WDW= 1
##$XDIM= 65536
##$YMAX_p= 501227377
##$YMIN_p= -278794801
$$ End of Bruker specific parameters
$$ ---------------------------------
##NTUPLES= NMR SPECTRUM
##VAR_NAME=  FREQUENCY,     SPECTRUM/REAL,   SPECTRUM/IMAG
##SYMBOL=    X,             R,               I
##VAR_TYPE=  INDEPENDENT,   DEPENDENT,       DEPENDENT
##VAR_FORM=  AFFN,          ASDF,            ASDF
##VAR_DIM=   65536,         65536,           65536
##UNITS=     HZ,            ARBITRARY UNITS, ARBITRARY UNITS
##FACTOR=    0.620285442955139, 1,           1
##FIRST=     20137.2065510682, 0,            0
##LAST=      -20513.1999529968, 0,           0
##MIN=       -20513.1999529968, -278794801,  0
##MAX=       20137.2065510682, 501227377,    0
$$ Real data points
##PAGE= N=1
##DATA TABLE= (X++(R..R)), XYDATA
$$ [...]
42267a6376790r399467j0187145L277921J9511203K1282467O026910p144670N22442
$$ -16376790 -25776257 -35963402 -32685481 -13174278 8108189 14135099 6990429 7512871
42259G512871J8177359J5731960r990205k3992698m805207J8912118J1175118
$$ 7512871 25690230 41422190 31431985 7439287 2634080 21546198 32721316
42252C2721316j5074240k1043676m639907K637992o773814p098522J0920568K2892296
$$ 32721316 17647076 -3396600 -8036507 -5398515 -12172329 -19270851 -8350283 14542013
42244A4542013J2631557m242089r317002m227419L909359J1823186R333783j0815472
$$ 14542013 27173570 22931481 13614479 9387060 13296419 25119605 34453388 23637916
42236B3637916k7930762j2392260K3200657L0230503m892478l5157668k0561942
$$ 23637916 -4292846 -16685106 6515551 36746054 31853576 -3304092 -23866034
42229b3866034J4691690K2700483J046727j4012525n915855O563795O232224k38191
$$ -23866034 -9174344 13526139 14572866 560341 -5355514 1208281 7440505 7202314
42221G202314k055O164101Q056315P12207q821821q045158N584829J8149827J5845421
$$ 7202314 7200259 13364360 21420675 22132882 13311061 5265903 10850732 29000559 44845980
42212D4845980M346242r42750J19185m664803j3519347r951171P586869J7650287
$$ 44845980 49192222 48249472 48368657 43703854 30184507 20233336 27820205 45470492
42204D5470492O048082j4375696k2902439j4290518K942606J5825579J1226774
$$ 45470492 51518574 37142878 14240439 -50079 2892527 18718106 29944880
42197B9944880j1037463k7300725j3695739J6888620K6638598N988444j3747996
$$ 29944880 18907417 -8393308 -22089047 -5200427 21438171 27426615 13678619
42190A3678619r271889M376629O800032M662681R959867J2444367n10557j5964916
$$ 13678619 4406730 8783359 15583391 20246072 30205939 42650306 42139749 26174833
42182B6174833j3017977M807999J6734882J3813570K687183r639146j8809378
$$ 26174833 13156856 17964855 34699737 48513307 51200490 41561344 22751966
42175B2751966j9835071j3208937n564573K143302J3104177J7713677N99370k7696823
$$ 22751966 2916895 -10292042 -15856615 -13713313 -609136 17104541 17703911 -9992912
42167i992912l2892051m508928K5596024K9176144J8331081J5357120J4429918
$$ -9992912 -42884963 -47393891 -21797867 7378277 25709358 41066478 55496396
42160E5496396J257533j3378894j1679781k277478m153401j1621802o149575Q432168
$$ 55496396 56753929 43375035 31695254 29417776 25264375 13642573 7492998 15925166
42152A5925166J2308655K751955n945899p891483p188353l104929M243647M394558
$$ 15925166 28233821 30985776 25039877 17148394 9960041 6855112 11098759 15493317
42144A5493317n833895r226321M644894J6201961O084739r886678o902798N545518
$$ 15493317 9659422 433101 5077995 21279956 27364695 17478017 10575219 16120737
42136A6120737K268975j1008916r271135M717879O686762k846673j344287R984108
$$ 16120737 18389712 7380796 -1890339 2827540 9514302 6667629 5323342 15307450
42128A5307450O814794j0905876j5595135j190489O243715m696870j3495484p472419
$$ 15307450 22122244 11216368 -4378767 -5569256 674459 -4022411 -17517895 -24990314
42120b4990314J3679K495319J2257808K5404682J5514830j8200789l4689580q145860
$$ -24990314 -24976635 -22481316 -10223508 15181174 30696004 12495215 -22194365 -30340225
42112c0340225L1196100M0061490J8189902n170192j5940434j8688353j5617056
$$ -30340225 855875 40917365 59107267 53937075 37996641 19308288 3691232
42105C691232q684724p298076j2435594r171905O753845J4987281L021017r672172
$$ 3691232 -4993492 -12291568 -24727162 -33899067 -27145222 -12157941 -9136924 -18809096
42097a8809096l463496P815463K886431p690412l58686J8932612K4934841J4992773
$$ -18809096 -22272592 -14457129 -11570698 -19261110 -19619796 -687184 24247657 39240430
42089C9240430P110592L927487o949225k0594081j7897542k258749O88958j4346052
$$ 39240430 46351022 50278509 43329284 22735203 4837661 2578912 3267870 -11078182
42081a1078182k1920182p543306R994125J1402909M983997M699089L952628p081133
$$ -11078182 -32998364 -40541670 -30547545 -19144636 -14160639 -9461550 -5508922 -12590055
42073a2590055j6456418p619090J0137356J3814894L447313J012155J2478098
$$ -12590055 -29046473 -36665563 -26528207 -12713313 -9266000 -8253845 4224253
42066D224253J6896217J800742j3666543p884514P549147M282070j8082092k9525619
$$ 4224253 21120470 22921212 9254669 1370155 8919302 13201372 -4880720 -34406339
42058c4406339j4355394O370940Q362103j386051k071114N456071N471536N7856
$$ -34406339 -48761733 -42390793 -34028690 -35414741 -37485855 -32029784 -26558248 -26500392
42050b6500392O010830K0019313J7262531o901701k2133825o685121J7474387
$$ -26500392 -20489562 -470249 16792282 9890581 -12243244 -18928365 -1453978
42043a453978J6272869n837679j4413363K522148J8587806R217526j5178788k6702487
$$ -1453978 14818891 8981212 -5432151 -2910003 15677803 24895329 9716541 -16985946
42035a6985946j5787834K753679J1730925Q168337j08197n700398o811667m965408
$$ -16985946 -32773780 -30020101 -18289176 -10120839 -10229036 -15929434 -22741101 -27706509
42027b7706509j531177K233845L703135J061474k494449m71070Q805468J8501054
$$ -27706509 -29237686 -27003841 -23300706 -22239232 -24733681 -25204751 -16399283 2101771
42019B101771K0132967J2247479N32991q483247j1729427r381265l165778M333358
$$ 2101771 22234738 34482217 35015208 26531961 14802534 5421269 2255491 6588849
42011F588849R162300O897674k281163r768535o377904L407243L529210j0942868
$$ 6588849 15751149 22648823 20367660 10599125 4221221 7628464 11157674 214806
42003B14806k2443850j3249387Q341557J8491101R624073m193308j0457252q723480
$$ 214806 -22229044 -35478431 -27136874 -8645773 978300 -3215008 -13672260 -22395740
41995b2395740Q83456J8640952L1610431K1089642q148195k6229838j6718951
$$ -22395740 -21512284 -2871332 28739099 49828741 41680546 15450708 -1268243
41988a268243J670062M364783o223048j2590638j0041048l971561O765905K2784259
$$ -1268243 401819 4766602 -1456446 -14047084 -24088132 -28059693 -21293788 1490471
41980A490471L0698380J8581698j675198q474709k208738j462940j0212892j1792998
$$ 1490471 32188851 50770549 49095351 40620642 38411904 36948964 26736072 14943074
41972A4943074J779864J5689833J4828866L787684m536431p492909r955347j1779058
$$ 14943074 16722938 32412771 47241637 51029321 46492890 38999981 29044634 17265576
41964A7265576q347358o08548L229927k119433r673303n339943J3301698K7011283
$$ 17265576 8918218 8309670 11539597 9420164 -253139 -5593082 7708616 34719899
41956C4719899J4891388j4597213k8073355j0028250J5389275J8612384M350813
$$ 34719899 49611287 35014074 6940719 -3087531 12301744 30914128 35264941
41949C5264941k684026J872298K092151m932539m907534L832154M111592r777828
$$ 35264941 32580915 34453213 36545364 31612825 26705291 30537445 34649037 24871209
41941B4871209j9899667j2936811j27966K717797j967963k699554L033267J0613612
$$ 24871209 4971542 -7965269 -8093235 -5375438 -7343401 -10042955 -7009688 3603924
41933C603924J5867830J2518608m118784k2719630k1095965L549230K5088347
$$ 3603924 19471754 31990362 27871578 5151948 -15944017 -12394787 12693560
41926A2693560K1516433K277502j0957388j4285004j4736427r344270N504628
$$ 12693560 34209993 36487495 25530107 11245103 -3491324 -12835594 -7330966
41919g330966J4579549M61572k3886150k5610975J898774K6862201K1499842k207016
$$ -7330966 7248583 7710155 -16175995 -41786970 -39888196 -13025995 8473847 6266831
41911F266831j1523727M326646K4086633K3125931J826369j7086867j6099419
$$ 6266831 -5256896 -930250 23156383 46282314 48108683 31021816 14922397
41904A4922397k901792J845930o276712j0720011k006170N499603k563645j4002192
$$ 14922397 12020605 13866535 7589823 -3130188 -5136358 363245 -2200400 -16202592
41896a6202592p095400J4262644K5242436J7072143O003091L623312J476452q097662
$$ -16202592 -23297992 -9035348 16207088 33279231 39282322 42905634 44382086 36284424
41888C6284424j6582487j4441573m833264O377498J7622940K0648830K410088
$$ 36284424 19701937 5260364 427100 6804598 24427538 45076368 47486456
41881D7486456k9468982m2875961k0779573J1488891J8918638L360620o085571
$$ 47486456 18017474 -24858487 -45638060 -34149169 -15230531 -11869911 -17955482
41874a7955482O20505N554461j231441m495894Q936397K6033609K4116249J200846
$$ -17955482 -17334977 -11780516 -13011957 -17507851 -8571454 17462155 41578404 42779250
41866D2779250k1734437k5285725j1416413J423348P51862n134646L35525J6048745
$$ 42779250 21044813 -4240912 -15657325 -14233977 -13482115 -18616761 -18281236 -2232491
41858b232491K1311421M733273j8069177k5571274j6908829m640929O488119J6704772
$$ -2232491 19078930 23812203 5743026 -19828248 -36737077 -41378006 -34889887 -18185115
41850a8185115J8304965O153130o954685o784293j920275p773806j4326001j07330
$$ -18185115 119850 6272980 -681705 -7465998 -9386273 -17160079 -31486080 -31593410
41842c1593410K4908340K5780828k738810k3492424j1724115J0317458J2278186
$$ -31593410 -6685070 19095758 16356948 -7135476 -18859591 -8542133 3736053
41835C736053l18553m989410j041854j942869o134505k860933M100442L217792
$$ 3736053 3417500 -1571910 -2613764 -4556633 -10691138 -13552071 -9451629 -6233837
41827f233837k294675l42525Q449841J3926189J4113982J2499107O070893o382143
$$ -6233837 -8528512 -8871037 -421196 13504993 27618975 40118082 46188975 39806832
41819C9806832j3175268n379142N419624L965710l529351j802877N071093J203244
$$ 39806832 26631564 21252422 26672046 30637756 27108405 25305528 30376621 31579865
41811C1579865j1503097j5682239p585923p90815j915846m120661m461527p149109
$$ 31579865 20076768 4394529 -3191394 -3982209 -5898055 -10018716 -14480243 -21629352
41803b1629352r048345j396703J2727815J9888799J5568450O436474m226459j6458357
$$ -21629352 -30677697 -32074400 -19346585 542214 16110664 22547138 18320679 1862322
41795A862322k2039357j1528726Q238644J9984814J7161679N609441q824500j8964001
$$ 1862322 -20177035 -31705761 -23467117 -3482303 13679376 19288817 10464317 -8499684
41787h499684j3619227M893286J3731304J772369q155185L350268J3746814m352056
$$ -8499684 -22118911 -17225625 -3494321 -1721952 -9877137 -6526869 7219945 2867889
41779B867889k7562145j3985824K1042899K1654119j6154654l3529638l791783
$$ 2867889 -24694256 -38680080 -17637181 4016938 -12137716 -45667354 -49459137
41772d9459137K5647034J2966175j5177889j6679032J024409J0868732J7507553
$$ -49459137 -23812103 -10845928 -26023817 -42702849 -41678440 -30809708 -13302155
41765a3302155L3068510L7658528J1551255k1367660k7207001j4209373q863310
$$ -13302155 19766355 57424883 68976138 47608478 20401477 6192104 -2671206
41758b671206o149552J0429120K3590738P670767j9422730k0985510l183263L81317
$$ -2671206 -8820758 1608362 25199100 32869867 13447137 -7538373 -10721636 -10340319
41750a0340319p381949M115344K7054183J9611556j8840415l6802850j0231490
$$ -10340319 -17722268 -13606924 13447259 33058815 14218400 -22584450 -32815940
41743c2815940K0497780J5627971p963870j3140068J997936J4112166J3172566
$$ -32815940 -12318160 3309811 -4654059 -17794127 -15796191 -1684025 11488541
41736A1488541M875840n844864j3465389j0277451k423L719334J009287O784744
$$ 11488541 16364381 10519517 -2945872 -13223323 -13225746 -9506412 -8497125 -1712381
41728a712381K0298234J9438471k554925k0608206j3946685L993970Q572154k710718
$$ -1712381 18585853 38024324 35469399 14861193 914508 4908478 13480632 10769914
41720A0769914j5369299j8484092o927318J7805611L6347422K2475889j9226960
$$ 10769914 -4599385 -23083477 -30010795 -12205184 24142238 46618127 27391167
41713B7391167m7449979l3154856M286092K6810017K4031733J1072454o47307
$$ 27391167 -20058812 -53213668 -48927576 -22117559 1914174 12986628 12339321
41706A2339321p689816m539356P894492J4509688O279442k970904J518039R908143
$$ 12339321 4649505 110149 8004641 22514329 28793771 25822867 27340906 37249049
41698C7249049M826108q893488j4653758j2808618j3410934j0229292Q135131
$$ 37249049 42075157 33181669 18527911 5719293 -7691641 -17920933 -9785802
41691i785802K6425213J5895271j6964449k8504839J266298L4390359K4456774
$$ -9785802 16639411 32534682 15570233 -12934606 -11668308 22722051 47178825
41684D7178825j8397077m0376812j5901792K1616198K7720177L215495j4710114
$$ 47178825 28781748 -11595064 -27496856 -5880658 21839519 25055014 10344900
41677A0344900n797718J1110061R792816r471096k6813875k8704769j4637965
$$ 10344900 4547182 15657243 25450059 15978963 -10834912 -39539681 -54177646
41670e4177646J0111442L3235392L6365973J5129220p981202r104586M108656
$$ -54177646 -44066204 -10830812 25535161 40664381 32683179 23578593 27687249
41663B7687249N723328p192647j2080907O6081J0861591O161638m377916r034496
$$ 27687249 33410577 26217930 14137023 14203104 25064695 31226333 26848417 17813921
41655A7813921j0978980j2191928m548754R561054J1763322j544433p683669M506428
$$ 17813921 6834941 -5356987 -9905741 -344687 11418635 9874202 2190533 6696961
41647F696961J1847116l400660j7276345j794340K1727593R604213l2836289n1922426
$$ 6696961 18544077 15143417 -2132928 -3927268 17800325 27404538 -5431751 -57354177
41639e7354177k2105294J9208317K7829944R776612j56953P966989J4555680P277202
$$ -57354177 -79459471 -60251154 -32421210 -22644598 -22801551 -14834562 -278882 6998320
41631F998320l957559p782797o562856n316435j72057J1695912J8742122N981323
$$ 6998320 3040761 -4742036 -11304892 -16621327 -16793384 -5097472 13644650 19625973
41623A9625973k0068397l1685976j3920544J3212175K0705291R387728K090271
$$ 19625973 -442424 -32128400 -46048944 -32836769 -12131478 -2743750 -653479
41616f53479K804703o997811k6969857k6429682P323936L8319261K8250488o710407
$$ -653479 2151224 -4846587 -31816444 -58246126 -50922190 -12602929 15647559 8937152
41608H937152j9054872J652468J9604941R947862j0275697j6135816r620438n586917
$$ 8937152 -10117720 -8465252 11139689 21087551 10811854 -5323962 -14944400 -20531317
41600b0531317m982540k27656N513702J517317j2597920k3835312k0499304m590118
$$ -20531317 -25513857 -25741513 -20227811 -18710494 -31308414 -55143726 -75643030 -80233148
41592h0233148J0956377J6589456J6565238K0495884K5071467J6332602m380648
$$ -80233148 -69276771 -52687315 -36122077 -15626193 9445274 25777876 21397228
41585B1397228j3397135J623147J6509449K173984k8774026l5449721o309122
$$ 21397228 8000093 9623240 26132689 28306673 -467353 -35917074 -42226196
41578d2226196K5893481L0830111J4541039j890226j1274925j4583018r097423
$$ -42226196 -16332715 14497396 29038435 27148209 15873284 1290266 -7807157
41571g807157J494259L646887m031733l576826J1184177J6408852o421206l4666360
$$ -7807157 -6312898 -2666011 -6697744 -10274570 909607 17318459 10897253 -23769107
41563b3769107l2862107n665107R965237J879757k655293J4156821L0379134K0556885
$$ -23769107 -56631214 -62296321 -52331084 -50451327 -53106620 -38949799 -8570665 11986220
41555A1986220l210580j0840387K71485N575844o583273j9928965j7566583m300945
$$ 11986220 8775640 -2064747 -1793262 3782582 -2800691 -22729656 -40296239 -44597184
41547d4597184N409469P192132N775000M400460L662979M160814L960371n19028
$$ -44597184 -39187715 -31995583 -26220583 -21820123 -18157144 -13996330 -10035959 -10554987
41539a0554987o690418o785852j238557o84896p588415q024622O862971K2927192
$$ -10554987 -17245405 -24031257 -25269814 -25954710 -33543125 -41567747 -34704776 -11777584
41531a1777584K2135855R955406M563729N954259j043440j5370809j7152791q69055
$$ -11777584 10358271 20313677 24877406 30831665 29788225 14417416 -2735375 -3604430
41523c604430J3146526R471568j510333m765853k926129l805880l481082K252830
$$ -3604430 9542096 19013664 17503331 12737478 9811349 6005469 2524387 4777217
41515D777217M711037k417981p673961M16642J1103431O004047j1603104k0737210
$$ 4777217 9488254 7070273 -603688 -187046 10916385 16920432 5317328 -15419882
41507a5419882j1811000M567064J5311691J7163820J2558614M741024l019365
$$ -15419882 -27230882 -22663818 -7352127 9811693 22370307 27111331 24091966
41500B4091966r574981j4507397j2704553M36284J6133058J8846884R762898N137931
$$ 24091966 14516985 9588 -12694965 -12258681 3874377 22721261 32484159 37622090
41492C7622090N734490o802007l1477096l6205168o241852K5098050K3947294
$$ 37622090 43356580 36554573 5077477 -31127691 -37369543 -12271493 11675801
41485A1675801P121939Q902294K0654524R674204j7737672k4027315n642004K462076
$$ 11675801 18797740 27700034 48354558 58028762 40291090 16263775 10621771 13083847
41477A3083847r269725r570274J2872935K4244723L299050k0438731j4874644
$$ 13083847 3814122 -5756152 7116783 31361506 34660556 14221825 -652819
41470f52819M973279P595107l696807l921939R243189J6157734P961834o874945
$$ -652819 4320460 11915567 8218760 4296821 13540010 29697744 37659578 30784633
41462C0784633j9106579k2163610r878387J2162762K4580724J8361121P783267
$$ 30784633 11678054 -10485556 -20363943 -8201181 16379543 34740664 42523931
41455D2523931N914525M158482p887233k0106698j8653137r409030m829416j695373
$$ 42523931 48438456 52596938 44709705 24603007 5949870 -3459160 -8288576 -9983949
41447i983949P483996J3784582M239792j4155905k1833540j1140740R939247K8032611
$$ -9983949 -2499953 11284629 15524421 1368516 -20465024 -31605764 -21666517 6366094
41439F366094K7588348R30590l1273343l1166980N516632L3147157J6130468j8224322
$$ 6366094 33954442 34885032 3611689 -27555291 -22038659 11108498 27238966 9014644
41431I014644k0331605P784491K1097064L894362j2216275m646949Q819460P431462
$$ 9014644 -11316961 -3532470 17564594 21458956 9242681 4595732 13415192 20846654
41423B0846654O07005M704781J2385021O020059j3444089k7878782k4105923n012763
$$ 20846654 21453659 26158440 38543461 44563520 31119431 3240649 -20865274 -25878037
41415b5878037J4708164J9539954P194390p476805j0558029p433410j1375080
$$ -25878037 -11169873 8370081 15564471 8087666 -2470363 -9903773 -21278853
41408b1278853j9458469j7045285l186137P869364J0242118J1848574J4900938
$$ -21278853 -40737322 -57782607 -60968744 -53099380 -42857262 -31008688 -16107750
41401a6107750J1072229j38486p133299m981405q55286K986884J2456084K2835443
$$ -16107750 -5035521 -5174007 -12307306 -17288711 -18143997 -15157113 -2701029 20134414
41393B0134414J7402828o184532k6436950k5252398q852420P350009J7828940
$$ 20134414 37537242 31352710 4915760 -20336638 -29189058 -21839049 -4010109
41386d010109K0569261R748485j0162454j7834630m41193K3976446K6658757M952394
$$ -4010109 16559152 26307637 16145183 -1689447 -2130640 21845806 48504563 53456957
41378E3456957j6561487j8809381p731468k95729k664988p194866n703913J03935
$$ 53456957 36895470 18086089 10354621 10058892 7393904 199038 -5504875 -5400940
41370e400940L137660L009241O487857J3235685J1151657m759499j8803808j5118806
$$ -5400940 -2263280 745961 7233818 20469503 31621160 26861661 8057853 -7060953
41362g060953l742597n648878j6715937j2878603P386744J5624089j089504j6065425
$$ -7060953 -10803550 -16452428 -33168365 -46046968 -38660224 -23036135 -24125639 -40191064
41354d0191064l565511K0353714K2577743J810924j4840976j4358604q590230
$$ -40191064 -43756575 -23402861 -825118 985806 -13855170 -28213774 -36804004
41347c6804004n360381L646589K0478405K8502176J4269767j0558897k0552897
$$ -36804004 -42164385 -38517796 -18039391 10462785 24732552 14173655 -6379242
41340f379242n451431J8747410K6742706J0122194j3728884k1168115j0054330
$$ -6379242 -11830673 6916737 33659443 43781637 30052753 8884638 -1169692
41333a169692n51280o081752j4960673r606417O215860J3181094M358900o890587
$$ -1169692 -1720972 -7802724 -22763397 -32369814 -26153954 -12972860 -8613960 -15504547
41325a5504547o394460N016341J6019352J6266307L206390j4767035k2690450
$$ -15504547 -21899007 -16882666 -863314 15402993 18609383 3842348 -18848102
41318a8848102j4005133L55296N363633J339904K02280N078786O862765K322112
$$ -18848102 -32853235 -32497939 -27134306 -25794402 -25592122 -20513336 -13650571 -11328459
41310a1328459J809870J2438635K4011712K1250707M949704q135834n823545N663045
$$ -11328459 -9518589 2920046 26931758 48182465 53132169 44996335 39172790 44835835
41302D4835835J0387780J731225j0789419j4068017p695849l704775j0103077
$$ 44835835 55223615 56954840 46165421 32097404 24401555 20696780 10593703
41295A0593703j9751510j9288722o568311N512756M072041o444901n817626J7909790
$$ 10593703 -9157807 -28446529 -35014840 -29502084 -25430043 -31874944 -37692570 -19782780
41287a9782780M6745063M6388250R104382k9149760l0689665n862490L508830
$$ -19782780 26962283 73350533 82454915 53305155 22615490 16753000 20261830
41280B0261830j3255244k2374254l147066J6742767O488557j6931086j6408427
$$ 20261830 7006586 -15367668 -18514734 -1771967 4716590 -12214496 -28622923
41273b8622923O704673J9421861J1313965K485257J254498n894253j8435314j5151471
$$ -28622923 -21918250 -2496389 8817576 11302833 12557331 6663078 -11772236 -26923707
41265b6923707O094498J8061266Q263940p20473O725529J0861463n228825k0348016
$$ -26923707 -20829209 -2767943 5495997 4775524 11501053 22362516 17133691 -3214325
41257c214325r433630J2273460J4632607K601409K388993J1144519K299749k3106225
$$ -3214325 -12647955 -374495 14258112 16859521 19248514 30393033 32692782 9586557
41249I586557l1636975r082194J8424841K4199848J2089544k364694j4369129
$$ 9586557 -22050418 -31132612 -12707771 11492077 23581621 21216927 6847798
41242F847798k1177644j5250553K7741P794296K902613N39343Q738291J3044909
$$ 6847798 -14329846 -29580399 -29552658 -21758362 -18855749 -18316406 -9578115 3466794
41234C466794K216962j0606234q675801L166677J0361338J0839405R467189M325927
$$ 3466794 5683756 -4922478 -13598279 -10431602 -70264 10769141 20236330 24562257
41226B4562257n277968r717492l394391L752753K814014L53691K808990K867743
$$ 24562257 19284289 9566797 6172406 9925159 12739173 13092864 15901854 18769597
41218A8769597l069567k417634R773682J4432640j023877j5985475q352297O656566
$$ 18769597 15700030 13282396 23056078 37488718 36464841 20479366 12127069 18783635
41210A8783635K854348r660370l856791J1147903L418836k0865602k0917910R686132
$$ 18783635 21637983 11977613 8120822 19268725 22687561 1821959 -19095951 -9409819
41202i409819K8634980J3096359o350242j174934J0777414M408729q766318q459301
$$ -9409819 19225161 32321520 25971278 24796344 35573758 39982487 31216169 22756868
41194B2756868l914124j0055860j4340629k943000O056476o655551k0975342q103665
$$ 22756868 18842744 8786884 -5553745 -8496745 -2440269 -9095820 -30071162 -38174827
41186c8174827J7187549J8558338j454667q588036L193914N640115r681447j6170934
$$ -38174827 -20987278 -2428940 -3883607 -12471643 -9277729 -3637614 -13319061 -29489995
41178b9489995P44047K0103310K0871791Q986462k177169r996584j1338867J3679
$$ -29489995 -28745948 -8642638 12229153 21215615 19038446 9041862 -2297005 -2283326
41170b283326J5110763J4433152r79191q798633l065215l479867j6642394j9160944
$$ -2283326 12827437 27260589 26281398 17482765 14417550 10937683 -5704711 -24865655
41162b4865655L145319K6585312K2150191l409247k0163978j3841427N393786
$$ -24865655 -21720336 4864976 27015167 23605920 3441942 -10399485 -5005699
41155e005699K0175076J7907082j865104k0990988j7489895M507956J6350128
$$ -5005699 15169377 33076459 31211355 10220367 -7269528 -2761572 13588556
41148A3588556M429305j2249315j3752093n169113K036385R970402J8822099J5591876
$$ 13588556 18017861 5768546 -7983547 -13152660 -11116275 -1145873 17676226 33268102
41140C3268102j870882j2188057k797083P600755J180013q678205n158222q12754
$$ 33268102 31397220 19209163 16412080 24012835 25192848 16514643 11356421 10543667
41132A0543667j0723448j6901898J749398K3488616J2391956j9379833k5836872
$$ 10543667 -179781 -17081679 -15332281 8156335 20548291 1168458 -24668414
41125b4668414L58514J8092567M878778j2498981o461556J3087160K4978094K5879777
$$ -24668414 -24309900 -6217333 -1338555 -13837536 -20299092 -7211932 17766162 43645939
41117D3645939J6581118p587478l4261269l3486790q90284K6699311K0725374
$$ 43645939 60227057 52639579 18378310 -15108480 -15998764 10700547 31425921
41110C1425921o69641p023511j440561l381767q901407j977919J0165254P689579
$$ 31425921 30756280 23732769 22292208 18910441 10009034 8031115 18196369 25885948
41102B5885948n034663o294393L939955L913417j0939168j9361753r818313K136876
$$ 25885948 20851285 14556892 18496847 22410264 11471096 -7890657 -17708970 -15572094
41094a5572094R28164o726037p109487M49235Q925378J4366800J2629430l50683
$$ -15572094 -14643930 -21369967 -28479454 -28030219 -19104841 -4738041 7891389 7540706
41086G540706j5990781j5332104M663771K0466819J1895146q503695j3433582
$$ 7540706 -8450075 -23782179 -19118408 1348411 13243557 4739862 -8693720
41079h693720n21121P200786n99433o155314N104131J8079466J0623249r596360
$$ -8693720 -9214841 -2014055 -2613488 -8768802 -3664671 14414795 25038044 15441684
41071A5441684j3916209L943771J7362875O965610j0580020r916655L667721N473509
$$ 15441684 1525475 5469246 22832121 29797731 19217711 9301056 12968777 18442286
41063A8442286o833845r892872N923582K0144849J4309760k151979j1716451j4778207
$$ 18442286 11608441 1715569 7639151 27784000 42093760 39941781 28225330 13447123
41055A3447123j8259735j5176633J727436J7553137J2230775n512420p762743
$$ 13447123 -4812612 -19989245 -18261809 -708672 11522103 6009683 -1753060
41048a753060R275940J8987187O995164p307575m775274L009696k382801j1579238
$$ -1753060 7522880 26510067 33505231 26197656 21422382 24432078 22049277 10470039
41040A0470039l245954J6593416K0371737K403262j1461501l868144Q751395L716434
$$ 10470039 7224085 23817501 44189238 46592500 35130999 31262855 40014250 43730684
41032D3730684j3785326k1168674j1774330n30813j186328j1681071j9991744
$$ 43730684 29945358 8776684 -2997646 -3528459 -4714787 -16395858 -36387602
41025c6387602j4731456O258973K8900829L0791516P558853j5777604j4524384
$$ -36387602 -51119058 -44860085 -15959256 14832260 22391113 6613509 -7910875
41018g910875J633140M009229j0431205j5945237k001088R094149R12820q707188
$$ -7910875 -6277735 -2268506 -12699711 -28644948 -30646036 -21551887 -20639067 -29346255
41010b9346255N99514J4655264Q113861j0465395j0014226J2512661K6237343
$$ -29346255 -28746741 -14091477 -5977616 -16443011 -26457237 -13944576 12292767
41003A2292767J3543243o896106j2448173n729334J87038L120776M042556k888996
$$ 12292767 25836010 18939904 6491731 762397 949435 4070211 8112767 5223771
40995E223771j6420323j9861447l612051J6124248J7792062L627166q018349j0354828
$$ 5223771 -11196552 -31057999 -34670050 -18545802 -753740 2873426 -5144923 -15499751
40987a5499751j0074183q058209J983059J6530719K1595700J2035115j807229
$$ -15499751 -25573934 -33632143 -31649084 -15118365 6477335 18512450 16705221
40980A6705221r971026j3798206j6588967j3384019J933615K2841364L0874805
$$ 16705221 6734195 -7064011 -23652978 -37036997 -35103382 -12262018 18612787
40973A8612787J4509486j3071916k2637753l454233J7252327N734552k9053803
$$ 18612787 33122273 20050357 -2587396 -6041629 11210698 16945250 -12108553
40966a2108553m1295044j1019724K5493828K6785399L419737m891947Q494802
$$ -12108553 -53403597 -64423321 -38929493 -12144094 -8724357 -13616304 -5121502
40959e121502J5112718M343336k013166P276664J2911212J203507j1872196j0299116
$$ -5121502 9991216 14334552 12321386 19598050 32509262 33712769 21840573 11541457
40951A1541457m377828p632254j1359164m192433M100955K131637R15965J2088468
$$ 11541457 7163629 -468625 -11827789 -16020222 -11919267 -9787630 -8871665 3216803
40943C216803J9715885M668690j6550433j2468611J1401708J8999751J585704
$$ 3216803 22932688 27601378 11050945 -1417666 9984042 28983793 30569497
40936C0569497r996837J348931J2094236J778395j1036544k371504J4661481J2395865
$$ 30569497 20572660 21921591 34015827 35794222 24757678 22386174 37047655 49443520
40928D9443520m440181q225517M278213Q336821n256105j4911109m676357J0298046
$$ 49443520 45003339 36777822 41056035 49392856 44136751 29225642 24549285 34847331
40920C4847331Q558161o430125j5598242j1896355k948863N303276J1882525J1913875
$$ 34847331 43405492 36975367 21377125 9480770 6531907 11835183 23717708 35631583
40912C5631583j33557j7139481k1542733o051180J4857773J9699962L326369j8549570
$$ 35631583 35498026 18358545 -3184188 -9235368 5622405 25322367 28648736 10099166
40904A0099166k6988132j8283776l592855O797079J3449457K0293675K3381388
$$ 10099166 -16888966 -35172742 -38765597 -31968518 -18519061 1774614 25156002
40897B5156002J5175901j313312j2117808r091065M45351M878143J736968n147516
$$ 25156002 40331903 39018591 26900783 17809718 18255069 23133212 24870180 19722664
40889A9722664j3532170j9728689j5763350j108740R243038L354635n265387O641363
$$ 19722664 6190494 -13538195 -29301545 -30410285 -21167247 -17812612 -23077999 -16436636
40881a6436636L2895330L7824462O494622k6583070k0113454J6266266L3605005
$$ -16436636 16458694 54283156 60777778 34194708 14081254 30347520 63952525
40874F3952525R554347k4635152k9731122p770526R012688K988983j3206463j9287102
$$ 63952525 73506872 48871720 19140598 11370072 20382760 23371743 10165280 -9121822
40866i121822r819649N350272J2743168O577897n773412j0793056m242916N467570
$$ -9121822 -18941471 -13591199 -848031 5729866 -43546 -10836602 -15079518 -9611948
40858i611948J2103479J9399146K6793924K0888405l642619k5695768k1776481
$$ -9611948 2491531 21890677 48684601 69573006 65930387 40234619 18458138
40851A8458138k450912N47084j6701379k3054581k009302K0704768J6866246j955808
$$ 18458138 16007226 16554310 -147069 -23201650 -25210952 -4506184 12360062 10404254
40843A0404254o661526L470910O485439j930790n139280J371937M173832P19094
$$ 10404254 3742728 7213638 13699077 11768287 6629007 8000944 12174776 12893870
40835A2893870M760818J7162751J9422526O072177l736957p21244m167677k5790730
$$ 12893870 17654688 34817439 54239965 60312142 56575185 55853941 51686264 25895534
40827B5895534l9932504j8656708K0392844L4128464J4228442n895215m186560
$$ 25895534 -14036970 -32693678 -12300834 21827630 36056072 30160857 25974297
40820B5974297K942952m124658j4935429r695694O100711J0352016j125648r969169
$$ 25974297 28917249 24792591 9857162 161468 6262179 16614195 15488547 5519378
40812E519378m637192L402028p11726j1568661j1085171M100766J5703459Q810020
$$ 5519378 882186 4284214 3572488 -7996173 -19081344 -14980578 722881 9532901
40804I532901o508085r574737R45891P214446J814453j830797M784218Q731024
$$ 9532901 3024816 -6549921 -5604030 1610416 3424869 1594072 6378290 15109314
40796A5109314j026709j0989065m027446R812011P754905q060392j4212803m923005
$$ 15109314 14082605 3093540 -933906 8878105 16633010 8572618 -5640185 -10563190
40788a0563190R18055n073629p158188L412475J0516814J878248p386340L4600
$$ -10563190 -9645135 -14718764 -21876952 -18464477 -7947663 -6069415 -13455755 -13421155
40780a3421155J2850141Q833120q058768j2418960M309619K1225274J6250287
$$ -13421155 -571014 8262106 203338 -12215622 -7906003 13319271 29569558
40773B9569558o922888k4075094j5837422J2534922L3415941K3298251r460276
$$ 29569558 22646670 -1428424 -17265846 -4730924 28685017 51983268 42522992
40766D2522992l1186893k1969277K324555J4288205Q700066M13431j59415N418584
$$ 42522992 11336099 -10633178 -8308623 5979582 14679648 15093079 14933664 20352248
40758B0352248J2684295J6045481P711190j0712747k1425794j0568113R309519
$$ 20352248 33036543 49082024 56793214 46080467 24654673 14086560 23396079
40751B3396079J2810351m491822k0886148j6980925L406352K1139526K0835436
$$ 23396079 36206430 31714608 10828460 -6152465 -2746113 18393413 39228849
40744C9228849L386503j3241798j0762520N165305Q029708j2027482k8997252
$$ 39228849 42615352 29373554 18611034 23776339 31806047 19778565 -9218687
40737i218687j7038518R160594J5281607j787750j3889950p819321M41102m84287
$$ -9218687 -26257205 -17096611 -1815004 -3602754 -17492704 -25312025 -24870923 -25355210
40729b5355210j042379M141654L892209n198981p437847N650230J9470650J9822434
$$ -25355210 -26397589 -22255935 -18363726 -23562707 -31000554 -25350324 -5879674 13942760
40721A3942760J2280903O185703m81156p807876o407380K720316J452536j6138146
$$ 13942760 26223663 32409366 31928210 24120334 17712954 20433270 21885806 5747660
40713E747660k7523025j3331929J2209509K2116117J3144064K149170j038600
$$ 5747660 -21775365 -35107294 -22897785 -781668 12362396 14511566 13472966
40706A3472966J587074P082160J0157902J978770j4761181k2274721j2799429
$$ 13472966 15060040 22142200 32300102 34278872 19517691 -2757030 -15556459
40699a5556459j385283L10270K486366J2003638J3125392k312390j0673705N579592
$$ -15556459 -16941742 -16631472 -14145106 -2141468 10983924 8671534 -2002171 3577421
40691C577421J9078743k937749l7693707l3108180J1750227M1567353K4167415
$$ 3577421 22656164 19718415 -17975292 -51083472 -39333245 2234108 26401523
40684B6401523j0412457k1396339p508763R943104J9424589J6509729k083426
$$ 26401523 15989066 -5407273 -12916036 -2972932 16451657 32961386 30877960
40677C0877960k3976317k5190407l953143J2606776Q022681k245268j767419K054367
$$ 30877960 6901643 -18288764 -22241907 -9635131 -1612450 -3857718 -5625137 -3570770
40669c570770J84469J695862J1701895J4463451N2181j4408429j1921481k982555
$$ -3570770 -3386301 -1690439 10011456 24474907 24527088 10118659 -1802822 -4785377
40661d785377l619606o733640R15252J2303474J4907624J3184483J2047391j130301
$$ -4785377 -8404983 -15138623 -14223371 -1919897 12987727 26172210 38219601 37089300
40653C7089300k9526256m3298021j8281505J8831556K3809121J586658m017927
$$ 37089300 7563044 -35734977 -54016482 -35184926 -11375805 -9789147 -13807074
40646a3807074J7445083K8065198N557798k1490952j9237853N043941K2268587
$$ -13807074 3638009 31703207 37261005 15770053 -3467800 1576141 23844728
40639B3844728K0983416Q450388o471600j4133208n827910J0107637J0966035
$$ 23844728 44828144 53278532 46806932 32673724 26845814 36953451 47919486
40632D7919486q010762k2246522j3374729L267216N073227k338773L63471J0013901
$$ 47919486 39908724 17662202 4287473 7554689 12627916 10289143 10652614 20666515
40624B0666515O810226r313506j5452564j305233J4940441J4094172K129345k025025
$$ 20666515 27476741 18163235 2710671 1405438 16345879 30440051 32569396 30544371
40616C0544371O015339J2730066O956068o215345j3563946j0789792o761215r884058
$$ 30544371 36559710 49289776 56245844 50030499 36466553 25676761 18915546 9031488
40608I031488j4748225q927925P457710J8086149J1068454m356972r726187j164048
$$ 9031488 -5716737 -14644662 -7186952 10899197 21967651 17610679 7884492 6720444
40600F720444P923881O000611m003861j1726513j0744485j156847J1400259J6381741
$$ 6720444 14644325 20644936 16641075 4914562 -5829923 -6986770 4413489 20795230
40592B0795230O085969j1737724j6545114R11708K2207775K0416563n728874k9462645
$$ 20795230 26881199 15143475 -1401639 -489931 21717844 42134407 36405533 6942888
40584F942888k9783277j3870353M25850R580909J8791517K3419687J5186986J591836
$$ 6942888 -22840389 -36710742 -36284892 -26703983 -7912466 15507221 30694207 32286043
40576C2286043j044109O654209Q177742j21403k802763O016164J0081027j114056
$$ 32286043 31241934 37896143 46073885 45952482 43149719 49165883 59246910 58132854
40568E8132854j2417802p769287K226122k084895j6456393j9614211o485225O475177
$$ 58132854 45715052 37945765 40171887 38086992 21630599 2016388 -4468837 2006340
40560B006340P204131J691039J231507Q721040J7404204J5410782l165536k4587477
$$ 2006340 9210471 10901510 12133017 20854057 38258261 53669043 50503507 25916030
40552B5916030k3936023K076490K4647018J9880323O99156p223744m401218o653130
$$ 25916030 1980007 4056497 28703515 48583838 49282994 42059250 37658032 31004902
40544C1004902j0534227k087697R586514L318224j3673703j3229732N509172J3261655
$$ 31004902 20470675 18382978 27969492 31287716 17614013 4384281 9893453 23155108
40536B3155108Q50716o562748M072955J1242552o26654j3142772p442420M263932
$$ 23155108 24005824 17443076 21516031 32758583 32131929 18989157 11546737 15810669
40528A5810669L213386n322634p867754o362687n569300J015768J3222736J4901559
$$ 15810669 19024055 13701421 5833667 -529020 -6098320 -5082552 8140184 23041743
40520B3041743J994967m118126P813996J5411462j090417k3574061k3895457n059629
$$ 23041743 25036710 20918584 28732580 44144042 43053625 19479564 -4415893 -9475522
40512i475522J1905557J9989301J8622551n66637k9778138l3476469K650272L6500904
$$ -9475522 2430035 22419336 41041887 40475250 10697112 -22779357 -20129085 16371819
40504A6371819K5193621p769465r629664J7121867K4254958J321025j2140920
$$ 16371819 41565440 33795975 24166311 41288178 65543136 66864161 54723241
40497E4723241j49425M626052j6406593l3935655k1833875K510168J3058992J2922365
$$ 54723241 54573816 59199868 42793275 8857620 -12976255 -10466087 2592905 15515270
40489A5515270J3818553J0672775k09435n988690p81785J714000m375791m882214
$$ 15515270 29333823 40006598 39797163 33808473 33026688 34740688 30364897 25482683
40481B5482683M056021M583640p113966p845476R061789J3804906q805648k4372798
$$ 25482683 29538704 34122344 27008378 19162902 28224691 42029597 33223949 8851151
40473H851151j159965L3345639L0952554l851781k4487968j3974209q88999o223341
$$ 8851151 7691186 41036825 71989379 68137598 43649630 29675421 28786422 22563081
40465B2563081j5591098j1077186J615839Q342338O490312J388728j621219K464301
$$ 22563081 6971983 -4105203 -2489364 5852974 12343286 13732014 12110795 14575096
40457A4575096J3048135J8753519R636878p310753j6281441j2459053k972222
$$ 14575096 27623231 46376750 56013628 48702875 32421434 19962381 16990159
40450A6990159N723417J0069851O545081j824770m436832J099041L595908j224165
$$ 16990159 22713576 32783427 39328508 37503738 33066906 34165947 37761855 36537690
40442C6537690j462434O493608N191870j2797675k3523314p821980J2420789P036974
$$ 36537690 35075256 41568864 46760734 33963059 10439745 2617765 15038554 22075528
40434B2075528j1903771j1418653M529891L746739j3878993j3733165J2141036
$$ 22075528 10171757 -1246896 3282995 7029734 -6849259 -20582424 -8441388
40427h441388K9214424J8368997M716706R685236J5573674L109647j1467823o841041
$$ -8441388 20773036 39142033 43858739 53543975 69117649 72227296 60759473 53918432
40419E3918432M853807J888334p668546l512778P374686K836564j3544948j6643705
$$ 53918432 58772239 60660573 52992027 49479249 56853935 59690499 46145551 29501846
40411B9501846p96715J2854056J0458503J449394l052658n943768j1246917j1941760
$$ 29501846 28705131 41559187 52017690 53467084 50414426 44470658 33223741 21281981
40403B1281981K5647J9841381L2396002K6734126Q015110m352993L427453J9506341
$$ 21281981 21307628 41149009 73545011 100279137 108294247 103941254 107368707 126875048
40395A26875048J7078328r195185l1614565k5994348n881345k281237j8950054
$$ 126875048 143953376 134758191 103143626 77149278 71267933 68986696 50036642
40388E0036642k9990630j9318903o70676N904663J43729l724346K559079J3640722
$$ 50036642 20046012 727109 56433 5961096 6104825 2380479 4939558 18580280
40380A8580280J8225978J0932504q37754l591398M846336J0293029K083019r284075
$$ 18580280 36806258 47738762 46901008 43309610 48155946 58448975 60531994 51247919
40372E1247919o769046O474357J1258559J876988o101907p63222J0050440J4539849
$$ 51247919 44478873 50953230 62211789 64088777 57986870 57223648 67274088 81813937
40364H1813937J4244523J5175733J2876285n13970j9587984k8335180j9424594
$$ 81813937 96058460 111234193 124110478 123596508 104008524 75673344 56248750
40357E6248750k714879P116994O500970L797383N765749P023465k359213j8877083
$$ 56248750 53533871 60650865 67151835 70949218 76714967 83738432 81379219 62502136
40349F2502136k4173020q895893R765670P624467j2807288k4407739j2931255
$$ 62502136 38329116 29433223 39198893 46823360 34016072 9608333 -3322922
40342c322922M853261P724869j193864m431304L002904J1457396J3872678J0909170
$$ -3322922 1530339 9255208 8061344 3630040 6632944 18090340 31963018 42872188
40334D2872188L603732n941988j0310146n555639J80867m1362L669030K2312629
$$ 42872188 46475920 40533932 30223786 24668147 24849014 24807652 28476682 50789311
40326E0789311M1082578L2256539k062031k5215919j4014380J1567970K1110801
$$ 50789311 91871889 124128428 122066397 96850478 82836098 94404068 115514869
40319A15514869J3901468O139611j629571j6335138k5543661j1783446J1486868
$$ 115514869 129416337 135555948 133926377 117591239 92047578 80264132 91751000
40312I1751000J1933364j1747830k4978822r915163R495225Q555099l137055p248079
$$ 91751000 103684364 91936534 66957712 57042549 66537774 75092873 71955818 64707739
40304F4707739q666450j6234003j6332020K950579K0505916J0339402j2461600
$$ 64707739 56041289 39807286 23475266 26425845 46931761 57271163 44809563
40297D4809563j2147401R155363J5102360k907866j1796535M990413J8358471
$$ 44809563 32662162 41817525 56919885 54012019 42215484 47205897 65564368
40290F5564368L513186j8146903j5856620R02698K990704q890171j0894198q782
$$ 65564368 69077554 50930651 35074031 35976729 38967433 30077262 19183064 19174282
40282A9174282M310487j489337J606020J9835877L2742373K3272652Q70189j4809037
$$ 19174282 23484769 21995432 23601452 43437329 76179702 99452354 100322543 85513506
40274H5513506j7300101j1739983k691042O972893J2284799Q490609m497551j9842311
$$ 85513506 68213405 56473422 53782380 60755273 73040072 81530681 77033130 57190819
40266E7190819k4370725q564273J7505853K7953363J2055187q925966j1034647
$$ 57190819 32820094 24255821 41761674 69715037 81770224 72844258 61809611
40259F1809611j951753m148838j3929537p487570J4769133K4189641J0764837
$$ 61809611 59857858 55709020 41779483 34291913 49061046 73250687 84015524
40252H4015524R1772Q747700J4579026n158669l1841023l1075647l661796J8887298
$$ 84015524 84107296 92854996 107434022 102275353 70434330 39358683 35696887 54584185
40244E4584185K0198425J2304841Q075889P121124R094833J7828490K9371279
$$ 54584185 74782610 87087451 95163340 102284464 111379297 129207787 158579066
40237A58579066L4198015L2814964L2822489L1486276J9714470L108812j310340
$$ 158579066 192777081 225592045 258414534 289900810 309615280 312724092 311413752
40230C11413752Q033748J3562669N963001m112289p325749r038848j3757296j5221329
$$ 311413752 319447500 333010169 338973170 334860881 327535132 318496284 304738988 289517659
40222B89517659j1610448j2825259k2234827k8518581k6138357k4910159k7243091
$$ 289517659 277907211 265081952 242847125 214328544 188190187 163280028 136036937
40215A36036937j8266254L900535J1919301j0932092l5552328k5002678P210441
$$ 136036937 117770683 121671218 133590519 122658427 87106099 62103421 69313862
40208F9313862J6166539m456407j5914466j254481Q586155p313702k0131188n33062
$$ 69313862 85480401 81023994 65109528 63855047 72441202 65127500 44996312 44463250
40200D4463250K7204346K0920343j1715630k5791368r488512L700573m908614
$$ 44463250 71667596 92587939 80872309 55080941 45592429 49293002 44384388
40193D4384388j0881378O460722K5734786J7426546q773242j9366887o154234
$$ 44384388 33503010 39963732 65698518 83125064 74351822 54984935 48830701
40186D8830701P549825M536682o853201j2129395r837499n957456k906424m53963
$$ 48830701 56380526 60917208 54064007 41934612 32097113 26139657 23233233 22779270
40178B2779270J028295K634466O013590Q471874N502569o05847j961522L258927
$$ 22779270 23807565 26442031 32455621 40927495 46430064 45824217 43862695 47121622
40170D7121622P560983N369169R32536J248139O101351Q915312M566281n309523
$$ 47121622 54682605 60051774 60984310 62232449 68333800 77249112 81815393 76505870
40162G6505870j2163398o927223Q321399J7565194Q623816p695764q920144O878494
$$ 76505870 64342472 57415249 65736648 83301842 91925658 84229894 75309750 82188244
40154H2188244J6097788M352445j0441217m686255J4159511J8098580l36726j9651455
$$ 82188244 98286032 102638477 92197260 87511005 101670516 119769096 119432370 99780915
40146I9780915k1816716j1634837K80513J2319414K0375890J1820762j3321813
$$ 99780915 77964199 66329362 66609875 78929289 99305179 111125941 97804128
40139I7804128l0281316j7612957J1743702K6236018J6742679K795983Q11509
$$ 97804128 67522812 49909855 61653557 87889575 104632254 107428237 108239746
40132A08239746O532090J0742819J2439369J0335097l61540j3320354j0248285
$$ 108239746 114771836 125514655 137954024 148289121 147927581 134607227 124358942
40125A24358942J1957420K7754677J4320781j3707004k1593902k185947J6199283
$$ 124358942 136316362 164071039 178391820 164684816 143090914 140904967 157104250
40118A57104250J1939353j889974j867685J1255675J8769121J4485568J0918733
$$ 157104250 169043603 167153629 165285944 176541619 195310740 209796308 220715041
40111B20715041J7603419K8674402L3649502K8902869J6527576K468977k360414
$$ 220715041 238318460 266992862 300642364 329545233 346072809 348541786 346181372
40104C46181372Q873955K4887120K4324899M686924j0917971p294204k390398
$$ 346181372 355055327 379942447 404267346 408954270 398036299 390742095 388351697
40097C88351697j9089210m2587878l5217025M577492K9236591L956674m2645149
$$ 388351697 369262487 326674609 291457584 296035076 325271667 329228341 286583192
40090B86583192n4813996k2913746Q272572J657532k9424037m7467630l7197910
$$ 286583192 231769196 208855450 217128022 218785554 189361517 141893887 104695977
40083A04695977j2457475P650106J3318229L297390j4234891k2291393r901742
$$ 104695977 92238502 99888608 113206837 116504227 102269336 79977943 70076201
40076G0076201J2197723K0575919O440311j3996274j9954895r572741K848734
$$ 70076201 82273924 102849843 109290154 95293880 75338985 65766244 68614978
40069F8614978P116660N269211J168022o431230j5649114j6276058k868768J2749392
$$ 68614978 75731638 81000849 82168871 75737641 60088527 43812469 40943701 53693093
40061E3693093J4433377M621809L77347O656243J0182632L922658j195408J523884
$$ 53693093 68126470 72748279 73125626 79781869 89964501 93887159 92691751 94215635
40053I4215635J40949j2443584j9191887n700493R006041k181759k7221071k7134086
$$ 94215635 94356584 81913000 62721113 57020620 66026661 63844902 36623831 9489745
40045I489745M784890L1180119K6187978Q990065N950321R603602q66456k0582512
$$ 9489745 14274635 45454754 71642732 80632797 86583118 96186720 95320264 74737752
40037G4737752k7283893j5766698n40760P805752R929586Q302218N658836N631350
$$ 74737752 47453859 31687161 31146401 38952153 48881739 57183957 62842793 68474143
40029F8474143M217896p227373k0663622j2440155J8864223L8333154K1180063
$$ 68474143 72692039 65464666 44801044 32360889 51225112 89558266 110738329
40022A10738329q793452j5834815n853963p131034j5608590m512456K0460283
$$ 110738329 101944877 86110062 80256099 73125065 57516475 53004019 73464302
40015G3464302K4486707L050129r738434M38036Q103394j307890p720633j405871
$$ 73464302 97951009 101001138 91262704 91700740 99804134 98496244 90775611 89369740
40007H9369740m189683k0445641j4631142K6619594N4083371K4147870k7853904
$$ 89369740 85180057 64734416 50103274 76722868 130806239 154954109 127100205
40000A27100205l6184125j407314J9772409O880245m064716P963717J7617324
$$ 127100205 90916080 89508766 109281175 116161420 112096704 120060421 137677745
39993A37677745O566723m203873K602088Q692812k436248j1819520K100922K4465769
$$ 137677745 144244468 140040595 142642683 151335495 148899247 137079727 139180649 163646418
39985A63646418K7318975J1365643k610090o790557n155413M810612K2407351
$$ 163646418 190965393 202331036 199720946 192930389 187774976 192585588 214992939
39978B14992939K8906896J0769571j1629247p554560J7062141K6096567P000491
$$ 214992939 243899835 254669406 243040159 235485599 252547740 278644307 285644798
39971B85644798j1377681j989826K4525472L9131587L0859195J1272637l689278
$$ 285644798 274267117 272277291 296802763 335934350 366793545 378066182 374376904
39964C74376904m428450R425010K6520141L1845964K4086302J6217686J4273965
$$ 374376904 369948454 379373464 405893605 437739569 461825871 478043557 492317522
39957D92317522Q909855m056286j0774744j559787P978962j672988k0179600j9117763
$$ 492317522 501227377 497171091 486396347 484836560 492815522 491142534 470962934 451845171
39949D51845171M160477J9486024O672449j7490336k7303200k4023168k5625195
$$ 451845171 456005648 475491672 482164121 464673785 437370585 413347417 387722222
39942C87722222l3833066l3543248k1118968j2111947j7009589k5660270k3866014
$$ 387722222 353889156 320345908 299226940 287114993 270105404 244445134 220579120
39935B20579120j4479530j1969355k1108255l0355823k6544741j0349891N348073
$$ 220579120 206099590 194130235 173021980 142666157 116121416 105771525 111119598
39928A11119598J0120349N509015p04617n159162q551925p945395M37780R685383
$$ 111119598 121239947 126748962 126044345 120885183 112333258 104387863 104825643 114511026
39920A14511026N920955j0203204j8181265m764604J4643969J6751992L763936
$$ 114511026 120431981 110228777 92047512 87282908 101926877 118678869 122442805
39913A22442805k959823K487857M673860l584508q574523J37649J2107397J2451337
$$ 122442805 119482982 121970839 126644699 123060191 114485668 114623317 126730714 139182051
39905A39182051P06997j5041992k7573030k6745964n199024K1598889K2223943
$$ 139182051 139889048 124847056 97274026 70528062 65329038 86927927 109151870
39898A09151870p508224k9213161j1996155K1352485K6843136K590541j5687431
$$ 109151870 101643646 72430485 60434330 81786815 108629951 111220492 95533061
39891I5533061j3746852j1971937j7692618q945326J8345304K8440552J47955
$$ 95533061 81786209 69814272 52121654 43176328 61521632 89962184 90110139
39884I0110139k9607817j5507319K3701866K7893665j4966304m8385619k7186830
$$ 90110139 60502322 44995003 68696869 96590534 81624230 33238611 6051781
39877F051781K1728390M1703598K1104679m555014r547982m034381m995659r619226
$$ 6051781 27780171 69483769 90588448 86033434 76485452 72451071 67455412 57836186
39869E7836186o829269K546086Q226389M100714p162103j6587944j4005457O04988
$$ 57836186 51006917 53553003 61779392 65880106 58718003 42130059 28124602 28729590
39861B8729590J0816435J688508j4984384j1162558J6118133L5159094K4143944
$$ 28729590 39546025 41234533 26250149 15087591 31205724 66364818 90508762
39854I0508762L489715K582422J3486182P629226j3922338k2880036j3123274
$$ 90508762 93998477 96580899 110067081 117696307 103773969 80893933 67770659
39847F7770659r337567k0198806k1124429O43241J8840545J0050414o411539j90229
$$ 67770659 58433092 38234286 17109857 17753098 36593643 46644057 40232518 40042289
39839D0042289K0878752K6487000J3501404M822304O711610K472809j1865769
$$ 40042289 60921041 87408041 100909445 105731749 112443359 114916168 103050399
39832A03050399j8179664q065877L414523L810018J35279J299064L735316K845056
$$ 103050399 84870735 76804858 80219381 84029399 84164678 85463742 89199058 92044114
39824I2044114J088670k098176j0752695j7021177n628024J7996806K5523908
$$ 92044114 93132784 91034608 80281913 63260736 57632712 75629518 101153426
39817A01153426M395862k1087963k3471325r484952m226732j1859694j4957636
$$ 101153426 105549288 84461325 60990000 51505048 47278316 35418622 20460986
39810B0460986n959637L283635L023675j525319j816240K487110O618447O535847
$$ 20460986 14501349 17784984 20808659 19283340 17467100 19954210 26572657 33108504
39802C3108504R23920n474234k975718R827175J7856599O841337j3317566j7754223
$$ 33108504 34032424 28558190 25582472 35409647 53266246 60107583 46790017 29035794
39794B9035794j459114J1266263L07292k1053485k3837174k138157K1319767K6081034
$$ 29035794 27576680 38842943 39150235 18096750 -5740424 -7878581 13441186 39522220
39786C9522220J5124369K721805m197060m944155K278514J4249779J7364570L439149
$$ 39522220 54646589 57368394 53171334 48227179 50505693 64755472 82120042 85559191
39778H5559191j3117396j0789527O525757J1690045n245959j8916530m859729
$$ 85559191 72441795 61652268 68178025 79868070 74622111 55705581 50845852
39771E0845852K2617263K9407864R241744j0971386j1963861m970846o860802
$$ 50845852 73463115 102870979 112112723 101141337 89177476 84206630 77345828
39764G7345828j1830834k842318J7917499K6261840O089905k6755535l8709729
$$ 77345828 65514994 62672676 80590175 106852015 112941920 86186385 47476656
39757D7476656j7251109J1928851J4883264p515313k1163700n464954K0002353
$$ 47476656 30225547 42154398 57037662 49522349 28358649 22893695 42896048
39750D2896048K5747501J1299080l216505r256220j1350696p564692N629942J5118890
$$ 42896048 68643549 79942629 76726124 67469904 56119208 48554516 54184458 69303348
39742F9303348M838766j4680951j7721368l815270K386960o197726q787725L469134
$$ 69303348 74142114 59461163 41739795 37924525 40311485 34113759 25326034 28795168
39734B8795168J0996586K833640k507122P191319J1827582n946177k6292310k2477020
$$ 28795168 39791754 42625394 40118272 47309591 59137173 53190996 26898686 4421666
39726D421666l727906M233702L066177J0659373K0103097R661454j2359316j3839387
$$ 4421666 693760 4927462 7993639 18653012 38756109 48417563 36058247 22218860
39718B2218860P756715J7700844p54495k0242679j4788826J431092M035801n6666
$$ 22218860 29975575 47676419 46921924 26679245 11890419 13321511 17357312 17300646
39710A7300646Q935577K1807369J1531538j9005781l3347493j1980261J9438462
$$ 17300646 26236223 48043592 59575130 40569349 7221856 -4758405 14680057
39703A4680057K5671367P225506p417309l793245M734695L036690n408343r973987
$$ 14680057 40351424 47576930 40159621 36366376 41101071 44137761 38729418 28755431
39695B8755431r567493q001491l752605M052197P812184K372863l016276K336170
$$ 28755431 19187938 11186447 7433842 11486039 19298223 21671086 18654810 20990980
39687B0990980J1614962J0611897J750788r50082K508616k04528p408140m706172
$$ 20990980 32605942 43217839 44968627 44018545 46527161 46322633 38914493 34208321
39679C4208321M428652r87285j9606912k0562213O664887K7049270J0752612j9038875
$$ 34208321 38636973 37649688 18042776 -2519437 4145450 31194720 41947332 22908457
39671B2908457k2518661n020550k034736j6316363j4920104J2490755L5161933
$$ 22908457 389796 -4630754 -6665490 -22981853 -37901957 -25411202 9750731
39664I750731K9357802Q732518n729110j4294697k1325254j7651094k7005J3353124
$$ 9750731 39108533 47841051 42111941 27817244 6491990 -11159104 -11186109 2167015
39656B167015P437578n558063n686225M477178Q338520L610797K137757P026632
$$ 2167015 9604593 4046530 -1639695 2837483 11176003 14786800 16924557 23951189
39648B3951189Q661283K600252l797996m256919j484438K98042J747223M150829
$$ 23951189 32612472 35212724 31414728 27157809 25673371 25971413 27718636 31869465
39640C1869465N499828M473496L597908M342605K617491m917577j1269394m383236
$$ 31869465 37369293 41842789 45440697 49783302 52400793 47483216 36213822 31830586
39632C1830586J4089482K4347377J2817717n861066o576567R595557J6302341
$$ 31830586 45920068 70267445 83085162 77224096 70647529 80243086 96545427
39625I6545427K036825j3105400j0085082J818279N454873L498031O579714J0713915
$$ 96545427 98582252 85476852 75391770 77210049 82664922 86162953 92742667 103456582
39617A03456582P355520J289630j572512p807938j6882750r207184J8708103L0985580
$$ 103456582 110812102 112101732 110529220 102721282 85838532 76631348 95339451 126325031
39609A26325031J779727l3876008k6293386Q190203J0517741k3690725l5997385
$$ 126325031 128104758 94228750 67935364 76125567 86643308 62952583 26955198
39602B6955198k543255K8501393K0279341L081359J0094309J6170553r989503
$$ 26955198 24411943 52913336 73192677 76274036 86368345 102538898 92549395
39595I2549395m0483028l2208934j187706O172112q910238p965175J2472448J8556377
$$ 92549395 52066367 19857433 18669727 24841839 15931601 7966426 20438874 38995251
39587C8995251K496557p741830k048680L31807l522198P044773K9582074L1911246
$$ 38995251 41491808 33749978 31701298 32033105 28510907 35555680 65137754 97049000
39579I7049000N274456j8543422j7938554r346726q694330m972792P976734J1486954
$$ 97049000 102323456 83780034 65841480 56494754 47800424 42827632 50804366 62291320
39571F2291320k371943j0415023K44355M472444j6141857l2937127j3253633K1465944
$$ 62291320 59919377 49504354 49748709 54221153 38079296 5142169 -8111464 13354480
39563A3354480K4995249k055336j6695361l593214P084801k716094r231715O856042
$$ 13354480 38349729 36294393 19599032 16005818 23090619 20374525 11142810 17998852
39555A7998852K2481157R506477j5667712j4268285J4674392L0772143J0495622
$$ 17998852 40480009 49986486 34318774 20050489 34724881 65497024 75992646
39548G5992646k0784430k6823708q223268O834833N893731K709508P537355J0391184
$$ 75992646 55208216 28384508 20161240 26996073 32889804 35599312 43136667 53527851
39540E3527851Q91333j3040522j7420657j0518819J845865J7221156L0191568
$$ 53527851 54419184 41378662 23958005 13439186 15285051 32506207 62697775
39533F2697775K7385358N483308j5369671j4968517k152742L97414o581327l150190
$$ 62697775 90083133 95566441 80196770 65228253 63075511 63472925 56891598 53741408
39525E3741408J0804499J1607151o982092j9080011p270341R009640N269113j0081112
$$ 53741408 64545907 76153058 69170966 50090955 42820614 51830254 57099367 47018255
39517D7018255j3113724k983745K599123l32770j26720N500586O898458L535929
$$ 47018255 33904531 30920786 33519909 33187139 33060419 38561005 45459463 48995392
39509D8995392N637032J3299965J3470798J344525j1612988j4975701j0728567
$$ 48995392 54632424 67932389 81403187 82747712 71134724 56159023 45430456
39502D5430456m456522J259453K182708m654558j0336953j600660J6086760J8995921
$$ 45430456 40973934 42233387 44416095 39761537 29424584 27823924 43910684 62906605
39494F2906605k636813k7179441k8121649o897989J3605962J9380302J4490514
$$ 62906605 60269792 33090351 4968702 -1929287 11676675 31056977 45547491
39487D5547491N873332m312066j1170637p208999M996869J1312302L820467p816826
$$ 45547491 51420823 47108757 35938120 28729121 33725990 45038292 48858759 41041933
39479D1041933r793243k592362K524631J198570j41539K904695O923753R849826
$$ 41041933 31248690 28656328 31180959 32379529 32237990 35142685 42066438 51916264
39471E1916264J4532362J7778252Q314951j3312127k4379108p521968J8279985
$$ 51916264 66448626 84226878 92541829 79229702 54850594 47328626 65608611
39464F5608611J8023303p596513j8459432O401339L4386079K5930535o796824
$$ 65608611 83631914 76035401 57575969 63977308 98363387 124293922 117497098
39457A17497098k0030065m779023N160652q433229k1372946j2139990J056770
$$ 117497098 97467033 92688010 97848662 89415433 68042487 55902497 56959267
39450E6959267o889075k3708489j9682287L116461J4995069O814208Q19981R634181
$$ 56959267 50070192 26361703 6679416 9795877 24790946 31605154 32425135 42059316
39442D2059316J5652069M312781q087751m82580J6707650J6117636m158359j8064342
$$ 42059316 57711385 62024166 53936415 53453835 70161485 86279121 82120762 64056420
39434F4056420j1498172p27957l029434r784010m567702O487997L884037j1304276
$$ 64056420 52558248 51830291 48800857 39016847 34449145 40937142 44821179 33516903
39426C3516903j5838752l2269J6307637J3902611J485566k658508j153858p234191
$$ 33516903 17678151 17645882 33953519 47856130 49341696 46683188 45529330 38295139
39418C8295139j4179764l356354J8566839K1118376k956544k1468037j0023404
$$ 38295139 24115375 20759021 39325860 60444236 57487692 36019655 25996251
39411B5996251J0946501J0390736m453600n316534N819063J204247k0293033k5309157
$$ 25996251 36942752 47333488 42879888 37563354 43382417 44586664 24293631 -1015526
39403a015526N19091K6525086K1978870j229284j2530058o842679j20077K792493
$$ -1015526 -496435 26028651 48007521 46778237 34248179 27405500 27285423 30077916
39395C0077916R176898J6531549J4644910N684269J102481J078491l696553j1838894
$$ 30077916 39254814 55786363 70431273 76115542 77218023 78296514 74599961 62761067
39387F2761067j2175394m692277k226563r415441j6188588j4370670o341666L580934
$$ 62761067 50585673 45893396 43666833 34251392 18062804 3692134 -2649532 931402
39379I31402J1883878J0928643j838079j0701072K119963K5982367L0687744J0582488
$$ 931402 12815280 23743923 21905844 11204772 13324735 39307102 69994846 80577334
39371H0577334n647266Q04241J1462937M432808r142540o927521N550338O986142
$$ 80577334 74930068 75734309 87197246 91630054 82487514 75559993 81110331 88096473
39363H8096473j115816j15857P018759k890324k9085309l7436097r701017K4403664
$$ 88096473 86980657 86864800 93883559 90993235 61907926 24471829 14770812 39174476
39355C9174476K5748221j671456k1245225j6560464o536967p813565q763380O376335
$$ 39174476 64922697 63251241 42006016 25445552 18908585 11095020 2331640 8707975
39347H707975K6044476K4436216l73975k1629504j9720202n570214Q5067l476531
$$ 8707975 34752451 59188667 58814692 37185188 17464986 11894772 11979839 8503308
39339H503308j787506Q698263J5543403R316649n696037j9010887k0873248m861560
$$ 8503308 6715802 15414065 30957468 40274117 34578080 15567193 -5306055 -10167615
39331a0167615K2149233L5721891J8000024j4042800k5456200j0863974m60583
$$ -10167615 11981618 47703509 65703533 51660733 26204533 15340559 14879976
39324A4879976j1060469j9711791l633433J9663926J8778340l068454j5517032
$$ 14879976 3819507 -15892284 -19525717 138209 18916549 15848095 331063
39317C31063o611396Q076381J6225958K0517846K0642002R644759q477619j8301023
$$ 331063 -6280333 1796048 18022006 38539852 59181854 68826613 60348994 42047971
39309D2047971j3099410N14684J5522697K4409854J3037515k0678389m6546414
$$ 42047971 28948561 29463245 44985942 69395796 82433311 61754922 15208508
39302A5208508l0477559J5482419M1705878K4830332o913447j9967003j5558042
$$ 15208508 -15269051 213368 41919246 66749578 59836131 39869128 24311086
39295B4311086j0458915p638734m242351m066597m540385N761456K1190040J7075002
$$ 24311086 13852171 6213437 1971086 -2095511 -6635896 -874440 20315600 37390602
39287C7390602q286937j9511503L121243K6232526J1530219k3341846l1225797
$$ 37390602 29103665 9592162 12713405 38945931 50476150 27134304 -4091493
39280d091493n665740J6859472J5820469O724591M257122L101614j117317l580975
$$ -4091493 -9757233 7102239 22922708 29647299 33904421 37006035 35888718 32307743
39272C2307743o334686j4717318j7856912k048737J8058346J4947049n355385
$$ 32307743 25973057 11255739 -6601173 -8649910 9408436 24355485 19000100
39265A9000100r811055N546170Q244309j1739461k0613473J326840K2845314J2199785
$$ 19000100 9189045 14735215 22979524 11240063 -9373410 -8046570 14798744 26998529
39257B6998529j2094450j6315595o971322j0517666k0413537r448408J7179981
$$ 26998529 14904079 -1411516 -8382838 -18900504 -39314041 -48762449 -31582468
39250c1582468K5924281R774045j990748O022777J2170844k938508k3419739k1559890
$$ -31582468 -5658187 4115858 2125110 8147887 20318731 17380223 -6039516 -27599406
39242b7599406M216203K9848788L3350209J2862144j4388888k5908015j4171570
$$ -27599406 -23383203 6465585 39815794 52677938 38289050 12381035 -1790535
39235a790535N035540J1141731K632683o867915j0159295r941545o158227K697411
$$ -1790535 3245005 14386736 17019419 10151504 -7791 -9949336 -16107563 -13410152
39227a3410152Q707222L184242n856877l652844O218794P561795K93182o17624
$$ -13410152 -4702930 -1518688 -7375565 -11028409 -4809615 2752180 3045362 2427738
39219B427738N450769L821114m558362j879690J0293244P452990j2621412j7351747
$$ 2427738 7878507 11699621 7141259 5261569 15554813 23007803 10386391 -6965356
39211f965356O911240K4745073O177210k0699086j2123478K0223838K8041362
$$ -6965356 -54116 24690957 30868167 10169081 -1954397 18269441 46310803
39204D6310803L601118j2314202Q71313J5697337Q162452o120441n956655M44672
$$ 46310803 49911921 37597719 38469032 54166369 62328821 56208380 50251725 50696397
39196E0696397k779233r672669p785813j592090O08069M036247J1082784O509984
$$ 50696397 47917164 38244495 30458682 28866592 29474661 33510908 44593692 51103676
39188E1103676j7601849l8289030k9227677p23326J3867051M380318r049425j0776749
$$ 51103676 33501827 -4787203 -34014880 -34738206 -20871155 -16490837 -25540262 -36317011
39180c6317011n599100J80696Q915539J8005751J7101447O002302j765974k78183
$$ -36317011 -41916111 -41735415 -32819876 -14814125 2287322 8289624 6523650 6245467
39172F245467l58628r143395j4978995m325807J5673539K3551724R324198j3735383
$$ 6245467 5886839 -3256556 -18235551 -22561358 -6887819 16663905 25988103 12252720
39164A2252720k2621431p308416J8843509L1958151K2999907O312633j343090
$$ 12252720 -10368711 -17677127 1166382 33124533 56124440 62437073 61093983
39157F1093983k279363q037231j5903244j2481698J501951R052586K636852n701352
$$ 61093983 58814620 50777389 34874145 22392447 23894398 32946984 35583836 29882484
39149B9882484n721513l527663o381996q635983l607004L534472N799630N717614
$$ 29882484 24160971 20633308 14251312 5615329 2008325 5542797 11342427 17060041
39141A7060041O164967K130788o684313q019683L660537J2173918J493149j7316996
$$ 17060041 23225008 25355796 18671483 10651800 14312337 26486255 27979404 10662408
39133A0662408k1065603r244080j556241l823005p33524J3989435K3319368J2922752
$$ 10662408 -10403195 -19647275 -21203516 -25026521 -25760045 -11770610 11548758 24471510
39125B4471510o075328j3160037n528660L642388O321254O072777O080339K269144
$$ 24471510 18396182 5236145 -292515 3349873 9671127 15743904 21824243 24093387
39117B4093387q199991j7436308j2356129P969535K4699701J7274078r685043
$$ 24093387 15893396 -1542912 -13899041 -5929506 18770195 36044273 26359230
39110B6359230k7699743j8271327N338770J9033669J8355857J3786973P427149
$$ 26359230 -1340513 -19611840 -14273070 4760599 23116456 36903429 44330578
39103D4330578m666784j4045278q245231M479736M156678o349724l494763J5325169
$$ 44330578 39663794 25618516 17373285 21853021 26009699 19659975 16165212 31490381
39095C1490381K2713970N349259j3377012j2674873o746513j3129548j6207572
$$ 31490381 54204351 59553610 46176598 33501725 26755212 13625664 -2581908
39088b581908M071847K7667262J8751783j5397646l0614181j0142242J5642287
$$ -2581908 1489939 29157201 47908984 32511338 1897157 -8245085 7397202
39081G397202J9195527R151540K189815m883656j6509341j9124796l102879J5289761
$$ 7397202 26592729 35744269 37934084 33050428 16541087 -2583709 -5686588 9603173
39073I603173J5719596L472874k718028o64723j993991p498453n654700O667634
$$ 9603173 25322769 28795643 26077615 25412892 23418901 15920448 10265748 16933382
39065A6933382J8140076J7589331M196177j4411147k5567220j8448830K153222
$$ 16933382 35073458 52662789 56858966 42447819 16880599 -1568231 584991
39058E84991J4327972K893651j9267788k5484671q307078J3282767J8888175Q451386
$$ 584991 14912963 17806614 -1461174 -26945845 -35252923 -21970156 -3081981 5369405
39050E369405k445116j607794P850539J2163808L719867q235541r574555j767116
$$ 5369405 2924289 1316495 9167034 21330842 25050709 16815168 7240613 5473497
39042E473497J860146K97381O541703J9156373J5310229j2142875l2691927j7715387
$$ 5473497 7333643 7631024 14172727 33329100 48639329 36496454 3804527 -13910860
39034a3910860J4625849K3620632M325341j1450129p841902k464102p178366p124740
$$ -13910860 714989 24335621 28660962 17210833 9368931 6904829 -273537 -7398277
39026g398277P415030J8328291Q340028r794677j3081661j370800P948255O395098
$$ -7398277 16753 18345044 26685072 16890395 3808734 2437934 10386189 16781287
39018A6781287n00827m971995j469971J0522769J8696255O840340j8201157k6229246
$$ 16781287 16280460 11308465 9838494 20361263 39057518 45897858 27696701 1467455
39010A467455m935342J7557303J1807614q852256j0271648Q691512J6130856k064986
$$ 1467455 -3467887 14089416 25897030 17044774 6773126 15464638 31595494 29530508
39002B9530508k2646855k2144879p464287J596311P16389j113106R14628M311659
$$ 29530508 6883653 -15261226 -22725513 -21129202 -20412813 -21525919 -20611291 -16299632
38994a6299632O415997O175118L413419O85842J331988M098130N119984N060221
$$ -16299632 -9883635 -3708517 -295098 390744 1722732 5820862 10940846 16001067
38986A6001067P373847J0294404Q830943M233046K494667L457538O28809p595900
$$ 16001067 23374914 33669318 42500261 46733307 49227974 52685512 53314321 45718421
38978D5718421j5334311j8308108j7188047j2216718l409369M273780N017078
$$ 45718421 30384110 12076002 -5112045 -17328763 -20738132 -16464352 -11447274
38971a1447274R47116j496790j537872r92856M074291J5606685K2007338J1072688
$$ -11447274 -10500158 -11996948 -13534820 -14527676 -10453385 5153300 27160638 38233326
38963C8233326p931875j4240951p421672p450671j9531140k2870025m375032J8625261
$$ 38233326 30301451 16060500 8638828 1188157 -18342983 -41213008 -45588040 -26962779
38955b6962779K3756458J3359311L036163l153657p983192n636125P932623J8336408
$$ -26962779 -3206321 10152990 13189153 10035496 2052304 -3583821 4348802 22685210
38947B2685210P966571j5832866k6466933j1317489J5232902L0866310K5041144
$$ 22685210 30651781 14818915 -11648018 -22965507 -7732605 23133705 48174849
38940D8174849K355160k0851543k5405837p520234J3109238J4378228j595844
$$ 48174849 50530009 29678466 4272629 -3247605 9861633 24239861 22644017
38933B2644017j3824125j0376469J649644J0212395Q700282l919971j8475924
$$ 22644017 8819892 -1556577 93067 10305462 19005744 15085773 -3390151
38926c390151j5754482J0458883L4249279K4409089r210640k2744177J136900
$$ -3390151 -19144633 -8685750 25563529 49972618 40761978 18017801 19154701
38919A9154701K7442120J9281718j1040289k5210714j4578200l024692l714617
$$ 19154701 46596821 65878539 54838250 29627536 15049336 12024644 8310027
38912H310027m738499J513342M151434k194932l350669J0458303K4740180K1034121
$$ 8310027 3571528 5084870 9236304 7041372 3690703 14149006 38889186 59923307
38904E9923307M291327o711873p305318q032647j3217933j5898556j2898372r108927
$$ 59923307 64214634 57502761 50197443 42164796 28946863 13048307 149935 -8958992
38896h958992n719136J367628R218428Q225370j259783o151607J94014Q804402
$$ -8958992 -14678128 -13310500 -4092072 4133298 2873515 -3278092 -3084078 5720324
38888E720324J0980603J0105694J0241116O765513j891644o480994k149920J642426
$$ 5720324 16700927 26806621 37047737 43813250 41921606 35440612 33290692 34933118
38880C4933118j496462k419013L810277K784953j3783623k4423871q092515J5276763
$$ 34933118 33436656 31017643 34827920 37612873 23829250 -594621 -8687136 6589627
38872F589627R832927j6893439k0217823J2539337M0162885K8303710n057406
$$ 6589627 16422554 -470885 -20688708 -8149371 32013514 60317224 55259818
38865E5259818k4571675k4628182j7064589j667391K0871197K9697565J0109697
$$ 55259818 30688143 6059961 -11004628 -12672019 8199178 37896743 48006440
38858D8006440j6746470k0835896o513263O94743k400536J061446J1314900J2014405
$$ 48006440 31259970 10424074 3910811 4605554 2205018 3266464 14581364 26595769
38850B6595769L507763K923509J0495246P277978r574362j8405676o663415J2387725
$$ 26595769 30103532 33027041 43522287 50800265 41225903 22820227 16156812 28544537
38842B8544537K2987272K3366096J3522564q695284l1647476l4166197j5756381
$$ 28544537 51531809 74897905 88420469 79725185 48077709 13911512 -1844869
38835a844869q27228k787270n575774O888944K3267955K2392064L741995j3655160
$$ -1844869 -2672097 -5459367 -11035141 -4146197 19121758 41513822 45255817 31600657
38827C1600657j3139789O854811L1704123L8431672J7913577r136578j4949103
$$ 31600657 18460868 25315679 57019802 95451474 113365051 104228473 89279370
38820H9279370l062147j425144j6634165k4785356j4622945o013690j0613256
$$ 89279370 86217223 84792079 68157914 43372558 28749613 22735923 12122667
38813A2122667q474414J2860873K7679832J1515576j4555121j4965558M002059
$$ 12122667 3648253 16509126 44188958 55704534 41149413 26183855 30185914
38806C0185914P916692p533776j3049623J725145J1388118j815538j9514276j5407427
$$ 30185914 38102606 30568830 17519207 19244352 30632470 28816932 9302656 -6104771
38798f104771R493102L2090562L4036817J5613750p253316j6216651p871093L916619
$$ -6104771 3388331 35478893 69515710 85129460 77876144 61659493 53788400 57705019
38790E7705019Q873286J3245337K0812268J6757441q442545l2508573k6667259
$$ 57705019 66578305 79823642 100635910 117393351 108950806 76442233 49774974
38783D9774974N97682J5352192Q971488L894915R616305R913927J61763k92515
$$ 49774974 50372656 65724848 74696336 78591251 88207556 98121483 98283246 97990731
38775I7990731J3468417J6759976k111538j6752262m652474J4820263J3477976
$$ 97990731 111459148 128219124 126107586 109355324 104702850 119523113 133001089
38768A33001089L87719J069530J0046471K609203j6976023j9201301P3538J0682889
$$ 133001089 133388808 134458338 144504809 147114012 130137989 110936688 111010226 121693115
38760A21693115l425936k0226070j6701655k052956K792453k929737o866969o224078
$$ 121693115 118267179 98041109 81339454 79286498 82078951 79149214 72282245 66058167
38752F6058167m705064J084233J3158733J8308420K291140k5104444l6879865
$$ 66058167 61353103 62437336 75596069 93904489 96195629 71091185 34211320
38745C4211320k1770715L845750J8815504J8581391J0067717j497787j2531061
$$ 34211320 12440605 16286355 35101859 53683250 63750967 62253180 49722119
38738D9722119j7168652j3465657r173140j2503944j8690807j3583760P561976
$$ 49722119 32553467 19087810 9914670 -2589274 -21280081 -34863841 -27301865
38731b7301865K9689395L0635091N758993k1777452k1689321P814290L2295887
$$ -27301865 2387530 33022621 38781614 17004162 -4685159 3129131 35425018
38724C5425018K0551357j3362327k6426709n542635J5125102O491349j3237088
$$ 35425018 55976375 42614048 16187339 10644704 25769806 32261155 19024067
38717A9024067j2247629K665148K687644r119887l640479J7843275J9664790o661114
$$ 19024067 6776438 9441586 12129230 3009343 -631136 17212139 36876929 30215815
38709C0215815k2670299m598106J7603049J1687299m403484J162884J6350698
$$ 30215815 7545516 2947410 20550459 32237758 27834274 28997158 45347856
38702D5347856Q080661j8131116k7307170j1610831N546182J3161709J7735252
$$ 45347856 53428517 35297401 7990231 -3620600 1925582 15087291 32822543
38695C2822543J2558126j2115194l2654047j5698881K0832746K3717565j1007444
$$ 32822543 45380669 33265475 611428 -15087453 5745293 29462858 18455414
38688A8455414k6674332L015402L0392262J2718699j9405227j6623928J0033056
$$ 18455414 -8218918 -5203516 25188746 37907445 18502218 1878290 11911346
38681A1911346J6513488N20230o277168r68526r153866l0170643l3512003j0932498
$$ 11911346 28424834 28945064 22667896 21699370 12545504 -17625139 -51137142 -62069640
38673f2069640J1066106J5251989J3040203J4461486J2220172K964549l889201
$$ -62069640 -51003534 -35751545 -22711342 -8249856 3970316 6934865 3045664
38666C045664m876305n855094m531935N740761J5181575Q083568o480561n057465
$$ 3045664 -1830641 -7685735 -12217670 -6476909 8704666 16788234 10307673 5250208
38658E250208Q309726N127811j7461006k6668433o321363J6212525J3208667m671932
$$ 5250208 13559934 18687745 1226739 -25441694 -31763057 -15550532 -2341865 -7013797
38650g013797j3485999j1665235p785458J732049J7405626K1339713L934386j2905594
$$ -7013797 -20499796 -32165031 -39950489 -38218440 -20812814 526899 4461285 -8444309
38642h444309o884769P212948J151421j9265305k3231202l800566J5433787K0441493
$$ -8444309 -15329078 -8116130 -6964709 -26230014 -49461216 -53261782 -37827995 -17386502
38634a7386502K1461886K4649895J9505634L321610q078473o100564l977059j2108352
$$ -17386502 4075384 28725279 48230913 51552523 43474050 37373486 33396427 21288075
38626B1288075j8309172r289765L922277J983739j1092984j3364964J225727J4756467
$$ 21288075 2978903 -6310862 -2388585 -404846 -11497830 -24862794 -23637067 -8880600
38618h880600J3725269P032608O751119O260902o640436k3058699j9793114N283334
$$ -8880600 4844669 11877277 18628396 24889298 18248862 -4809837 -24602951 -19319617
38610a9319617K4224280J6126200k734238l835134R334038P250178j6206577k8665713
$$ -19319617 4904663 21030863 18296625 14461491 23795529 31045707 14839130 -13826583
38602a3826583o016272K8867249L5656517J1047969j1043357q696112L724764
$$ -13826583 -19842855 9024394 44680911 55728880 44685523 35989411 39714175
38595C9714175M009311p303229j5535953j5203748j0632038l087047P410613J2064250
$$ 39714175 43723486 36420257 20884304 5680556 -4951482 -8038529 -627916 11436334
38587A1436334J160546j6819958j9202507M26098J8221149R555728j5219268k2410667
$$ 11436334 12596880 -4223078 -23425585 -22999487 -4778338 4777390 -10441878 -32852545
38579c2852545k051716J7035174Q371290j4387484j8841678r83879J2811802P637829
$$ -32852545 -34904261 -17869087 -9497797 -23885281 -42726959 -43710838 -30899036 -23261207
38571b3261207j313562K352895J0920941Q493716l849730j3153780j3944619r088862
$$ -23261207 -24574769 -22221874 -11300933 -2807217 -6656947 -19810727 -33755346 -42844208
38563d2844208J23587J1570699J6542831R419355j056543j620423P561309J4573517
$$ -42844208 -42720621 -31149922 -14607091 -5187736 -6244279 -7864702 -303393 14270124
38555A4270124J1844998J445005j1249986j9384466j4922014J463016J4364969
$$ 14270124 26115122 27560127 16310141 -3074325 -17996339 -16533323 -2168354
38548b168354R795765m589162q010666M845570J6528216J0783370p349385k0342925
$$ -2168354 7627411 3038249 -4972417 -126847 16401369 27184739 19835354 -507571
38540e07571j8819260p579009L752928R887954J0526254O075956l625549j4635780
$$ -507571 -19326831 -26905840 -23152912 -13264958 -2738704 3337252 -288297 -14924077
38532a4924077j6938070m601988J2742946J8410937J0521773L751774N312890
$$ -14924077 -31862147 -36464135 -23721189 -5310252 5211521 8963295 14276185
38525A4276185L997026p740988j6368881p392430R326859J3288121M091251k068880
$$ 14276185 18273211 10532223 -5836658 -13229088 -3902229 9385892 13477143 11408263
38517A1408263j633997p010055k0277232k4814297r018035J6958083L3602890
$$ 11408263 9774266 2764211 -17513021 -42327318 -51345353 -34387270 -784380
38510g84380L0116641Q812540j6427956k6144779j3087405O092393J0005441P45865
$$ -784380 29332261 38144801 21716845 -4427934 -17515339 -11422946 -1417505 -671640
38502f71640k868330L865655Q454914O856245P004512N267701j1628411l3902526
$$ -671640 -3539970 325685 8780599 15636844 22641356 27909057 16280646 -17621880
38494a7621880k9174411Q752313M0183593L0673395j808464j6308553n853781
$$ -17621880 -46796291 -38043978 2139615 32813010 31004546 14695993 8842212
38487H842212M146849M97401o384502r458854j3458300j6307152q220788P137657
$$ 8842212 12989061 13486462 7101960 -2356894 -15815194 -32122346 -40343134 -33205477
38479c3205477J2537294L215754n419801j554916P546420R919175N657784K876768
$$ -33205477 -20668183 -17452429 -22872230 -24427146 -16880726 -6961551 -1303767 1573001
38471A573001N899841J1654212J2092358R52371j5654149k0487521o656905Q863205
$$ 1573001 7472842 19127054 31219412 32171783 16517634 -3969887 -10626792 -1763587
38463a763587O439251q238014j3887172n425756L684824O686706Q509393P377904
$$ -1763587 4675664 -3562350 -17449522 -22875278 -19190454 -12503748 -3994355 3383549
38455C383549l051161j1892717o3354K2674238K1000660j1956045l5160967j6521887
$$ 3383549 332388 -11560329 -11623683 11050555 32051215 20095170 -15065797 -31587684
38447c1587684J8246153K3417442q53917j5684055m699481R259152O971148k405111
$$ -31587684 -13341531 10075911 9221994 -6462061 -11161542 -1902390 5068758 2663647
38439B663647n497654m464960l115435K183656P496536j46021j7580146k0737408
$$ 2663647 -2834007 -7298967 -10414402 -8230746 -734210 -880231 -18460377 -39197785
38431c9197785L24320K1638922J8250741o02031r646850n927792m780403p783265
$$ -39197785 -38873465 -17234543 1016198 414167 -9232683 -15160475 -19940878 -27724143
38423b7724143k065948J1300646J4813116L958609l982129K183045J0526502O576178
$$ -27724143 -29790091 -18489445 -3676329 282280 -3699849 -1516804 9009698 15585876
38415A5585876n188785j1366077q472262j267943O688897J0314287J081333k0078555
$$ 15585876 10397091 -968986 -9441248 -10709191 -4020294 6293993 7375326 -12703229
38407a2703229l5310088k7398621j198120K1159440K3180740O808398j1637910
$$ -12703229 -48013317 -75411938 -76610058 -55450618 -32269878 -25461480 -37099390
38400c7099390j3439464N956054K6601761K1403352q334842k8104178j2845067
$$ -37099390 -50538854 -44582800 -17981039 3422313 -4912529 -33016707 -45861774
38393d5861774J9304664L2251992J8705856J377771l317412M14185M566053M910964
$$ -45861774 -26557110 5694882 24400738 25778509 22461097 22875282 27441335 32352299
38385C2352299n404888k5754798l3587112p690961L2434832M1163309Q790036
$$ 32352299 26947411 1192613 -32394499 -40085460 -7650628 33512681 42302717
38378D2302717k1868983j5377782R535724J4778284j231084j1309617o186169
$$ 42302717 20433734 5055952 14591676 29369960 28138876 16829259 10643090
38371A0643090k083597q297619j4719916j1761045k241994P413747J2509049Q160938
$$ 10643090 8559493 261874 -14458042 -26219087 -28461081 -21047334 -8538285 -377347
38363c77347m041231j0775620k301024J1212016J2957997L829641k404212k633171
$$ -377347 -4418578 -15194198 -17495222 -6283206 6674791 10504432 8100220 5467049
38355E467049m283766n323213M202135J9765026K2448854O558709j0677032j3598590
$$ 5467049 1183283 -4139930 62205 19827231 42276085 48834794 38157762 24559172
38347B4559172p032153l687143o189726r397971r394604l110139J0802229K3998527
$$ 24559172 17527019 13839876 7650150 -1747821 -11142425 -14252564 -3450335 20548192
38339B0548192K1416717L90535k1038881k3464921q861554L322915p310j1741082
$$ 20548192 41964909 42355444 21316563 -2148358 -11009912 -7686997 -7694307 -19435389
38331a9435389j4505584j480406J4731837J6189031J592459j2334999j3167511
$$ -19435389 -33940973 -35421379 -20689542 -4500511 -2908052 -15243051 -28410562
38324b8410562o432833j206262N142721J5562029J8794820M995453j1695425q199385
$$ -28410562 -34843395 -36049657 -30906936 -15344907 3449913 8445366 -3250059 -11449444
38316a1449444J2279080K2745367J1781331k331792k551010L882951L485867j541675
$$ -11449444 829636 23575003 35356334 33024542 30473532 34356483 37842350 36300675
38308C6300675k805980k504149o810899j2968728j5042770j3992270j1997414
$$ 36300675 33494695 30990546 24179647 11210919 -3831851 -17824121 -29821535
38301b9821535n407903P007991J7029039J7578967J2838801R390225N441209k167450
$$ -29821535 -35229438 -28221447 -11192408 6386559 19225360 28615585 34056794 31889344
38293C1889344q316619p190852l276791m876668j1135240j4114731j0232746k702295
$$ 31889344 23572725 16381873 13105082 8228414 -2906826 -17021557 -27254303 -29956598
38285b9956598M019096O885646N212864K851442M609144P821808M173460p024962
$$ -29956598 -25937502 -19051856 -13838992 -10987550 -6378406 1443402 5616862 -1408100
38277a408100j5007601j0930981J668414J2457203J3507064K735289j2368166
$$ -1408100 -16415701 -27346682 -25678268 -13221065 285999 3021288 -9346878
38270i346878j5252034K425514K3852055K3159632K65917j8234557j6252404n798059
$$ -9346878 -24598912 -22173398 1678657 24838289 25104206 6869649 -9382755 -15180814
38262a5180814j729707j913576k081874o411845j0351670J949372K6422718L2014479
$$ -15180814 -16910521 -18824097 -20905971 -27317816 -37669486 -35720114 -9297396 22717083
38254B2717083P058233j4287462j286133K2616526J5311986j7141973l2404044
$$ 22717083 29775316 15487854 14201721 36818247 52130233 34988260 2584216
38247B584216j9036787n310927m054731L018613J9456191J9549412m234745k0757991
$$ 2584216 -16452571 -21763498 -25818229 -22799616 -3343425 16205987 11971242 -8786749
38239h786749r030568Q379649O115421k045373P496354K3385448J8764650k324153
$$ -8786749 -17817317 -9437668 -3322247 -5367620 2128734 25514182 44278832 41954679
38231D1954679j3030914p369618k549322m041608r54884N362925R9571j3871699
$$ 41954679 28923765 21554147 19004825 14963217 14008333 19371258 19470829 5599130
38223E599130j3765593N054081J6059806J050165k0174347j8507766L001268J7874321
$$ 5599130 -8166463 -3112382 12947424 13997589 -6176758 -24684524 -21683256 -3808935
38215c808935J5592864R179998P345846K345914r955329j7224983q451242P760884
$$ -3808935 11783929 20963927 28309773 30655687 20700358 3475375 -4975867 2785017
38207B785017J4427182Q324993j16888l924216n015636n191230l768332m401848
$$ 2785017 17212199 25537192 25420304 21496088 16480452 11289222 7520890 3119042
38199C119042j2193575k0911305j4736779J0373859L5562812L7575162J4013834
$$ 3119042 -9074533 -29985838 -44722617 -34348758 1214054 38789216 52803050
38192E2803050j5415031k8466713j7525160N794846J8254435N355301j9401320
$$ 52803050 37388019 8921306 -8603854 -2809008 15445427 20800728 1399408
38185A399408k4966414j325271K3200364J7256588j0276406k2218429m688026
$$ 1399408 -23567006 -24892277 -1691913 15564675 5288269 -16930160 -21618186
38178b1618186J6339739J4736405j483138q461831k749504o26602q440055j3015027
$$ -21618186 -5278447 9457958 7974820 -487011 -3236515 -3863117 -12303172 -25318199
38170b5318199l996155Q993158R958467m90915o520218m72091N950973J07606
$$ -25318199 -29314354 -20321196 -10362729 -10853644 -17373862 -17845953 -11894980 -11787374
38162a1787374r910901m793576J5613125K6432632R797494j8806646k8437232
$$ -11787374 -21698275 -26491851 -10878726 15553906 25351400 6544754 -21892478
38155b1892478j0461706J4594904K4998687J9317761R107489J975217l055226
$$ -21892478 -32354184 -17759280 7239407 26557168 35664657 37639874 34584648
38148C4584648r640077j7736770k1372720j3749818K770987J5422355J4559330
$$ 34584648 24944571 7207801 -14164919 -27914737 -25143750 -9721395 4837935
38141D837935M703200k896530l754633n87777L209384L535295l221429j0677864
$$ 4837935 9541135 6644605 2889972 2302195 5511579 9046874 5825445 -4852419
38133d852419m110239J6950854K9187180J4767070j0387716j7902045p239700
$$ -4852419 -8962658 7988196 37175376 51942446 41554730 23652685 16412985
38126A6412985K33403K33560O994035J6483633M896451k6029616l8321794j2968127
$$ 16412985 16646388 16879948 23873983 40357616 45254067 19224451 -19097343 -32065470
38118c2065470J5350094P492976k0158993k0779809J0810280L0255777R390718
$$ -32065470 -16715376 -9222400 -29381393 -50161202 -39350922 -9095145 295573
38111B95573k4564534k8934339j161086K4181945K2229277L293039p445984j943707
$$ 295573 -24268961 -53203300 -54364386 -30182441 -7953164 -4660125 -12106109 -14049816
38103a4049816O262460M581570j940096j042611O892888R864138L237789l999810
$$ -14049816 -7787356 -3205786 -5145882 -6188493 704395 10568533 13806322 9806512
38095I806512l974557J51150K929116M867462O614465M384645k769798r016532
$$ 9806512 5831955 5983105 8912221 13779683 20394148 24778793 22008995 12992463
38087A2992463r823976o274838J018492J1676937J7236114P695853r007593j1299090
$$ 12992463 3168487 -3106351 -2087859 9589078 26825192 34521045 25513452 14214362
38079A4214362L798719J1152049o400556k9826728k9773091o701715J5281506
$$ 14214362 18013081 29165130 22764574 -7062154 -36835245 -43536960 -28255454
38072b8255454K3944114K5571425K2581359Q913452j1233198k0550758j0368867
$$ -28255454 -4311340 21260085 43841444 52754896 41521698 20970940 10602073
38065A0602073P624528J5861863R080927l152612o658837K546417J0782120J829837
$$ 10602073 18226601 34088464 43169391 40016779 33357942 35904359 46686479 48516316
38057D8516316j7734272k3424018r845084j401808j1461722j6048711N909176
$$ 48516316 30782044 7358026 -2487058 -3888866 -15350588 -31399299 -25490123
38050b5490123K9929581K1039607n379946m304844K3536512K8990326n202235
$$ -25490123 4439458 25479065 20099119 15794275 39330787 68321113 63118878
38043F3118878l3263901j7066275J7410763K5267614P354023o911761j2345857
$$ 63118878 29854977 12788702 30199465 55467079 62821102 55909341 43563484
38036D3563484k2288920k9568955j6240808P023194J1844768k27322R00456K1985954
$$ 43563484 21274564 -8294391 -24535199 -17512005 -5667237 -5894559 -4994103 16991851
38028A6991851L2407861J2429868j5591673k0402145l260308J1285544J0096203
$$ 16991851 49399712 61829580 46237907 25835762 22575454 33860998 43957201
38021D3957201L71867o434709o304406l060162m129644j1297461j4531058m164590
$$ 43957201 44329068 37894359 31589953 28529791 24400147 13102686 -1428372 -5592962
38013e592962J0992927J1842219k547836j1714645n050093K120797n023442j5296092
$$ -5592962 5399965 17242184 14694348 2979703 -2070390 50407 -4973035 -20269127
38005b0269127r117432J0108198K0787662J3513359m6102o396145m385335j99560
$$ -20269127 -29386559 -19278361 1509301 15022660 14976558 8580413 4195078 3995518
37997C995518J414374N08831K091445R516849J4472468L892283j6425922k0620245
$$ 3995518 5409892 5918723 8010168 17527017 31999485 35891768 19465846 -1154399
37989a154399O13491J8721252N515461k0826477j9473543R417583K2711773J753317
$$ -1154399 -540908 18180344 23695805 2869328 -16604215 -7186632 15525141 17278458
37981A7278458j7287866j69318L0900430K9612415p560922l8969694l3841997
$$ 17278458 -9408 -178726 30721704 60334119 52773197 13803503 -20038494
37974b0038494l221521K2429824K4100245L208594k1815728k7645576q915931
$$ -20038494 -23260015 -830191 23270054 26478648 4662920 -22982656 -31898587
37967c1898587J3258854J7876250J1806887J4433844K3077023J7157191n764220
$$ -31898587 -18639733 -763483 11043404 25477248 48554271 65711462 59947242
37960E9947242k3074554k0124178q531465m842103r077375j2088190r335237p30157
$$ 59947242 36872688 16748510 8217045 3374942 -5702433 -17790623 -27125860 -27856017
37952b7856017J0500740J4629583M164850j1544680j4559310l144167O995295
$$ -27856017 -17355277 -2725694 1439156 -10105524 -24664834 -27809001 -20813706
37945b0813706P453792N538299O277343N556728L858198N937748M447129j1492966
$$ -20813706 -13359914 -7821615 -1544272 4012456 7870654 13808402 18255531 6762565
37937F762565k7858694j6243881J8002116L1939302O447244k2359568j8036135
$$ 6762565 -21096129 -37340010 -19337894 12601408 19048652 -3310916 -21347051
37930b1347051J912405L24166j7341738j6214461Q165316K5531312K0425304P613862
$$ -21347051 -19434646 -19110480 -36452218 -52666679 -44501363 -18970051 1455253 9069115
37922I069115p41147p942684j1189637p16635J4668929J2077876q670994k1231477
$$ 9069115 8327968 385284 -10804353 -11520988 3147941 15225817 6554823 -14676654
37914a4676654j3110064j850704j422474l19114J2584575K4192458J6587336o139248
$$ -14676654 -27786718 -29637422 -31059896 -31379010 -18794435 5398023 21985359 15846111
37906A5846111k4655108k5548128p526079J8763089L1093625J4172920j5067826
$$ 15846111 -8808997 -34357125 -41883204 -23120115 7973510 22146430 7078604
37899G078604k1071235K817990K3250093J5045506m919667j0257431o681015j4459715
$$ 7078604 -13992631 -11174641 12075452 27120958 22201291 11943860 5262845 -9196870
37891i196870k7677830k2918757l84322J4294739Q831646j375825j216494M282263
$$ -9196870 -36874700 -59793457 -60177779 -45883040 -37051394 -38427219 -39643713 -35361450
37883c5361450M930676K341814L155277P500525J1496256J2711659R116825Q75162
$$ -35361450 -30430774 -28088960 -24933683 -17433158 -5936902 6774757 15891582 16766744
37875A6766744m955928j499535M489231j257722j6888770k1332997m067614J5377764
$$ 16766744 11810816 10311281 14800512 13542790 -3345980 -24678977 -28746591 -13368827
37867a3368827J2766990m989278r108939P876270K0506205R438589q620649p257449
$$ -13368827 -601837 -5591115 -14700054 -6823784 13682421 23121010 14500361 7242912
37859G242912P715836P115094j5011586l0253983j7928168N085565J1085079N91900
$$ 7242912 14958748 22073842 7062256 -23191727 -41119895 -36034330 -24949251 -24357351
37851b4357351m502095L714713J1274493O588704m965112j1707444q300325K954428
$$ -24357351 -28859446 -25144733 -13870240 -7281536 -12246648 -23954092 -32254417 -29299989
37843b9299989J3755466J3883192K465296p701194n783900K294881M961406L880774
$$ -29299989 -15544523 -1661331 803965 -6897229 -12681129 -10386248 -5424842 -1544068
37835a544068P928647J4324254J2213766J725324o721844r459248j0021210o304736
$$ -1544068 6384579 20708833 32922599 34647923 27926079 18466831 8445621 2140885
37827B140885M793699J3293958O814992o579537p570546L408761P434757n53406
$$ 2140885 6934584 20228542 27043534 20463997 12893451 16302212 23736969 23183563
37819B3183563o129405m377243o753719j3377551p827396J0461024J8004719N375000
$$ 23183563 17054158 12676915 5923196 -7454355 -15281751 -4820727 13183992 18558992
37811A8558992n119541K742946J1424754J591193j3507854j1223542L601621J1267988
$$ 18558992 13439451 16182397 27607151 29198344 15690490 4466948 8068569 19336557
37803A9336557R297694O004112j600484j6607157k3993068j1557911M659788M554774
$$ 19336557 28634251 34638363 33037879 16430722 -7562346 -19120257 -14460469 -9905695
37795i905695q05502R354319K2274405R261223k0328833k6050531J61165K0092739
$$ -9905695 -10711197 -1356878 20917527 30178750 9849917 -16200614 -16039449 4053290
37787D053290R406509q387936o147591M782467K252824n813785N55128J3677006
$$ 4053290 13459799 5071863 -1075728 3706739 5959563 145778 700906 14377912
37779A4377912R558650j0213645j9049831o885073O311859M149244k321935L576586
$$ 14377912 23936562 13722917 -5326914 -12211987 -5900128 -1750884 -4072819 -496233
37771d96233J5263973J3065391m122728j5312036p159827P803272J0554519J960121
$$ -496233 14767740 27833131 23710403 8398367 1238540 9041812 19596331 21556452
37763B1556452l019029r99486l364553j3531064j8113966p419873Q966985J6006211
$$ 21556452 18537423 17537937 14173384 642320 -17471646 -24891519 -15924534 81677
37755H1677J1633017K636858o927226j3348888j0166243J057825O802436L26953
$$ 81677 11714694 14351552 7424326 -5924562 -16090805 -15032980 -8230544 -7903591
37747g903591n984777j19144Q993021O624694k323483k234108O590194J0675515
$$ -7903591 -13888368 -14007512 -5014491 1610203 -713280 -2947388 3642806 14318321
37739A4318321P463803N842038O339199K088942k970682Q71959P115913K075j5484680
$$ 14318321 21782124 27624162 33963361 36052303 33081621 33953580 41069493 41071568 25586888
37730B5586888j6229136J431969J2824944L153130j0380277q798165j349368o480433
$$ 25586888 9357752 10789721 23614665 26767795 16387518 7589353 6239985 -240448
37722b40448j9654007k1122156o015457J1849722K0381970J8495415J0087903
$$ -240448 -19894455 -41016611 -47032068 -35182346 -14800376 3695039 13782942
37715A3782942J964991L023247J2936944J6071910j25437k3412230k7443527n364315
$$ 13782942 15747933 18771180 31708124 47780034 47654597 24242367 -3201160 -8565475
37707h565475J9610021K1870108K704974j4908722j5373759n043805K643290O473507
$$ -8565475 11044546 32914654 35619628 20710906 5337147 293342 2936632 9410139
37699I410139J2971860J8083841Q909187j2546970k3636883j1070649O586894
$$ 9410139 22381999 40465840 49375027 36828057 13191174 2120525 8707419
37692H707419L944896j3227074j7246794j359373J2172157Q991138J240739M32952
$$ 8707419 12652315 -574759 -17821553 -19180926 -7008769 1982369 3223108 3656060
37684C656060k514514j4142100j7927580K03193K1743369J7755662p037528k0015956
$$ 3656060 1141546 -13000554 -30928134 -30724941 -8981572 8774090 1736562 -18279394
37676a8279394q968159L794496J911248J280894J8394679L4702482K0722675j3785547
$$ -18279394 -27247553 -23453057 -21541809 -20260915 -1866236 32836246 53558921 39773374
37668C9773374k5918104o65211K4150697J1406690k0687937k5902301J107624
$$ 39773374 13855270 13190059 37340756 48747446 28059509 2157208 3264832
37661C264832J8427926O07082k6125425k6305586m083577J2283363J3676412J1967182
$$ 3264832 21692758 22299840 -3825585 -30131171 -34214748 -21931385 -8254973 3712209
37653C712209J1921137P684837J092102K97341L181200J419919k579475p32006
$$ 3712209 15633346 23318183 24410285 24707626 27888826 29308745 26729270 25997264
37645B5997264L854430L297360J654148N246397M175087j2513831k9854298k3025939
$$ 25997264 29851694 33149054 34803202 40049599 44224686 31710855 1856557 -21169382
37637b1169382K714029J7653549J2895479Q678437J4174956J2317747n476473
$$ -21169382 -18455353 -801804 12093675 20772112 34947068 47264815 41788342
$$ [...]
##END NTUPLES=NMR SPECTRUM
##END=
