##TITLE=31Pdec_LR-0154_OMe-CH2Cl2-TFA
 CD3CN+TFA, 64 sc
 22.2.2023
##JCAMPDX= 6.0         $$ Bruker NMR JCAMP-DX V2.0
##DATA TYPE= NMR SPECTRUM
##DATA CLASS= NTUPLES
##ORIGIN= UXNMR, Bruker Analytische Messtechnik GmbH
##OWNER= root
$$ XWIN-NMR		Version 3.5
$$ Wed Feb 22 15:56:37 2023 Russian Standard Time (UT+4h)  she@DPX200
##.OBSERVE FREQUENCY= 81.013821
##.OBSERVE NUCLEUS= ^31P
##.ACQUISITION MODE= SIMULTANEOUS
##.ACQUISITION SCHEME= undefined
##.AVERAGES= 64
##.DIGITISER RES= 16
##SPECTROMETER/DATA SYSTEM= spect
##.PULSE SEQUENCE= zgpg30
##.SOLVENT NAME= CD3CN
##.SHIFT REFERENCE= (INTERNAL, CD3CN, 0, 248.564)
##AUDIT TRAIL= $$ (NUMBER, WHEN, WHO, WHERE, WHAT)
$$ ##TITLE= Audit trail, XWIN-NMR		Version 3.5
$$ ##JCAMPDX= 5.01
$$ ##ORIGIN= Bruker BioSpin GmbH
$$ ##OWNER= she
$$ F:/spectra/data/she/nmr/P31/1/pdata/1/auditp.txt
$$ ##AUDIT TRAIL=  $$ (NUMBER, WHEN, WHO, WHERE, WHAT)
(   1,<2023-02-22 15:55:28.26 +0400>,<she>,<DPX200>,
      <continue with go, POWCHK disabled, PULCHK disabled
       configuration hash MD5:
       00 E9 B6 7A A2 85 ED C7 34 08 36 98 17 FE 4E 26
       data hash MD5: 32K
       04 86 79 EA CD 0E C3 C6 83 F7 0F E2 68 FC 75 2A>)
(   2,<2023-02-22 15:55:36.21 +0400>,<she>,<DPX200>,
      <Start of raw data processing
       efp BC_mod = 2 LB = 1 FT_mod = 6 PKNL = 1 PHC0 = -11026.84 PHC1 = 182.4102 SI = 64K 
       data hash MD5: 64K
       C4 27 2B 0B 67 7F 5C 43 7A FC 82 37 7E 1F 6A 46>)
(   3,<2023-02-22 15:55:47.25 +0400>,<she>,<DPX200>,
      <pk PHC0 = -6.947451 PHC1 = 0 
       data hash MD5: 64K
       2B 41 98 93 9C 69 C3 3A CC CA C1 1D E0 6D EF 9A>)
$$ ##END=
$$ 
$$ hash MD5
$$ 3C 8D 0F 11 9F 95 D8 60 16 75 CE 02 1A 26 7B 28
##$RELAX= 
##$RELAX= 
##$RELAX= 
##$RELAX= 
##$RELAX= 
##$RELAX= 
##$RELAX= 
##$RELAX= 
##$RELAX= 
$$ Bruker specific parameters
$$ --------------------------
##$DU= <F:/spectra>
##$EXPNO= 1
##$NAME= <P31>
##$PROCNO= 1
##$TYPE= <nmr>
##$USER= <she>
##$AMP= (0..31)
100 100 100 100 100 100 100 100 100 100 100 100 100 100 100 100 100 100 
100 100 100 100 100 100 100 100 100 100 100 100 100 100 
##$AQSEQ= 0
##$AQ_mod= 1
##$AUNM= <au_zg>
##$AUTOPOS= <>
##$BF1= 81.014009
##$BF2= 200.13
##$BF3= 200.13
##$BF4= 200.13
##$BF5= 200.13
##$BF6= 200.13
##$BF7= 200.13
##$BF8= 200.13
##$BYTORDA= 1
##$CFDGTYP= 0
##$CFRGTYP= 5
##$CHEMSTR= <none>
##$CNST= (0..31)
1 1 145 1 1 1 1 1 1 1 1 1 1 1 1 1 1 1 1 1 1 1 1 1 1 1 1 1 1 1 1 1 
##$CPDPRG= <waltz16>
##$CPDPRG1= <>
##$CPDPRG2= <waltz16>
##$CPDPRG3= <>
##$CPDPRG4= <mlev>
##$CPDPRG5= <mlev>
##$CPDPRG6= <mlev>
##$CPDPRG7= <mlev>
##$CPDPRG8= <mlev>
##$CPDPRGB= <>
##$CPDPRGT= <>
##$D= (0..31)
0 1 0 0 0 0 0 0 0 0 0 0.03 2e-05 3e-06 0 0 0 0 0 0 0 0 0 0 0 0 0 0 0 0 
0 0 
##$DATE= 1677066824
##$DBL= (0..7)
120 120 120 11 120 120 24 19 
##$DBP= (0..7)
150 150 150 150 150 150 150 150 
##$DBP07= 0
##$DBPNAM0= <>
##$DBPNAM1= <>
##$DBPNAM2= <>
##$DBPNAM3= <>
##$DBPNAM4= <>
##$DBPNAM5= <>
##$DBPNAM6= <>
##$DBPNAM7= <>
##$DBPOAL= (0..7)
0.5 0.5 0.5 0.5 0.5 0.5 0.5 0.5 
$$ [...]
##$SUBNAM2= <"">
##$SUBNAM3= <"">
##$SUBNAM4= <"">
##$SUBNAM5= <"">
##$SUBNAM6= <"">
##$SUBNAM7= <"">
##$SUBNAM8= <"">
##$SUBNAM9= <"">
##$SW= 501.771253377433
##$SWIBOX= (0..15)
0 1 3 0 0 0 0 0 0 0 0 0 0 0 0 0 
##$SW_h= 40650.406504065
##$TD= 32768
##$TD0= 1
##$TE= 0
##$TE2= 300
##$TE3= 300
##$TEG= 300
##$TL= (0..7)
0 120 53 12 22 120 120 120 
##$TP= (0..7)
150 150 150 150 150 150 150 150 
##$TP07= 0
##$TPNAME0= <>
##$TPNAME1= <>
##$TPNAME2= <>
##$TPNAME3= <>
##$TPNAME4= <>
##$TPNAME5= <>
##$TPNAME6= <>
##$TPNAME7= <>
##$TPOAL= (0..7)
0.5 0.5 0.5 0.5 0.5 0.5 0.5 0.5 
##$TPOFFS= (0..7)
0 0 0 0 0 0 0 0 
##$TUNHIN= 0
##$TUNHOUT= 0
##$TUNXOUT= 0
##$USERA1= <user>
##$USERA2= <user>
##$USERA3= <user>
##$USERA4= <user>
##$USERA5= <user>
##$V9= 5
##$VALIST= <valist>
##$VCLIST= <CCCCCCCCCCCCCCC>
##$VD= 0
##$VDLIST= <DDDDDDDDDDDDDDD>
##$VPLIST= <PPPPPPPPPPPPPPP>
##$VTLIST= <TTTTTTTTTTTTTTT>
##$WBST= 1024
##$WBSW= 4
##$XGAIN= (0..3)
0 0 0 0 
##$XL= 0
##$YL= 0
##$YMAX_a= 2280
##$YMIN_a= -2280
##$ZGOPTNS= <>
##$ZL1= 120
##$ZL2= 120
##$ZL3= 120
##$ZL4= 120
##$ABSF1= 0
##$ABSF2= 0
##$ABSG= 0
##$ABSL= 0
##$ALPHA= 0
##$AQORDER= 0
##$ASSFAC= 0
##$ASSFACI= 0
##$ASSFACX= 0
##$ASSWID= 0
##$AUNMP= <proc_1d>
##$AZFE= 0.1
##$AZFW= 0.5
##$BCFW= 0
##$BC_mod= 2
##$BYTORDP= 0
##$COROFFS= 0
##$CY= -3
##$DATMOD= 1
##$DC= 0
##$DFILT= <>
##$DTYPP= 0
##$F1P= 0
##$F2P= 0
##$FCOR= 1
##$FTSIZE= 65536
##$FT_mod= 6
##$GAMMA= 0
##$GB= 0
##$INTBC= 1
##$INTSCL= 6.047779e-11
##$ISEN= 30
##$LB= 1
##$LEV0= 0
##$LPBIN= 0
##$MAXI= 10000
##$MC2= 0
##$MEAN= 0
##$ME_mod= 0
##$MI= 50
##$NCOEF= 0
##$NC_proc= -8
##$NLEV= 6
##$NOISF1= 182.463
##$NOISF2= 159.3651
##$NSP= 0
##$NTH_PI= 0
##$NZP= 0
##$OFFSET= 248.5645
##$PC= 4
##$PHC0= -11033.79
##$PHC1= 182.4102
##$PH_mod= 1
##$PKNL= yes
##$PPARMOD= 0
##$PSCAL= 0
##$PSIGN= 0
##$REVERSE= no
##$SF= 81.0140089999694
##$SI= 65536
##$SIGF1= 159.3651
##$SIGF2= -187.1042
##$SINO= 113.3802
##$SIOLD= 16384
##$SREGLST= <1H.CDCl3>
##$SSB= 0
##$STSI= 65536
##$STSR= 0
##$SW_p= 40650.406504065
##$SYMM= 0
##$S_DEV= 0
##$TDeff= 32768
##$TDoff= 0
##$TI= <>
##$TILT= no
##$TM1= 0
##$TM2= 0
##$TOPLEV= 0
##$USERP1= <user>
##$USERP2= <user>
##$USERP3= <user>
##$USERP4= <user>
##$USERP5= <user>
##$WDW= 1
##$XDIM= 65536
##$YMAX_p= 220414898
##$YMIN_p= -272672878
$$ End of Bruker specific parameters
$$ ---------------------------------
##NTUPLES= NMR SPECTRUM
##VAR_NAME=  FREQUENCY,     SPECTRUM/REAL,   SPECTRUM/IMAG
##SYMBOL=    X,             R,               I
##VAR_TYPE=  INDEPENDENT,   DEPENDENT,       DEPENDENT
##VAR_FORM=  AFFN,          ASDF,            ASDF
##VAR_DIM=   65536,         65536,           65536
##UNITS=     HZ,            ARBITRARY UNITS, ARBITRARY UNITS
##FACTOR=    0.620285442955139, 1,           1
##FIRST=     20137.2065510682, 0,            0
##LAST=      -20513.1999529968, 0,           0
##MIN=       -20513.1999529968, -272672878,  0
##MAX=       20137.2065510682, 220414898,    0
$$ Real data points
##PAGE= N=1
##DATA TABLE= (X++(R..R)), XYDATA
$$ [...]
42589c37077j101060k870579q38303K156208L223480M301387P020385P888228
42581A9442669L659621k574468n683553n249081l330641J10968L944508L040030
42573A3360053l796501p827697j863316O282779L784543o138365p842985J257035
42565b784454N617663k362771q170283J583309J6009275J5748536K296515o113179
42557B1824611k944274L45215m007057q832386o079433J177717N746498N498318
42549A2729209J683921l515683n330507p79042L958257J91113q268386q492658
42541g823776R54320O444899J141126m100210J70014O063202L137910l069381
42533B918104j667787L764617K049941m952240n221731K694429P854142N486230
$$ y = [-337077, -1438137, -4308716, -5147019, -2990811, 232669, 4534056, 11554441, 19442669, 23102290, 20527822, 14844269, 9595188, 6264547, 6375515, 10320023, 13360053, 9563552, 1735855, -127461, 6155318, 9939861, 3801496, -4041489, -2784454, 2833209, 470438, -7699845, -6116536, 9892739, 25641275, 27937790, 21824611, 18880337, 19225552, 15218495, 6386109, 306676, 1484393, 7230891, 12729209, 14413130, 10897447, 5566940, 4787898, 8746155, 8937268, 668882, -7823776, -6869456, -424557, 716569, -3383641, -3213627, 2849575, 5987485, 2918104, 1250317, 5014934, 7064875, 2112635, -3109096, -414667, 7439475, 12925705]
42525A2925705K356398K163392j52386o182855r061094n443302j386654j250878
42517f031674q45655L042721N818342L728601P75683Q05564O22339k644293m931035
42508C40593k865521p76438k677727m165591o13146K980043n6849n400895l622046
42499a6857577M498856R224595O827336K912368J165960r62642m232667m913202
42491b336973k480340j427818k617172j102308L944047N471371j89213n772476
42483f510882l437828L139020M682498M87020j518889K462500O944397N890772
42475A2138608P87353k481287j334373J403588J555164j874888n816912o272992
42467a895739k281528L577667Q107345R357965O126273j171056q333942r867725
$$ y = [12925705, 15282103, 17445495, 17293109, 11110254, 2049160, -3394142, -4780796, -6031674, -6877329, -3834608, 1983734, 5712335, 6488018, 7293582, 7915921, 5271628, 340593, -2524928, -3301366, -5979093, -10144684, -10757830, -7777787, -7834636, -13235531, -16857577, -12358721, -3134126, 3693210, 6605578, 7771538, 6808896, 2576229, -2336973, -4817313, -6245131, -8862303, -9964611, -6020564, -549193, -738406, -6510882, -9948710, -6809690, -2127192, -1640172, -3159061, -696561, 6247836, 12138608, 12925961, 10444674, 9110301, 10513889, 12069053, 10194165, 4377253, -1895739, -4177267, -599600, 7507745, 16865710, 22991983, 21820927, 13486985, 3619260]
42459C619260n756281k178823k767401l267140Q43092N530863L627906l175397
42451c523921n533459J38239O878636P609963L431999j384877n808579q851010
42443g043009o308598K575225R691537P212323l46719j701194M232561O263099
42435A4575225j905497j1387536j0627922j547113M458030K870138j05213O87573
42427b982315K128938j07563l757295l744227j5305K918863K359427m03959k957282
42418f560718l423506m86182M594672O927341L225705k116787j178429O157178
42410G139274J0397306M972323m366980p591717m061206j472271k895837k876095
42402g55203K031311O411404M259714j308541k726173O97067K648619k6159l488559
$$ y = [3619260, -2137021, -4315844, -7083245, -10350385, -9507293, -3976430, -348524, -3523921, -9057380, -8919141, -2040505, 5569458, 9001457, 7616580, 1808001, -7043009, -13351607, -10776382, -1084845, 6127478, 5780759, 4079565, 8312126, 14575225, 12669728, 1282192, -9345730, -10892843, -6434813, -3564675, -3669888, -2982315, -853377, -960940, -4718235, -8462462, -8477767, -5558904, -3199477, -3603436, -6560718, -9984224, -10470406, -5875734, 1051607, 4277312, 2160525, 982096, 7139274, 17536580, 22508903, 18141923, 10550206, 6489000, 5016729, 2120892, -755203, 1276108, 7687512, 11947226, 10638685, 7912512, 8609579, 11258198, 11232039, 7743480]
42393G743480l954719k669337j776098n04986J318276N99811l764907o548589
42385i557069k498641N163975Q278407M854189Q46781P69539K485472K566588
42377A2909241J040068j359331n073888p971705n347138K387319P397256M661769
42369H643591o95946k029918j594690m699771q448585o231734k54976J641919
42361a3670110J37157K917174Q700721O826746l728933r444305l221378L720379
42353g762549R57167l278040K733370J1852370Q478135m758914r632050n69045
42345a979556P830570M384456l776988n714383k484726p65996j118831o05729
42337d231183M12606P83148J739108K759707P91206k558682j003288M862862N167024
$$ y = [7743480, 3788761, 1119424, -656674, -1161660, 156616, 756427, -3008480, -9557069, -12055710, -6891735, 1386672, 6240861, 7087642, 7857181, 10342653, 12909241, 13949309, 12589978, 7516090, -455615, -5802753, -3415434, 3981822, 8643591, 7947645, 5917727, 4323037, -376734, -8825319, -15057053, -15312029, -13670110, -13532953, -10615779, -1915058, 4911688, 1182755, -8261550, -11482928, -7762549, -6805382, -10083422, -7350052, 4502318, 12980453, 8221539, -1410511, -1979556, 5851014, 10235470, 6458482, 744099, -1740627, -2506623, -3625454, -4231183, -3818577, -3035429, -1296321, 1463386, 2254592, -304090, -1307378, 3555484, 8722508]
42328H722508l818926j1052011o029522M956224P826728O62391n421843k481384
42320f635835N773503J0286075N491032n938782j3185686o915528P086987J1406045
42312G367811J96251j0486861n112570Q163048J0500091J052049m534451p73943
42304F371425J349067l908323p224013j970689L642649R00047m763515l211312
42296h814664M421322Q409516M100133m129764r031471o203501K401608Q040056
42288h06765L442503o616122r718556k580261N054821O002056M865096O571708
42280F214480O448756K2973o344980m769702P98147Q66286m640457p623893m636899
42271a3665289O03155M701610O334765L601560k235263l901308K339749Q260237
$$ y = [8722508, 4903582, -6148429, -12177951, -7221727, 605001, 1267392, -4154451, -6635835, -862332, 9423743, 14914775, 8975993, -4209693, -11125221, -4038234, 7367811, 7564062, -2922799, -8035369, 127679, 10627770, 11679819, 7145368, 6371425, 7720492, 3812169, -3411844, -5382533, -1739884, -839837, -5603352, -8814664, -4393342, 4016174, 8116307, 3986543, -5044928, -11248429, -8846821, -806765, 2635738, -3980384, -13698940, -16279201, -11224380, -5222324, -357228, 6214480, 12663236, 12686209, 6341229, 1571527, 2369674, 3235960, -1404497, -9028390, -13665289, -13062134, -8360524, -2025759, 1575801, -659462, -4560770, -2221021, 6039216]
42263F039216M712128k990037k943353K968274J491175q695794j2352367j697526
42255a3468284R853874P498816l112700o001237R18203N187834K80502n952103
42247d795095m395752L486646R920412J0230782M946699k595115p820092p617036
42239A361449l966198k251607m203885n296510j163805N968230R748556O852106
42231G048336m55854p151389q636563l127361N918889J1007763P802666N93474
42223A2999961k865186j254017M4551j686001k972717j783561k003690n897278
42215e417938p945918k714052N259058P023444K309802r22997R04238L114369
42207A610006K174125Q58329J658714K055029l60559l564217m846536m207066
$$ y = [6039216, 10751344, 7761307, 4817954, 7786228, 9277403, 581609, -11770758, -13468284, -3614410, 3884406, 771706, -5229531, -4311328, 876506, 1157008, -4795095, -9190847, -5704201, 4216211, 14446993, 19393692, 16798577, 8978485, 1361449, -2604749, -4856356, -9060241, -14356751, -15520556, -9552326, 196230, 7048336, 6592482, -558907, -9195470, -12322831, -6403942, 4603821, 12406487, 12999961, 10134775, 8880758, 8925309, 7239308, 4266591, 2483030, 479340, -5417938, -13363856, -16077908, -10818850, -3795406, -1485604, -2408601, -1504363, 1610006, 3784131, 4642460, 6301174, 8356203, 7995644, 4431427, -415109, -4622175]
42199d622175k066896J453464L694564J715597j557808m31469L166751J200583
42191B552611o140376q008658K46613Q374292O756425P87584L70429L750933K881652
42182A1571505j942412m456712m140655m165315k495921L268142O902975K025539
42174F567146m838568l485485J655260j624344j0605413j0014402K087803R743486
42166a0514517M731953j608912N91044M294571J262795k376883J139155N718622
42158C237828K454983l908679l538777J485453K595899N60311J777305L868879
42150H533202m49867q067114q353338n51216M871263K809840n75353l7504J780610
42141c9477J968411K056495K238286k86585m246166l845670J368474M044791L32099
$$ y = [-4622175, -6689071, -5235607, -1541043, 174554, -1383254, -1814723, 1352028, 2552611, -3587765, -11596423, -11349810, -2975518, 3780907, 4568491, 4938920, 8689853, 11571505, 9629093, 5172381, 1031726, -3133589, -5629510, -2361368, 4541607, 6567146, 1728578, -1756907, -101647, -1725991, -12331404, -22345806, -20258003, -10514517, -5782564, -7391476, -6800432, -2505861, -1243066, -3619949, -2480794, 3237828, 5692811, 1784132, -1754645, -269192, 2326707, 2887018, 4664323, 8533202, 8083335, 16221, -8337117, -8888333, -4017070, -1207230, -1782583, -1820087, -39477, 1928934, 3985429, 6223715, 5937130, 1690964, -2154706, -786232, 3258559, 3590658]
42132C590658l556648r76650M735158N071952j803764q851426q530109p40368
42124a1061197P065155P394885J277799k524428Q48186N225489K984441k377645
42116H832685j729639M045719M830139j715301n774649j854705J910626k038883
42108F505992p224670l701082N092661P363917R88468m769982m416808k413664
42100b575168k926622l078315k07796J749365j425073o415735o633076j795828
42092b3308248K115955J836664Q43273L085978O474662N805334N93314l829326
42084f382394l621376j307406j041331j913226j2001M261483N950306L153290
42076i12655J48655R68442L784537M354001J965010q60628k085568j019401J934399
$$ y = [3590658, 34010, -942640, 3792518, 8864470, 7060706, -1790720, -10320829, -11061197, -3996042, 3398843, 4676642, 2152214, 3000400, 8225889, 11210330, 8832685, 7103046, 11148765, 15978904, 14263603, 8488954, 6634249, 8544875, 6505992, -718678, -4419760, 672901, 8036818, 9025286, 4255304, -161504, -2575168, -5501790, -8580105, -8787901, -7038536, -8463609, -14879344, -21512420, -23308248, -21192293, -19355629, -18512356, -15426378, -8951716, -3146382, -2553068, -6382394, -10003770, -11311176, -12352507, -14265733, -14277734, -10016251, -4065945, -912655, -764000, 204442, 3988979, 8342980, 10307990, 9447362, 7361794, 6342393, 8276792]
42067H276792L768912K03658p843508j1988918n524870O604786J2120531N725945
42059A1343328n272500j0212681o055511J804426O157224L864930k223892n654859
42051f249535k360337M793042Q818768O122227m47995n620736o273239k310993
42043c528798L590264O452314K767536m453333p348398k144887N834788Q364591
42035I534077L516278l783569q465308r186052o362550m69085O191604Q846890
42027a77715M442902l741377q058337m306074L649788Q517498P679254M240798
42019A2246737R42606k639723n854416n241333o20386J962348r89533k984935
42011c178635L098899J1174783Q266440n022630j2502295n168073N678519N848149
$$ y = [8276792, 12045704, 12249362, 4405854, -7583064, -13107934, -6503148, 5617383, 11343328, 6070828, -4141853, -10197364, -8392938, -2235714, 1629216, -594676, -6249535, -8609872, -3816830, 5001938, 11124165, 10676170, 5055434, -1217805, -3528798, 61466, 6513780, 9281316, 4827983, -2520415, -4665302, 1169486, 9534077, 13050355, 9266786, 801478, -8384574, -14747124, -15216209, -9024605, -177715, 4265187, 523810, -7534527, -11840601, -8190813, 326685, 8005939, 12246737, 13189343, 10549620, 4695204, -546129, -1166515, 795833, -193700, -3178635, -79736, 11095047, 19361487, 14338857, 1836562, -3331511, 2347008, 8195157]
42003H195157j519103m060094m36382J070355n98314J153575N355268L070420
41995A2230882n552355q346130k92354P654332O095994J329695K437650M974824
41987B0532538k98776j0124138j3444666q708504l546844k62619N011151R913917
41979i27941O655067l147212p716037k986440J200900j725479l876088K628851
41971i894379J0502636Q117526j478741n180247k69546K608905k529627p785321
41963e908794m370842M089348P580198L536091k106145n031516o921083r288370
41955a8421113q736842j973074P148601J0331957N220780q40387j11177N346356
41947b034899P110384K574624k103301k002135r8460n70604j100055K268000O279947
$$ y = [8195157, 6676054, 2615960, 2179578, 3249933, 2651619, 3805194, 9160462, 12230882, 6678527, -1667603, -1959957, 5694375, 11790369, 13120064, 15557714, 20532538, 20233762, 10109624, -3335042, -12043546, -15590390, -15853009, -10841858, -927941, 5727126, 2579914, -5136123, -8122563, -6921663, -8647142, -12523230, -9894379, 608257, 8725783, 7247042, 2066795, 1797249, 4406154, 1876527, -5908794, -10279636, -6190288, 1389910, 4926001, 2819856, -2211660, -9132743, -18421113, -27157955, -29131029, -21982428, -11650471, -6429691, -7270078, -7381255, -2034899, 5075485, 7650109, 5546808, 3544673, 3446213, 2875609, 1775554, 4043554, 10323501]
41938A0323501L995889l662625p457862k818016L199149J862350n058269q429727
41930h045610m560486J104066L031448K556473L250611L874339Q44109m119043
41922b064093m547615J422334P100765N706953o60296m520985l173301n81814
41914a318052r2869m60606J53667Q29307L64529k90696O7294J075029K038392
41905B365995K573062J627958j067391k639069m02534K326630m70065p085816
41897b771230p922097O75267R265211P820972j80539l572764K43122L081255r95875
41888E643322p844437r627928m074740M012689P772043M720579l33225o51799
41880c83496L015776K820327l730926q023190k720544O119876P422979J014774
$$ y = [10323501, 14319390, 10656765, 3198903, 380887, 3580036, 5442386, 384117, -8045610, -12606096, -11502030, -8470582, -5914109, -2663498, 1210841, 2054950, -2064093, -6611708, -5189374, 1911391, 7618344, 6958048, 2437063, -736238, -1318052, -1410921, -1871527, -1717860, -888553, -524024, -814720, -747426, 327603, 2365995, 4939057, 6567015, 5499624, 2860555, 2458021, 4784651, 4314586, -2771230, -10693327, -10018060, -752849, 7068123, 6887584, 3314820, 3557942, 6639197, 5643322, -2201115, -11829043, -15903783, -11891094, -4119051, 601528, 268303, -383496, 2632280, 5452607, 1721681, -6301509, -9022053, -2902177, 4520802, 5535576]
41872E535576m072274l803848j582233J056850N054510O205545j043769j1186758
41864c836401j1024703J579458J3137297J2428901L025545n680278r727553q540151
41856h637885j937130N380144N758883J89954j505489L374621N609152Q05201
41848I037451k311601J356457K438722n175821r671141k37560J1204259O714543
41840A3355309p521505r654746L074918J0896735L739859n363433m578362p39808
41832C208967l205153p091646m417179P50573N61180k382966o31918M743706O606442
41823a857994L033871k011717n195334m541491J407843Q995293R587692R95128
41815A0413291o876428n012263J745952L037591r54330j824025J924737L049561
$$ y = [5535576, 1463302, -2340546, -3922779, -2865929, 2188581, 8394126, 7350357, -3836401, -14861104, -13281646, -144349, 12284552, 15310097, 9629819, -97734, -8637885, -10575015, -5194871, 564012, 753966, -751523, 2623098, 8232250, 9037451, 6725850, 8082307, 10521029, 5345208, -4325933, -4563493, 6640766, 13355309, 5833804, -3820942, -746024, 10150711, 13890570, 8527137, 3948775, 3208967, 3814, -7087832, -11505011, -10754438, -10193258, -12576224, -13208142, -8464436, -1857994, 1175877, -835840, -6031174, -10572665, -9164822, -169529, 9418163, 10413291, 3536863, -1475400, 270552, 3308143, 2353813, 529788, 2454525, 5504086]
41807E504086j259554m349081p13848N845687Q167198M900589M19020j537980
41799A6976117j449054k316724n661959r204791r054672m312438J955556O309791
41791f758174P163076L828539k588129p020164m464390K304641M847002J193510
41783a494089q04567L974948R205448O896592l23952m061288k575152o96226r17773
41774I203941k075581l953411n974261m250632K633076P933288M986534j584311
41766F918643j910806L860320O283329K030698j834403n14082J390811j125077
41758A5099433n264470n611811k118156Q59702K21914l010993m273061K21300
41750c876142O948015O401753l991699j3145147j0382359j242795J578904j231743
$$ y = [5504086, 4244532, -104549, -818397, 5027290, 13194488, 18095077, 18514097, 16976117, 15527063, 13210339, 7548380, -1656411, -10711083, -15023521, -13067965, -6758174, 404902, 4233441, 1645312, -5374852, -9839242, -7534601, -2687599, -1494089, -2298656, 1676292, 10881740, 17778332, 17454380, 13393092, 10817940, 10121714, 9203941, 7128360, 3174949, -2799312, -7049944, -4416868, 3516420, 8502954, 6918643, 5007837, 8868157, 15151486, 17182184, 15347781, 14833699, 16224510, 15099433, 9834963, 4223152, 2104996, 2964698, 3186612, 175619, -4097442, -3876142, 3071873, 9473626, 5481927, -7663220, -18045579, -19288374, -17709470, -18941213]
41742a8941213J729335J1186796J4839527Q244017J385087j33672l503865j0916101
41734C889911j0495962L378224J5683947J1249154k159032o938026k284217o54769
41726A1669230m480191m723255K28317J778964k431968m680628j588982J111384
41718c117129O00262J201911L625207J959931m471512p294441k334302K975762
41710f854311J463913k686560j537287L968126O026648J443219m557584n082614
41702g816450O49482N990231L644426m848131r111464l040351N950473P080439
41694a501345J728609k75420K740868K887362k078359m592741j273905R22007
41686a442924k245830m018261J521224Q550490Q594669L234229m38074j131795
$$ y = [-18941213, -17211878, -6025082, 8814445, 17058462, 18443549, 18309877, 14806012, 3889911, -6606051, -3227827, 12456120, 23705274, 21546242, 14608216, 12323999, 11669230, 7189039, 2465784, 2694101, 4473065, 2041097, -2639531, -4228513, -3117129, -2516867, -1314956, 2310251, 4270182, -201330, -7495771, -9830073, -6854311, -5390398, -8076958, -9614245, -5646119, 380529, 1823748, -2733836, -7816450, -7166968, -1176737, 2467689, -2380442, -11491906, -14532257, -8581784, -1501345, 227264, -48156, 2692712, 5580074, 3501715, -1091026, -2364931, -1442924, -3688754, -7707015, -6185791, 2364699, 10959368, 14193597, 13755523, 12623728]
41678A2623728k095067l347113k903902k043149k561371k327709L36486J928247
41670c89850l09146k195662N53449L587082K05599o819794q515985l129059K228150
41661a4785216K790969R94896j61413j015175j202931J545330O393056Q442666
41653C002182N035516q49188m911612n841795m491630k113060k10618O54235K030893
41644g695077M815419O101208K589540l269291n081742j244062K399951N35365
41636h48689m329723n349212m92178M714380M112386j253395m457349j888335
41628i792115K168800K563722J229320K774112M942168J651912m998319n728382
41620e188782P22649M096259q25068n134841j021994M513726K025148l384812
$$ y = [12623728, 10528661, 7181548, 4277646, 2234497, -326874, -2654583, -2318097, -389850, -698996, -2894658, -2341209, 1245873, 1451472, -5368322, -13884307, -17013366, -14785216, -11994247, -10999351, -11160764, -12175939, -13378870, -11833540, -5440484, 3002182, 8037698, 7188510, 2276898, -3564897, -8056527, -10169587, -10380205, -9725970, -7695077, -2879658, 3221550, 5811090, 2541799, -2539943, -3784005, -1384054, -848689, -5178412, -10527624, -11019802, -6305422, -2193036, -3446431, -7903780, -9792115, -7623315, -5059593, -3830273, -1056161, 3886007, 5537919, 539600, -5188782, -4466133, -369874, -1194942, -6329783, -7351777, -2838051, -812903, -4197715]
41612d197715j042514N872303N363191k348675n027994O29240M184421Q0260l863837
41603c51320j362086K319519J608601K08166K109929L074762r23943m965247k843701
41594a125320L013243O184611M929882N00550o501985j2107890q791027L238201
41586a0659735J1429749O205905m802318p048304Q98115P459341N504279j49996
41578H837036k298268k6722L260447M487487K568751o76362j648668P4604K02016
41569A4780321l456084o271108l677749J045758J855211o11786j437420l30945
41561A896198n66558j227309J160417M286854K111263m310909o660876j891344
41553e202264L053690K106664j516381j998206p8538l26917l182064m766697k518371
$$ y = [-4197715, -5240229, 632074, 5995265, 3646590, -1381404, -752164, 3432257, 3512517, -351320, -1713406, 606113, 2214714, 2422880, 4532809, 7607571, 6683628, 1718381, -1125320, 1887923, 8072534, 13002416, 13502966, 7000981, -5106909, -13897936, -10659735, 770014, 6975919, 2173601, -4874703, -3976588, 3482753, 8987032, 8837036, 6538768, 6512046, 9772493, 14259980, 16828731, 16152369, 14503701, 14578305, 14780321, 11324237, 5053129, 1375380, 2421138, 4276349, 3664563, 2227143, 1896198, 1329640, 102331, 1262748, 5549602, 7660865, 3349956, -3310920, -5202264, -2148574, -41910, -1558291, -3556497, -3635035, -3961952, -7144016, -11910713, -14429084]
41544a4429084K788516Q791660J2097044R221511R03550n874240m699444J308335
41536A0107848K025230o198476j3970317j0301904K065425R478916N670256o47185
41528a770207q4603L531290J242074n235874o620053j948644Q16447l02544J208246
41519i163868N941172N496191j288000l123940M733106R928404K514216p499920
41511G537361o207750J219419N97459o051904m770775M575140P217994r12235
41503C204709n948464O56126Q696146O682932j215657m658532k694997p71352
41495C950911l61614J8602n71112k874199l958160j436093K818702O112293P389855
41486A1089185M938585j998253q328562p589287k376635j309666m422731k524476
$$ y = [-14429084, -11640568, -2848908, 9248136, 18469647, 19373197, 13498957, 8799513, 10107848, 12133078, 5934602, -8035715, -18337619, -16272194, -6793278, -1123022, -1770207, -1854810, 1676480, 2918554, -2317320, -8937373, -10886017, -10069570, -10372114, -9163868, -3222696, 2273495, 985495, -2138445, 2594661, 12523065, 15037281, 7537361, 1329611, 2549030, 3146489, -2905415, -7676190, -3101050, 4116944, 3204709, -2743755, -2087629, 6608517, 13291449, 12075792, 7417260, 4722263, 3950911, 3589297, 3607899, 3036787, 162588, -3795572, -5231665, -2412963, 3699330, 11089185, 16027770, 14029517, 5700955, -1888332, -4264967, -5574633, -9997364, -12521840]
41478a2521840O286216J1677934P385641L56489k421841m027327p137752n900888
41470f303368K167856P613873L377239k514502l13995M929405L051687l564628
41462H443567n839372m265359m934319n488620j96522N777938K919794m997927
41454h580820n504756K202136O951562M687444K267837K129980q81212n698380
41446b426209l871815M352083P684684K006582l117836j262927J209370j470297
41438C103635m447925k861057o16998q78831J067108P289209J0183365M830346
41430A7668852j421313j017050J453294r85571m277057j043089N239268N590133
41422B1207467O8352m169292n259015o335314o378806k271270K419691J353091
$$ y = [-12521840, -6235624, 5442310, 12827951, 13184440, 10762599, 6735272, -402480, -6303368, -4135512, 3478361, 6855600, 4341098, 4027103, 8956508, 12008195, 8443567, 2604195, -1661164, -6595483, -12084103, -12280625, -6502687, -3582893, -8580820, -14085576, -11883440, -4931878, -244434, 2023403, 4153383, 3272171, -2426209, -6298024, -1945941, 5738743, 7745325, 4627489, 3364562, 4573932, 3103635, -1344290, -4205347, -4822345, -5701176, -4634068, 2655141, 12838506, 17668852, 16247539, 15230489, 16683783, 15698212, 11421155, 10378066, 15617334, 21207467, 21275819, 17106527, 11847512, 5512198, -866608, -3137878, -718187, 634904]
41414F34904l327323l772586M08103J768843k126354n097162k729832K152652
41406a2088755N736964P120076M857681k318458r560446q691355K26603P254170
41398g463520N710561L39008j211434J363304L893854N295767O563414N991382
41390B0482336J345887m889134p422144m937296j436791q67609k924081m263709
41382d912541k358790J705555L734845R93166l229210k237368M938155R907503
41374H541315M517227p183074j2004248m165603O449830O991944j164792n129734
41366c147135K41200M865457m52340q534035n594146P573388J5327394Q577016
41358A8856799m097340j0204995q663324n336684j492188M490451Q916011N991574
$$ y = [634904, -2692419, -6465005, -6056902, -4288059, -6414413, -11511575, -14241407, -12088755, -6351791, 768285, 5625966, 3307508, -6252938, -14944293, -14717690, -7463520, -1752959, -1413951, -2625385, -1262081, 2631773, 7927540, 14490954, 20482336, 21828223, 16939089, 9516945, 4579649, 3142858, 2275249, -648832, -4912541, -7271331, -5565776, -1830931, -837765, -4066975, -6304343, -1366188, 8541315, 13058542, 5875468, -6128780, -10294383, -3844553, 3147391, 1982599, -3147135, -2905935, 1959522, 1507182, -7026853, -12620999, -5047611, 10279783, 18856799, 14759459, 4554464, -4108860, -9445544, -10937732, -6447281, 2468730, 8460304]
41350H460304k141965o638029l407368K789108N839157M425111N32288l061471
41342F797135l365829K79770L990007L665838J012444N74347J488034j701494
41334A2740252r126353j2855813p221846K639378O579732J610572n005285m375373
41326a5014736M085948J1782942J0172331N93596p044381o076170m23352K042614
41318A18792k05813k691572k562883q64765R19176J744514J40342k854874k262747
41309h519830L830005Q556645M541159m228155o963543j519006L567399K636539
41301A901213p26368k346610l221437l856050j530399L182998N042088K808903
41293A254338J559803L048234K381958j684717k615488K202972N124558O48184
$$ y = [8460304, 6318339, -319690, -3727058, -937950, 4901207, 9326318, 9858606, 6797135, 3431306, 3711076, 7701083, 11366921, 12379365, 12953712, 14441746, 12740252, 3613899, -9241914, -16463760, -13824382, -7244650, -5634078, -10639363, -15014736, -10928788, 854154, 11026485, 11620081, 4575700, -1500470, -1923822, 118792, -87021, -2778593, -5341476, -6206241, -5287065, -3542551, -3402209, -6257083, -8519830, -4689825, 3866820, 8407979, 4179824, -2783719, -4302725, -735326, 1901213, 1174845, -1171765, -4393202, -8249252, -9779651, -6596653, -1554565, 1254338, 2814141, 5862375, 8244333, 6559616, 3944128, 6147100, 11271658, 11919842]
41285A1919842m977162m800672k829612m654567m909609L400175J3332023J1807406
41277A8287824j73032q727790p295612k590672l33136J753582M492591L316832
41269H730587j845689l442567J507008N137242Q42329n761910m933494L092407
41261C325913Q666080N012428m594445j0805708p344388K394734P973414L725369
41253H353397l736542m434872R52089L289309l21285l505512k617294j199982
41245c220692k79526M306396J0430868P635244n737511j4503123o451933Q482355
41237F62078J1276662N7831r810526q449818j090553M093510N266118K886022
41229D891324k443747n772868j377798O775802P625793p53457p168493m034091
$$ y = [11919842, 6942680, 2142008, -687604, -5342171, -10251780, -6851605, 6480418, 18287824, 18114792, 9387002, 2091390, -499282, -832418, 921164, 5413755, 8730587, 6884898, 3442331, 4949339, 10086581, 10928910, 5167000, 233506, 3325913, 11991993, 17004421, 12409976, 1604268, -5740120, -3345386, 4628028, 8353397, 4616855, 181983, 1134072, 4423381, 4102096, 596584, -2020710, -3220692, -3500218, 806178, 11237046, 18872290, 13134779, -1368344, -7820277, 662078, 11938740, 11996571, 2186045, -6263773, -7354326, -3260816, 2005302, 4891324, 2447577, -3325291, -4703089, 2072713, 9698506, 8945049, 1776556, -2257535]
41221b257535J673593J004951k168158J416441R827827J1823933L901621m455298
41213B0767375m386517R66942K278356l387234r800056r591446k275078N529197
41205A01539O804786J147398m902311m910129O10262N363517M777293Q07400j175720
41196H624035Q18327L031184Q52392m778030p784702m590748P55263J571454k559844
41187d060669n329929k200657M129397P763870O032048N66348n067773p198962
41179e366327m340094N54752K755234K006502K575046N463924N639557N54300
41171I842894l881163j629608L429971L065781k608487o245098n414586m388872
41163g829168l924276L31082O942548P002615j430678p081037j324960P909209
$$ y = [-2257535, -583942, 421009, -1747149, -330708, 9497119, 21321052, 25222673, 20767375, 16380858, 17347800, 19626156, 16238922, 6438866, -3152580, -5427658, 101539, 6906325, 8053723, 3151412, -1758717, -1148455, 4215062, 8992355, 9799755, 8624035, 9442362, 12473546, 13325938, 8547908, 763206, -3827542, -3072279, -1500825, -4060669, -9390598, -11591255, -7461858, 302012, 6334060, 6900408, 1832635, -5366327, -9706421, -9151669, -6396435, -4389933, -1814887, 3649037, 9288594, 9842894, 5961731, 4332123, 7762094, 10827875, 8219388, 1974290, -3440296, -7829168, -11753444, -11422362, -4479814, 2522801, 1092123, -5988914, -7313874, 595335]
41155E95335P601460j242719o666174l949157N50494J940689J994687J703962
41147B528577p92869l408871j063498M524488N573599J194495m83978L422975
41139A1494918M972187n54037n759514l761878K55675p76056l243335j207693
41131A420267R41610l116534p380066k214723P387425Q205539J113054k04491
41123F152081O610089P907503k053851j0203567o084023J424529J31566n610814
41115a726487m474416K072777L850122m14091l163725j858283m56675J62091K057256
41106c951431L019634J86232j927691J907225N969257J165116p945818p969391
41098i546867J776720P808742M487356J455260M425503M963088k205379p025748
$$ y = [595335, 8196795, 6954076, 287902, -3661255, -3110761, -1170072, 824615, 2528577, 1735708, -1673163, -2736661, 1787827, 7361426, 8555921, 8071943, 11494918, 16467105, 15913068, 10153554, 6391676, 6647351, 5871295, 2627960, 1420267, 2361877, -754657, -8134723, -10349446, -2962021, 5243518, 6356572, 6152081, 12762170, 20669673, 18615822, 8412255, 2328232, 3752761, 3884327, -1726487, -6200903, -4128126, -278004, -692095, -3855820, -5714103, -6170778, -6008687, -3951431, -931797, -745565, -2673256, -766031, 5203226, 6368342, -1577476, -9546867, -7770147, 38595, 4525951, 5981211, 10406714, 15369802, 13164423, 6138675]
41090F138675j147213N803316J510597p443864n933952M105202O427852k960610
41082F500003r660200l926345N746015P905048M059418J363285l58137m527728
41074G101359p601367l435569N004217P626210R72204p102903p922797j929289
41066g287935M008330N519399M070819K975089K810395J494370k039267n525137
41058F026063n568590j867443J863645J676727k236108n136675k040951O464065
41050h19267J2656467Q487684m207998j3078699q727032K907405P101009o07619
41042C711950q426285m432710P182435J2195754N678310k451241k183331L134970
41034A4409852K852357n065553j0734244n963669M178209P883010K338780l132027
$$ y = [6138675, 4991462, 10794778, 12305375, 4861511, -1072441, 3032761, 9460613, 6500003, -3160197, -7086542, -1340527, 6564521, 10623939, 11987224, 11629087, 7101359, -500008, -3935577, 1068640, 8694850, 9667054, 2564151, -5358646, -7287935, -3279605, 2239794, 6310613, 9285702, 12096097, 13590467, 11551200, 6026063, 457473, -1409970, 453675, 2130402, -105706, -5242381, -7283332, -819267, 11837200, 20324884, 16116886, 3038187, -5688845, -2781440, 4319569, 3711950, -4714335, -9147045, -1964610, 10231144, 15909454, 13458213, 11274882, 14409852, 17262209, 12196656, 1462412, -4501257, -323048, 7559962, 9898742, 6766715]
41026F766715q42620M445018L310006l820621p316097k742818L185361L296082
41018F281026m47732k534759l202041n564468p293050l154163N084375R061763
41010a769049N485526O13734L41417J897445q4618l974775l858319K99799J856853
41001H08013k318251o377564l377835M585061Q362887L387942m565840p053080
40993f548667l661224j289311l318160m506100N43127P915375Q889951K321956
40985C46947l914477m529244l109697l885165l836279J179408P252599P035115
40977c460793J391528j427521J818489N330309M108941P03778q46101j498169
40969F120461l429970m860740l400002o77854Q57362K052302L401079J559230
$$ y = [6766715, 5924095, 10369113, 13679119, 9858498, 2542401, -200417, 2984944, 6281026, 5833294, 3298535, 96494, -5467974, -12761024, -15915187, -10830812, -1769049, 3716477, 4330211, 4671628, 6569073, 6484455, 2509680, -1348639, -1048840, 808013, -1510238, -7887802, -11265637, -6680576, 1682311, 5070253, 504413, -6548667, -10209891, -11499202, -14817362, -19323462, -18780335, -10864960, -1975009, 346947, -3567530, -8096774, -11206471, -15091636, -18927915, -17748507, -10495908, -3460793, -2069265, -3496786, -1678297, 3652012, 7760953, 8464731, 7618630, 6120461, 2690491, -2170249, -5570251, -6248105, -5390743, -3338441, 62638, 1621868]
40961A621868m466552p546547q51867R917318J1666158J722844q105021p592764
40953c634563j77437M957316N484367M560142K399407l016935r055884r548516
40945h032103l334205L487446N251391L117361K024921L521929L942802j62338
40937I817204o153685p094704p27436N823461M285190l080186n866730l20812
40929c317698N221102L101378k279046k060109L242524N541606K192419j230540
40921A0411636q89954L47026p18208k828606m035827m865592n425359m054909
40913a2059793j147090R9704q22876J91526N283336R975299Q756902K556789k903355
40904I930442m189155k312078N06751K696639K602770p75831n494486p107028
$$ y = [1621868, -2844684, -10391231, -11243098, -1325780, 10340378, 12063222, 3958201, -3634563, -3812000, 1145316, 6629683, 11189825, 13589232, 10572297, 1516413, -8032103, -11366308, -7878862, -2627471, 489890, 2514811, 6036740, 9979542, 9817204, 3663519, -3431185, -4158621, 1664840, 5950030, 2869844, -2996886, -3317698, 1903404, 5004782, 2725736, 665627, 3908151, 9449757, 11642176, 10411636, 9521682, 9868708, 9150500, 6321894, 2286067, -2579525, -8004884, -12059793, -13206883, -13107179, -13930055, -13738529, -8455193, 1520106, 10277008, 12833797, 9930442, 5741287, 3429209, 3935960, 6632599, 9235369, 8459538, 2965052, -4141976]
40896d141976l016485L697594O169513J150526n862512n990269J416988O674347
40888I7726K590367m944792n133852K115606O692037L395466k121855l589975
40880h99272j772546O17792L453899N113500J863229m258642m945042J583351
40872G56269N532730K62479o237164l888664K809218K493790l709486m218395
40864f199223L109840O970612P45453p460027p641055j248943L947034N125958
40856b650351M650515M133923L625754L402240K666271o42340n786789p956186
40848A443037l851240L746206Q909983Q010128J536970o508151j0347660o895055
40840c955782M86379N263444M685690Q02627l734217o562077m509057K222089
$$ y = [-4141976, -7158461, -3460867, 2708646, 3859172, -2003340, -7993609, -6576621, 97726, 2688093, -2256699, -7390551, -5274945, 1417092, 4812558, 2690703, -899272, -2671818, -2054026, 1399873, 6513373, 8376602, 4117960, -827082, 756269, 6288999, 6551478, 314314, -3574350, -765132, 1728658, -1980828, -6199223, -3089383, 3881229, 4626682, -2833345, -10474400, -11723343, -7776309, -2650351, 2000164, 6134087, 9759841, 13162081, 15828352, 15186012, 9399223, 1443037, -2408203, 1338003, 10247986, 18258114, 19795084, 13286933, 2939273, -3955782, -3469403, 1794041, 6479731, 7282358, 3548141, -3013936, -7522993, -5300904]
40832e300904O536351K621028l726322k056064O047250Q404512J740890k982328
40824A1284413Q97526M931984R04451n035869l911513M88069l79827m123234k784521
40815B271479J973871K499088k14133Q10808M013083J550379n083415o098549
40807A722611p08952J059012l643267n132322J295273O224437J934666m500973
40799a749515l151886L190195N390948K721593R39923P77534j375357m240831
40791B502604k736065K616387N420423K760225j539988l432666l175738k713171
40783b97989k671586k727042k304212r03358O48786O37982l44604O88669L864436
40774c408918M580402J77007m992525n299682j549660J601824K963179M296634
$$ y = [-5300904, 1235447, 3856475, 130153, -1925911, 4121339, 12525851, 14266741, 11284413, 12181939, 17113923, 18018374, 12982505, 9070992, 9559061, 9179234, 5056000, 2271479, 4245350, 6744438, 6530305, 7341113, 11354196, 12904575, 7821160, 1722611, 1013659, 2072671, -1570596, -6702918, -5407645, 816792, 2751458, -1749515, -4901401, -1711206, 3679742, 6401335, 7341258, 8118792, 6743435, 2502604, -233461, 2382926, 7803349, 10563574, 9023586, 5590920, 2415182, -297989, -2969575, -5696617, -8000829, -8904187, -8255401, -7617419, -7962023, -7273354, -3408918, 1171484, 1348491, -3644034, -8943716, -10493376, -8891552, -5928373, -1631739]
40766a631739N016282L262530O30894q601j29227k929212o100211m029986K550004
40757c369266N966289K183793m043818o583423m953097j710309J753529L864800
40749f891502K277632j809155k953752J156710N356562M014847r50701l537721
40741c337080k351600p39482L817J950888N062763N503076J119458m774380p094868
40732d657408m569828k04306K506365K683337K074706K551386L428691J975180
40724E788123k449059n992476m427565P43125L374603O81515k987588k456131
40716g725453R72812K052884j05718q84607K219655N415441M478825J118720k30327
40707G312232N95909L49027j151672q32194J160250N85370l325108m951458n91069
$$ y = [-1631739, 3384543, 6647073, 7277967, 7269366, 7140139, 4210927, -1889284, -5919270, -3369266, 2597023, 4780816, 736998, -5846425, -10799522, -12509831, -10756302, -6891502, -4613870, -6423025, -9376777, -8220067, -2863505, 1151342, 200641, -3337080, -5688680, -6428162, -6424345, -4473457, 589306, 6092382, 7211840, 2437460, -4657408, -9227236, -9431542, -6925177, -4241840, -2167134, 384252, 3812943, 5788123, 3339064, -2653412, -7080977, -6337852, -2963249, -2281734, -5269322, -7725453, -6752641, -4699757, -4805475, -5690082, -3470427, 1945014, 6423839, 7542559, 7312232, 7908141, 8257168, 7105496, 6273302, 7433552, 8018922, 4693814, -257644, -848713]
40698h48713M964014N082066J014963q87407N49425M52929l152427o100734n037482
40689c963366j982546J11329J544077L167168L695953K411745R92371K57372j253680
40680D980423l156182k112166J915131L100682j777239o688755m474123J739369
40672f472860K973413j443189l056437J565185N094061J746461k808963n78937
40664b981266N385447N359251j559923n321272K13537P774354O504537l196967
40656A2177698j0194455o699837L032212R015662O899945N83824m378768o219863
40648D216418n479473j936654L722367P025400L337827m613984p448537p76738
40640a953374P336880N938971l430327p914179j224963P068998N217952l542459
$$ y = [-848713, 4115301, 9197367, 10212330, 9324923, 9874348, 10327277, 7174850, 1074116, -3963366, -5945912, -5834583, -4290506, -1123338, 2572615, 4984360, 5976731, 6234103, 4980423, 1824241, -287925, 1627206, 4727888, 2950649, -3738106, -8212229, -6472860, -3499447, -4942636, -7999073, -6433888, -1339827, 406634, -2402329, -2981266, 2404181, 7763432, 6203509, 882237, 1095774, 8870128, 15374665, 12177698, 1983243, -4716594, -1684382, 7331280, 14231225, 14815049, 10436281, 4216418, -1263055, -3199709, 522658, 7548058, 10885885, 6271901, -1176636, -1953374, 5383506, 11322477, 7892150, -22029, -1246992, 5822006, 11039958, 7497499]
40632G497499n823154K080926Q822281M721095m602242p034895p65047N123060
40624A0019523M294710j55395k802044k950788k404950j221309J136916L513547
40616I430210M536635M036404J292544m913987j2017139j2968158m130822P937063
40608f797250J2121614N026795n742106j0421001o166444K396207Q204070O947964
40600E569849N17502l959073j406971M357630M506414l185806j0639795r436297
40592a3676547o42689Q159754J1907751J0251915M358841k836825n376572m0851
40584A2104777O731517M481582p001508j5385955j1078677O24848P190198M330043
40576A996825j594118l656276q18772M324906Q430694Q109779K761434l015108
$$ y = [7497499, 1674345, 3755271, 12577552, 17298647, 12696405, 5661510, 4896463, 10019523, 14314233, 14158838, 11356794, 8406006, 6001056, 4779747, 5916663, 9430210, 13966845, 18003249, 19295793, 14381806, 2364667, -10603491, -14734313, -6797250, 5324364, 10351159, 4609053, -5811948, -11978392, -9582185, -1378115, 5569849, 6087351, 2128278, 721307, 5078937, 9585351, 6399545, -4240250, -13676547, -14319236, -6159482, 5748269, 16000184, 20359025, 17522200, 12145628, 12104777, 18836294, 23317876, 16316368, 930413, -10148264, -9523416, -2333218, 1996825, 402707, -3253569, -4072341, 252565, 8683259, 16793038, 19554472, 16539364]
40568A6539364m219144k428394k953664n264328k948678N050201J0215724N748471
40560A9739552l369840o989639k835887K466499L080518l83158l714836l691341
40552D301868p10742Q30334k830503p877950n398153N409811J2630238P109363
40544A3464266l107451l632110M798875P947084M05978p083639n577293l38209
40536F877501O93660n16505P14090J540483j656759l867656L34816N004570J139717
40527A0263917o990612o673237L057061Q895748L092932n696282o065348P85292
40519F69471N456350L768859n10910k735007j995207k94622n8612j463273j854525
40510I82524l6873K62869l909621o936065m37753J2010470J5397512L306338j0994360
$$ y = [16539364, 12320220, 9891826, 6938162, 1673834, -1274844, 3775357, 13991081, 19739552, 16369712, 9380073, 6544186, 9010685, 12091203, 11708045, 7993209, 4301868, 3591126, 4421460, 1590957, -6286993, -11685146, -6275335, 6354903, 13464266, 10356815, 6724705, 11523580, 19470664, 19876642, 12793003, 7215710, 6877501, 7571161, 7054656, 7768746, 9309229, 7652470, 3784814, 4119630, 9124200, 10263917, 3273305, -3399932, -342871, 8552877, 11645809, 5949527, -115821, 669471, 6125821, 9894680, 9383770, 6648763, 4653556, 4358934, 4300322, 2837049, 982524, 945651, 1208520, -2701101, -9637166, -10074919, 1935551, 17333063, 20639401, 9645041]
40501I645041j1112557R73831R208790N650534j820017l715770j095185j76819
40493G557848j991480k781800j120852O12380J093273K317101N745016Q488392
40485A9919878N910534j895348q693172q960346m288920j53334J819142L643242
40477G301676M060785j087094r555728j1280268j641484R677496J0282052J532870
40469I290305m795861l890058k228224m126854m182090K383199R842693R465417
40461A1758527K338863k636304j617141M51512o45711j864549Q01520M203079
40453A2789796J767299n893042r838793m275871N088515Q065406K881878k795280
40445G789908k796604J068064M056168M226501J071483n574095j1520358r075894
$$ y = [9645041, -1467516, -493685, 8715105, 14365639, 12545622, 8829852, 7734667, 7557848, 5566368, 2784568, 1663716, 2276096, 3369369, 5686470, 11431486, 19919878, 25830412, 23935064, 15241892, 6281546, 1992626, 1839292, 3658434, 7301676, 11362461, 10275367, 719639, -10560629, -12202113, -2524617, 7757435, 9290305, 4494444, 604386, -1623838, -5750692, -9932782, -7549583, 2293110, 11758527, 14097390, 11461086, 9843945, 10295457, 9649746, 7785197, 8586717, 12789796, 14557095, 8664053, -1174740, -5450611, -362096, 7703310, 10585188, 7789908, 4993304, 6061368, 10117536, 14344037, 15415520, 9841425, -1678933, -10754827]
40437a0754827K259131J0961968O931768l830264p019456n64917L412354j673860
40429b78103o739398k242287O056106N829007k686977o799906P3137R123820Q428606
40420A0764005j615184r831164q418930o87101N374917O845429O183663M365774
40412A2981409p19096p793862r701442k114480Q551045J1708023N511994k575889
40404A5847702o847681p956196o692068j691637M226154L804858l790097q875707
40396a1974672l970631N239341Q380163M851542K042553K730861K931279P99186
40388A1029622p50500o18484j372397l317797l024171N43840L723909L656439
40380I870461J543267q13200l183100m420900k428709J848101M595587M546710
$$ y = [-10754827, -8495696, 2466272, 9398040, 5567776, -1451680, -2016597, 1395757, -278103, -7017501, -9259788, -3203682, 2625325, -61652, -6861558, -6788421, 2335399, 10764005, 9148821, -682343, -9101273, -9788374, -4413457, 2431972, 8615635, 12981409, 12262313, 4468451, -5232991, -7347471, 1203574, 12911597, 18423591, 15847702, 9000021, 1043825, -5648243, -7339880, -3113726, 691132, -3098965, -11974672, -15945303, -10705962, -2325799, 2525743, 4568296, 7299157, 10230436, 11029622, 10279122, 9660638, 8288241, 4970444, 1946273, 2490113, 6214022, 9870461, 11413728, 10600528, 7417428, 2996528, 567819, 2415920, 7011507, 11558217]
40372A1558217L833523K484997k314253r203266j0802132l235432O783944R359351
40364H464949L385530l271456l943467L49041L743391J959501l650432p004035
40356C3022l670890K805882M088205j682350n979826j079173Q551290J1706236
40348A4772396N409067j974543k912704R0132R6954l902918o511064m226445j26352
40339G14523Q93478r04671p56044L010823N530996K388008k594268j849131M168970
40330A0602684O417021N71354o068146n719682j757255j873077m476879j613550
40322c917530O455462J0079301M885762j954076l361546j725590j935729k488514
40314F037540K30671M230035M924102K196747r57428l406452m692253k910641
$$ y = [11558217, 15391740, 17876737, 15562484, 6359218, -4442914, -7678346, -894402, 8464949, 11850479, 8579023, 4635556, 4984597, 8727988, 10687489, 7037057, 33022, -3637868, -831986, 3256219, 1573869, -4405957, -5485130, 3066160, 14772396, 20181463, 18206920, 15294216, 15384348, 15481302, 11578384, 5067320, 840875, 714523, 1608001, 703330, -52714, 2958109, 8489105, 10877113, 8282845, 6433714, 10602684, 17019705, 17591059, 11522913, 5803231, 4045976, 2172899, -2303980, -3917530, 2537932, 12617233, 17502995, 15548919, 12187373, 10461783, 8526054, 6037540, 6268211, 10498246, 15422348, 17619095, 16661667, 13255215, 8562962, 5652321]
40306E652321J130793K230735r97150j734213L841319P208038r8197j0075501
40298G158145q290892K244949M117647n870530r704854K689889J5160893R805563
40290A7310810m516762o257913N225777J0712553K808470m239609K35768O708063
40282B7987157K473766q330755j2259689n673412L189957O101788J567239o201692
40274H854359r670451l762848O446818R256798J697741n447386l156387L249440
40266G468084M430014J937158K603773M446725O15736o169351o332950J85714
40258I184903L121771j150350m055358L38450N947942N235960m7257m198078n744448
40249H633535m874090j56733O283545P245154M82833n872444m282437J806281
$$ y = [5652321, 6783114, 9013849, 8016699, 6282486, 10123805, 17331843, 17233646, 7158145, -1132747, 1112202, 5229849, -640681, -10345535, -7655646, 7505247, 17310810, 12794048, 6536135, 11761912, 22474465, 25282935, 21043326, 21279094, 27987157, 30460923, 22130168, 9870479, 4197067, 7387024, 13488812, 15056051, 8854359, -816092, -4578940, 1867878, 11124676, 12822417, 7375031, 4218644, 7468084, 11898098, 13835256, 16439029, 20885754, 21501490, 15332139, 8999189, 9184903, 12306674, 11156324, 7100966, 7439416, 13387358, 18623318, 18576061, 14377983, 8633535, 3759445, 3602712, 9886257, 17131411, 17614244, 11741800, 7459363, 9265644]
40241I265644N061055N207938N021583J990597n898262j1243372n931674M224865
40233G698374O148291k66635k122739M703741Q061839m79815j0916264r508470
40225C318322R54141O508893K216027l698349l531302J422319N772983O155310
40217A9118344K289146k584511l001378K072331N792425K374903l187235k056965
40209B0817060L809309L795311m308449j0049700o142206J572649M878989M407362
40201A8780325L614918N84836n556777p764953r21332P408185P177152J849853
40193B5172207J681897M971555J144674q395446r475399J213912Q298479J344637
40185B5956516q465521o452275K910952N284088k99846k842487P32549K547398
$$ y = [9265644, 14326699, 19534637, 24556220, 26546817, 20648555, 9405183, 3473509, 7698374, 13846665, 13580030, 11457291, 16161032, 24222871, 23743056, 12826792, 3318322, 4272463, 10781356, 12997383, 9299034, 5767732, 7190051, 12963034, 19118344, 21407490, 18822979, 15821601, 17893932, 23686357, 26061260, 22874025, 20817060, 24626369, 28421680, 24113231, 14063531, 7921325, 9493974, 14372963, 18780325, 22395243, 22980079, 17423302, 9658349, 8737017, 16145202, 23322354, 25172207, 26854104, 31825659, 32970333, 24574887, 15099488, 16313400, 24611879, 25956516, 17490995, 11038720, 13949672, 19233760, 18933914, 16091427, 16823976, 19371374]
40177A9371374l95187j526341K229265M691841J371443l270569l585933n07332
40169A8378561J977487K206846M7092l942457o609591m577769K28433K541727
40161A0250329J619819J268667K084843J005060q13347J844431Q051239R306293
40153C4617334K058442o026786o763593j661579K953138M529017L345535p50300
40145C2301208n487583n525320K87997N854365O330373M502429M581402N431398
40137D8276269M563505L131931K354187Q46801k33023L577622J0906167J2869483
40129H6292942O734330K482001P903657J6040617J7051935J3823275J4098300
40122A64427057J5090969R810602K396036J718485M084804j073380j0599460j0527224
$$ y = [19371374, 18976187, 17449846, 19679111, 24370952, 25742395, 22471826, 18885893, 18378561, 20356048, 22562894, 22609986, 18667529, 12057938, 7480169, 7708602, 10250329, 11870148, 13138815, 15223658, 16228718, 15415371, 17259802, 25311041, 34617334, 36675776, 30648990, 23885397, 22223818, 25176956, 29705973, 33051508, 32301208, 26813625, 21288305, 21576302, 27430667, 33761040, 38263469, 42844871, 48276269, 52839774, 55971705, 58325892, 59172693, 58939670, 62517292, 73423459, 86292942, 93027272, 95509273, 103412930, 119453547, 136505482, 150328757, 164427057, 179518026, 189328628, 191724664, 193443149, 197527953, 196454573, 185855113, 175327889]
40114A75327889r9414N442783j1832l251971N826105J7150555J6077479L953304
40106B20414898p855017j5038805k0307577k3319965k1792482j8546565j8000520
40099I5553967j8289615j4583060p898415l676445l260916k915873n12011J659122
40091D6076754O66292l322871o856868o090021j418616J610489n45110l161790
40083B6958259j21181M696736J886159p418782j0854897l331764M851080L983406
40075B0649016j368649k234395M29865M97165j467218q20918J736157K044538
40067A9465561k80348l453234p295066r020131k332827J1168557J7482362P668324
40059C3403198o940600r071531N49314P027659M880224K708448N569291P817805
$$ y = [175327889, 175228475, 180671258, 180659426, 177407455, 183233560, 200384115, 216461594, 220414898, 212559881, 197521076, 177213499, 153893534, 132101052, 113554487, 95553967, 77264352, 62681292, 54782877, 51106432, 47845516, 44929643, 44417632, 46076754, 46743046, 43420175, 36563307, 30473286, 29054670, 30665159, 30120049, 26958259, 26837078, 31533814, 33419973, 26001191, 15146294, 11814530, 16665610, 20649016, 19280367, 17045972, 17475837, 17973002, 16505784, 15684866, 17421023, 19465561, 19185213, 15731979, 8436913, -583218, -2916045, 8252512, 25734874, 33403198, 26462598, 17391067, 17940381, 24968040, 29848264, 32556712, 38126003, 45943808]
40051D5943808N407010K121590L97912k750552p405634q508041m984853j859091
40043B8362149j077661L42767J611799j595373o293931l706300M987917P269152
40035B9900519j044736p763513l508260L595610K333330l613422m097933p8760
40027A5722835L96863k569861k798729q39722j424819j316242O208440J5766178
40019B9144943J3542776j062430j1278613n969956M899451N723836k853150p501003
40011B4645854k619706L351185J777599m452789o334221j358059L677173K073926
40003B0760962l859185o044794k012276J398664j635899o178042l286451N425350
39995D568329Q358029P49094p531379o115402J111011L340213j08981n28172L958696
$$ y = [45943808, 51350818, 53472408, 53870320, 51119768, 43714134, 35206093, 30221240, 28362149, 27284488, 27627255, 29239054, 27643681, 21349750, 17643450, 22631367, 29900519, 28855783, 21092270, 17584010, 21179620, 23512950, 19899528, 15801595, 15722835, 16119698, 13549837, 10751108, 9911386, 8486567, 7170325, 13378765, 29144943, 42687719, 41625289, 30346676, 24376720, 29276171, 35000007, 32146857, 24645854, 22026148, 25377333, 27154932, 22702143, 16367922, 15009863, 18687036, 20760962, 16901777, 10856983, 8844707, 10243371, 8607472, 2429430, -857021, 4568329, 12926358, 13675452, 6144073, 28671, 1139682, 4479895, 4370914, 3842742, 7801438]
39986G801438M658020k304332p671859k845402O315938Q328460K930967r61900
39978A6251330m27040l38945j364123J470446O527448M420197o022941j2255301
39970H261071n857435M325832O070381J586523J47333Q18390l432336r410712
39962B509047p160770J695276M768120n90827l015590K733467O527741Q40169
39954H306633n856891l691948J961906O02262m916245l482060N105720R213478
39946G242855K986732n920917p734936j910490M610560N181958j216604q544373
39938e305215q431377M0036P619265O322053K20738j265645K370001L342175q18097
39929D093934l337017L91841N216110L924370k427229o082486k406253M587022
$$ y = [7801438, 12459458, 10155126, 2483267, -362135, 5953803, 14282263, 17213230, 16251330, 15824290, 15485345, 14121222, 15591668, 22119116, 26539313, 20516372, 8261071, 2403636, 6729468, 12799849, 14386372, 14533705, 15352095, 11919759, 2509047, -4651723, -2956447, 1811673, 1220846, -1794744, 938723, 7466464, 8306633, 2449742, -1242206, 719700, 1321962, -3594283, -7076343, -1970623, 7242855, 10229587, 4308670, -3426266, -5336756, -726196, 4455762, 3239158, -5305215, -13736592, -13696556, -6077291, 244762, 465500, -800145, 1569856, 4912031, 4093934, 756917, 1148758, 6364868, 10289238, 7862009, 1779523, -626730, 3960292]
39921C960292O346994p28418r959998j0817590j705040P630923R011391N804794
39913I543348M947976M716832r69817r475371j1099312l778081L499848L835234
39905A220657N64442m07139J150221K618046L214556K470793m73603l327958j981975
39896E048040K253821K956153j184389l386203K13113L728512J008328m480771
39888F156604n725076k977572j455235j946832q54396K499439M902038M534171
39880E133141K463823Q0911j336910n63897R67645k89567l774621l901277N74901
39871f45851K443733k518407o618471j621191O753854P008740M50090j616181
39863C636316K640195L790534j45250P26788Q905514J1535104P78604j1593369
$$ y = [3960292, 10307286, 9578868, -381130, -11198720, -12903760, -5272837, 3738554, 9543348, 14491324, 19208156, 18238339, 8762968, -2336344, -6114425, -2614577, 1220657, 1785099, 1377960, 2528181, 5146227, 8360783, 10831576, 10357973, 7030015, 5048040, 7301861, 10258014, 9073625, 5687422, 5900535, 9629047, 10637375, 6156604, 431528, -2546044, -4001279, -5948111, -6802507, -4303068, 598970, 5133141, 7596964, 7677875, 6340965, 5777068, 6744713, 6455146, 2680525, -1220752, -645851, 1797882, -720525, -7338996, -8960187, -2206333, 4802407, 5252497, 3636316, 6276511, 10067045, 9921795, 10648583, 19554097, 31089201, 31867805, 20274436]
39855B0274436j2005896o038861p036601j2523381r202601K877178R253677M497705
39847i904344j43702L556141Q385899N524976j545842m856244l830884j492538
39839d306538K536082P174558O142821k158458q403624n240063Q11432P15321
39831b728469j295212L580872J0278644O212539o478863j2121941n789522O29848
39823g712104L0728K90695O108627P926777n9383o149200L00628R134209N102609
39814A4973586o130921o776464L724382Q310345L23611p807161o932046l904116
39806d218784n555724o194779k77788N759126M943999K407090N395822R235604
39798A1494566N156442l999970p710842l440428K477685O444470R240917Q416914
$$ y = [20274436, 8268540, 2229679, -4806922, -17330303, -26532904, -23655726, -14402049, -9904344, -10048046, -6491905, 1893994, 7418970, 5873128, 1016884, -2814000, -4306538, -1770456, 5404102, 11546923, 9388465, 984841, -4255222, -3443790, -2728469, -4023681, -442809, 9835835, 16048374, 9569511, -2552430, -8341952, -7712104, -7681376, -7390681, -1282054, 6644723, 6585340, 436140, 736768, 9870977, 14973586, 8842665, 2066201, 5790583, 14100928, 14424539, 6617378, -314668, -4218784, -9774508, -15969287, -16247075, -10487949, -5543950, -3136860, 2258962, 11494566, 16651008, 12651038, 4940196, 1499768, 3977453, 10421923, 19662840, 28079754]
39790B8079754O39369q630443r198807j517731K699571j685726n330653J13403
39782E168737P969647O416002l670718j0254626p088646l27373K096950K47090
39774E57063j153725m12150N98163P93416J183941K636046M607362N744186M416434
39765A8970736l30827o518978q890612l728670N491362R995578N044427m204046
39757A5828970q116990l119996M890479P376513K048979n213643o869422k122930
39749D701960K046352k25470n282965m666194J934006N009181m69026o228635
39741c180791k801121N449714P048780J718481J16512N165178O336727k954097
39733A6899383j3347012j2612106k832674M146897L322381K8486l00397J890673
$$ y = [28079754, 28719123, 20088680, 10889873, 9372142, 12071713, 10385987, 5055334, 5168737, 13138384, 19554386, 15883668, 5629042, -1459604, -1786977, 309973, 557063, -596662, -1008812, -410649, 382767, 1566708, 4202754, 8810116, 14554302, 18970736, 18639909, 12120931, 3230319, -498351, 4993011, 14988589, 20033016, 15828970, 7711980, 4591984, 9482463, 16858976, 18907955, 13694312, 6824890, 4701960, 6748312, 6522842, 1239877, -3426317, -1492311, 3516870, 3047844, -3180791, -5981912, -532198, 6516582, 8235063, 8351575, 13516753, 19853480, 16899383, 3552371, -9059735, -11892409, -7745512, -4423131, -4394645, -4695042, -2804369]
39725b804369L689654L394511J092206r55386K2696K820521K583026j769575m880926
39716C192358l052125K71412J173903J271672J928053l91516o107842p560129
39708i274214j137588L348820k798311j0282927m514286R455599J2383327M59801
39700b359779r018472m692017M103804N867633L365955K634734R10552l391693
39692b579283k401078O652632J0856251L62539j2674875j0589834K416368P737844
39684b19436J975789q71620M460197O695953j26396n836532k520854K172519l71487
39675E358133m991518l493217N15147n37527l632883j030214M853140N168692
39667B209753K20365j131045K991702M333598j309954p069517n810795J85051
$$ y = [-2804369, 885285, 4279796, 5372002, 4416616, 4439312, 7259833, 9842859, 8073284, 3192358, 140233, 411645, 1585548, 2857220, 4785273, 4393757, -1714085, -9274214, -10411802, -7062982, -9861293, -20144220, -24658506, -15202907, -2819580, -2359779, -11378251, -16070268, -11966464, -6098831, -2732876, -98142, 812410, -2579283, -4980361, 1672271, 12528522, 12891061, 216186, -10373648, -7957280, -219436, 1756353, 884733, 5344930, 12040883, 11914487, 6077955, 3557101, 5729620, 5358133, 366615, -3126602, -2611455, -3148982, -6781865, -7812079, -2958939, 2209753, 2430118, 1299073, 4290775, 8624373, 7314419, 244902, -5565893, -5380842]
39659e380842M574164N415825L882423L5900n209971p914525n543731q94305J838913
39650i196149K076218J107779r03028k695479q59851M452080O832361K223078
39642C037009l598926k955789J727043K348771p96946J10265N445956N792952
39634A1110335k007360p769457l393978M266118M415306j473405m020823q39670
39626B87066K762100L815137K921210q28649o547592p108388J125173P963739
39618D389796J907562r584999q086599P127209J5882141P252578m635284m136711
39610A0115693K542031J067777o283051o188180K461460P458963L070397l392253
39602A0852837m912912k895457q29188N68227P35781m10992M53214N294908Q239429
$$ y = [-5380842, -806678, 4609147, 8491570, 8527470, 3317499, -4597026, -10140757, -11035062, -9196149, -7119931, -6012152, -6915180, -9610659, -10470510, -6018430, 813931, 3037009, -561917, -3517706, -1790663, 558108, -238838, -128573, 5317383, 11110335, 9102975, 1333518, -2060460, 2205658, 6620964, 5147559, 1126736, 287066, 3049166, 6864303, 9785513, 8956864, 2409272, -4699116, -3573943, 4389796, 6297358, -3287641, -11374240, -4247031, 11635110, 18887688, 14252404, 10115693, 12657724, 13725501, 7442450, 1254270, 3715730, 11174693, 14245090, 10852837, 5939925, 3044468, 2215280, 2783507, 3519288, 3108296, 3561510, 8856418, 17095847]
39593A7095847K383079p867535j0777024l837757L279391L608249J096532J219462
39585F200244K260539J63675m504471q117143p713094j809271P057976J0811446
39577D349901M340045m620250l590413N768622Q306380j765398j1127535p300119
39569e638767L157451O324347J737181l92225K967342N038219K322065p52351
39561A4763262p26869j32358k166923o131210q922541p305583N011Q800421J0807579
39552H990789L421723n395237p457050n377335o009969p267018j708689Q633655
39544a2169131J2606438O572006m1315L94515K853405l39587o197928n782001
39536b103598J552417O418226J903168p472881j1248516n337742L368846N499455
$$ y = [17095847, 19478926, 11611391, 834367, -3003390, 276001, 3884250, 4980782, 6200244, 8460783, 8624458, 4119987, -3997156, -11710250, -13519521, -6461545, 4349901, 8689946, 4069696, 479283, 6247905, 14554285, 12788887, 1661352, -5638767, -2481316, 3843031, 5580212, 5187987, 8155329, 13193548, 15515613, 14763262, 14036393, 13904035, 11737112, 5605902, -3316639, -10622222, -10617211, -1816790, 8990789, 12412512, 7017275, -439775, -5817110, -11827079, -19094097, -20802786, -12169131, 437307, 7009313, 6967998, 7362513, 10215918, 9876331, 3678403, -2103598, -551181, 5867045, 7770213, 297332, -10951184, -16288926, -12920080, -7420625]
39528g420625Q55282j920731K036666O901461N682375J074733j53085Q85495j643139
39519F298432n787596l927458K607107L513853l090072o041163M24208O048400
39511D5711J144852p242442p173307q64095J475506K72969L855555J0425912Q911020
39502A0851681j561896q275905m643675L28665j973098o481631m938554L52663
39494a6341750K487502K196887M463213Q027597P660161L788155J445689J574490
39486A5301944P26790k067235m660304o398966p305591m942479J199130M786495
39478c360216L26789o085911l393845P157664J1963474M525450n533922p382804
39470a783321k941249N77504K752094N434311L866930n712829j3995793p688238
$$ y = [-7420625, -6565343, -8486074, -6449408, 452053, 6134428, 7209161, 7056076, 7941571, 6298432, 510836, -3416622, -809515, 2704338, -385734, -6426897, -6002689, 45711, 1190563, -6051879, -13225186, -14089281, -12613775, -12340806, -8485251, 1940661, 10851681, 9289785, 1013880, -3629795, -3301130, -5274228, -11755859, -16694413, -16341750, -13854248, -11657361, -7194148, 833449, 8493610, 12281765, 13727454, 15301944, 16028734, 13961499, 9301195, 2902229, -4403362, -9345841, -8146711, -3360216, -3033427, -9119338, -12513183, -5355519, 6607955, 11133405, 5599483, -1783321, -4724570, -4147066, -1394972, 4039339, 7906269, 2193440, -11802353, -19490591]
39462a9490591R497414J8217798R395498l434237m583239J714115Q64176p440122
39454D740812q920584J267590Q984798K027368j0554938j0985334J373637R573494
39446b493157L970368n186256m638680L049665O146738K172759j164293m57495
39438A399649o82160l958214m641374M44230N247649L616287j024271j460433
39430a058637K244009M077674J744885j302986k060369o78568J995507M520881
39422I482396L567001k054807o737172l590519M808024P577021j05326r396388
39414C550230q715395J475763R748875P961129l22597o009542n110263r75365
39406A602835J809469K310693J842437R28706r4604L67142K631230K992548k156159
$$ y = [-19490591, -9993177, 8224621, 17620119, 14185882, 9602643, 11316758, 12180934, 4740812, -4179772, -2912182, 6072616, 8099984, -2454954, -13440288, -12066651, -2493157, 1477211, -3709045, -8347725, -5298060, 848678, 3021437, 1857144, 1399649, 717489, -3240725, -7882099, -7437869, -2190220, 1426067, 401796, -1058637, 1185372, 5263046, 7007931, 5704945, 3644576, 2966008, 4961515, 9482396, 13049397, 10994590, 4257418, 666899, 5474923, 13051944, 12946618, 3550230, -5165165, -3689402, 6059473, 14020602, 13698005, 7688463, 2578200, 1602835, 3412304, 5722997, 7565434, 8494140, 8399536, 8766678, 11397908, 14390456, 12234297]
39397A2234297r588636j1645632o483580o08330R27541R71268L340255N615824
39389e236993M454941K686239M015874N030027O73968n600168o306915k377715
39381b660742j150374k955708r65083M612147M427780l855103r029760k986468
39373a4563311N998782N638105k328110o674799l969033l84091R29312L120266
39365a2232879O272829N173600q34503m284672l11130N420004M864983p25012
39357C343220l458276j006861N38069l013200o653081l276246N186131R267896
39349I27652M352941l610545o327347k577909K972725N999134M352331j792055
39341D296927p528702n872552J991237M858197k765891r447961k295976J1463220
$$ y = [12234297, 2645661, -8999971, -15483551, -16091881, -15164340, -14193072, -10852817, -5236993, -782052, 1904187, 5920061, 10950088, 11624056, 6023888, -283027, -2660742, -3811116, -6766824, -7731907, -3119760, 1308020, -2547083, -11576843, -14563311, -8564529, -2926424, -5254534, -11929333, -15898366, -16282457, -15353145, -12232879, -5960050, -786450, -1620953, -5905625, -6216755, -796751, 4068232, 3343220, -115056, -1121917, -583848, -3597048, -10250129, -13526375, -8340244, 927652, 5280593, 1670048, -4657299, -7235208, -4262483, 1736651, 6088982, 4296927, -3231775, -9104327, -7113090, -2254893, -5020784, -14468745, -16764721, -5301501]
39333e301501J3073155O85551p784099k805427L532231k86766o579909l794045
39325i260810L385507L793992n87071l23730L337180J838095l673213m092887
39317e582937J118461L510627P96029r77035j06991j097591l462699j452411L851011
39308c403536M546588k86075k915891r39371l80973k416856m57868N568383N950456
39299E264857j781584o214105n55396N089554L07236q058499p283419J054465
39291a2176891N520939L257822O73699j80614k702712n188103j935053M952427
39283g778486O411424O70262l630704j137903K739792J821668j432962j400761
39275c737670J906811M592248N039267L729033L62655m348716o582479l550100
$$ y = [-5301501, 7771654, 8457205, 673106, -2132321, 1399910, 1113144, -5466765, -9260810, -5875303, -2081311, -2668382, -2992112, 345068, 2183163, -1490050, -5582937, -4464476, -953849, -157820, -1134855, -1241846, -2339437, -5802136, -7254547, -3403536, 1143052, 856977, -2058914, -2998285, -3379258, -5796114, -6253982, -685599, 5264857, 3483273, -2730832, -3286228, 1803326, 2110562, -5947937, -13231356, -12176891, -6655952, -3398130, -2724431, -2905045, -5607757, -10795860, -12730913, -7778486, -1367062, -696800, -4327504, -5465407, -2725615, -903947, -2336909, -3737670, -1830859, 2761389, 7800656, 11529689, 11892344, 7543628, 961149, -2588951]
39267b588951J671521L405579O90605k381426l295506l804672m761738k635788
39259a3700376M872217J2128628J0140274j314055j1286675j0538630k842995
39252a2541612J130122j678823m385726j439136M292136P038885N258067J016714
39244a309373l234181m952859k711725O19276J68046l055676j637834P061237
39236i053089J4226657J0002182k434081r704324m483488O487933J1229426N397817
39228B1669033m673522r314958n064029K196046M016054p59580n474075n443424
39220b848455l518690l202706j826116L621181Q270521N180218k519548m411023
39212a254618J537649N318831L77016n851717l433474M437549O172995p56076
$$ y = [-2588951, -917430, 2488149, 3178754, 797328, -2498178, -6302850, -11064588, -13700376, -8828159, 3300469, 13440743, 12126688, 840013, -9698617, -12541612, -11411490, -13090313, -17476039, -18915175, -14623039, -7584154, -2326087, -1309373, -4543554, -9496413, -12208138, -11588862, -11420816, -14476492, -16114326, -9053089, 5173568, 15175750, 12741669, 3037345, -1446143, 5041790, 16271216, 21669033, 16995511, 7680553, 2616524, 4812570, 8828624, 8069044, 2594969, -2848455, -6367145, -9569851, -11395967, -7774786, 495735, 5675953, 3156405, -1254618, 283031, 5601862, 5978878, 127161, -3306313, 1131236, 7304231, 6548155]
39204F548155o553678l925182K395015M399233K151173P45829P06140j426956
39196E039729m943783m885648o36518K128267J56038k706352k585120j540739
39188i974126k091721j283604L563315P554512M474125k192031l155525K284852
39180h20203M802230k77592n541316k899121M517694P437742K878356l890061
39172F207729o984756n049438o98315J785984n2569l333629k281014L789324Q306714
39163A690030O012108O7843l015689k237943j376301j765940q95931K362642N343317
39154F184136N057467J772450j243535p23382L005966N149693J399192n623953
39146A4978034q176295l254699K912203K836468k922881p568144o636116j471405
$$ y = [6548155, -5523, -3930705, -1535690, 2863543, 5014716, 5760545, 6466685, 5039729, 95946, -4789702, -5426220, -3297953, -3141915, -5848267, -8433387, -9974126, -12065847, -13349451, -9786136, -2231624, 2242501, 50470, -3105055, -820203, 3982027, 3704435, -1836881, -4736002, -218308, 7219434, 10097790, 6207729, -777027, -5826465, -6524780, -4738796, -4791365, -8124994, -10406008, -6616684, 1690030, 7702138, 7769981, 4754292, 2516349, 1140048, -625892, -1521823, 840819, 6184136, 11241603, 13014053, 11770518, 11047136, 14053102, 19202795, 20601987, 14978034, 6801739, 3547040, 6459243, 9295711, 6372830, -1195314, -7831430, -9302835]
39138i302835L998028O811823O287422L920124J418905j354566m573680n488208
39130A717013j605087L375651K804001k586923m475433M75021N474144N049559
39122A0227946L396537N045076N208920j667277r980086j0039641l147430J057865
39114A01910k3368j51293K908614L855951O40863j429209N14823J818015r56955
39105G279351l794976k563609l77824k153463o161529o506352j702000L689101
39097a2291301N005909K081166j644241k826711j235743M39586J10248j160305
39089a1521392j174875K65164K046747L838241N134637M167395P51350j662662
39081A844605j20149L373532M762794L257264M80106k871782n628696m775461
$$ y = [-9302835, -5304807, 1507016, 7794438, 11714562, 13133467, 11778901, 7205221, 1717013, 111926, 3487577, 6291578, 3704655, -770778, -295757, 5178387, 10227946, 13624483, 18669559, 23878479, 22211202, 12231116, 2191475, -955955, 101910, 78542, -72751, 2835863, 6691814, 7332677, 5903468, 6418291, 8236306, 7279351, 3484375, 920766, 542942, -1610521, -7772050, -14278402, -15980402, -12291301, -7285392, -5204226, -6848467, -9675178, -10910921, -10471335, -10361087, -11521392, -12696267, -12431103, -10384356, -6546115, -1411478, 2755917, 3507267, 1844605, 1724456, 5097988, 9860782, 13118046, 13598152, 10726370, 5097674, 322213]
39073C22213k24134K674301Q16133q33040K065140L838574k227314r785810o828549
39064a0182486M341617Q509194N57770p103715m810119M01379q54446l941330
39056a3082136O13090R707298J1681372L822793m869915o947730l822011k35493
39048c132732J435036R28707p09688j430951q75360j449201l927705m832602j756218
39039a5750714K157758L412187L970053O386114P101188J896269m760371m448017
39031c5533J952533M709597n109m800686l615856r18120k615796m950682p61067
39022a1040719P332037R461170L454134j972856r54065J289276j161501l889420
39014B518056K85790P438282O676171k682790q855138n111802O83940k92049l827930
$$ y = [322213, 98079, 2772380, 3588513, 2755473, 4820613, 8659187, 6431873, -3353937, -10182486, -5840869, 2668325, 3226095, -3877620, -8687739, -8286360, -9140806, -13082136, -12469046, -2761748, 8919624, 12742417, 7872502, 924772, -2897239, -3132732, -1697696, -768989, -1478677, -2909628, -3784988, -5234189, -9161894, -13994496, -15750714, -13592956, -10180769, -6210716, 175398, 7276586, 9172855, 4412484, -35533, 1917000, 6626597, 6621488, 1820802, -1795054, -2713174, -5328970, -10279652, -11040719, -3708682, 5752488, 9206622, 7233766, 6279701, 7568977, 6407476, 2518056, 2803846, 10242128, 16918299, 14235509, 5380371, 268569, 952509, 660460, -3167470]
39005c167470j171421N097542M764280l355947r543894p985823l403504j089702
38997a9855939N26582L836120O171222M599974J208829n51555o08624l6022J899866
38988b809547N118145O473651L308914k819843p645530p525608j518294O528775
38980h89337Q896777K016102p035453q044804j131181M569548N196143N471774
38972I049569O521712K215021p460964j1141118k600038P329648N809369k926066
38964F797133n507033n54957J696978j940093l482582R41539M696123L034769
38956E681877P67687K257138L072022j487874o612863m790582J828967M093497
38948D809869m93074m252809p58579N986938P108128N33640o658740p014510q85142
$$ y = [-3167470, -4338891, 758651, 5522931, 2166984, -7376910, -15362733, -18766237, -19855939, -19329357, -15493237, -9322015, -4722041, -3513212, -4064767, -4673391, -4709413, -2809547, 2308598, 8782249, 12091163, 9271320, 1625790, -5899818, -7418112, -889337, 8007440, 10023542, 2988089, -5056715, -6187896, -1618348, 3577795, 9049569, 15571281, 17786302, 10325338, -815780, -3415818, 3913830, 9723199, 6797133, 1290100, 735143, 2432121, 492028, -2990554, -2049015, 2647108, 5681877, 6449564, 8706702, 11778724, 10290850, 3677987, -1112595, 716372, 4809869, 4316795, 63986, -694593, 5292345, 12400473, 12934113, 6275373, -739137, -1624279]
38939a624279M958509M969496k59535n555635o184456j991496K298119J751211
38931a638066k797180n066175j274214M504063N866293K759138L13018M69275
38923C136152J78489k097085l640658k436680l7391J884398L310747L108631m41923
38914B964680m876679m811030j37189K676559K79059k381659l50662L437390L467377
38905B67846K64906j716316j372958p25483L8757K031529L648298J830318k880876
38896A386021n843797l355375K890413O413090K265036n588879o415937L039566
38888e209862J0480255L099620j1951930j4886706j821186R163538N723522j084936
38880f487685K516551R377011M505632q302552j1809501k881472L891029K43424
$$ y = [-1624279, 3334230, 8303726, 8044191, 2488556, -3695900, -5687396, -3389277, -1638066, -4435246, -9501421, -10775635, -6271572, -405279, 2353859, 2666877, 3136152, 3314641, 1217556, -2423102, -4859782, -4897173, -3012775, 297972, 3406603, 2964680, -1911999, -6723029, -6860218, -4183659, -3904600, -6286259, -6636921, -3199531, 267846, 532752, -1183564, -2556522, -3282005, -3243248, -1211719, 2436579, 4266897, 1386021, -4457776, -7813151, -4922738, 1490352, 3755388, -1833491, -8249428, -5209862, 5270393, 8370013, -3581917, -18468623, -20289809, -11126271, -5402749, -6487685, -3971134, 5405877, 9911509, 1608957, -10200544, -13082016, -9190987, -8947563]
38872h947563m922342k300467M289892O818726M786222K021906l28943k230980
38864h13549k136918k51222L17216j275018j640336J231560M349578L768021o80131
38855B869201n643219o966754k772077L850714P125031N751427L951492K897306
38847A1063121j899124r583131r661191J761203J0595499L397944j0024079r938292
38839a4288050K235298O836325r39298m134697M959802J0650556J862381p238728
38831e6411j238156R359539N419252q523515j1726102o67166P355930L015805
38823B939176l351460k131632J497372M87661j587314N26232L170708J151402
38815B702145k075222m64991L582605K676336l823335q652411o339955J069378
$$ y = [-8947563, -13869905, -16170372, -11880480, -5061754, -275532, 1746374, 1417431, -813549, -2950467, -3201689, -2884473, -4159491, -5799827, -4568267, -218689, 3549332, 2869201, -2774018, -9740772, -12512849, -8662135, -1537104, 4214323, 8165815, 11063121, 9163997, -419134, -10080325, -8319122, 2276377, 5674321, -4349758, -14288050, -12052752, -5216427, -6155725, -10290422, -5330620, 5319936, 7182317, -56411, -1294567, 8064972, 13484224, 4960709, -6765393, -7432559, -76629, 2939176, -412284, -2543916, -1046544, -558883, -2146197, -1619965, 1550743, 2702145, 626923, 161932, 3744537, 6420873, 2597538, -6054873, -12394828, -11325450]
38807a1325450P483487Q298469L339020k669894l724832O59909M058008J554920
38799G673637k958594k526012J939618L010003j104288l392095L33174M139261
38791G114704J735284k777223j752705K757488K321007l141967m818936l28320
38783A109332J588491m054827r327024o122799P05058K058481l36200J644387
38775a2735101P086090O645373j922607r075467o269381L899561J2213417J2125713
38767A1967598L888987n759617q254903k059287M532265M032251r5441l35145
38759G916708K149746J068375k092429o01701L275254P738r556824j2098690k112618
38750a2044441Q542797Q417919K418819J154774L974769L135261j927384n218060
$$ y = [-11325450, -3841963, 4456506, 7795526, 5125632, 1400800, 2060709, 6118717, 7673637, 4715043, 2189031, 4128649, 7138652, 6034364, 2642269, 2975443, 7114704, 8849988, 6072765, 4320060, 7077548, 9398555, 6256588, 1437652, 1109332, 2697823, -1357004, -10684028, -16806827, -16101769, -14043288, -14379488, -12735101, -5649011, 996362, -926245, -10001712, -16271093, -12371532, -158115, 11967598, 15856585, 10096968, 1842065, -217222, 4315043, 8347294, 8251853, 7916708, 10066454, 11134829, 9042400, 8440699, 11715953, 11723691, 2166867, -9931823, -12044441, -3501644, 4916275, 7335094, 8489868, 12464637, 15599898, 13672514, 8454454]
38742H454454m884536l664500j499527L360389P515170N039836k940216p951381
38734C429689m580663L155425O778501K342518n539912p932151j377641O884756
38726C160522P182111K90856m070584j915699L72274j310810j398932M062210
38718F371948P895082K424050p095665r436046l262536L268340N232772M193738
38710I591683J717877j231029q24935M509948P607797R64317r850741j1890761
38702E94156l876088J915906j065113m080438J865357J1257191J2227303L222523
38694B2060797o539226r853601p547110l285464J021236L933685L450460n32728
38686B708049m903154o269136m547389k535317k058062j691520P62086M307768
$$ y = [8454454, 3569918, -94582, -1594109, 1766280, 9281450, 14321286, 11381070, 3429689, -1150974, 2004451, 8782952, 11125470, 5585558, -2346593, -3724234, 3160522, 10342633, 10633489, 6562905, 4647206, 5019480, 3708670, 2309738, 6371948, 14267030, 16691080, 9595415, 159369, -3103167, 165173, 5397945, 9591683, 11309560, 10078531, 9253596, 13763544, 21371341, 22335658, 12484917, 594156, -3281932, -1366026, -2431139, -6511577, -4646220, 6610971, 18838274, 22060797, 15521571, 5667970, -1879140, -5164604, -4143368, -209683, 3240777, 2708049, -2195105, -8464241, -13011630, -15546947, -17605009, -19296529, -18534443, -14226675]
38678a4226675N303264K442557q14042j08615M781272R761956J0121949M106475
38670B1368141n217588j1208558r253148j885405M143467N930007N853251N070872
38662A4801039J488882m004705n953110k826956q25685m054209o958980l172061
38654a1505785L550474N215977J950500n11611j963348n824332q411539k445645
38646a9945309Q085174R463997j292830r561006l887618O656392O120587m481492
38638h842105r379328j565690Q317561Q754318K689039L71803L661834N116737
38630I124169K95678o194985p837913m166069P18716L834327M374674J733976
38622A882573l438669p194455n359747R63337O166948O849818M676318K187815
$$ y = [-14226675, -8923411, -6480854, -7294896, -7403511, -2622239, 7139717, 17261666, 21368141, 16150553, 4941995, -4311153, -6196558, -2053091, 3876916, 9730167, 14801039, 16289921, 12285216, 6332106, 3505150, 2679465, -1374744, -8333724, -11505785, -7955311, -2739334, -788834, -1300445, -3263793, -9088125, -17499664, -19945309, -11860135, -2396138, -3688968, -13249974, -17137592, -10481200, -4360613, -8842105, -18221433, -19787123, -11469562, -2715244, -26205, 345598, 4007432, 9124169, 9419847, 3224862, -4613051, -8779120, -8060404, -4226077, 148597, 1882573, -1556096, -8750551, -14110298, -13146961, -6980013, -130195, 4546123, 6733938]
38614F733938m07313k914635l440211j395440P39707J115611J274153K555015
38606D260825K464850j667549o962270p104792p38466N316191L430703m888072
38598e888580r008837j440055J1297806J4941244N674569m554447n105176j292737
38590D623787l311507p568311k876756P941857R507672j270896r083669m813169
38582f850992P96810k334883n922098l9502O909043K827097m470146R07544J4020459
38573E843332J4411679j017853j2393435p544169J655843Q88234n511515n203876
38565h871760K639830Q935816P950255R22072p445822j0582185m506353N128350
38557e829797P575244J957914r84395L999606Q121452L274663m841294o693431
$$ y = [6733938, 6326625, 3411990, -28221, -1423661, -683954, 431657, 1705810, 4260825, 6725675, 5058126, -1904144, -9008936, -9747402, -4431211, -1000508, -5888580, -14897417, -16337472, -5039666, 9901578, 15576147, 11021700, 5916524, 4623787, 1312280, -6256031, -9132787, -1190930, 8316742, 7045846, -2037823, -6850992, -6054182, -8389065, -14311163, -14350665, -7441622, -4614525, -9084671, -8177127, 5843332, 20255011, 19237158, 6843723, -700446, 955397, 1843631, -3667884, -8871760, -6231930, 2703886, 10654141, 11576213, 4130391, -6451794, -10958147, -5829797, 1745447, 3703361, 2718966, 6718572, 14840024, 18114687, 13273393, 6579962]
38549F579962l331907j381337r41573J240632K410561j454983n729302k981797
38541e589744L954605N700515J574343j58590K658157K511284l571172p384549
38533c05151k727818L973545L883310l30922j65773L397353J316483o964136r793786
38524g716895p77869R459019P464300l197276p284879p71343M159170p10966o922559
38515f299298l840819M348319O537243K608457J215682L299596R81805o886668
38507A964317j0514553m157169M572611N684018P3226l631061r13625M581321
38499b340915O421407K153638l966940n115588n35889K752010N38148j222228
38491a316357L218146P061097L99183j1268283j2341381j154359O800287L167749
$$ y = [6579962, 3248055, 1866718, 925145, 2165777, 4576338, 3121355, -2607947, -5589744, -1635139, 4065376, 5639719, 5481129, 8139286, 10650570, 7079398, -305151, -3032969, 940576, 4823886, 4492964, 4327191, 7724544, 9041027, 2076891, -7716895, -8494764, 964255, 8428555, 5231279, -2053600, -2824943, 1334227, 623261, -6299298, -10140117, -5791798, 745445, 3353902, 4569584, 7869180, 8850985, 1964317, -8550236, -12707405, -8134794, -2450776, -2377550, -6008611, -6922236, -2340915, 4080492, 6234130, 2267190, -2848398, -3384287, -632277, -94129, -1316357, 1901789, 8962886, 9362069, -1906214, -14247595, -15401954, -8601667, -5433918]
38483e433918j609144K070978O843497K701308m931219m477275K990308O983641
38475E138176L836692j498018n111003n769764j757392M810159N944007r23913
38467D668944n990099j281757N425214K776138m998357n269426J874213N283469
38459B488339K305053L90379N44898l775997j0265792p614893M378341J0924142
38451f25530M603795l292723j471770M977425O221905L673300L445576L512251
38443B1044229q78287n918629m759336M19606K110652k97892j389346m4911k4699
38434A0261387k008809l118684l260391m688968n999810l292300K795096P000865
38426b311614O482541L202098l57570l340089m679219l263302n6480K688027L570397
$$ y = [-5433918, -7043062, -4972084, 1871413, 4572721, -358498, -4835773, -1845465, 5138176, 8974868, 7476850, 2365847, -3403917, -5161309, -351150, 5592857, 4668944, -1321155, -2602912, 2822302, 5598440, 600083, -4669343, -2795130, 2488339, 4793392, 5183771, 5728669, 1952672, -8313120, -15928013, -11549672, -625530, 3978265, 685542, -786228, 4191197, 10413102, 14086402, 17531978, 21044229, 20165942, 14247313, 9487977, 9907583, 12018235, 11720343, 10330997, 10286086, 10261387, 8252578, 5133894, 1873503, -2815465, -8815275, -12107575, -9312479, -2311614, 4170927, 7373025, 7015455, 3675366, -1003853, -4267155, -4323635, -1635608, 1934789]
38417A934789J637535l364617p768942n235221M308142J1105008O973737l066852
38409F523579p517127m117537p31994j677961k201471J842431O673227O377365
38401E170512P36583n611775q004942m336993L061886P300805L376961m476051
38393b783014p039541k379203K299334K311430J637943M321279P132827N889568
38385A1390623K789204J361515n22652n503175q862672m144281N359318R073552
38377A0941432L360752l897397m503701J90820L149709R74332l674900o491804
38369D9243n784112l132162r66721M90748L132065P216690R525765O976549N03981
38360A8012046o297833j0320965r178835j916660P291271R979858K923890n953467
$$ y = [1934789, 3572324, 207707, -7561235, -12796456, -8488314, 2616694, 9590431, 6523579, -993548, -5111085, -5843079, -7521040, -9722511, -7880080, -1206853, 5170512, 5907095, 295320, -7709622, -12046615, -8984729, -1683924, 1693037, -2783014, -9822555, -12201758, -9902424, -7590994, -5953051, -1631772, 5501055, 11390623, 14179827, 15541342, 15018690, 9515515, 652843, -3491438, 1867880, 10941432, 14302184, 10404787, 5901086, 6091906, 9241615, 10215947, 6541047, 49243, -5734869, -8867031, -9833752, -9343004, -6210939, 1005751, 10531516, 17508065, 18012046, 11714213, 1393248, -7785587, -9702247, -2410976, 7568882, 10492772, 4539305]
38352D539305o748802l93254L866245J990483j062472o57113J819568L638444
38344F992404M505737M063157J415987j428870j178371P34430l33392l936012
38336A0835070m482991p01481K083380Q35770j635247l841783p566643r976294
38328a4450219m075318P964915J2523331L171227q012118p206286J569773M894839
38320c619856J004776q04374K178879K936381j204202l833518q32263L511789
38312f62388M488052L201168K338500J987236J449521K22983l010856p460331
38304B553885p841411j298627N257181K814707n840018q942308k581445M721853
38296a1156183N671462K946826J363625J24066k608286m414731k807977J44630
$$ y = [4539305, -2209497, -2602751, 1263494, 3253977, 2191505, 1534392, 3353960, 6992404, 11498141, 15561298, 16977285, 15548415, 14370044, 15104474, 14771082, 10835070, 6352079, 5650598, 7733978, 8569748, 6934501, 3092718, -4473925, -14450219, -18525537, -10560622, 1962709, 5133936, -2878182, -10084468, -8514695, -3619856, -2615080, -3419454, -1240575, 1695806, 491604, -3341914, -4174177, -662388, 3825664, 7026832, 9365332, 11352568, 12802089, 13025072, 10014216, 2553885, -5287526, -6586153, -1328972, 1485735, -4354283, -13296591, -15878036, -11156183, -5484721, -2537895, -1174270, -1050204, -3658490, -8073221, -10881198, -10736568]
38288a0736568J105255l64656k859258m438371k390458L372911O942973K805177
38280f562995m539846n003256K431173P957900N517196K68875j292081p645R18652
38271c12027J562627J857477j56320l028402k249062J036020J97589m577895m140486
38262i810479M325525J0224889N000495m798517q228724n074727j160248L128649
38254f393137Q906986J0292565J891086r453898j1732076m006263M198702O943187
38246F47152N681783J903739l669468o258491j674220M815481L825226m108877
38238A162325q948901n791759j94720J887087J031791j42643q33202J8318K996837
38229h814867M706197J602296k621994r18875N539869P800630K362141m174119
$$ y = [-10736568, -9631313, -9995969, -12855227, -17293598, -19684056, -16311145, -9368172, -6562995, -11102841, -16106097, -13674924, -5717024, -199828, 69047, -1223034, -1230679, -312027, 1250600, 3108077, 2951757, -76645, -2325707, -1289687, -1092098, -5669993, -9810479, -5484954, 4739935, 9740430, 4941913, -3286811, -8361538, -9521786, -6393137, 2513849, 12806414, 14697500, 5243602, -6488474, -10494737, -6296035, 647152, 6328935, 8232674, 4563206, -1695285, -3369505, 1445976, 5271202, 1162325, -7786576, -13578335, -13773055, -11885968, -10854177, -10996820, -11830022, -11811704, -8814867, -4108670, -2506374, -5128368, -6047243, -507374, 7293256, 9655397, 5481278]
38221E481278n632217l429454p35887K402259M688519K347686l160720l746699
38213a785235L249373Q472194L255121o587359q339598o01447N424555K562171
38205E649775l515347m853786k803552l159452m737305j029395P442668J0869581
38197C863187L844246n256776n038005K878861O785178K223885l022475k521480
38189C756621j4710m08433q93074K136962M496715R03932m861481n238672p21149
38180h43289K303782K726252M458271O593804L594469m149784q723815n522841
38172D36849J278663N551154N219043O71276o092325r642405n326031L105876
38164d797900O619796L146085j70501J353536L764114K945332J289316J120676
$$ y = [5481278, -150939, -3580393, -4316280, -1914021, 2774498, 5122184, 1961464, -1785235, 1464138, 9936332, 13191453, 6604094, -1735504, -2336951, 3087604, 5649775, 2134428, -2719358, -5522910, -8682362, -13419667, -14449062, -7006394, 3863187, 7707433, 2450657, -2587348, 291513, 7076691, 9300576, 6278101, 3756621, 3741911, 3333478, 2440404, 4577366, 9074081, 9978013, 5116532, -122140, -843289, 1460493, 4186745, 8645016, 15238820, 18833289, 14683505, 5959690, 436849, 1715512, 7266666, 12485709, 13156985, 7064660, -2577745, -7903776, -4797900, 1821896, 4967981, 4797480, 6151016, 9915130, 12860462, 14149778, 15270454]
38156A5270454j226034q121192j3005875p957137L912554J1109629Q123142P73246
38148H878787l247142l304621k989874k950613j012828K087722K005390k477715
38140c010894n736691k386875L824887L936885l009732p286987k185189N892871
38132i961725O777921J165084j594948K183589O350665M934000n40518m908176
38124D405892n350816k392215J155838J875973l91937j303237J892096N157963
38116E049557L310337j542100l148639q12906O54432o93924k453348l555357m339752
38107g531700k341627M000215Q769577N096902k269395j691682O957121J0425241
38099B1414652K276997o698432m850357L313512M986270k706434j0824169j1158335
$$ y = [15270454, 14044420, 5923228, -7082647, -15039784, -11127230, -17601, 8105541, 8878787, 5631645, 2327024, -662850, -3613463, -4626291, -2538569, -533179, -3010894, -8747585, -11134460, -7309573, -3372688, -6382420, -13669407, -15854596, -9961725, -3183804, -2018720, -3613668, -1430079, 4920586, 9854586, 9314068, 4405892, -944924, -3337139, -2181301, -305328, -697265, -2000502, -108406, 5049557, 8359894, 6817794, 3669155, 2856249, 3510681, 2816757, 363409, -3191948, -7531700, -9873327, -5873112, 2896465, 7993367, 5723972, 4032290, 10989411, 21414652, 23691649, 16993217, 12142860, 15456372, 20442642, 17736208, 6912039, -4246296]
38091d246296l906067M762493Q164540M403284j237525k411279q17712l093742
38083A617696p810332m992878P301670J5955327R988313l271470q597295l585451
38075F605580J253060l74109l789063l316086k23379J059691r70435m184270n058268
38066h997279j603019L738498N575603K132171k035783k185372P46839K856124
38058B27782K335918o36786m921489o797584k518530M445801N038539k192863
38050e019212o687659r54934P109549N741829k605554n317071J394576Q478553
38042B140077Q394646L498327r21247l335566l727245j784021L71571o86435l996288
38033d6181m505131l95271M270754N176557K091122k705738o382897o064837j487627
$$ y = [-4246296, -8152363, -3389870, 4774670, 9177954, 7940429, 5529150, 4711438, 1617696, -6192636, -11185514, -3883844, 12071483, 22059796, 18788326, 10191031, 6605580, 7858640, 7484531, 3695468, 379382, 156003, 1215694, 245259, -3939011, -8997279, -10600298, -6861800, -1286197, 845974, -1189809, -3375181, -2628342, 227782, 2563700, 1926914, -2994575, -9792159, -12310689, -7864888, -2826349, -5019212, -11706871, -12661805, -5552256, 189573, -2415981, -7733052, -6338476, 2140077, 10534723, 14033050, 13111803, 9776237, 6048992, 4264971, 4636542, 3950107, -46181, -4551312, -4946583, -675829, 4500728, 6591850, 3886112, -2496785, -8561622, -10049249]
38024a0049249L072831L410364J100665N25244J744332J398720p22547j783421
38016a303061j501589j598476p63473K969754N669359J477603o385125p412530
38008h847538J032714Q823031P210997J90025l379922k266920j136331j389116
38000B36940o88152J247178K460041K515762J460275k749310j0282813j4746638
37992b0546717r117227L326830J0325826N315993m025306n595725J875153Q083766
37984a0357407N078556k664574m373946L269030J2006634J1847286K379512p333756
37976I851335q816394k267129N080503O854674K833441k839948o709591p715549
37968c728658n190828R04803O560288N352933k326203o113495J260330J0929691
$$ y = [-10049249, -6976418, -3566054, -2465389, -1940145, -195813, 1202907, 480360, -1303061, -2804650, -4403126, -5166599, -2196845, 3472514, 4950117, -1435008, -8847538, -7814824, 1008207, 8219204, 8409229, 5029307, 2762387, 1626056, 236940, -451212, 795966, 3256007, 5771769, 7232044, 4482734, -5800079, -20546717, -29663944, -26337114, -16011288, -10695295, -14720601, -20316326, -18441173, -10357407, -5278851, -7943425, -12317371, -9048341, 2958293, 14805579, 17185091, 9851335, 1034941, -1232188, 3848315, 10702989, 13536430, 10696482, 3986891, -3728658, -8919486, -8014683, -1454395, 3898538, 1572335, -4541160, -3280830, 7648861]
37960G648861P900331o337794j3397567l909334Q699916Q330235j142823n036016
37952B755809r48031J811029O22567J460219L945046N45353p533158q854281l67379
37943f562826O560294M628564J548184M432656O174668j399681j1223635j1070951
37935f912727k782812K149574J447079K609744O980449P226913J372978l340071
37927H751127l154805l101095n900809n976691P8776N906085M907023N49341O5494
37918B124446K943753L039400j039616m676869m934352l534086k524163j728480
37910a0329967p01357K68987J202740K058188J969172Q52880K50413M49941p48066
37901d727069l521270l597273J135732M892098J493703m479332k567463P205850
$$ y = [7648861, 15549192, 9211398, -4186169, -8095503, 604413, 8934648, 7791825, 2755809, 1807778, 3618807, 4241374, 5701593, 9646639, 10191992, 2658834, -6195447, -6562826, -2532, 4626032, 6174216, 10606872, 16781540, 15381859, 4158224, -6912727, -9695539, -7545965, -6098886, -3489142, 3491307, 10718220, 12091198, 8751127, 5596322, 2495227, -3405582, -9382273, -9303497, -3397412, 1509611, 2058952, 2124446, 5068199, 8107599, 7067983, 2391114, -2543238, -6077324, -8601487, -10329967, -11031324, -10762337, -9559597, -7501409, -5532237, -4679357, -4428944, -3979003, -4727069, -8248339, -11845612, -10709880, -5817782, -4324079, -8803411, -11370874, -4165024]
37893d165024J2316333N578190l972938m563714J287487K384050l053900n813333
37885b849j537899K611720J77479m608288m466316k55089K022147J178781P89702
37876d090612J386539o7470k991401k315066L249429P727522N970052Q77550j524384
37867H222159q75480j312076l509418l800853j287157L3305j843843l101110n50913
37858h025386K378313Q03146l412928m121368j63918L485131L797385L322561
37850a937064M448628N057072K467258j800961l810867j726408K648324M912894
37842A0258876J118841o809194r895193k117557Q882724R153409j946859r165996
37834e20949l081417N769691L187048o739579q207857K206323J1199457Q256211
$$ y = [-4165024, 8151309, 13729499, 9756561, 5192847, 6480334, 8864384, 5810484, -2849, -1540748, 1070972, 1248451, -3359837, -7826153, -8081242, -6059095, -4880314, -4090612, -2704073, -2771543, -5762944, -8078010, -4828581, 2898941, 8868993, 9746543, 8222159, 7346679, 6034603, 2525185, -1275668, -2562825, -2529520, -4373363, -7474473, -8025386, -5647073, -4843927, -8256855, -12378223, -12542141, -9057010, -5259625, -1937064, 2511564, 7568636, 10035894, 8234933, 4424066, 2697658, 5345982, 10258876, 11377717, 4568523, -5326670, -7444227, 1438497, 10591906, 8645047, -520949, -3602366, 2167325, 5354373, -1385206, -9593063, -7386740, 3812717, 12068928]
37826A2068928j975752q890495q219611k345932M161383O551642L362861m44953
37818D268071P02647L899387J315316o879481j1297349o751826J095339N054554
37810h593342M790106K942350K53217k005614j527006k4335j902515n209283k203821
37801a3480243P218124J1829269M861947m887286n453581J730223O343957M915714
37793A3078124K587547K144996N73374l531990o273456l855763J996470N321534
37785A2040836K120243l970461l904372M925489J1641158M638109j0008608j4420032
37777C062362m606071L715139K01135m615668Q52470Q476424M709448n390709
37769F404530o659655M48984K035806m032145m654894M979855J2252422O883898
$$ y = [12068928, 10093176, 1202681, -7016930, -9362862, -5201479, 1350163, 4713024, 4268071, 4970718, 8870105, 10185421, 3305940, -7991409, -14743235, -13647896, -8593342, -3803236, -860886, -607669, -2613283, -4140289, -4164624, -6067139, -11276422, -13480243, -6262119, 5567150, 10429097, 5541811, 88230, 1818453, 8162410, 13078124, 15665671, 17810667, 18384041, 14852051, 8578595, 4722832, 6719302, 12040836, 14161079, 10190618, 6286246, 11211735, 22852893, 27491002, 17482394, 3062362, -1543709, 2171430, 2372565, -2243103, -1390633, 7085791, 11795239, 6404530, -255125, 193859, 2229665, -1802480, -6457374, -1477519, 10774903, 17658801]
37761A7658801m535763j0409443r052275n124961p17672L233633L994809J503642
37753c449229K48988K548933N256088N768052N112688K959230k879881r065023
37745F499846p261272L128704J0422397N186012o526348j1121867m541179M957999
37737G44292Q406194M737453j056514l940822k966284j449343k500626m144488
37729b170138j528320N226869R023550M064242o266775j2491411r265567q87985
37721a4295535L693716J152360k201184J101822Q460741R928437K916472l519849
37713G236980k817758n63556k997428m730229J337745R116513P810943K87773
37705A4680983k125711K0915l722684j2023445j1034472J245384Q863542L225334
$$ y = [17658801, 13123038, 2713595, -6338680, -11463641, -12181313, -8947680, -4952871, -3449229, -3200241, -651308, 4604780, 10372832, 15485520, 18444750, 15564869, 6499846, -761426, 2367278, 12789675, 17975687, 11449339, 327472, -4213707, 744292, 9150486, 13887939, 12831425, 8890603, 5924319, 4474976, 1974350, -2170138, -3698458, 1528411, 10551961, 14616203, 8349428, -4141983, -13407550, -14295535, -10601819, -9449459, -11650643, -10548821, -2088080, 7840357, 10756829, 7236980, 4419222, 3855666, 858238, -3871991, -2534246, 6582267, 14393210, 14680983, 12555272, 12576187, 8853503, -3169942, -14204414, -12959030, -4095488, -870154]
37697h70154l453639K5555N497827K120220l536598l61613N998860K899411o152345
37688B167524o926114J254283N211896P29076k207029J212325K751149k453536
37680A739574o246867j647213M951353M505320l28215p62909L822899O103627
37672A2137569K609502k264550l497815j225707J016869L24191l422907p113447
37664a436295o581606j202199M430792N352262J911351j481656k417479k436759
37656c861589k882020k185738P36521K826615J00040n762034p430299k15166J1360344
37647g313326J7049653J0708485l590771j4554453j3505733l131401M561546J963004
37639g812996m153454j862950P789758J0904821J406169q761308o869267K523780
$$ y = [-870154, -4323793, -4298238, 1199589, 3319809, -216789, -578402, 5420458, 8319869, 2167524, -4758590, -3504307, 1707589, 2436665, 229636, 1441961, 4193110, 1739574, -4507293, -6154506, -1203153, 3302167, 2973952, 2211043, 6033942, 12137569, 14747071, 12482521, 8984706, 7758999, 8775868, 9100059, 5677152, -1436295, -8017901, -9220100, -4789308, 562954, 2474305, 992649, -1424830, -3861589, -6743609, -8929347, -8192826, -5366211, -5266171, -11028205, -18458504, -18673670, -7313326, 9736327, 20444812, 16854041, 2299588, -11206145, -14337546, -9776000, -7812996, -11966450, -13829400, -6039642, 4865179, 6271348, -2489960, -9359227, -6835447]
37631f835447O679104M204770K995549L957133J116127m265490m323592N55562
37623D083716J715158j728922j447142L066820J779348o696052r458891q68472
37615i554437N834933n39844j0431741r182796L5508L975635J273802Q52157M321900
$$ y = [-6835447, -156343, 4048427, 7043976, 11001109, 12117236, 7851746, 3528154, 4083716, 5798874, 4069952, 2622810, 5689630, 7468978, 772926, -8685965, -9554437, -3719504, -4259348, -14691089, -23873885, -23838377, -19862742, -18588940, -17736783, -13414883]
$$ [...]
##END NTUPLES=NMR SPECTRUM
##END=
