##TITLE=31Pdec_LR-0154-OMe-EtOAc
 CD3CN, 64 sc
 15.2.2023
##JCAMPDX= 6.0         $$ Bruker NMR JCAMP-DX V2.0
##DATA TYPE= NMR SPECTRUM
##DATA CLASS= NTUPLES
##ORIGIN= UXNMR, Bruker Analytische Messtechnik GmbH
##OWNER= root
$$ XWIN-NMR		Version 3.5
$$ Wed Feb 15 14:24:54 2023 Russian Standard Time (UT+4h)  she@DPX200
##.OBSERVE FREQUENCY= 81.013821
##.OBSERVE NUCLEUS= ^31P
##.ACQUISITION MODE= SIMULTANEOUS
##.ACQUISITION SCHEME= undefined
##.AVERAGES= 64
##.DIGITISER RES= 16
##SPECTROMETER/DATA SYSTEM= spect
##.PULSE SEQUENCE= zgpg30
##.SOLVENT NAME= CDCl3
##.SHIFT REFERENCE= (INTERNAL, CDCl3, 0, 248.564)
##AUDIT TRAIL= $$ (NUMBER, WHEN, WHO, WHERE, WHAT)
$$ ##TITLE= Audit trail, XWIN-NMR		Version 3.5
$$ ##JCAMPDX= 5.01
$$ ##ORIGIN= Bruker BioSpin GmbH
$$ ##OWNER= she
$$ F:/spectra/data/she/nmr/P31/1/pdata/1/auditp.txt
$$ ##AUDIT TRAIL=  $$ (NUMBER, WHEN, WHO, WHERE, WHAT)
(   1,<2023-02-15 14:23:49.89 +0400>,<she>,<DPX200>,
      <continue with go, POWCHK disabled, PULCHK disabled
       configuration hash MD5:
       00 E9 B6 7A A2 85 ED C7 34 08 36 98 17 FE 4E 26
       data hash MD5: 32K
       79 67 7B 06 BB 50 DD CC A5 04 A8 F4 61 C5 97 E0>)
(   2,<2023-02-15 14:23:52.56 +0400>,<she>,<DPX200>,
      <Start of raw data processing
       efp BC_mod = 2 LB = 1 FT_mod = 6 PKNL = 1 PHC0 = -10962.75 PHC1 = 16.21271 SI = 64K 
       data hash MD5: 64K
       14 7E 86 A6 FA A0 C9 7A 8D FE 40 64 1B 23 DF 50>)
(   3,<2023-02-15 14:24:05.26 +0400>,<she>,<DPX200>,
      <pk PHC0 = 5.614646 PHC1 = 0 
       data hash MD5: 64K
       18 3F E6 AA 0E D4 8C C5 A5 3A B7 CF 0A 9B FB DC>)
(   4,<2023-02-15 14:24:11.39 +0400>,<she>,<DPX200>,
      <abs ABSG = 5 
       data hash MD5: 64K
       53 37 F2 93 4E 4D 46 CA 59 05 3A 46 CF 54 94 B5>)
$$ ##END=
$$ 
$$ hash MD5
$$ 66 D8 16 A9 8E A6 C7 A6 74 A7 AB 19 10 2A 3B 23
##$RELAX= 
##$RELAX= 
##$RELAX= 
##$RELAX= 
##$RELAX= 
##$RELAX= 
##$RELAX= 
##$RELAX= 
##$RELAX= 
$$ Bruker specific parameters
$$ --------------------------
##$DU= <F:/spectra>
##$EXPNO= 1
##$NAME= <P31>
##$PROCNO= 1
##$TYPE= <nmr>
##$USER= <she>
##$AMP= (0..31)
100 100 100 100 100 100 100 100 100 100 100 100 100 100 100 100 100 100 
100 100 100 100 100 100 100 100 100 100 100 100 100 100 
##$AQSEQ= 0
##$AQ_mod= 1
##$AUNM= <au_zg>
##$AUTOPOS= <>
##$BF1= 81.014009
##$BF2= 200.13
##$BF3= 200.13
##$BF4= 200.13
##$BF5= 200.13
##$BF6= 200.13
##$BF7= 200.13
##$BF8= 200.13
##$BYTORDA= 1
##$CFDGTYP= 0
##$CFRGTYP= 5
##$CHEMSTR= <none>
##$CNST= (0..31)
1 1 145 1 1 1 1 1 1 1 1 1 1 1 1 1 1 1 1 1 1 1 1 1 1 1 1 1 1 1 1 1 
##$CPDPRG= <waltz16>
##$CPDPRG1= <>
##$CPDPRG2= <waltz16>
##$CPDPRG3= <>
##$CPDPRG4= <mlev>
##$CPDPRG5= <mlev>
##$CPDPRG6= <mlev>
##$CPDPRG7= <mlev>
##$CPDPRG8= <mlev>
##$CPDPRGB= <>
##$CPDPRGT= <>
##$D= (0..31)
0 1 0 0 0 0 0 0 0 0 0 0.03 2e-05 3e-06 0 0 0 0 0 0 0 0 0 0 0 0 0 0 0 0 
0 0 
##$DATE= 1676456543
##$DBL= (0..7)
120 120 120 11 120 120 24 19 
##$DBP= (0..7)
150 150 150 150 150 150 150 150 
##$DBP07= 0
##$DBPNAM0= <>
##$DBPNAM1= <>
$$ [...]
##$SUBNAM3= <"">
##$SUBNAM4= <"">
##$SUBNAM5= <"">
##$SUBNAM6= <"">
##$SUBNAM7= <"">
##$SUBNAM8= <"">
##$SUBNAM9= <"">
##$SW= 501.771253377433
##$SWIBOX= (0..15)
0 1 3 0 0 0 0 0 0 0 0 0 0 0 0 0 
##$SW_h= 40650.406504065
##$TD= 32768
##$TD0= 1
##$TE= 0
##$TE2= 300
##$TE3= 300
##$TEG= 300
##$TL= (0..7)
0 120 53 12 22 120 120 120 
##$TP= (0..7)
150 150 150 150 150 150 150 150 
##$TP07= 0
##$TPNAME0= <>
##$TPNAME1= <>
##$TPNAME2= <>
##$TPNAME3= <>
##$TPNAME4= <>
##$TPNAME5= <>
##$TPNAME6= <>
##$TPNAME7= <>
##$TPOAL= (0..7)
0.5 0.5 0.5 0.5 0.5 0.5 0.5 0.5 
##$TPOFFS= (0..7)
0 0 0 0 0 0 0 0 
##$TUNHIN= 0
##$TUNHOUT= 0
##$TUNXOUT= 0
##$USERA1= <user>
##$USERA2= <user>
##$USERA3= <user>
##$USERA4= <user>
##$USERA5= <user>
##$V9= 5
##$VALIST= <valist>
##$VCLIST= <CCCCCCCCCCCCCCC>
##$VD= 0
##$VDLIST= <DDDDDDDDDDDDDDD>
##$VPLIST= <PPPPPPPPPPPPPPP>
##$VTLIST= <TTTTTTTTTTTTTTT>
##$WBST= 1024
##$WBSW= 4
##$XGAIN= (0..3)
0 0 0 0 
##$XL= 0
##$YL= 0
##$YMAX_a= 2773
##$YMIN_a= -2761
##$ZGOPTNS= <>
##$ZL1= 120
##$ZL2= 120
##$ZL3= 120
##$ZL4= 120
##$ABSF1= 248.5645
##$ABSF2= -253.2056
##$ABSG= 5
##$ABSL= 3
##$ALPHA= 0
##$AQORDER= 0
##$ASSFAC= 0
##$ASSFACI= 0
##$ASSFACX= 0
##$ASSWID= 0
##$AUNMP= <proc_1d>
##$AZFE= 0.1
##$AZFW= 0.5
##$BCFW= 0
##$BC_mod= 2
##$BYTORDP= 0
##$COROFFS= 0
##$CY= -3
##$DATMOD= 1
##$DC= 0
##$DFILT= <>
##$DTYPP= 0
##$F1P= 0
##$F2P= 0
##$FCOR= 1
##$FTSIZE= 65536
##$FT_mod= 6
##$GAMMA= 0
##$GB= 0
##$INTBC= 1
##$INTSCL= 6.047779e-11
##$ISEN= 30
##$LB= 1
##$LEV0= 0
##$LPBIN= 0
##$MAXI= 10000
##$MC2= 0
##$MEAN= 0
##$ME_mod= 0
##$MI= 50
##$NCOEF= 0
##$NC_proc= -8
##$NLEV= 6
##$NOISF1= 182.463
##$NOISF2= 159.3651
##$NSP= 0
##$NTH_PI= 0
##$NZP= 0
##$OFFSET= 248.5645
##$PC= 4
##$PHC0= -10957.14
##$PHC1= 16.21271
##$PH_mod= 1
##$PKNL= yes
##$PPARMOD= 0
##$PSCAL= 0
##$PSIGN= 0
##$REVERSE= no
##$SF= 81.0140089999694
##$SI= 65536
##$SIGF1= 159.3651
##$SIGF2= -187.1042
##$SINO= 113.3802
##$SIOLD= 16384
##$SREGLST= <1H.CDCl3>
##$SSB= 0
##$STSI= 65536
##$STSR= 0
##$SW_p= 40650.406504065
##$SYMM= 0
##$S_DEV= 0
##$TDeff= 32768
##$TDoff= 0
##$TI= <>
##$TILT= no
##$TM1= 0
##$TM2= 0
##$TOPLEV= 0
##$USERP1= <user>
##$USERP2= <user>
##$USERP3= <user>
##$USERP4= <user>
##$USERP5= <user>
##$WDW= 1
##$XDIM= 65536
##$YMAX_p= 412654620
##$YMIN_p= -180071527
$$ End of Bruker specific parameters
$$ ---------------------------------
##NTUPLES= NMR SPECTRUM
##VAR_NAME=  FREQUENCY,     SPECTRUM/REAL,   SPECTRUM/IMAG
##SYMBOL=    X,             R,               I
##VAR_TYPE=  INDEPENDENT,   DEPENDENT,       DEPENDENT
##VAR_FORM=  AFFN,          ASDF,            ASDF
##VAR_DIM=   65536,         65536,           65536
##UNITS=     HZ,            ARBITRARY UNITS, ARBITRARY UNITS
##FACTOR=    0.620285442955139, 1,           1
##FIRST=     20137.2065510682, 0,            0
##LAST=      -20513.1999529968, 0,           0
##MIN=       -20513.1999529968, -180071527,  0
##MAX=       20137.2065510682, 412654620,    0
$$ Real data points
##PAGE= N=1
##DATA TABLE= (X++(R..R)), XYDATA
$$ [...]
42464a182342M942033P897037K148548l915438l827619k249252l711558m544837
42456d443428j759334M79918q71776j895961M62036K839043K545409K143830K427967
42447A927704m29553n557177m670662M367051J0370368M185052o421645p729972
42439c958834l83569K837913l064121r128467o881884O10438N087226L841828
42431a1039470O08557m11223J514405L959369M103562J725492p25570j292962
42423a557840k26414J881027M957784P226417N305685j183657p601756r021769
42415b20523n032184J153478N477038M335039k587036r386438q642179j005154
42407a5907959M941273M417391J922688K112716K517629L77901m60909L299187
$$ plain form
42464 -1182342 3759691 11656728 13805276 9889838 6062219 3812967 101409 -4443428
42456 -4443428 -6202762 -5722844 -6594620 -8490581 -8028545 -5189502 -2644093 -500263 1927704
42447 1927704 1498151 -4059026 -8729688 -4362637 6007731 10192783 3771138 -3958834
42439 -3958834 -4342403 -1504490 -4568611 -13697078 -20578962 -19968524 -14881298 -11039470
42431 -11039470 -10430913 -10842136 -9327731 -5368362 -1264800 460692 -264878 -1557840
42423 -1557840 -1784254 96773 5054557 12280974 17586659 16403002 8801246 -220523
42415 -220523 -5252707 -4099229 1377809 5712848 3125812 -6260626 -14902805 -15907959
42407 -15907959 -10966686 -6549295 -4626607 -2513891 3738 381639 -79270 3219917
42399C219917O230558J783565n890015o818964R5128N974032N027301P94590j285354
42390I130758p04027J64379k24189k111740l952725k578444K422918N668728J986743
42381I802401n500671q452864m201249J445859K589798j32790k169252p17453
42373g336221L205895O179845N623031K565311p4146k034635m811671n829808
42365b512399k00495Q929556J0072962n45416j0692716q438466N62239K906906
42357H2171j727131l011217P07915Q36996m043447m555511K605005P942619M544781
42348C382181j366387j354726L204211N892442M208328r77935p539708j0206895
42340d758489m713882L325984L263562l875536n114764L407317Q419605O02647
$$ plain form
42399 3219917 9450475 11234040 5344025 -1474939 -1379811 4594221 9621522 10416112 9130758
42390 9130758 8426731 8591110 8366921 6255181 2302456 -275988 2146930 7815658 9802401
42381 9802401 4301730 -4151134 -8352383 -6906524 -4316726 -4449516 -6618768 -7336221
42373 -7336221 -4130326 2049519 7672550 10237861 10163715 8129080 3317409 -2512399
42365 -2512399 -2712894 6216662 16289624 15744208 5051492 -3386974 -2824735 82171
42357 82171 -1644960 -4656177 -3948262 -3111266 -7154713 -11710224 -9105219 -1162600 3382181
42348 3382181 2015794 661068 3865279 9757721 13966049 12988114 5448406 -4758489
42340 -4758489 -9472371 -6146387 -2882825 -6758361 -11873125 -8465808 -46203 556444
42332E56444r370820p386653K422532O201103K385618M36887K847412L226600
42324A319123r6530k054928j445089j545303j096688L459812P486355K655142
42316H681894p291676q551719J816283R680919M264110o219273p327540J200904
42308c746098O886916K271507o818768j0053145m454706L422480N485852J622957
42300e383005m28712L710765P708904L608876m941396o923145o70645L334171
42292A5813j451854q122771p444937n64134N203202O855958N606334J525415m642408
42283c019382p768489l463990M592106Q185978M745944n06779k035449J80388
42275I10327K197427Q83903k848634m697681k051216J759387J466535j887092
$$ plain form
42332 556444 -8814376 -16201029 -13778497 -7577394 -5191776 -4754889 -1907477 1319123
42324 1319123 1222593 -832335 -2277424 -3822727 -4919415 -1459603 6026752 8681894
42316 8681894 1390218 -7161501 -5345218 4335701 8599811 2380538 -4947002 -3746098
42308 -3746098 3140818 5412325 -1406443 -11459588 -15914294 -12491814 -7005962 -5383005
42300 -5383005 -5811717 -2100952 5607952 9216828 4275432 -2647713 -3318358 15813
42292 15813 -1436041 -9558812 -17003749 -17567883 -12364681 -5508723 97611 1623026 -3019382
42283 -3019382 -10787871 -14251861 -9659755 -1473777 3272167 2765388 729939 910327
42275 910327 3107754 3991657 1143023 -3554658 -5605874 -3846487 -2379952 -4267044
42267d267044j789537L416673P275327N208304J225895J73976j64783l054041
42259H024770m966841j669656K636282J246323l307714l095339J517373K170785
42251B555983l474491p832010n149869J422421O554058Q519305O249455j084019
42243G760833q723756q786661j595941L469023K213087J738109O876784J0015051
42235A2966529L118692p599182r677921k595680K770681P12547l527516m253712
42227h085562k177310N22162L893015O731043O020972K229334l32725l28006j215822
42218G257101m374337o022403l803143j268304k035061l507104o83852O230292
42210h206811J1810126J1667500N997642j853170p852849r135412n684547m17090
$$ plain form
42267 -4267044 -6056581 -2639908 4635419 9843723 11069618 11243594 11078811 8024770
42259 8024770 3057929 1388273 4024555 5270878 1963164 -1132175 385198 2555983
42251 2555983 -918508 -8750518 -13900387 -12477966 -5923908 2595397 8844852 7760833
42243 7760833 -962923 -9749584 -11345525 -7876502 -5663415 -3925306 2951478 12966529
42235 12966529 16085221 8486039 -1191882 -3787562 -1016881 -304334 -3831850 -8085562
42227 -8085562 -10262872 -9740710 -5847695 883348 6904320 9133654 8800929 8472923 7257101
42218 7257101 2882764 -3139639 -6942782 -8211086 -10246147 -13753251 -14437103 -8206811
42210 -8206811 3603315 15270815 21268457 19415287 11562438 2427026 -3257521 -3674611
42202c674611L164418L298275K96054l988234o682098n410327m39687M859994
42194h576216O152019J644524n164137p043443n21762P985963Q193715k11577
42186B459086n614395l37797P889531P228560r03805n223671k159567P84109j273620
42177B848431m263512m074684k109319K31664L575719N234508J522170k751714
42169B13263J416308J0309633Q434476p252236j8233205j0041680N694327Q708324
42161g50790l86140m479368K308614Q786963O752326O29048m041720p498354q676828
42152g356249m018049L194821L793228k949246o523911j322401M495994K144139
42144h541674m588567o350615j848276K804101M074602L892428M677218N963333
$$ plain form
42202 -3674611 -510193 2788082 3084136 -904098 -7586196 -12996523 -13436210 -8576216
42194 -8576216 -2424197 -779673 -5943810 -12987253 -13509015 -5523052 2670663 2459086
42186 2459086 -3155309 -3493106 4396425 11624985 10721180 5497509 3337942 4122051 2848431
42177 2848431 -1415081 -5489765 -7599084 -7367420 -3791701 1442807 2964977 213263
42169 213263 1629571 11939204 20373680 13121444 -5111761 -15153441 -9459114 -750790
42161 -750790 -1136930 -5616298 -3307684 5479279 12231605 12860653 8818933 1320579 -7356249
42152 -7356249 -11374298 -8179477 -4386249 -7335495 -13859406 -15181807 -10685813 -8541674
42144 -8541674 -13130241 -19480856 -21329132 -18525031 -14450429 -10558001 -5880783 82550
42136H2550N061878k71454p699998r560403j271628R699194J0338396o84892r726501
42127d032858n726772N732133J1003812N548160l465707q143365p276687l951306
42119a0312590p37232J700553L240350K940070J66817k712397j816476J855116
42111e675789J719354m216638p413758n64570Q942684P792660k998878q656195
42103a1071130k212958O738763P801593K510887l151043p778948j0257115o691549
42095b4111500J713485O694426N034493L565684O145109O105447o33070n670857
42087a156783j350774N447211L882977m069808q556591o929128l098022J736253
42079a4094665O816965O868123O69772k423516L235761O742621k867903j4688951
$$ plain form
42136 82550 5144428 4872974 -2827024 -12387427 -13659055 -3959861 6378535 5693643 -4032858
42127 -4032858 -9759630 -4027497 6976315 12524475 9058768 915403 -6361284 -10312590
42119 -10312590 -11049822 -9349269 -6108919 -3168849 -3002032 -5714429 -7530905 -5675789
42111 -5675789 -3956435 -8173073 -15586831 -16151401 -7208717 583943 -2414935 -11071130
42103 -11071130 -13284088 -6545325 1256268 3767155 616112 -7162836 -17419951 -24111500
42095 -24111500 -22398015 -15703589 -10669096 -7103412 -958303 5147144 4514074 -1156783
42087 -1156783 -2507557 2939654 6822631 2752823 -5803768 -12732896 -15830918 -14094665
42079 -14094665 -7277700 -409577 260195 -2163321 1072440 7815061 4947158 -9741793
42071i741793r447549Q870472J5910739K640665j2230895j0987510J66969N740226
42063i078676L577209J773215L339597M843211M182744J518166k973419o700043
42055D82004m993071J605038N605212K219024m327707p506962o124795k158830
42047a5200087L180893P607867P339646K354771k096644k057305P04252K232521
42039D065914M64320m390877r043495p799504K65202O914848M848600p02067o452
42030e383511M756677L770851j908808j889413L256815J491994p183879o761691
42022i850965O897446J4397891K538729j2521500r782878L742723O085661m045268
42014b538161q232906m00842N517571J067007m318373j495890M470125N278319
$$ plain form
42071 -9741793 -19189342 -10318870 5591869 8232534 -3998361 -14985871 -14818902 -9078676
42063 -9078676 -5501467 -3728252 -388655 4454556 8637300 10155466 7182047 482004
42055 482004 -4511067 -2906029 2699183 4918207 590500 -6916462 -13041257 -15200087
42047 -15200087 -12019194 -4411327 2928319 5283090 3186446 1129141 1833393 4065914
42039 4065914 4530234 139357 -8904138 -16703642 -16438440 -9523592 -4674992 -5377059 -5383511
42030 -5383511 -626834 3144017 1235209 -654204 2602611 4094605 -3089274 -9850965
42022 -9850965 -2953519 11444372 13983101 1461601 -8321277 -4578554 1507107 -2538161
42014 -2538161 -10771067 -11171909 -5654338 -4587331 -8905704 -10401594 -5931469 -653150
42006f53150J508184k456795n184201m653328K335541J2012238J3861716M669840
41998B1440045n242506n353369K013819P189066N783653L96064n406098r135783
41990A1684891q555712l765690J307499K576885q6714l665499n153780l310889
41982h969009N62045L308653L348196K697938L350155L629853J549009p82908
41974H693932p42227m92307k939179n092662k561531J632554J151225k303446
41966b653641j391745L497492M056043j474079m950559k465441k68370j799375
41958g449675o77901O039746Q862736L28798j0491762r749422J117311Q922264
41950c097905P892727L352695o57065m906354p066754k627506N019050O537531
$$ plain form
42006 -653150 855034 -1601761 -6785962 -11439290 -9103749 2908489 16770205 21440045
41998 21440045 16197539 10844170 12857989 20047055 25830708 26226772 20820674 11684891
41990 11684891 3129179 -636511 670988 3247873 3161159 -504340 -5658120 -8969009
41982 -8969009 -8406964 -5098311 -1750115 947823 4297978 7927831 9476840 8693932
41974 8693932 7951705 7459398 4520219 -572443 -3133974 -1501420 -350195 -2653641
41966 -2653641 -4045386 -547894 3508149 2034070 -2916489 -5381930 -5650300 -7449675
41958 -7449675 -8127576 -2087830 6774906 7103704 -3388058 -13137480 -12020169 -3097905
41950 -3097905 4794822 8147517 7490452 2584098 -4482656 -7110162 -2091112 4446419
41942D446419R93956k122891J728324N040117J215570m826473n323544j263603
41934a12125J479453J329399k76760l557635p019426n222505K507904O917386
41926c954309J431391n486236j898479P735531Q256205j572097o010493K419416
41918I20929J0462110N398192m945870n953144L56605R78868n004305n696840
41910c483455K332589P912097L450626m167438o071594l595741j647890M84654
41902d786152M125490M747944j029046p384085o367886O58274N843490N928402
41894A736431L622343P43671k769651m676576k225437K358730L943266J589957
41886D322734j376065l257101m575727l929046O23709O127328O652139J514203
$$ plain form
41942 4446419 5440375 3317484 5045808 10085925 11301495 6475022 1151478 -112125
41934 -112125 1367328 2696727 2419967 -1137668 -8157094 -13379599 -10871695 -3954309
41926 -3954309 -2522918 -8009154 -9907633 -2172102 6084103 4512006 -1498487 920929
41918 920929 11383039 16781231 11835361 5882217 6238822 7217690 2213385 -3483455
41910 -3483455 -1150866 6761231 10211857 6044419 -27175 -3622916 -5270806 -4786152
41902 -4786152 -660662 4087282 3058236 -4325849 -10693735 -10035461 -4191971 1736431
41894 1736431 5358774 6102445 3332794 -1343782 -3569219 -1210489 2732777 4322734
41886 4322734 2946669 -310432 -4886159 -8815205 -8191496 -2064168 4587971 6102174
41878F102174l538827m358563k929185k690927l646702l729406j729173K305687
41870a4214922O825160Q564930N575877O23678j516441j05244J426114J019895
41862H199047j35756j237232l172861n366822n024601r45723M394624P402444
41854D113120O250291J554031l793218o306227n470995m134110l529905j126814
41846a2443827L618414N862819K736463n77781J058645L230186m66384n528163
41838b509628k932024L959459L012103n508449p022893L552431J1845669O540933
41830A0937601k646801j975296L465368j26487j0450648j2590094m159813J292837
41822a6253333k489006m888051K326377J0766399R434255J895633j331355Q4619
$$ plain form
41878 6102174 2563347 -1795216 -4724401 -7415328 -11062030 -14791436 -16520609 -14214922
41870 -14214922 -7389762 1175168 6751045 7374723 5858282 5753038 7179152 8199047
41862 8199047 8063291 6826059 3653198 -1713624 -6738225 -7683948 -3289324 4113120
41854 4113120 10363411 11917442 8124224 1817997 -3652998 -7787108 -11317013 -12443827
41846 -12443827 -8825413 -2962594 -226131 -803912 254733 3484919 3018535 -2509628
41838 -2509628 -5441652 -1482193 1529910 -3978539 -11001432 -7449001 4396668 10937601
41830 10937601 8290800 6315504 9780872 9654385 -796263 -13386357 -17546170 -16253333
41822 -16253333 -18742339 -23630390 -21304013 -10537614 -1103359 792274 -539081 -454462
41814d54462j358088n605444m519369K982422O595428k61484r389850q584692
41806b0595539J369811P986622L851688m911212q061477l391109L305508O214701
41798a4231007M000652p55903l165152N14833P562553R505148K394992o149907
41790c23791n802421K259436O973300L250950j628177j22146M382300L835999
41782A2825450j868335n032974j250846M937762N883730o43286r321493j2530293
41774g000285p940919r29792J742364p8829r87615J522413L908529K736747l99257
41765g426644k051382j323200Q52555L411502M380757J932731k198250m095101
41757f517032l603936m150139n300092j798892O908962J2689409R119626N37300
$$ plain form
41814 -454462 -1812550 -7417994 -11937363 -8954941 -2359513 -2620997 -12010847 -20595539
41806 -20595539 -19225728 -11239106 -7387418 -12298630 -20360107 -23751216 -20445708 -14231007
41798 -14231007 -10230355 -10986258 -14151410 -13636577 -6074024 3431124 5826116 -323791
41790 -323791 -6126212 -3866776 3106524 6357474 4729297 4607151 8989451 12825450
41782 12825450 10957115 5924141 4673295 9611057 15494787 14851501 5530008 -7000285
41774 -7000285 -14941204 -15870996 -14128632 -14207461 -15195076 -13672663 -9764134 -7027387 -7426644
41765 -7426644 -9478026 -10801226 -9948671 -6537169 -2156412 -223681 -2421931 -6517032
41757 -6517032 -10120968 -14271107 -19571199 -21370091 -14461129 -1771720 7347906 7885206
41749G885206m587955m513179k854281j090814R48218R19544k551127m875181
41741a0719569j126188N068009N257087j848442q399990p566436o81539N828219
41733a4188849O774445J990064l171288k590180L044474O603932M808649K667869
41725E939116L775485L460588j750264n575006k428625P31434m612253j1467961
41717a1927486o445877P049121J1724654K967403m893654k434057K114269O66415
41709a179212q81083L257648N623652p42788p517316m273990L218862L004958
41701E10731k463343k004191L436264L025630l259513m040085K478442M447895
41693B131830k518102o686746j09983P428427M782314k146083j190369N302955
$$ plain form
41749 7885206 3297251 -1215928 -4070209 -5161023 -4212805 -3293261 -5844388 -10719569
41741 -10719569 -11845757 -6777748 -1520661 -3369103 -11769093 -19335529 -20017068 -14188849
41733 -14188849 -7414404 -5424340 -8595628 -11185808 -8141334 -1537402 3271247 5939116
41725 5939116 9714601 13175189 11424925 5849919 3421294 4152728 -459525 -11927486
41717 -11927486 -18373363 -11324242 400412 3367815 -1525839 -3959896 -1845627 -1179212
41709 -1179212 -2060295 1197353 6821005 6078217 -1439099 -5713089 -2494227 510731
41701 510731 -1952612 -3956803 -520539 2505091 -754422 -4794507 -2316065 2131830
41693 2131830 -386272 -7073018 -7183001 245426 5027740 2881657 1691288 6994243
41685F994243M941420l558500q265960l394463K347829P26801l334743q83191
41677d426564O333531Q535627K331597n180820o829913l774145j383819j127615
41669e522121l24775J858951K269360j511383o887713q732648n280335L24085
41661b3806579M266565N940065O749775O787778M887821J734590N03933K946360
41653A0010308O093302N018338r18658o434028o220173j512087J119743k192094
41645D964651p483806p375212n8692P978000R013227K668045m091458n187296
41637D27459j803145L24878j475654l911141k553975K114554M952036K381354
41629D56366k877360m620888p45234L774572L113425j583961l779782q39110K455373
$$ plain form
41685 6994243 11935663 8377163 111203 -3283260 -935431 -208630 -3543373 -4426564
41677 -4426564 1906967 10442594 12774191 7593371 763458 -3010687 -4394506 -5522121
41669 -5522121 -5846896 -3987945 -1718585 -3229968 -10117681 -18850329 -24130664 -23806579
41661 -23806579 -19540014 -13599949 -6850174 -62396 4825425 6560015 7063948 10010308
41653 10010308 16103610 21121948 20203290 13769262 7549089 6037002 7156745 4964651
41645 4964651 -2519155 -9894367 -9953059 -1975059 7038168 9706213 5614755 427459
41637 427459 -1375686 -1050808 -2526462 -6437603 -8991578 -6877024 -1924988 456366
41629 456366 -2420994 -7041882 -7787116 -4012544 -899119 -2483080 -6262862 -7101972 -4646599
41620d646599J576888q26753K53279L626551L773553o3667k747574j570306P5408
41611e49220j104883l636756m921775m746228k810423K229040Q185844Q944376
41603A589975K838404l145993k439830J990303L211580J167259R78600K935675
41595I125973K088492k537082n774118m594498k173395j649952j344516R69116
41587e889980L348400K643890l22182j445046J624085O433328P518646J849405
41579A5760546o694641j0122023n369293J926709N071408M068519J858353k441207
41571D058371r529099j2820982n059284Q569102J3928826O399207l321299m824449
41563b599607m23295K391623K280369J544769o38159n130143p955913n474158
$$ plain form
41620 -4646599 -3069711 -3896464 -3643185 -16634 3756919 3693252 945678 -624628 -549220
41611 -549220 -1654103 -5290859 -10212634 -14958862 -17769285 -15540245 -7354401 1589975
41603 1589975 4428379 1282386 -1157444 832859 4044439 5211698 6190298 9125973
41595 9125973 11214465 8677383 2903265 -1691233 -3864628 -5514580 -6859096 -5889980
41587 -5889980 -2541580 102310 -219872 -1664918 -40833 6392495 13911141 15760546
41579 15760546 9065905 -1056118 -6425411 -4498702 572706 4641225 6499578 4058371
41571 4058371 -5470728 -18291710 -23350994 -14781892 -853066 5546141 2224842 -2599607
41563 -2599607 -3022902 -631279 1649090 3193859 2555700 -2574443 -10530356 -16004514
41555a6004514p13319J466460J813612L446665N093265L916787J553935P38672
41547A311563o82540n184339q209089l700378M931101Q074111L521359j723189
41539a661401l277525l966051n129480k790580L557974O531984J142645o255656
41531a1848090n776963K548501R031728O682082j222762n832607k392010M941780
41523c868341P471192K052813m273894k893527M344468P250590J736434m931865
41515F887870n761675l320766k601690j952723J545137L682120m83053n691550
41507g696330k549687O885898J0477596L778701m162022n338965k846086k133094
41499c583989k061692p03621j031827l500977j493800O966889J1223569L007954
$$ plain form
41555 -16004514 -16717833 -15251373 -13437761 -9991096 -4897831 -981044 572891 1311563
41547 1311563 629023 -4555316 -12764405 -16464783 -11533682 -3459571 61788 -1661401
41539 -1661401 -4938926 -8904977 -14034457 -16825037 -13267063 -6735079 -5592434 -11848090
41531 -11848090 -17625053 -15076552 -6044824 637258 -585504 -6418111 -8810121 -3868341
41523 -3868341 3602851 5655664 1381770 -1511757 2832711 10083301 11819735 6887870
41515 6887870 1126195 -2194571 -4796261 -6748984 -5203847 -1521727 -2004780 -7696330
41507 -7696330 -10246017 -3360119 7117477 10896178 6734156 1395191 -1450895 -3583989
41499 -3583989 -5645681 -6349302 -7381129 -10882106 -12375906 -5409017 5814552 8822506
41491H822506p618358n407124N687292P774945k434797q509638j322736O811314
41483C803404L587188l664252k476090L143100J124390o728685p769443J11125
41475h869263N702549K749164k695237m540862m013502k270028K990315R717542
41467a229322J0289513K842455m432918m885836j799636p64802j160668n36773
41459a677987o00009k585740k338702L193834Q758508O944370r86614o511135
41451D196525m769402Q09113L994712K085119k706655n717745m529069k168573
41443h805975l215078o176512m424325L159717Q167879L908412m070510n038030
41435a6494422K075104P741366N197829j582167m756460k646126N0398k94563
$$ plain form
41491 8822506 1204148 -4202976 1484316 9259261 6824464 -1685174 -3007910 3803404
41483 3803404 7390592 3726340 1250250 4393350 5517740 -1210945 -8980388 -8869263
41475 -8869263 -3166714 -417550 -3112787 -7653649 -11667151 -13937179 -10946864 -1229322
41467 -1229322 9060191 11902646 7469728 2583892 784256 19454 -1141214 -1677987
41459 -1677987 -2277996 -4863736 -7202438 -4008604 4749904 11694274 10707660 4196525
41451 4196525 -572877 236236 4230948 6316067 3609412 -2108333 -6637402 -8805975
41443 -8805975 -12021053 -18197565 -22621890 -19462173 -11294294 -7385882 -11456392 -16494422
41435 -16494422 -14419318 -6677952 -1480123 -3062290 -7818750 -10464876 -10414478 -10709041
41427a0709041j830491p41169K694204M005155J086328k017970o99448L149519
41419e062913M069891J620621L60745J432980P44792k924627m699911j709415
41411f167837J577297N11941k129355q00859M083667P228733O120878L079463
41403A3503928P38421r19929l075058n415313n292539m77183O014386O831918
41395A1908631P1232n421292j520270N576055L339760o967134j0992338l618661
41387g624017L615538K170941r82622J540831M071455N76828j950627L507368
41379D925695Q439522J996499q726042q757186K83128L723913j494938m081960
41371c691369J83040K415170j421599l168668J915402O402356L774088j306170
$$ plain form
41427 -10709041 -12539532 -13280701 -10586497 -6581342 -5495014 -7512984 -8212432 -5062913
41419 -5062913 -993022 627599 988344 2421324 3166116 241489 -4458422 -6167837
41411 -6167837 -4590540 -4078599 -6207954 -7008813 -2925146 4303587 10424465 13503928
41403 13503928 14242349 13322420 10247362 4832049 -460490 -937673 5076713 11908631
41395 11908631 11979863 6558571 5038301 10614356 13954116 6986982 -4005356 -7624017
41387 -7624017 -4008479 -1837538 -2820160 -1279329 2792126 3368954 1418327 4925695
41379 4925695 13365217 15361716 6635674 -2121512 -1838384 1885529 390591 -3691369
41371 -3691369 -3508329 -1093159 -2514758 -5683426 -3768024 2634332 6408420 5102250
41363E102250k024193O04449K175459J678805l8132j853818o65985M596909P233833
41354A6809577J89134j1022712j3593159n802589J853631M308800O709283R799085
41346I251050O392857k931701o596753j312080J061918n576517r782795k868087
41338a2362108M570176R54546n080568N89070J1912274J1270835j980722j0885286
41330a011783o932272R88811M393578N688467P561054N927401j007512p025343
41322H582401o695970k446763J101268L278754M524837L412657J6007k281257
41314I491934j177562J613271L273658K670100k42633m464004p096300n607198
41306a538734j182300K517226L306051J279822k392375n146500m162772n60281
$$ plain form
41363 5102250 3078057 3682506 5857965 7536770 7498638 5644820 4978835 9575744 16809577
41354 16809577 16998711 5975999 -7617160 -13419749 -11566118 -7257318 -548035 9251050
41346 9251050 15643907 12712206 6115453 4803373 5865291 288774 -9494021 -12362108
41338 -12362108 -7791932 -6837386 -11917954 -11328884 583390 11854225 9873503 -1011783
41330 -1011783 -7944055 -6955244 -2561666 3126801 10687855 16615256 15607744 8582401
41322 8582401 1886431 -560332 540936 3819690 8344527 11757184 11773191 9491934
41314 9491934 8314372 9927643 13201301 15871401 15628768 11164764 4068464 -1538734
41306 -1538734 -2721034 -203808 3102243 4382065 1989690 -3156810 -7319582 -7879863
41298g879863P74346j527528k488512R33713L853676J201761l412827l339920
41290a1885154N78767K353528N33711j638367k845007l370977j300540L574558
41282a3999481N547924Q58123l973204j007346N544323N565736m7257j440570
41274b951752K471162K562454k829594l641026L825862Q544878K235565o647557
41266C569992o179229R22667L371679p18208l253949n54339K279735J464131K83081
41257A185560K264244M580898K251480l599703n784283l85344O622832N915374
41249A3051058k353065p934739n111838r70134l104336o144848p93344Q521947
41241d839299Q357021k381385r782965n892642J150421K416927P55373J494750
$$ plain form
41298 -7879863 -7105517 -8633045 -11121557 -10187844 -6334168 -5132407 -8545234 -11885154
41290 -11885154 -11306387 -8952859 -8419148 -10057515 -12902522 -16273499 -17574039 -13999481
41282 -13999481 -8451557 -7593434 -11566638 -12573984 -7029661 -1463925 -1511182 -2951752
41274 -2951752 -480590 2081864 -747730 -4388756 -562894 7981984 10217549 3569992
41266 3569992 -2609237 -1686570 1685109 966901 -2287048 -2841387 -561652 902479 1185560
41257 1185560 3449804 8030702 10282182 6682479 898196 512852 7135684 13051058
41249 13051058 10697993 2763254 -2348584 -3318718 -6423054 -12567902 -13361246 -4839299
41241 -4839299 3517722 1136337 -8646628 -14539270 -13388849 -10971922 -10216549 -8721799
41233h721799K379071R80246J778133O776547Q414207J656985n423795l866868
41225C972727J244591j2329n049696m086519J918139L090346j589750k638214
41217c150705L063907O765113K101433n876101r483281p537563k704784K489860
41209a4332121M393817L88147n213297m510194K550738P321897N222553J573658
41201b604802J675153L051024J983585M96941J304225J717875j465772n480457
41193F77772n607547k239117J003883L040593M439375L631219q74013o126106
41185b053941p108569k931130K337414M379503K323214j078474j866889P52621
41177e246251K357766j117930o035659m813714K045722N090241M47455k907169
$$ plain form
41233 -8721799 -6342728 -5362482 -3584349 3192198 11606405 13263390 7839595 3972727
41225 3972727 5217318 5204989 155293 -3931226 -2013087 1077259 -512491 -3150705
41217 -3150705 -86798 6678315 8779748 2903647 -6579634 -14117197 -16821981 -14332121
41209 -14332121 -9938304 -9550157 -14763454 -19273648 -16722910 -9401013 -4178460 -2604802
41201 -2604802 -929649 2121375 4104960 4601901 5906126 7624001 6158229 677772
41193 677772 -4929775 -7168892 -6165009 -3124416 1314959 4946178 4072165 -2053941
41185 -2053941 -9162510 -12093640 -9756226 -5376723 -3053509 -4131983 -5998872 -5246251
41177 -5246251 -2888485 -4006415 -10042074 -14855788 -12810066 -7719825 -7272370 -10179539
41169a0179539L034782J1457519J0257120P99646m183217j47494L507501n53188
41161A3993130o454116n393151Q28716L661314N25904l425295m263604l683249
41153d210351m195667m591292k063058L112490O660281M401410k552063p510241
41145a0948491m829267L478452J0008785J0516207O938334J967201m275120j0054785
41137B801316j0139900l060152L739406K476088l325345l007428N549853J2181666
41129G215504Q779791K50781l717733k333538k360336o053529q117431n026678
41121a1363169p30786l77963k869685l195339K60257M000146M165233R56397j420757
41112a0575666J215224P754352J0731445L737330q985386j4561952o477112O063660
$$ plain form
41169 -10179539 -7144757 4312762 14569882 15369528 11186311 11038817 14546318 13993130
41161 13993130 7539014 2145863 2974579 6635893 7161797 3736502 -527102 -4210351
41153 -4210351 -8406018 -12997310 -15060368 -11947878 -5287597 -886187 -3438250 -10948491
41145 -10948491 -15777758 -12299306 -2290521 8225686 15164020 17131221 12856101 2801316
41137 2801316 -7338584 -10398736 -6659330 -4183242 -7508587 -10516015 -4966162 7215504
41129 7215504 15995295 16246076 12528343 10194805 7834469 1780940 -6336491 -11363169
41121 -11363169 -12093955 -12471918 -15341603 -18536942 -18276685 -14276539 -10111306 -9154909 -10575666
41112 -10575666 -9360442 -1606090 9125355 12862685 3877299 -10684653 -17161765 -11098105
41104a1098105Q892229N87173p129920n970276j29892L386139N380408R519108
41096C436864J2602992Q070028k769223j0719006j0196745m433248J379120N591675
41088B962457P139085L947627k114040m615870j540859L84438l988131q533853
41080f359146m296627N535146Q560764R86401o837081n283515K303877O602024
41072A211843M801941N23870l569663o631387o340902j116201N787431R309991
41064C976923Q442548N135684j80838p032552j1146890q258568p06500N128544
41056d641649O864560O306422L653903j508111m977643k154628K833699J626360
41048H002913m048688l486502M791366Q281425K55685p839694l810519N710191
$$ plain form
41104 -11098105 -2205876 -1618703 -8748623 -14718899 -14848791 -11462652 -6082244 3436864
41096 3436864 16039856 24109884 21340661 10621655 424910 -4008338 -2629218 2962457
41088 2962457 10101542 14049169 11935129 7319259 5778400 6162838 2174707 -6359146
41080 -6359146 -10655773 -5120627 3440137 4426538 -2410543 -7694058 -5390181 1211843
41072 1211843 6013784 6537654 2967991 -3663396 -10004298 -11120499 -5333068 3976923
41064 3976923 12419471 17555155 17374317 10341765 -805125 -9063693 -9770193 -4641649
41056 -4641649 2222911 8529333 12183236 10675125 5697482 3542854 6376553 8002913
41048 8002913 3954225 467723 5259089 13540514 13796199 5956505 2145986 7856177
41040G856177O193607j671107m959244p11221J054299l426927n241535O13864
41032b92087O158826M173141o05608j427588p78240l285028n617421k751636J937222
41023b488419K225151j43821M40901K425576J60238m360540l369420L135452N856091
41014C881209L41460o191706n927746j052129J577270P70167L13139J438361J894179
41005b955796J341223K479783O007353Q144139N228685r69438m793239l405834
40997A1076876M9708J033547m72719j187715p02822k379192o950254r346929n130583
40988a4010083K550992O297307L599966p30403q96252L748019Q653583Q358725
40980A7571854J568358o583635q863625m103602J210404J464179j167163j517171
$$ plain form
41040 7856177 14049784 12378677 7419433 6708212 7762511 4335584 -905951 -292087
41032 -292087 5866739 10039880 9434272 8006684 7228444 3943416 -1674005 -4425641 -2488419
41023 -2488419 -263268 -407089 33812 2459388 2619626 -1740914 -5110334 -1974882 3881209
41014 3881209 4222669 -1969037 -7896783 -8948912 -7371642 -6601475 -6288336 -4849975 -2955796
41005 -2955796 -1614573 865210 6872563 15016702 20245387 19275949 14482710 11076876
40997 11076876 11126584 12160131 11687412 10499697 9796875 7417683 467429 -8879500 -14010083
40988 -14010083 -11459091 -5161784 -1561818 -2292221 -3188473 559546 9213129 17571854
40980 17571854 19140212 12556577 3692952 -410650 799754 2263933 1096770 -420401
40972d20401L82947Q55563l01905k80531L85901j699640n769671o386530j386200
40963a4620467M647424O596437M466638J362540n74883q70868l76648r03809k525920
40954b799556k006374K283234N364160J433160n885295o403131K012192R149061
40946C147451O321725j941968n069671n65503M574238L955038j510557o097835
40938B812918n496913q66933K518701J616200n33622L2800J524313J65438j509232
40929B63670J990123Q098453Q096405J292041l186244j806924k330748q573442
40921C843334j1436631l977272N272278N338706L64527J208932O358930N652253
40913A2625057j133572m333700j532221l29407l537398n038914k228693p5929
$$ plain form
40972 -420401 -37454 818109 516204 235673 621574 -1078066 -6847737 -13234267 -14620467
40963 -14620467 -9973043 -3376606 1090032 2452572 1877689 1006821 630173 -273636 -2799556
40954 -2799556 -4805930 -2522696 2841464 4274624 -1610671 -8013802 -6001610 3147451
40946 3147451 9469176 7527208 2457537 1892034 6466272 10421310 8910753 2812918
40938 2812918 -2683995 -3550928 -1032227 583973 50351 83151 1607464 1772902 263670
40929 263670 2253793 10352246 18448651 19740692 16554448 14747524 12416776 3843334
40921 3843334 -7593297 -11570569 -6298291 -959585 -595058 613874 6972804 12625057
40913 12625057 11491485 7157785 5625564 5296157 1758759 -3280155 -5508848 -5584777
40905e584777j82921K188557O852092O387819l98708m271108n90334K532680j647364
40896E285936o648499m206124J207509K61696m977290m475695L015397P992504
40888b544566N086106J33562j33787K016352Q0169o185352r763265n466906K926351
40879a3851336O626089K657574k055780K21415P332330J0149188N091096j931863
40871A4238713m450326k432420R19145L323510K441401k903979p933401n313729
40863b111086K990945N116476l603312j0941089m323841R079333J0978592j459437
40855E726581j0945489m911790O857055P152255m002360j0385059l114074P753026
40847e869855Q716711J485319j908836J572611K378067m523127r963473m982303
$$ plain form
40905 -5584777 -5767698 -3579141 3272951 9660770 9262062 4990954 4400620 6933300 5285936
40896 5285936 -1362563 -5568687 -4361178 -4099482 -9076772 -13552467 -10537070 -2544566
40888 -2544566 2541540 2675102 2541315 4557667 4637836 -1547516 -11310781 -16777687 -13851336
40879 -13851336 -7225247 -4567673 -6623453 -6402038 930292 11079480 16170576 14238713
40871 14238713 9788387 7355967 8275112 11598622 14040023 11136044 3202643 -2111086
40863 -2111086 879859 5996335 2393023 -8548066 -12871907 -3792574 7186018 5726581
40855 5726581 -5218908 -10130698 -3273643 3878612 -123748 -10508807 -13622881 -5869855
40847 -5869855 2846856 4332175 2423339 3995950 6374017 1850890 -8112583 -13094886
40839a3094886L687411L489439l505909l345163P097671J3981749P114415n328744
40831A0095983r636686m654317J139077L377309L833275L608876K457973J670321
40823A1891811J301159j685740o856557p219240K25990O464230K113528p282916
40815a047735q106328J589727J0075536R333408L925066J025081J157025J773652
40807A9725432K059706P15696m402281j0972815j2242362n835196K188554N194090
40799c569176L726952K483976L192134L560842J046306m242674q789379p901062
40791a0492081j427422L735623J248424n272747o238124K45783N550107L500306
40783i150131q30761L05852N719042Q217535N541076J939984M19118m32899j652160
$$ plain form
40839 -13094886 -9407475 -5918036 -9423945 -12769108 -5671437 8310312 15424727 10095983
40831 10095983 459297 -4195020 -3055943 321366 4154641 7763517 10221490 11891811
40823 11891811 13192970 11507230 4650673 -2568567 -2342577 4121653 6235181 -1047735
40815 -1047735 -9154063 -7564336 2511200 11844608 15769674 16794755 17951780 19725432
40807 19725432 21785138 22500834 18098553 7125738 -5116624 -10951820 -8763266 -3569176
40799 -3569176 157776 2641752 5833886 9394728 10441034 6198360 -2591019 -10492081
40791 -10492081 -11919503 -8183880 -6935456 -12208203 -18446327 -18200544 -12650437 -9150131
40783 -9150131 -9980892 -9675040 -3955998 4261537 9802613 11742597 12161715 11728816 10076656
40774A0076656j489989K37461j65448m643647q212724m373045M624713Q463409
40766D517386K262129n592771m387068L678173O800231J001415m883351l535079
40758a38935R17559K053833J516736K973759L120313k053107p420469n366610
40750d396921J302957L623323J174466J131718L551227K41680r382291j3404108
40742a6157949m037564R936670J4185187O325020l658711o451247j738723M105588
40734B508271N086671J327249j598481n01295N60509k707760o456951m492464
40726f274251N09866J243614n96858L082178J0392208R679396o51619p296584
40718A0087950l427275o6272o283857j2233845n859182N104589M954382l855264
$$ plain form
40774 10076656 8586667 8824128 8658680 4015033 -4197691 -8570736 -3946023 4517386
40766 4517386 6779515 1186744 -3200324 477849 7278080 8279495 3396144 -138935
40758 -138935 778624 2832457 4349193 7322952 10443265 8390158 969689 -4396921
40750 -4396921 -3093964 529359 1703825 2835543 6386770 6628450 -2753841 -16157949
40742 -16157949 -20195513 -10258843 3926344 10251364 6592653 141406 -1597317 2508271
40734 2508271 7594942 8922191 7323710 6822415 7382924 4675164 -1781787 -6274251
40726 -6274251 -5764385 -4520771 -5117629 -2035451 8356757 18036153 17384534 10087950
40718 10087950 6660675 6594403 310546 -11923299 -17782481 -12677892 -7723510 -11578774
40710a1578774n148509L902897R263505M324115o14042K144375N117104P60883
40702H171554m330639j128860N534155M329549m304605q702899k996060O018453
40694B590648R551037O810748K384585p96577k823508m089485m041171k140636
40686G445641R10130K965933K068833j063660l153812k137642J17783L70114j554465
40677E968855k790446j555311P97977K010042J297351q23717l001451k751074
40669h47774J534703O609570N616778l084218j0869488q140728K193204P338601
40661C50648K071270m030334j110596O359424O950032o54335p083932o567323
40653c715146k436033J336435M724201O343708K661520m355935o958912k932517
$$ plain form
40710 -11578774 -16727283 -12824386 -3560881 763234 149192 2293567 7410671 8171554
40702 8171554 3840915 2712055 8246210 12575759 8271154 -431745 -3427805 2590648
40694 2590648 12141685 18952433 21337018 20540441 17716933 13627448 9586277 7445641
40686 7445641 8355771 11321704 13390537 12326877 9173065 7035423 7153206 7523320 5968855
40677 5968855 3178409 1623098 2421075 4431117 5728468 4904751 1903300 -847774
40669 -847774 686929 7296499 12913277 9829059 -1040429 -9181157 -6987953 350648
40661 350648 2421918 -1608416 -2719012 3640412 10590444 9936109 2852177 -3715146
40653 -3715146 -6151179 -4814744 -90543 6253165 8914685 4558750 -2400162 -5332679
40645e332679M42364j655325l469922J139885P367365O520439l91133m846614
40637b25620l852964k360508l611994m686891k292618K725055P331748Q570847
40629A597055M408044l323374p748850l686767M797286Q355364L805715k913450
40621E291023n196154k555933J410269L395892J823912k297338m984058k821669
40613e934056K545222O147057N716941L029437o3808l105743m824643l623082
40605a12675o87684J081370J431720K220064K639613j30690m712153n373093m51518
40596d095046L938777K208686k569770l342465O22970L314124J300838j624178
40588b46064p58222K529619L488884J503262M51018J476451L48634n128131r243099
$$ plain form
40645 -5332679 -4890315 -6545640 -10015562 -8875677 -1508312 5012127 4620994 -225620
40637 -225620 -4078584 -6439092 -10051086 -14737977 -17030595 -14305540 -6973792 1597055
40629 1597055 6005099 2681725 -5067125 -8753892 -3956606 4398758 8204473 5291023
40621 5291023 94869 -2461064 -1050795 2345097 4169009 1871671 -3112387 -5934056
40613 -5934056 -3388834 2758223 8475164 11504601 11440793 8335050 3510407 -112675
40605 -112675 -800359 281011 1712731 3932795 6572408 6441718 1729565 -3643528 -4095046
40596 -4095046 -156269 2052417 -517353 -3859818 -3236848 77276 1378114 -246064
40588 -246064 -1004286 1525333 5014217 6517479 6968497 8444948 8793582 3665451 -5577648
40579e577648n268565L860644Q244551M349031j169290k418886j734784k777689
40571b492636l470763j442898k26508k841971m306082J022793Q356897Q172950
40563B771782R20923l876321k597450j055372j904533K04405O665258Q637066
40555I765758J71963j0167962r917636l58420N703559K029150l970646l250132
40547i994366L024170O957392M721465k32563k908916k044064M85983K712133
40539B721234L360202J286690l041060n792703l072161K778434M124735j678584
40531F86787o787031k730802O910532J0399831L710380m752297o568847l278528
40523b409975p24288Q2045J219167J627171j053168m572653l974110Q25721M210133
$$ plain form
40579 -5577648 -10846213 -6985569 1258982 5608013 4438723 2019837 285053 -2492636
40571 -2492636 -5963399 -7406297 -7632805 -10474776 -14780858 -13758065 -5401168 2771782
40563 2771782 3692705 -183616 -2781066 -3836438 -5740971 -5536566 1128692 9765758
40555 9765758 9937721 -230241 -10147877 -10506297 -4802738 -2773588 -6744234 -9994366
40547 -9994366 -6970196 -12804 4708661 4476098 1567182 -476882 9101 2721234
40539 2721234 6081436 7368126 4327066 -1465637 -4537798 -1759364 2365371 686787
40531 686787 -6100244 -8831046 -1920514 8479317 12189697 7437400 868553 -2409975
40523 -2409975 -3134263 -3052218 -1833051 -205880 -1259048 -5831701 -9805811 -8980090 -4769957
40514d769957K511934j234256j892042R05924K843496J058631k272002l559772
40506f408044l125934l838171m776373j049666P457388J2016892N487535o126798
40498c63171r874765k831574M881373M843377o7955l366508l967253k915343J316876
40489a2344943P897479J0165761M345826l137687m487007k113249k986846n577585
40481h238251k870233L670276M790802j038838m101641J251543P917561P718361
40473I099580K879869m53671k407541n437952o470471j789216M310044M694602
40465D425244Q46631L85258M216357N065241k66660n388889l875819J913533M901390
40456A2222286J874792m525690q993747p353630p03265L753510M06232o133264
$$ plain form
40514 -4769957 -2258023 -3492279 -5384321 -4478397 -1634901 -576270 -2848272 -6408044
40506 -6408044 -9533978 -13372149 -18148522 -19198188 -11740800 276092 5763627 -363171
40498 -363171 -10237936 -13069510 -8188137 -3344760 -3412715 -6779223 -10746476 -13661819 -12344943
40489 -12344943 -4447464 5718297 10064123 6926436 2439429 326180 -2660666 -8238251
40481 -8238251 -11108484 -7438208 -2647406 -3686244 -7787885 -6536342 1381219 9099580
40473 9099580 11979449 11525778 9118237 3680285 -2790186 -4579402 -269358 4425244
40465 4425244 5271875 5657133 9873490 14938731 14672071 9283182 5407363 7320896 12222286
40456 12222286 14097078 9571388 577641 -6775989 -7479254 -3725744 -3319512 -9452776
40448i452776n912287K201136Q413197O121924J91957k637191l204935l838148
40440h117123j012393P216880J2834694P327751m301202r475694n726429j831854
40432c085370k370228k402908J189582L707639J272460l037172m971621l890175
40424a3587793K93540P147905J0886603M633151p398659j1575476l274689N689736
40416g185682L868846m466103p702938k609344N843597J3011964J5053926Q029232
40408B3843498m779180j1166878m787586M448468M114654l161341o653445n406354
40400c548164n778025o098788O57786J0606038J1269667J608827n038728j400824
40392B277789L976104K250088k997080m882307m118618l600663j268238M276892
$$ plain form
40448 -9452776 -15365063 -13163927 -4750730 1371194 1563151 -1074040 -4278975 -8117123
40440 -8117123 -9129516 -1912636 10922058 18249809 13948607 4472913 -1253516 -3085370
40432 -3085370 -5455598 -7858506 -6668924 -2961285 -1688825 -4725997 -9697618 -13587793
40424 -13587793 -13294253 -6146348 4740255 9373406 1974747 -9600729 -12875418 -7185682
40416 -7185682 -3316836 -7782939 -15485877 -18095221 -12251624 760340 15814266 23843498
40408 23843498 19064318 7897440 3109854 7558322 11672976 8511635 1858190 -3548164
40400 -3548164 -9326189 -15424977 -14767191 -4161153 7108514 8717341 3678613 2277789
40392 2277789 6253893 8503981 5506901 624594 -3494024 -7094687 -8362925 -4086033
40384d086033Q564949Q220922O157896M222461j326373j0545952j4577451q046841
40376a1416422Q51245K133857p91952J441848P049377O217120j220965m771375
40368e07267q66479J406780l623756p668321j536118R099051J0520547L53441
40360G177878q860011o165444M496742J0509475O021433k765060o183493j272219
40352B959301O853711J0833166P108096j583573q190816p579080k220841L25930
40344H505894k915308o249085l686672K024999L605151J01764k597904j360839
40336b572000O68325R17107J256375K739466K239114k240836p273999q456795
40328a2723243n704530j306469L663201P924163Q582377M863064N10679j034076
$$ plain form
40384 -4086033 4478916 12699838 18857734 23080195 21753822 11207870 -3369581 -11416422
40376 -11416422 -10565177 -8431320 -9223272 -7781424 -732047 5485073 4264108 -507267
40368 -507267 -1373746 33034 -3590722 -11259043 -12795161 -3696110 6824437 7177878
40360 7177878 -1682133 -7847577 -3350835 7158640 13180073 10415013 4231520 2959301
40352 2959301 9813012 20646178 27754274 26170701 17979885 10400805 8179964 8505894
40344 8505894 5590586 -658499 -4345171 -2320172 1284979 1386743 -1211161 -2572000
40336 -2572000 -1903675 -986568 269807 3009273 5248387 3007551 -4266448 -12723243
40328 -12723243 -18427773 -19734242 -16071041 -8146878 435499 5298563 5809242 4775166
40320D775166j325898l214753m924238k302641M010336P907055M913888k576132
40312G262783p856090o418367J27531N695537N331319k91436n878375o521457
40304h548555j322573O498819J1464680R301181J227793n947500o484020j632101
40296D557724L165842M866298L524789o19579n738336o543450k27070P084156
40288A0070374O701772n08153n637305m799512k347536r53883J789878N101433
40280I417068L677471j716686k478559L935601Q271492M038634j974916j841914
40272B1328191J53580l547873r356994q800196l421944j027843j170623K456146
40264c387556P395930M302660n798069r856335k284101N979473M094411k965911
$$ plain form
40320 4775166 3449268 234515 -4689723 -6992364 -2982028 4925027 9838915 7262783
40312 7262783 -593307 -7011674 -6884143 -1188606 4142713 3851277 -2027098 -8548555
40304 -8548555 -9871128 -3372309 8092371 17393552 18621345 12673845 6189825 4557724
40296 4557724 7723566 12589864 16114653 15495074 9756738 3213288 2986218 10070374
40288 10070374 16772146 16263993 10626688 5827176 3479640 2525757 4315635 9417068
40280 9417068 13094539 11377853 8899294 12834895 21106387 25145021 23170105 21328191
40272 21328191 21481771 17933898 8576904 -223292 -3645236 -4673079 -5843702 -3387556
40264 -3387556 4008374 8311034 2512965 -7343370 -9627471 -3647998 446413 -2519498
40256b519498l581627K618418N586571P00742n063261l789018K611138N439971
40248B003436O62632n822855n242264K960831R533454O238413l694971q942777
40240b304101l546181O221829R692049M159479l004501m020364K53879K744380
40232A0196469N8129l787540m359490l153552l480543l746919m68046M187469
40224d554023M573815O48176k083576j815530j993640k636331J060808Q306806
40216A506505R784452P43211j0131536j1458657l448627M622877O667856L758989
40208B045070k05972j554960J161357M445270L074078j487796j929933K968890
40200H516004N320953J119680l083727k238429j336221m191223m350434K687805
$$ plain form
40256 -2519498 -6101125 -3482707 2103864 2804606 -2258655 -6047673 -3436535 2003436
40248 2003436 2666068 -3156787 -8399051 -5438220 4095234 10333647 6638676 -2304101
40240 -2304101 -5850282 371547 10063596 14223075 11218574 7198210 7452089 10196469
40232 10196469 10254598 6467058 2107568 -1045984 -4526527 -8273446 -8741492 -4554023
40224 -4554023 19792 667968 -1415608 -3231138 -5224778 -7861109 -6800301 1506505
40216 1506505 11290957 12034168 1902632 -9556025 -13004652 -8381775 -1713919 2045070
40208 2045070 1839098 284138 1445495 5890765 8964843 7477047 5547114 8516004
40200 8516004 13836957 14956637 11872910 9634481 8298260 4107037 -243397 2444408
40192B444408Q433470M711598j510960l69808K978070j193618o954894j957780
40184F580486Q660036Q509000k285498p129697j211829K240146k835956n941750
40176F584938k006101j032660o562681n564751P505182J5972823O272677q569063
40168A2600364r077067O33970L159825k202018j899482N146596N844751k571607
40160A1635332p206390k098205K193146j999115o195122j197797O383480M457219
40152E972548n040535q563093l86519J0065462J1347191L643838l723241m576103
40144H739548j439172O00300J296700L539176O533249N684573n6446n396869n516325
40135A3984734j917502J206964K936743M731787O624965P727537P970191O390566
$$ plain form
40192 2444408 10877878 15589476 14078516 13708708 16686778 15493160 8538266 6580486
40184 6580486 15240522 23749522 21464024 14334327 13122498 15362644 12526688 6584938
40176 6584938 4578837 3546177 -3016504 -8581255 -1076073 14896750 21169427 12600364
40168 12600364 3523297 4157267 7317092 5115074 3215592 8362188 14206939 11635332
40160 11635332 4428942 2330737 4523883 2524768 -3670354 -4868151 1515329 5972548
40152 5972548 932013 -7631080 -8017599 2047863 13395054 17038892 13315651 8739548
40144 8739548 7300376 7900676 9197376 12736552 19269801 24954374 24897928 19501059 13984734
40135 13984734 12067232 13274196 16210939 20942726 27567691 35295228 43265419 49655985
40127D9655985R25259o633968r321367l581203L983930M323375j774294n558491
40119C2019226l365056o72090k338368n613945n709205l064049j190303p08444
40111I357766L70171K152248K373695J45783k498007l312734k499998j935861
40103D153063k442037k469537K61994N558494R452047P398683k60266p159357
40095A4493084p344399k592166l61853l495774n776569r91195P076740R374993
40087A0382861M448247n02294j287302j235252k175924j24012N362654O566482
40079B1435460k80822o262333k631477M247320K235401p021277j0714425m819827
40071c811980J756114K908595K316760L049199K452730K77582M81835J766322
$$ plain form
40127 49655985 50581244 43947276 34625909 31044706 35028636 39352011 37577717 32019226
40119 32019226 28654170 27982080 25643712 20029767 14320562 11256513 10066210 9357766
40111 9357766 9727937 11880185 14253880 14399663 11901656 8588922 6088924 4153063
40103 4153063 1711026 -758511 -496517 5061977 14514024 21912707 21652441 14493084
40095 14493084 7148685 4556519 4194666 698892 -5077677 -6068872 1007868 10382861
40087 10382861 14831108 14328814 13041512 11806260 9630336 9506324 14868978 21435460
40079 21435460 21154638 14892305 12260828 16508148 18743549 11722272 1007847 -3811980
40071 -3811980 -2055866 852729 3169489 6218688 8671418 8949000 9430835 11197157
40063A1197157k273450r942802j0358029l96794R154479J0129672P502496O583683
40055B1596412K773314o324746j0933937l609459O339502O435185Q41890K082055
40047A9200216R193826R816715J030960o961344p565646m867706l133507j138606
40039A5574908J206482Q22706j809255k389846o01134l61285j790988q53732K688020
40030A2485876M820057M683459M425605K479294l711643q822294m352963O775451
40022A8782842J1689764O258321Q20276K842843N390803J62832p659866p103274
40014C1184541K135037J0136839J0493482N982688K236732J768979L603242M852746
40006G2394286L470961J535512L546532R788889J4942122J5479928J4369667J5770522
$$ plain form
40063 11197157 8923707 -1019095 -11377124 -11773918 -2619439 7510233 15012729 21596412
40055 21596412 24369726 18044980 7111043 3501584 9841086 16276271 17118161 19200216
40047 19200216 28394042 38210757 39241717 32280373 24714727 19847021 16713514 15574908
40039 15574908 16781390 17604096 15794841 13404995 12803861 12442576 10651588 9797856 12485876
40030 12485876 17305933 21989392 26414997 28894291 25182648 16360354 12007391 18782842
40022 18782842 30472606 36730927 37551203 40394046 45784849 45947681 38287815 31184541
40014 31184541 33319578 43456417 53949899 59932587 62169319 63938298 67541540 72394286
40006 72394286 75865247 77400759 80947291 90736180 105678302 121158230 135527897 151298419
39998A51298419J9577894K4522926L1735168M0560593M5159092M0831601L0560147
39991C84245840J9872330Q536450n999807j9395728k3004497j6237910q776354
39984C39240324p829699r552608p340991l539087o392723j7069742k6391814k6285073
39976B34838587j9733278j5778396j7503820j9804243j8423540j5716263j5260348
39969A12618699j5345756j2221414p219740n365247p468733q750530o195754k529503
39961D7522022r01783o1348J786574J948059k916761r538794j0332712l840848
39953B3664409K245740J427164k435347j303584M140968M876334k308820q595873
39945B1710991n675087J633121K711149k743645n239313j103272K600580P91248
$$ plain form
39998 151298419 170876313 195399239 227134407 267695000 312854092 353685693 384245840
39991 384245840 404118170 412654620 406654813 387259085 364254588 348016678 339240324
39984 339240324 331410625 321858017 314517026 310977939 304585216 287515474 261123660 234838587
39976 234838587 215105309 199326913 181823093 162018850 143595310 127879047 112618699
39969 112618699 97272943 85051529 77831789 72466542 64997809 56247279 50051525 47522022
39961 47522022 46620239 46558891 48345465 50293524 47376763 37837969 27505257 23664409
39953 23664409 25910149 27337313 24901966 23598382 27739350 32615684 30306864 21710991
39945 21710991 16035904 17669025 20380174 17636529 12397216 11293944 13894524 14685772
39937A4685772j878080o14323J054491r32277k476506J291826N819240L736820
39929B0686963k337180l588731N05957J620697l553962q367221o821774j161985
39921c017236L453714N203965M273736J160776j495920n06579K749589L509065
39913A5331110Q24903j513287j725315j816012j970513J62921L237013K252325
39905A4783145k964992o143974l981366l69381J443115L433395O080049N116860
39897A7396851p3334k765978K16030J723941l853512r382752n591765L035488
39889G04969M804220l27516j556376L752219N726036j44119l937073K560937J0972398
39880B2555695P885284m787380j2125000o898665K311017M816324Q61836k589886
$$ plain form
39937 14685772 12807692 12193369 13247860 12315583 9839077 11130903 16950143 20686963
39929 20686963 18349783 14761052 15267009 16887706 13333744 4966523 -1855251 -3017236
39921 -3017236 436478 5640443 9914179 11074955 9579035 9072456 11822045 15331110
39913 15331110 16156013 14642726 12917411 11101399 9130886 9293807 12530820 14783145
39905 14783145 11818153 5674179 1692813 1323432 2766547 6199942 12279991 17396851
39897 17396851 17323517 14557539 14773569 16497510 12643998 3261246 -2330519 704969
39889 704969 5509189 5181673 3625297 7377516 13103552 12959433 9022360 11583297 22555695
39880 22555695 30440979 25653599 13528599 6629934 8940951 13757275 14619111 12029225
39872A2029225k370791k08788K400389M740702M455581l6229n399344o382130
39864I228615k908625J26359J23044q78786j400787k437095k823095R36307P262201
39855G228138Q544284K373541k613194J189333P992221O943252j205301n875198
39847B4577076l159149L94523P77511K040083N939966O604131O93512n787981
39839C2079672o783674m857033m369044l119492J714879N459534K656482k341546
39831B0439778r69676N540150P230204M51694o917973p092105j785871K995606
39823A9891807N395650O591639N526047J58011p159109j0048557n279302K481740
39815A7557926N110784J41964o335000p016467j952365K707450L346918K294655
$$ plain form
39872 12029225 9658434 9449646 11850035 16590737 21046318 21010089 15610745 9228615
39864 9228615 6319990 6446349 6569393 5690607 4289820 1852725 -970370 -34063 7228138
39855 7228138 15772422 18145963 15532769 16722102 24714323 31657575 30452274 24577076
39847 24577076 21417927 21812450 22589961 24630044 30570010 37174141 37867653 32079672
39839 32079672 25295998 20438965 16069921 12950429 14665308 20124842 22781324 20439778
39831 20439778 19470102 25010252 32240456 32692150 25774177 18682072 16896201 19891807
39823 19891807 25287457 31879096 37405143 37563154 30404045 20355488 15076186 17557926
39815 17557926 22668710 22810674 16475674 9459207 7506842 10214292 13561210 15855865
39807A5855865K291940K088606k54195l293158m329648l098557r68799J040086
39799I332140J439943j325809n188172m828512Q46571N251155K547774l650710
39791D424380n297718j239111K540552K835691K822240M953295O107886K434144
39783A9581359m593659r485390q274094j625901N823551Q683466N240106p01081
39775A4648357l680902k241943M52637Q39310j882384n829385p684522m835305
39767a0214137J625925O975435P815198N561706L193681J067787j110186j179041
39759A3736368K035850M530177J943012k960808l855918r65660l22547k790351
39751A1350123k451798J639323J365804p081494j3791852p741216O397881J3906830
$$ plain form
39807 15855865 18147805 20236411 19982216 16689058 12359410 9260853 8292054 9332140
39799 9332140 10772083 9446274 4258102 -570410 276161 5527316 8075090 4424380
39791 4424380 -873338 -2112449 428103 3263794 6086034 11039329 17147215 19581359
39783 19581359 14987700 5502310 -2771784 -4397685 1425866 10109332 15349438 14648357
39775 14648357 10967455 8725512 9178149 10017459 8135075 2305690 -5378832 -10214137
39767 -10214137 -8588212 -1612777 6202421 11764127 14957808 16025595 14915409 13736368
39759 13736368 15772218 20302395 22245407 19284599 15428681 14463021 14140474 11350123
39751 11350123 8898325 10537648 11903452 4821958 -8969894 -16711110 -10313229 3593601
39743C593601R907789L203131M62531k128764p817641j0345739l733533O045391
39735h13234Q433764L449881O860J042034P21599k826851l008558K732866N926441
39726A5664802L5190p572816o349080L70763O87653o078644p854273N72413Q787741
39717a736251O627076j356778m420454j005406K333196J971446o65881m207920
39709b460972p182728n849969N91835N308744J900658m899772m774730K883366
39701a4483568P927285M512033j311014j815456J869040L591307J213717k510830
39693a007486m492223l219621R48212M626133L510076j652497m200388J98536
39685e289258O970739P904038J552616n135444n436065l65953L361131J631910
$$ plain form
39743 3593601 13501390 16704521 17167052 15038288 7220647 -3125092 -6858625 -813234
39735 -813234 7620530 11070411 11077271 12119305 12840904 10014053 7005495 9738361 15664802
39726 15664802 15699992 8127176 1778096 2148859 2836512 -3242132 -11096405 -10523992 -1736251
39717 -1736251 4890825 3534047 -886407 -1891813 441383 2412829 1746948 -2460972
39709 -2460972 -9643700 -15493669 -14901834 -9593090 -7692432 -12592204 -17366934 -14483568
39701 -14483568 -6556283 -2044250 -3355264 -5170720 -3301680 289627 1503344 -1007486
39693 -1007486 -5499709 -8719330 -7771118 -3144985 365091 -1287406 -5487794 -5289258
39685 -5289258 1681481 9585519 11138135 6002691 566626 200673 3561804 5193714
39677E193714k366848k707069Q90114K374451j515472n470321l253119K069119
39669d785431K273990k781058m252097J729940P460271N415480m93560j886580
39661B680955J139755J863455j236800k863493o80618J031316q30066l054641
39653a950137j685861J910240L779645K899419R02950j142157k585532j790998
39645C37569J728518M731777L114197k558257p107786o929643l740758j140299
39637a1564682J49164J433377K194614N19753k572807k775122J691768O521718
39629d402217O419589K165025p32404K78963K187510J858847K41166m42399l39037
39620G235043l59711L95508K594720L918995J577959l442565p498930q699817
$$ plain form
39677 5193714 2826866 119797 1009911 3384362 1868890 -3601431 -6854550 -4785431
39669 -4785431 -2511441 -5292499 -9544596 -7814656 -354385 5061095 4567535 2680955
39661 2680955 3820710 5684165 4447365 1583872 903254 1934570 1104504 -1950137
39653 -1950137 -3635998 -1725758 2053887 4953306 5856256 4714099 2128567 337569
39645 337569 2066087 6797864 9912061 7353804 246018 -6683625 -10424383 -11564682
39637 -11564682 -11415518 -9982141 -7787527 -7267774 -9840581 -12615703 -10923935 -4402217
39629 -4402217 2017372 4182397 3449993 3728956 5916466 7775313 8016479 7574080 7235043
39620 7235043 6875332 7270840 9865560 13784555 15362514 11919949 4421019 -4278798
39612d278798p346531l240975L460055Q996826Q186727J260578n083641n226359
39604c272118k27838N480303R110728Q836645K605448p631208j3705028r442729
39596h245797J10090M121944P34888p77968N216164J1358475Q208625j312177
39588A9414244o283499l694383j162950l636083o149829l156724K156781L377418
39580H64975P48511q36198o56092j964977m075161k012909M588645Q880870O309558
39571A1847222J368655M14490K047705N24145l902429n058846j050690K594499
39563H784751J940929M76489K101494L578466l06175p174303r013770k982721
39555b594840N032227P856109L920500l047764p234468m343742L501884P548396
$$ plain form
39612 -4278798 -11625329 -14866304 -11406249 -2409423 5777304 7037882 1954241 -3272118
39604 -3272118 -3499956 1980347 11091075 19927720 22533168 14901960 1196932 -8245797
39596 -8245797 -8135707 -4013763 -3278875 -4056843 1159321 12517796 20726421 19414244
39588 19414244 13130745 9436362 8273412 4637329 -1512500 -4669224 -2512443 864975
39580 864975 1613486 777288 121196 -1843781 -5918942 -7931851 -3343206 5537664 11847222
39571 11847222 13215877 13630367 15678072 16202217 12299788 7240942 6190252 8784751
39563 8784751 10725680 11202169 13303663 16882129 16575954 9401651 387881 -2594840
39555 -2594840 2437387 10293496 14213996 11166232 3931764 -411978 3089906 10638302
39547A0638302K567655m263439k179599O402621Q264416J07520n481237l47581
39539A5708658N673627J545834n796088l092930O317857P829511m1295m130264
39531B4014910M79698L463335j143912m634286P4603N740879L458133k994809
39523B8458551m950291k222870L53320K169805L976897K675237k637945n862896
39515B1959808l100932M6900j638446l396012M704L047183r93626o276269l147270
39506F506040M547362M901290k453302o416214k898694O36359m05467j812985
39498B604389o84611L87608J092002M052834O060692M85251r173484j0535357
39490e710676j082091O494501L201363l498256l145789J566636J310766m159686
$$ plain form
39547 10638302 13205957 8942518 6762919 13165540 21429956 21537476 16056239 15708658
39539 15708658 21382285 22928119 17132031 14039101 20356958 28186469 28145174 24014910
39531 24014910 24494608 27957943 26814031 22179745 22254348 27995227 31453360 28458551
39523 28458551 23508260 21285390 21638710 23808515 27785412 30460649 27822704 21959808
39515 21959808 18858876 18905776 17267330 13871318 13876022 16923205 15929579 9653310 6506040
39506 6506040 11053402 15954692 13501390 7085176 4186482 4822841 4417374 2604389
39498 2604389 1919778 2307386 3399388 7452222 13512914 13998165 4824681 -5710676
39490 -5710676 -6792767 -298266 2903097 -595159 -3740948 -2174312 -863546 -5023232
39482e023232o262457n05292P805769J0018546L324718n481043o065193K528784
39474C40600Q293097K076088p522113n945384M272039P314858J03634l620660
39466E312159J584901L467512m181335q094794J212236J0402251M408066p795392
39458F315604p910670J891263M700401k476385o833538l342674q6563l16196K215757
39449e843001Q102504R120190L346533j121005o49502p15089l115163k002130
39441G123337L555601N844860J701009k359898k365370k612814m921726m091874
39433A873125P60485K061013k948941n976459j510501L776040L046187O36922
39425A717871K713808N494692K406068l853042n702711k124062K073991L897856
$$ plain form
39482 -5023232 -11285689 -11790981 -3985212 6033334 9358052 3877009 -2188184 340600
39474 340600 8633697 10709785 3187672 -2757712 1514327 8829185 8932819 5312159
39466 5312159 6897060 10364572 6183237 -1911557 -699321 9702930 14110996 6315604
39458 6315604 -1595066 296197 4996598 2520213 -4313325 -7655999 -7742562 -8058758 -5843001
39449 -5843001 2259503 11379693 14726226 13605221 12955719 12240630 9125467 7123337
39441 7123337 10678938 16523798 18224807 15864909 13499539 10886725 5964999 1873125
39433 1873125 2633610 4694623 1745682 -4230777 -5741278 -1965238 1080949 1717871
39425 1717871 4431679 9926371 12332439 8479397 2776686 652624 2726615 6624471
39417F624471K728484j637534n795641l638271L738431O057216j492930r155522
39409b571296o307463K909529P097574M467066J786770J478254O77293k96902
39401I240825Q81777J537852j679558l979251J393233R934339J0139433P82702
39393B8251352p101365o646821l039972k550672l391945j487305K218988M217212
39385A0469472K707963k829012j0785022j4836132q770224M074284J2496254J0779934
39377C307517M372673L45477j041528k293904k853611j648038m12015l10920O11015
39368G6666K983092L189603j124089n937626n384805N17375N879539N601355J85802
39359E986912n079650n066899j32701M001170L339276N92876M1219M90495j314470
$$ plain form
39417 6624471 9352955 7715421 1919780 -1718491 2019940 8077156 6584226 -2571296
39409 -2571296 -8878759 -5969230 1128344 5595410 7382180 8860434 9537727 9240825
39401 9240825 10122602 11660454 9980896 6001645 7394878 17329217 27468650 28251352
39393 28251352 21149987 14503166 11463194 8912522 5520577 4033272 6252260 10469472
39385 10469472 13177435 10348423 -436599 -15272731 -24042955 -19968671 -7472417 3307517
39377 3307517 7680190 8025667 6984139 4690235 1836624 188586 -223429 -534349 76666
39368 76666 3059758 6249361 5125272 -812354 -6197159 -5679784 199755 5801110 5986912
39359 5986912 907262 -4159637 -4292338 -291168 3048108 3640984 3682203 4172698 2858228
39350B858228l165964q15098K860882J279010l484234k232630N493709Q267226
39342A1061129K15348q868800p979994o67647K201392j390335m883191m792294
39334a5104392l074418q19271K427203M890786M553867L003802K249560Q66149
39326a006714j748984j762922K521172N455763K362521k119846j936721k67108
39318A497161k599874m734111J05081O374753K994623o616297p358659L024363
39310g312960Q844235J308524p419796m198230M855323O459721J864430J746874
39302F148121N889493L686000o418701j2254337n625445N844784R235774J971328
39294H477017p297475r225465k092705P569111J0795373M792245l736444o243018
$$ plain form
39350 2858228 -307736 -1122834 1738048 3017058 -467176 -2699806 2793903 11061129
39342 11061129 11276477 2407677 -5572317 -6239964 -4038572 -5428907 -10312098 -15104392
39334 -15104392 -18178810 -18998081 -16570878 -11680092 -7126225 -4122423 -1872863 -1006714
39326 -1006714 -2755698 -4518620 -1997448 3458315 5820836 3700990 1764269 1497161
39318 1497161 -1102713 -5836824 -5731743 643010 3637633 -2978664 -10337323 -7312960
39310 -7312960 1531275 2839799 -4579997 -8778227 -3922904 2536817 4401247 6148121
39302 6148121 12037614 15723614 9304913 -2949424 -8574869 -2730085 6505689 8477017
39294 8477017 1179542 -8045923 -10138628 -2569517 8225856 13018101 9281657 3038639
39286C038639k759165q19059l977586o594403k532506N178339P866039K941066
39278B341364k421015n94238O438696R365641L403915n493688q254831l954687
39270H31157M18285N07851l25050J933749M838398L566851r52542l036512m71157
39261G311030K760649K397691j008362l946957m246484k319438r434O90346q94949
39252G34092l054624l109302n32854K269962K893024J710239Q34814R14113L64722
39243C024186j769590l540702k445915L15825O05332k529310m371251q53445N092008
39234f472862P411033N325290K846833J103392k254846n586647l108745M650996
39226C914444Q002840J420677o848767o158398O83027K497008k190685l332465
$$ plain form
39286 3038639 279474 -539585 -4517171 -11111574 -13644080 -8465741 -599702 2341364
39278 2341364 -79651 -673889 5764807 15130448 18534363 13040675 4785844 831157
39270 831157 1249442 1757293 1432243 3365992 8204390 11771241 10818699 7782187 7311030
39261 7311030 10071679 12469370 11461008 7514051 3267567 948129 938695 1629041 734092
39252 734092 -2320532 -5429834 -5962688 -3692726 -799702 910537 1745351 2659464 3024186
39243 3024186 1254596 -2286106 -4732021 -4416196 -3810864 -6340174 -10711425 -11564870 -6472862
39234 -6472862 938171 6263461 9110294 10213686 7958840 2372193 -736552 3914444
39226 3914444 11917284 13337961 6489194 330796 1013823 3510831 1320146 -2012319
39218b012319L577632R497739N423519m419409r359071o604625j937805M52018
39210e382321J828468L680531M671142L533961R30696k291474n497831o565894
39202e092722l228141K807691O228199M482105J321174J552762M048457L227326
39194A5346851k828132r045320r391702l855802K495504N691061N556784L320428
39186G289672r1008k838738k396853J114086L736533J914715l058207o499536
39178h29336n517055j379044K493724L511553J536234j151704j842857q5193K261870
39169a001808L817303M764869M604012J622031l423485n826295k395392L363225
39161E524460N136404J811789k083491l191692k421795j272837M81837K323548
$$ plain form
39218 -2012319 1565313 11063052 16486571 12067162 2708091 -3896534 -5834339 -5382321
39210 -5382321 -3553853 126678 4797820 8331781 9262477 6971003 1473172 -5092722
39202 -5092722 -8320863 -5513172 715027 5197132 6518306 8071068 12119525 15346851
39194 15346851 12518719 3473399 -5918303 -9774105 -7278601 -1587540 3969244 7289672
39186 7289672 7198664 4359926 1963073 3077159 6813692 8728407 5670200 -829336
39178 -829336 -6346391 -7725435 -5231711 -1720158 -183924 -1335628 -3178485 -3263678 -1001808
39169 -1001808 2815495 7580364 12184376 13806407 10382922 4556627 2161235 5524460
39161 5524460 10660864 12472653 10389162 7197470 4775675 3502838 3984675 6308223
39153F308223K190049m9469j555595p05194P22936J165942J576335J975432k65385
39144A1363274n286910p814191m297938K28731j096591n340324l159054N652643
39136i750360R363784J394577q267114o578023L648168Q572430M119757O9928
39128B573147K492655M463653k62251n089172j353256O175084N833928k546110
39120A2287678p337881k785676L700020L930922n39934l755601l709023j326219
39112D64286K778746O456207N972530J465570j975477j525499j84574p13344j606389
39103A1132056j863136l433398n459665l116283L197368M970108j841185q454237
39095d868372n335721L474505P042667L606706K74651K57852M84037r4079M92122
$$ plain form
39153 6308223 8498272 8448803 6893208 6188014 6910950 8076892 9653227 11628659 11363274
39144 11363274 6076364 -1737827 -6035765 -5807034 -6903625 -12243949 -15403003 -9750360
39136 -9750360 -386576 1008001 -7259113 -13837136 -10188968 -1616538 2503219 2573147
39128 2573147 5065802 9529455 9267204 4178032 2824776 8999860 14833788 12287678
39120 12287678 4949797 2164121 5864141 9795063 9255129 5499528 1790505 464286
39112 464286 3243032 9699239 15671769 17137339 15161862 13636363 13451789 12738445 11132056
39103 11132056 9268920 5835522 375857 -2740426 456942 5427050 3585865 -4868372
39095 -4868372 -10204093 -6729588 313079 3919785 4194436 4452288 4936325 4842246 5334368
39086E334368R24005j766818m999045l507079J440610L872323K780544J420103
39078E499011q59504n938217q201734q53625R580326Q982176k343391q116415
39070b251373r44402O342822K015394n996853m259597M542702P659954K778926
39062I887573j209159k07847R78976m78948j323588J74267J004245o09493k347841
39053E868185k293391j580812j619356k046914j766384L0033K932850M198433
39045C722644J222388l580185m484293q10971J827542J064654J515318M815040
39037E292137M192294l825210r911075m013853Q487559J3571726Q025179R30986
39029B2749743k117034m299682o985579n787101j2775L891978K127017j281762
$$ plain form
39086 5334368 6258373 4491555 -507490 -4014569 -2573959 1298364 4078908 5499011
39078 5499011 4639507 -1298710 -9500444 -10354069 -773743 8208433 5865042 -2251373
39070 -2251373 -3195775 3147047 5162441 -834412 -5094009 -551307 7108647 9887573
39062 9887573 8678414 8470567 9449543 8970595 7647007 7821274 8825519 8216026 5868185
39053 5868185 3574794 1993982 374626 -1672288 -3438672 -3408639 -475789 3722644
39045 3722644 4945032 1364847 -3119446 -3930417 -2102875 -1038221 477097 5292137
39037 5292137 9484431 5659221 -4251854 -8265707 221852 13793578 21818757 22749743
39029 22749743 20632709 16333027 9347448 3560347 3547572 7439550 9566567 8284805
39021H284805k347366k499252k833229p87862L342977M032603l99701l241654
39013C551321K86954M514833K176847l434489l661997J200970K043905m567140
39005B111204j0486459p424887J902792Q212290P285225K672436r73037k396374
38997I03190j894592L38364K381248Q03725m390257p628359m220401K639199N396217
38988e671666J916846k608106l406265j051696J871448L980616L740956R5590
38980a132277l875128l397301R3367P2240l516441k156919O770938J2410748N723360
38971A0992587n307046o749867M54910L466451j509848n019642j557602K435706
38963b794351J253349j124605q3104J392807k33689j771210L63787L014182J939866
$$ plain form
39021 8284805 5937439 3438187 604958 -182904 3160073 7192676 6792975 3551321
39013 3551321 3838275 8353108 10529955 7095466 3433469 4634439 6678344 2111204
39005 2111204 -8375255 -15800142 -13897350 -5685060 1600165 4272601 3299564 903190
38997 903190 -991402 -653038 1728210 2531935 -1858322 -9486681 -13707082 -11067883 -5671666
38988 -5671666 -3754820 -6362926 -9769191 -10820887 -8949439 -4968823 -1227867 -1132277
38980 -1132277 -5007405 -8404706 -8311339 -8239099 -11755540 -13912459 -7141521 5269227 10992587
38971 10992587 5685541 -1064326 -609416 2857035 1347187 -3672455 -5230057 -2794351
38963 -2794351 -1541002 -2665607 -2748711 -1355904 -1589593 -3360803 -2997016 17166 1957032
38954A957032p84100j192990m46564j254380j632677J213181M205705K349506
38946D414713k875354n429530l526652n41230J797264M851352P641592O157972
38938A2490127k9585n319791n074325j774548j014473l363810l931219M9597M731703
38929c236324M875563J437201L28721L661140O248696K850838m412696r012603
38921B740536p945165l335658J604977M269951K446236k802055n584451j687835
38913a0293464M551293N453135J060950j429716J042589L903083L498414J636201
38905I422485l27862m310592r189230q901516j385283O539276P920519M175945
38897C943742N14447j756637l348120k502579J664575N047911L439288j201007
$$ plain form
38954 1957032 1172932 -20058 -466622 -1721002 -3353679 -2140498 2065207 4414713
38946 4414713 1539359 -3890171 -7416823 -7958053 -6160789 -1309437 6332155 12490127
38938 12490127 12460542 7140751 2066426 291878 -722595 -4086405 -8017624 -7968027 -3236324
38929 -3236324 1639239 3076440 3405161 7066301 13314997 16165835 11753139 2740536
38921 2740536 -5204629 -8540287 -6935310 -2665359 -219123 -3021178 -8605629 -10293464
38913 -10293464 -5742171 -289036 771914 -657802 384787 4287870 7786284 9422485
38905 9422485 9094623 4784031 -4405199 -13306715 -14691998 -8152722 -232203 3943742
38897 3943742 4458189 2701552 -646568 -3149147 -1484572 3563339 7002627 5801620
38889E801620l998549l769702k204757J15532K546845K777675O92287o8147J391041
38880C283845K09418n429268q287910k263295O499697P666588K097024q74522
38872B901577Q74277N10439l881683n204068K3950N046698L696300j94609J19605
38863C892486L821493N080071K147175j375016k109405J5789K538576K036826
38855A6047995k850665q408540q802047l547497J516150K404739J845383L346533
38847A552051N010938L480858M58920J21412K092669K242028l07893k031330j273155
38838A1346498j003832l509242o013201m546210p2174K603768J464727n04087
38830b33753n14491k10038k267788n109745m870813j785607o1463p95656P1190
$$ plain form
38889 5801620 1803071 -1966631 -4171388 -4055856 -1509011 1268664 1960951 1892804 3283845
38880 3283845 3493263 -1936005 -10223915 -12487210 -5987513 1679075 3776099 2901577
38872 2901577 3775854 4286293 404610 -4799458 -4775508 271190 3967490 3772881 3892486
38863 3892486 7713979 12794050 14941225 13566209 11456804 11472593 14011169 16047995
38855 16047995 13197330 4788790 -4013257 -7560754 -6044604 -3639865 -1794482 1552051
38847 1552051 6562989 10043847 10502767 10624179 12716848 14958876 14650983 12619653 11346498
38838 11346498 10342666 6833424 820223 -3725987 -3798161 -1194393 270334 -233753
38830 -233753 -748244 -958282 -3226070 -8335815 -13206628 -14992235 -15053698 -15849354 -15778164
38821a5778164M591160Q379926O976024K613074K50577L60946O51801J535350
38813I580694L780128L750229j590030p079059n385418M08928K07295o431640
38805b758873q285571o67010N902073K153054n013305l869388L696138O684634
38797b158248K935084J43235J160652P98019k211782j966064K994015N330375
38789G025286P17071m839272m767036j307505P36654K588839O796827R647126
38781A6597990O190006r37665n227419n848402o089605n144285j12468N199656
38773D627808L020219n779689j0639591n618636K948461O634795N511362L841226
38765D545955J902240j368980k582985J505676O171553L278175o491340j2728448
$$ plain form
38821 -15778164 -11187004 -2807078 4168946 6782020 7032597 7393543 8045344 9580694
38813 9580694 13360822 17111051 15521021 8441962 3056544 3465472 3672767 -2758873
38805 -2758873 -11044444 -11711454 -5809381 -3656327 -8669632 -12539020 -8842882 -2158248
38797 -2158248 776836 920071 2080723 2878742 666960 -1299104 1694911 7025286
38789 7025286 7742357 2903085 -1863951 -3171456 -2434802 154037 6950864 16597990
38781 16597990 22787996 21850331 16622912 10774510 4684905 -459380 -571848 4627808
38773 4627808 7648027 1868338 -8771253 -14389889 -11441428 -4806633 704729 4545955
38765 4545955 6448195 5079215 2496230 4001906 10173459 13451634 6960294 -5768154
38757e768154q277681J874709P140188L576085k922325m251854R49353O187840
38749a491839M866226j514601m978373j393858M045502L969837j527100o017443
38741d041649n426061j416363K764541N550878O281199M742658J893106j147688
38733I200621m120899n774628l347726K850378P006503M452230j493230m311349
38725D461900l480058k874332k483840N16413L860396K326595k160544k033732
38717a867202L086487N125104J549283l62106K364834J744065o297631j1581002
38709f238168m867937N636594N886855k145728m511559J932807N773131P99932
38701B265927m554216j877071M509415N848665J784423j820194k389413j737996
$$ plain form
38757 -5768154 -14045835 -12171126 -5030938 -1454853 -4377178 -8629032 -7679679 -1491839
38749 -1491839 3374387 1859786 -3118587 -4512445 -466943 3502894 1975794 -4041649
38741 -4041649 -9467710 -10884073 -8119532 -2568654 3712545 8455203 10348309 9200621
38733 9200621 5079722 -694906 -4042632 -1192254 5814249 10266479 8773249 4461900
38725 4461900 981842 -1892490 -4376330 -3859917 479 2327074 166530 -1867202
38717 -1867202 1219285 6344389 7893672 7531566 9896400 11640465 5342834 -6238168
38709 -6238168 -11106105 -5469511 417344 -1728384 -6239943 -4307136 1465995 2265927
38701 2265927 -2288289 -4165360 344055 6192720 7977143 6156949 3767536 2029540
38693B029540j105407l15715L437q45364j889340j924777j494823j721212k213921
38684i477582j256590K415118P684614J0188931N433130m856003j1850073q940962
38676a0659417j50920N164996M241421K095924K102669K067843J70234j647152
38668C385598j968619k249736l083847k777936j034927L55103J180604K361516
38660c832244J923435k357069o175185k501961O265242Q819368J122597o816115
38652c551932n592486P21693L314050K261042K450790K413244j972026o625194
38644f580819l656003M616827P063974K22692o505878m868826J483966M200478
38636d023589J433829k670323m658539l480558Q11650N913022P285021K876079
$$ plain form
38693 2029540 924133 608418 611855 -233509 -2122849 -4047626 -5542449 -7263661 -9477582
38684 -9477582 -10734172 -8319054 -634440 9554491 14987621 10131618 -1718455 -10659417
38676 -10659417 -10810337 -5645341 -1403920 692004 2794673 4862516 5032750 3385598
38668 3385598 1416979 -832757 -3916604 -6694540 -7729467 -7374364 -6193760 -3832244
38660 -3832244 -1908809 -4265878 -10441063 -12943024 -6677782 2141586 3264183 -3551932
38652 -3551932 -9144418 -8422725 -5108675 -2847633 -396843 2016401 44375 -6580819
38644 -6580819 -10236822 -5619995 1443979 1666671 -4839207 -9708033 -8224067 -4023589
38636 -4023589 -2589760 -5260083 -9918622 -13399180 -12587530 -6674508 610513 3486592
38628C486592l616830o518564l841856K080032P417400Q892494N566469M94554
38620A3960291j621638k06273K35311l038482o213395m423926K87190J365181
38612C44259k352501m409471l37198N054933M266608j543021l643656J392805
38604a227242O053452K857667l935296m205809K704924O780821K363793m128276
38596G264034n510019m810401p680443j0001876l265089J0018358J6870363J0931772
38588A3816699j4943o006513o133519m346007j914992P81549J388553R0080J465928
38579h73165O317885P558892R77627n839459m015171K173300J878289m644523
38571C533675p107144k811846K46926m37558K970640J1834440J3510494N87396
$$ plain form
38628 3486592 -130238 -6648802 -10490658 -8410626 -993226 7899268 13465737 13960291
38620 13960291 12338653 12132380 12367691 9329209 3115814 -1308112 -1020922 344259
38612 344259 -2008242 -6417713 -6754911 -1699978 2566630 1023609 -2620047 -1227242
38604 -1227242 4826210 7683877 3748581 -457228 2247696 9028517 11392310 7264034
38596 7264034 1754015 -3056386 -10736829 -20738705 -24003794 -13985436 2884927 13816699
38588 13816699 13801756 7795243 1661724 -2684283 -4599275 -3817726 -2429173 -2339093 -873165
38579 -873165 5444720 13003612 13981239 8141780 4126609 6299909 8178198 3533675
38571 3533675 -3573469 -6385315 -6138389 -6575947 -3605307 8229133 21739627 22327023
38563B2327023j3841970j3073163q90188N507153J427675k105617P27291K755742
38555B833946n68989k744375Q85911M351652K333745n76257R1236o22649o799699
38546h15479j0896580m811776N113883O899386J945804J432277O307946O089735
38538A1265196j548541n504162l61530L404226l321320j2424350j0824599m17030
38530a9732110O222755N107687L576770N713338O895230L966085M90853j100663
38522A1139945l750730p901573p276227J180166Q924674N279701p162412j4226066
38514a3792522p701175M918717J0485247N564583j767620l287186L16306K517877
38506b745773M69648j529123J226859O088976N593325j921477q331231n552223
$$ plain form
38563 22327023 8485053 -4588110 -5478298 28855 1456530 -649087 78204 2833946
38555 2833946 2264957 -479418 406493 4758145 7091890 6515633 6606869 5984220 -815479
38546 -815479 -11712059 -16523835 -11409952 -4510566 -2564762 -1132485 5175461 11265196
38538 11265196 9716655 4212493 3850963 7255189 3933869 -8490481 -19315080 -19732110
38530 -19732110 -13509355 -8401668 -4824898 888440 7783670 11749755 12240608 11139945
38522 11139945 7389215 -512358 -7788585 -6608419 2316255 7595956 433544 -13792522
38514 -13792522 -21493697 -16574980 -6089733 -525150 -2292770 -5579956 -5263650 -2745773
38506 -2745773 -2276125 -3805248 -2578389 3510587 9103912 7182435 -1148796 -6701019
38498f701019L333814P553343K502092n109664p026543l254806O05836J475555
38490f621392L16393j266041j627424J276946O377295P813671J917034n860813
38482B325669o912944j384289K552644J251903k42128J669333K813582p67391
38474A306379n148201m361382Q21673N178026O128438L813390j576608p302848
38466a141133p471132j181438L119486j086743o870780l110660P286973R945410
38458e10017O43973p428362k904996P123533P744134k568847j0574545o458265
38450a4933392M459274R913951N557728j783141l931453p47366J940593J511795
38442A987989J264192L142350K968275k776708r120042p864979N81569P087615
$$ plain form
38498 -6701019 -3367205 4186138 6688230 1578566 -5447977 -8702783 -8096947 -6621392
38490 -6621392 -6304999 -7571040 -9198464 -7921518 -1544223 6269448 8186482 2325669
38482 2325669 -4587275 -5971564 -3418920 -2167017 -2409145 -739812 2073770 1306379
38474 1306379 -3841822 -8203204 -7381531 -2203505 3924933 7738323 6161715 -1141133
38466 -1141133 -8612265 -9793703 -6674217 -7760960 -14631740 -17742400 -10455427 -510017
38458 -510017 133956 -7294406 -10199402 -3075869 4668265 2099418 -8475127 -14933392
38450 -14933392 -10474118 -560167 4997561 3214420 -717033 -1464399 476194 1987989
38442 1987989 3252181 6394531 9362806 6586098 -2533944 -10398923 -9817354 -2729739
38434b729739N918610R88317j540518j322082j562097k890549l195821j531715
38426g865594O85278J757919J626576J812317L247170M049648J378129l522887
38418C168556n341542k154096R21334o76157l598855j946994L578461P766815
38410A717522Q765754P495615L100833l418560n316031O88004N364778j236667
38402A7161248j2167046j1725050M3563O867588J740003l985865j508642K412130
38394a162071R90100k02250L314582L771743m194703j0642304n800532K862564
38386a1062871L804394J372345O000886J2794923Q543393m517166j0625397m990286
38378A320221Q38137q67414m087141k244177J944493L686156K807798L56067k819615
$$ plain form
38434 -2729739 3188871 4177188 2636670 1314588 -247509 -3138058 -6333879 -7865594
38426 -7865594 -7180316 -5422397 -3795821 -1983504 1263666 5313314 6691443 3168556
38418 3168556 -2172986 -4327082 -3405748 -4081905 -7680760 -9627754 -6049293 1717522
38410 1717522 10483276 17978891 21079724 17661164 12345133 13033137 18397915 17161248
38402 17161248 4994202 -6730848 -6687285 180303 1920306 -2065559 -3574201 -1162071
38394 -1162071 -171971 -374221 2940361 6712104 2517401 -8124903 -13925435 -11062871
38386 -11062871 -7258477 -5886132 114754 12909677 21453070 16935904 6310507 1320221
38378 1320221 2158358 1290944 -2796197 -5040374 -3095881 590275 3398073 3754140 934525
38369I34525l041858K006757O399930K791133m758785n507505J056007M868676
38361D748880K062882n62756O58879Q32615k253263l730708k027466j764371k624590
38352d659898K219561J1768328J3974231L498979q831466j1687154p700110m584634
38344f002163k308011J863823M811244L723662K962723N515151N371348j685643
38336A4252134p320442k259395P298672P568351j987204q391107m776591J608767
38328E993185K524949k63797o55305K309684M707838L422748j229998o216096
38320A0593208p780685m454924J293040N156418M404744n16838n773407n954605
38312c033049L69093P025616O779928J437140p18344K009586K431441k405490
$$ plain form
38369 934525 -2107333 -100576 6299354 9090487 4331702 -1175803 -119796 4748880
38361 4748880 6811762 6249006 6907885 7740500 5487237 1756529 -270937 -2035308 -4659898
38352 -4659898 -2440337 9327991 23302222 26801201 17969735 6282581 -1417529 -6002163
38344 -6002163 -8310174 -6446351 -1635107 2088555 5051278 10566429 15937777 14252134
38336 14252134 6931692 4672297 11970969 19539320 17552116 9161009 4384418 5993185
38328 5993185 8518134 8254337 7599032 9908716 14616554 18039302 16809304 10593208
38320 10593208 2812523 -1642401 -349361 4807057 9211801 8694963 2921556 -3033049
38312 -3033049 -2663956 4361660 11141588 12578728 11860384 13869970 16301411 13895921
38304A3895921n208284p61423M574968L061365k120072l257615p92065m44452
38296H948343k307138k283631j179656l000788o162994n216053k83821L150272
38288h335466L115625K539146K576946J587001R2456P9441M6057k721626n741715
38279f762135l895873K073873O073340N299887K255446j145312m895996o727760
38271g724530l473550K872344O446356N265645K291516p87408m656687p384503
38263g150817n005319J768514O982646O750568K690694j966459n035728m596216
38255e562117o06671L035986K706100K87740m19759k89119k133717m069937k527632
38246i579126O76208J894683L219218P382187Q515693o5852j0761971q725308
$$ plain form
38304 13895921 8687637 7926214 12501182 15562547 13442475 10184860 9392795 8948343
38296 8948343 6641205 4357574 3177918 177130 -5985864 -11201917 -11485738 -8335466
38288 -8335466 -5219841 -2680695 -103749 1483252 1575708 1655149 1701206 -1020420 -6762135
38279 -6762135 -10658008 -8584135 -2510795 2789092 5044538 3899226 -996770 -7724530
38271 -7724530 -11198080 -8325736 -1879380 3386265 5677781 4890373 233686 -7150817
38263 -7150817 -12156136 -10387622 -3404976 3345592 6036286 4069827 -965901 -5562117
38255 -5562117 -6168788 -3132802 -426702 -138962 -558721 -847840 -2981557 -7051494 -9579126
38246 -9579126 -8902918 -7008235 -3789017 3593170 12108863 12043011 1281040 -7444268
38238g444268M851806J1697795L018854p956767p374035n15599M54980l429185
38230f696419l353478K03313l5378l410392k653670K170639L420550o39044l195288
38221a4189167r62365R43854j252418l694946j909795K283204M633944M502703
38213i644986L583601K208724K15697r35147J89306K481964L413062K052010k9368
38204C534863m40015J632968M143411L738939l41194m449809m170074K65745L747248
38195G662082K077510l040934n889912l434321J170758K746029N61778j730652
38187A22338k086210k088323k097006N32075N266125N844381m74273n822102j734953
38178b537948P007432Q196725N97533m409156r53298K974377j53018n072086l061607
$$ plain form
38238 -7444268 -2592462 9105333 12124187 4167420 -3206615 -3722214 -3267234 -6696419
38230 -6696419 -10049897 -9846584 -9881962 -13292354 -15946024 -13775385 -10354835 -10993879 -14189167
38221 -14189167 -15151532 -14207678 -15460096 -19155042 -21064837 -18781633 -14147689 -9644986
38213 -9644986 -6061385 -3852661 -3636964 -4572111 -4382805 -1900841 1512221 3564231 3534863
38204 3534863 3094848 4727816 8871227 12610166 12268972 7819163 3649089 3914834 7662082
38195 7662082 9739592 6698658 808746 -2625575 -1454817 1291212 1852990 122338
38187 122338 -1963872 -4052195 -6149201 -5617126 -351001 5493380 5019107 -802995 -2537948
38178 -2537948 4469484 12666209 13263742 8854586 7901288 10875665 10722647 5650561 2588954
38169B588954L992304P063670K809519m123667q168004o610172O1550O536965
38161D151119N474748k991844q879910m830081L664557O402843K081934l047881
38153B025485n619278o312877m097222K064936P687514P146344K562063P99490
38145F256455K601242K424587j267808l456660j265752J712716J520404j096839
38137G428345l081358k382687J295611N215038M184793l044666r688630q538364
38129h611918j706202L207273M238392M879372M864168M37587o230010p411096
38121f332434j462305M249140M349122J697443L05893l46883j136588o38163M81665
38112A166890p54350l086375j574374L102852M320120J206493R29380N050017
$$ plain form
38169 2588954 6581258 13644928 16454447 12330780 4162776 -2447396 -2385846 4151119
38161 4151119 9625867 6634023 -2245887 -7075968 -3411411 2991432 5073366 2025485
38153 2025485 -3593793 -9906670 -14003892 -11938956 -4251442 2894902 5456965 6256455
38145 6256455 8857697 11282284 10014476 6557816 5292064 7004780 8525184 7428345
38137 7428345 4346987 1964300 3259911 8474949 12659742 9615076 -73554 -8611918
38129 -8611918 -10318120 -7110847 -2872455 2006917 6871085 7308672 1078662 -6332434
38121 -6332434 -7794739 -3545599 803523 2500966 2806859 2459976 1323388 685225 1166890
38112 1166890 412540 -2673835 -4248209 -1145357 3174763 4381256 5310636 10360653
38104A0360653M459815n039462j2639010p921411K391055M966703N23874L96737
38096b501046O165364P352858j73955p045170n313566M39957K249179M09964k96841
38087A286744K12429j309338m395407n187551k469570Q84427J993155P59335r69019
38078i194795j253495L79775K242051K158370K05164j651714k710627l931877
38070a3757148m646046k112935L588501P158244M096829k368744m522829m26093
38062a2990221L337516J148726l230015j965746M988497Q958924M457143l218317
38054A486507n454856j295926L505902N278238M674377K106400k431512n375944
38046B493186k534309K894996K534993m483422q602478l750241L442205M642227
$$ plain form
38104 10360653 14820468 9781006 -2858004 -10779415 -8388360 -3421657 -2897783 -2501046
38096 -2501046 3664318 11017176 10843221 3798051 -1515515 -1075558 1173621 1583585 1286744
38087 1286744 1499173 189835 -4205572 -9393123 -11862693 -10978266 -8985111 -8225776 -9194795
38078 -9194795 -10448290 -10068515 -7826464 -5668094 -5462930 -7114644 -9825271 -13757148
38070 -13757148 -18403194 -20516129 -16927628 -9769384 -5672555 -8041299 -12564128 -12990221
38062 -12990221 -9652705 -8503979 -11733994 -13699740 -8711243 247681 4704824 1486507
38054 1486507 -3968349 -5264275 -1758373 3519865 8194242 10300642 7869130 2493186
38046 2493186 -41123 2853873 5388866 905444 -7697034 -11447275 -8005070 -3362843
38038c362843K897695N649204R903265O023536n041455j0343666l373992O274142
38030H625886O711121o99448n940537m794730j563037l63354m02700O08572K918562
38021E100335M689323L122931k927342r317297q549477R52870J0332620R979286
38013A3383249J679862m518672m108468j965768k452590l402471k347633j621422
38005e353913l146830m026600j991867J79436P99204L863875J0640727J2703038
37997A3667070L192406r260649j0020782k12824M599291j260311n497210N90365
37989d202644P333833L456894m942343n517398m38235o23658n190103l384767
37981a3508421N050942Q088738J502562m357812j763136L661969M542352K443650
$$ plain form
38038 -3362843 -465148 5184056 15087321 21110857 16069402 5725736 2351744 8625886
38030 8625886 15337007 14637559 8697022 3902292 2339255 1975901 1573201 2181773 5100335
38021 5100335 9789658 12912589 9985247 667950 -7881527 -6928657 3403963 13383249
38013 13383249 15063111 10544439 6435971 4470203 2017613 -1384858 -3732491 -5353913
38005 -5353913 -8500743 -12527343 -14519210 -14339774 -13540570 -9676695 964032 13667070
37997 13667070 16859476 7598827 -2421955 -2634779 1964512 704201 -4793009 -4202644
37989 -4202644 3131189 6588083 1645740 -3871658 -4309893 -4933551 -10123654 -13508421
37981 -13508421 -8457479 -368741 1133821 -3223991 -4987127 -1325158 3217194 5660844
37973E660844J150786l74332k242880l73590M842269N734649l75067n118211k234537
37964F669931K220490P29395l252729k711144P24917J461725Q3379n37450k558261
37955B830253o884871o633791K074225R489851M978157n252318o872930N72207
37947e699217N216245L370594K393362L831326M46227p691969j0052591l109738
37939a1295761L258874K266756j84648J329506J949695k069084l832591K553021
37931f024232J0062209Q646996K09575n684711n532678k752459L55845L223318
37923B503863L335332n47163m384038m227603k419576k871089l831267j240288
37915a3681829L876186O955567O261367L218016o22496l143229j934614J389799
$$ plain form
37973 5660844 6811630 6437298 4194418 3820828 8663097 14397746 14022679 8904468 6669931
37964 6669931 8890421 9619816 6367087 3655943 4380860 5842585 5925964 5388514 2830253
37955 2830253 -4054618 -10688409 -8614184 875667 5853824 601506 -6271424 -5699217
37947 -5699217 -482972 2887622 5280984 9112310 9558537 1866568 -8186023 -11295761
37939 -11295761 -8036887 -5770131 -5954779 -4625273 -2675578 -4744662 -8577253 -6024232
37931 -6024232 4037977 12684973 12894548 7209837 1677159 -1075300 -719455 2503863
37923 2503863 5839195 5292032 907994 -3319609 -5739185 -8610274 -12441541 -13681829
37915 -13681829 -9805643 -2850076 3411291 6629307 6006811 2863582 928968 2318767
37907B318767J560738k226626l997935n64583L147562L039058K695832N103028
37899A1075841N219949j036707p319261n822253l5192J472127q42886k16758L407647
37890E902507M097723J174907p62532j052724k170771k107069J922881M773990
37882A1778912J15999o395247l970899M520639N583085k330679n640166J142677
37874D804321N803026l58289p304231l518235M288983K589924o534003q977639
37866i206143k60831R509606J0884904M722611k934382p032608m914551J243197
37858B011803M082573n81494o712857n880652J98282K845402M79388J84926M762233
37849A389604P625549L629592k874041n165416l400849k041570k410226k446015
$$ plain form
37907 2318767 3879505 1652879 -2345056 -2909639 237923 3276981 5972813 11075841
37899 11075841 16295790 15259083 7939822 2117569 2082377 3554504 2711618 2494860 5902507
37890 5902507 10000230 11175137 10412605 9359881 7189110 5082041 7004922 11778912
37882 11778912 11894911 5499664 1528765 6049404 11632489 9301810 3661644 4804321
37874 4804321 10607347 10249058 2944827 -573408 3715575 6305499 -228504 -9206143
37866 -9206143 -9466974 42632 10927536 15650147 12715765 5683157 768606 2011803
37858 2011803 6094376 5512882 -1199975 -7080627 -6882345 -4036943 -3557555 -3372629 1389604
37849 1389604 9015153 12644745 9770704 4605288 1204439 -837131 -3247357 -5693372
37841e693372j012081J385213L995103N105671K565478k119185l319249J314111
37833B221689N842374L273388m148447p535186l584989J882093L400882K487153
37825C838957K173483J061540k456046m903114k757832N22468p22204m686448
37817g929196m648349j75961K511247J825834L248717P850474P900403n61635
37809A0021534r018741p805750J42418M969105M312535L288448L679901K370505
37801A1959955j099265l655523m421910m351186j939756L518955O879755L481158
37793A0372183j997676k085445P55545j349116o606199n733692J125157L571980
37785a947263j142196l626136N51534L645621J055318o12867J924362O99532p159724
$$ plain form
37841 -5693372 -6705453 -5320240 -1325137 3780534 6346012 4226827 907578 2221689
37833 2221689 8064063 11337451 7189004 -346182 -3931171 -2049078 1351804 3838957
37825 3838957 6012440 7073980 4617934 -285180 -3043012 -2520544 -3242748 -7929196
37817 -7929196 -12577545 -12753506 -10242259 -8416425 -5167708 2682766 10583169 10021534
37809 10021534 1002793 -6802957 -6660539 -1691434 2621101 5909549 9589450 11959955
37801 11959955 10860690 7205167 2783257 -1567929 -3507685 11270 6891025 10372183
37793 10372183 8374507 6289062 7044607 5695491 -910708 -6644400 -5519243 -1947263
37785 -1947263 -3089459 -6715595 -6164061 -2518440 -1463122 -2075989 -151627 547905 -6611819
37776f611819r469481J808768J3897517J0899054j755575o944658k291006N76117
37768A08917j803819j633803K543334K746841k375676l969138J239523N037552
37760A893731J737003l396608l961686r11701K390071M938507N241109J918590
37752I849016j349560k9485J879922l021266j0776136r085148K703865J0248517
37744D19725N498204k066235k069676J759537J799795k9304O49489K49924m690614
37735A520845p369959r31768P588226O204119l372028q427958m312880R08221
37727h193182M45583k931429l729661q11687L667804O717703N903750K574097
37719C642978J490888L017271N93917p642705j1296704j925369J0797327J0600127
$$ plain form
37776 -6611819 -16081300 -14272532 -375015 10524039 8768464 1823806 -467200 108917
37768 108917 -1694902 -3328705 -785371 1961470 -414206 -4383344 -3143821 1893731
37760 1893731 3630734 234126 -3727560 -4639261 -2249190 2689317 7930426 9849016
37752 9849016 8499456 8469971 10349893 7328627 -3447509 -12532657 -9828792 419725
37744 419725 5917929 3851694 1782018 3541555 5341350 5312046 5961535 6211459 1520845
37735 1520845 -5849114 -6780882 807344 7011463 3639435 -4788523 -9101403 -8193182
37727 -8193182 -7747599 -10679028 -14408689 -15220376 -11552572 -4834869 1068881 3642978
37719 3642978 5133866 8151137 8745054 1102349 -10194355 -12119724 -1322397 9277730
37711I277730o84653n600923J327041N636680k194780j0614866o289876L897090
37703e246557M478380l550841n337298L380413R910018M489128o134048r808340
37695g819145m513116K946239P266764P665655M876061Q86748p95647O33850Q21872
37686A1969281l595750q541058p465427j374644K394152J466708J419749N244743
37678A517754P061490J476752o497232p991220l291908m77763k601445m400367
37670a5203939k101808J464166L340651M549102N022568J881548l332163l132615
37662g512490M564223J0278129N454496m205870o450084L6625N124330K773798
37654A0063157k236396l864441k681797j734486j273070p30915q34348r57576
$$ plain form
37711 9277730 8593077 2992154 4319195 9955875 7761095 -2853771 -9143647 -5246557
37703 -5246557 -768177 -4319018 -9656316 -6275903 3634115 8123243 1989195 -7819145
37695 -7819145 -12332261 -9386022 -2119258 5546397 10422458 11309206 10513559 11147409 11969281
37686 11969281 8373531 -167527 -7632954 -9007598 -6613446 -5146738 -3726989 1517754
37678 1517754 8579244 10055996 3558764 -4432456 -7724364 -8202127 -10803572 -15203939
37670 -15203939 -17305747 -15841581 -12500930 -7951828 -2929260 -1047712 -4379875 -7512490
37662 -7512490 -2948267 7329862 12784358 8578488 2128404 2165029 7289359 10063157
37654 10063157 7826761 3962320 1280523 -453963 -1727033 -2457948 -3292296 -4249872
37646d249872J195009M765588M965884Q6310m546384l132663K738715O147141
37638G969728L135476l712885q782644q319104k737719L948277P144602N257425
37630C903156N64995l224173l839144j564604J399244L006664L359860L776288
37622G382286L878616K092248l58458O5693K615738J030288o768156j2523337
37614b585082p831927K835572P262585K111616l940926l702930K70759K428970
37606c151363J613838o14345k481876r69086N164458J0041183O106925l348926
37598A2360808o203835P95806O301345J573476o599100p668873k763496R72610
37590a231259L259592O804118P280883k4717q097833o383199J355870J699579
$$ plain form
37646 -4249872 -3054863 1710725 6676609 6762919 2216535 -916128 1822587 7969728
37638 7969728 11105204 7392319 -1390325 -9709429 -12447148 -8498871 -1354269 3903156
37630 3903156 4468151 1243978 -2595166 -4159770 -2760526 246138 3605998 7382286
37622 7382286 11260902 13353150 12994692 13060385 15676123 16706411 9938255 -2585082
37614 -2585082 -10417009 -7581437 -318852 1792764 -2148162 -5851092 -5580333 -3151363
37606 -3151363 -1537525 -2151870 -4633746 -5602832 -438374 9602809 15709734 12360808
37598 12360808 6156973 6952779 13254124 14827600 8228500 559627 -2203869 -1231259
37590 -1231259 2028333 8832451 16113334 16088617 7990784 1607585 2963455 4663034
37582D663034o262598q726371P843P843912M754339j435006O44834O771220N275039
37573A3536246k731382n630583j077738Q64272m165281o913850l38187P515279
37565A058776N481957l013745n224295J074603M899035L07999m426757j478798
37557a321225K831862j247337r249885q149720K639953R324958M625790k201100
37549b746704j444686K626871J684155j941788j059358K648693K162093j845710
37541H3566k767264j00055J299068J901516N760802R156420L841538p239791j0625320
37532A310480k258667N727016L511241k868838l655447l19863P33552M83916K849034
37523E512424M568617M32083n851556o503063k291585k09697q91936J066201N077669
$$ plain form
37582 4663034 -1599564 -10325935 -10318092 -2474180 2280159 845153 1489987 8261207 13536246
37573 13536246 10804864 5174281 4096543 4960815 795534 -6118316 -6456503 1058776
37565 1058776 6540733 3526988 -1697307 -622704 4276331 4584330 157573 -1321225
37557 -1321225 1510637 263300 -8986585 -17136305 -14496352 -5171394 -545604 -2746704
37549 -2746704 -4191390 -1564519 119636 -1822152 -2881510 -232817 1929276 83566
37541 83566 -2683698 -2783753 -1484685 416831 6177633 15334053 19175591 11935800 1310480
37532 1310480 -948187 4778829 8290070 5421232 1765785 1445922 2179474 2663390 5512424
37523 5512424 10081041 10513124 4661568 -1841495 -4133080 -4342777 -5234713 -4168512 909157
37514I09157L892834l315278p278894k109661N549763O199153N81182k906717
37506A521539o24593K615197J858728j091133j482822L56737q62625o319136q696723
37497a2724831j737378Q575229J0068144J747589m064738j95412M739276J184461
$$ plain form
37514 909157 4801991 1486713 -5792181 -7901842 -2352079 3847074 4428256 1521539
37506 1521539 896946 3512143 5370871 4279738 2796916 3153653 2291028 -4028108 -12724831
37497 -12724831 -14462209 -5886980 4181164 5928753 1864015 1668603 6407879 7592340
$$ [...]
##END NTUPLES=NMR SPECTRUM
##END=
