##TITLE=31Pdec_LR-0154-OMe-BK2-TFA
 DMSO-d6, 24 sc
 12.4.2023
##JCAMPDX= 6.0         $$ Bruker NMR JCAMP-DX V2.0
##DATA TYPE= NMR SPECTRUM
##DATA CLASS= NTUPLES
##ORIGIN= UXNMR, Bruker Analytische Messtechnik GmbH
##OWNER= root
$$ XWIN-NMR		Version 3.5
$$ Wed Apr 12 14:43:07 2023 Russian Standard Time (UT+4h)  she@DPX200
##.OBSERVE FREQUENCY= 81.013821
##.OBSERVE NUCLEUS= ^31P
##.ACQUISITION MODE= SIMULTANEOUS
##.ACQUISITION SCHEME= undefined
##.AVERAGES= 24
##.DIGITISER RES= 16
##SPECTROMETER/DATA SYSTEM= spect
##.PULSE SEQUENCE= zgpg30
##.SOLVENT NAME= CDCl3
##.SHIFT REFERENCE= (INTERNAL, CDCl3, 0, 248.564)
##AUDIT TRAIL= $$ (NUMBER, WHEN, WHO, WHERE, WHAT)
$$ ##TITLE= Audit trail, XWIN-NMR		Version 3.5
$$ ##JCAMPDX= 5.01
$$ ##ORIGIN= Bruker BioSpin GmbH
$$ ##OWNER= she
$$ F:/spectra/data/she/nmr/P31/1/pdata/1/auditp.txt
$$ ##AUDIT TRAIL=  $$ (NUMBER, WHEN, WHO, WHERE, WHAT)
(   1,<2023-04-12 14:41:56.28 +0400>,<she>,<DPX200>,
      <created by zg, POWCHK disabled, PULCHK disabled
       configuration hash MD5:
       00 E9 B6 7A A2 85 ED C7 34 08 36 98 17 FE 4E 26
       data hash MD5: 32K
       4F 66 A9 64 F4 9D 92 82 66 F2 A2 7D 2E 5C 54 D0>)
(   2,<2023-04-12 14:41:59.29 +0400>,<she>,<DPX200>,
      <Start of raw data processing
       efp BC_mod = 2 LB = 1 FT_mod = 6 PKNL = 1 PHC0 = -11191.38 PHC1 = 557.0854 SI = 64K 
       data hash MD5: 64K
       8E EE 3A F0 93 AC 44 5C 43 9D B8 56 4C 70 76 8C>)
(   3,<2023-04-12 14:42:17.68 +0400>,<she>,<DPX200>,
      <pk PHC0 = -2.368091 PHC1 = 0 
       data hash MD5: 64K
       FB C6 34 8D 9D 1B FC 10 7E 82 DA F1 63 9F AA D6>)
$$ ##END=
$$ 
$$ hash MD5
$$ EA 29 1B 39 42 B6 FB 8E 22 F8 E1 31 83 4E 85 0B
##$RELAX= 
##$RELAX= 
##$RELAX= 
##$RELAX= 
##$RELAX= 
##$RELAX= 
##$RELAX= 
##$RELAX= 
##$RELAX= 
$$ Bruker specific parameters
$$ --------------------------
##$DU= <F:/spectra>
##$EXPNO= 1
##$NAME= <P31>
##$PROCNO= 1
##$TYPE= <nmr>
##$USER= <she>
##$AMP= (0..31)
100 100 100 100 100 100 100 100 100 100 100 100 100 100 100 100 100 100 
100 100 100 100 100 100 100 100 100 100 100 100 100 100 
##$AQSEQ= 0
##$AQ_mod= 1
##$AUNM= <au_zg>
##$AUTOPOS= <>
##$BF1= 81.014009
##$BF2= 200.13
##$BF3= 200.13
##$BF4= 200.13
##$BF5= 200.13
##$BF6= 200.13
##$BF7= 200.13
##$BF8= 200.13
##$BYTORDA= 1
##$CFDGTYP= 0
##$CFRGTYP= 5
##$CHEMSTR= <none>
##$CNST= (0..31)
1 1 145 1 1 1 1 1 1 1 1 1 1 1 1 1 1 1 1 1 1 1 1 1 1 1 1 1 1 1 1 1 
##$CPDPRG= <waltz16>
##$CPDPRG1= <>
##$CPDPRG2= <waltz16>
##$CPDPRG3= <>
##$CPDPRG4= <mlev>
##$CPDPRG5= <mlev>
##$CPDPRG6= <mlev>
##$CPDPRG7= <mlev>
##$CPDPRG8= <mlev>
##$CPDPRGB= <>
##$CPDPRGT= <>
##$D= (0..31)
0 1 0 0 0 0 0 0 0 0 0 0.03 2e-05 3e-06 0 0 0 0 0 0 0 0 0 0 0 0 0 0 0 0 
0 0 
##$DATE= 1681296115
##$DBL= (0..7)
120 120 120 11 120 120 24 19 
##$DBP= (0..7)
150 150 150 150 150 150 150 150 
##$DBP07= 0
##$DBPNAM0= <>
##$DBPNAM1= <>
##$DBPNAM2= <>
##$DBPNAM3= <>
##$DBPNAM4= <>
##$DBPNAM5= <>
##$DBPNAM6= <>
##$DBPNAM7= <>
##$DBPOAL= (0..7)
0.5 0.5 0.5 0.5 0.5 0.5 0.5 0.5 
$$ [...]
##$SUBNAM2= <"">
##$SUBNAM3= <"">
##$SUBNAM4= <"">
##$SUBNAM5= <"">
##$SUBNAM6= <"">
##$SUBNAM7= <"">
##$SUBNAM8= <"">
##$SUBNAM9= <"">
##$SW= 501.771253377433
##$SWIBOX= (0..15)
0 1 3 0 0 0 0 0 0 0 0 0 0 0 0 0 
##$SW_h= 40650.406504065
##$TD= 32768
##$TD0= 1
##$TE= 0
##$TE2= 300
##$TE3= 300
##$TEG= 300
##$TL= (0..7)
0 120 53 12 22 120 120 120 
##$TP= (0..7)
150 150 150 150 150 150 150 150 
##$TP07= 0
##$TPNAME0= <>
##$TPNAME1= <>
##$TPNAME2= <>
##$TPNAME3= <>
##$TPNAME4= <>
##$TPNAME5= <>
##$TPNAME6= <>
##$TPNAME7= <>
##$TPOAL= (0..7)
0.5 0.5 0.5 0.5 0.5 0.5 0.5 0.5 
##$TPOFFS= (0..7)
0 0 0 0 0 0 0 0 
##$TUNHIN= 0
##$TUNHOUT= 0
##$TUNXOUT= 0
##$USERA1= <user>
##$USERA2= <user>
##$USERA3= <user>
##$USERA4= <user>
##$USERA5= <user>
##$V9= 5
##$VALIST= <valist>
##$VCLIST= <CCCCCCCCCCCCCCC>
##$VD= 0
##$VDLIST= <DDDDDDDDDDDDDDD>
##$VPLIST= <PPPPPPPPPPPPPPP>
##$VTLIST= <TTTTTTTTTTTTTTT>
##$WBST= 1024
##$WBSW= 4
##$XGAIN= (0..3)
0 0 0 0 
##$XL= 0
##$YL= 0
##$YMAX_a= 1641
##$YMIN_a= -1446
##$ZGOPTNS= <>
##$ZL1= 120
##$ZL2= 120
##$ZL3= 120
##$ZL4= 120
##$ABSF1= 0
##$ABSF2= 0
##$ABSG= 0
##$ABSL= 0
##$ALPHA= 0
##$AQORDER= 0
##$ASSFAC= 0
##$ASSFACI= 0
##$ASSFACX= 0
##$ASSWID= 0
##$AUNMP= <proc_1d>
##$AZFE= 0.1
##$AZFW= 0.5
##$BCFW= 0
##$BC_mod= 2
##$BYTORDP= 0
##$COROFFS= 0
##$CY= -3
##$DATMOD= 1
##$DC= 0
##$DFILT= <>
##$DTYPP= 0
##$F1P= 0
##$F2P= 0
##$FCOR= 1
##$FTSIZE= 65536
##$FT_mod= 6
##$GAMMA= 0
##$GB= 0
##$INTBC= 1
##$INTSCL= 6.047779e-11
##$ISEN= 30
##$LB= 1
##$LEV0= 0
##$LPBIN= 0
##$MAXI= 10000
##$MC2= 0
##$MEAN= 0
##$ME_mod= 0
##$MI= 50
##$NCOEF= 0
##$NC_proc= -8
##$NLEV= 6
##$NOISF1= 182.463
##$NOISF2= 159.3651
##$NSP= 0
##$NTH_PI= 0
##$NZP= 0
##$OFFSET= 248.5645
##$PC= 4
##$PHC0= -11193.75
##$PHC1= 557.0854
##$PH_mod= 1
##$PKNL= yes
##$PPARMOD= 0
##$PSCAL= 0
##$PSIGN= 0
##$REVERSE= no
##$SF= 81.0140089999694
##$SI= 65536
##$SIGF1= 159.3651
##$SIGF2= -187.1042
##$SINO= 113.3802
##$SIOLD= 16384
##$SREGLST= <1H.CDCl3>
##$SSB= 0
##$STSI= 65536
##$STSR= 0
##$SW_p= 40650.406504065
##$SYMM= 0
##$S_DEV= 0
##$TDeff= 32768
##$TDoff= 0
##$TI= <>
##$TILT= no
##$TM1= 0
##$TM2= 0
##$TOPLEV= 0
##$USERP1= <user>
##$USERP2= <user>
##$USERP3= <user>
##$USERP4= <user>
##$USERP5= <user>
##$WDW= 1
##$XDIM= 65536
##$YMAX_p= 298041914
##$YMIN_p= -216334029
$$ End of Bruker specific parameters
$$ ---------------------------------
##NTUPLES= NMR SPECTRUM
##VAR_NAME=  FREQUENCY,     SPECTRUM/REAL,   SPECTRUM/IMAG
##SYMBOL=    X,             R,               I
##VAR_TYPE=  INDEPENDENT,   DEPENDENT,       DEPENDENT
##VAR_FORM=  AFFN,          ASDF,            ASDF
##VAR_DIM=   65536,         65536,           65536
##UNITS=     HZ,            ARBITRARY UNITS, ARBITRARY UNITS
##FACTOR=    0.620285442955139, 1,           1
##FIRST=     20137.2065510682, 0,            0
##LAST=      -20513.1999529968, 0,           0
##MIN=       -20513.1999529968, -216334029,  0
##MAX=       20137.2065510682, 298041914,    0
$$ Real data points
##PAGE= N=1
##DATA TABLE= (X++(R..R)), XYDATA
$$ [...]
$$ plain form
41802 7587578 4546990 6836897 7833153 3366903 -1082685 -539404 606918 -3217686
41794 -3217686 -8399364 -7809764 -2446615 337465 -2198151 -5763910 -6210729 -3297373
41786 -3297373 1795813 7388979 10049131 7228854 1615713 -924989 1665113 5691063
41778 5691063 7158879 6371357 6079861 7066504 7210222 4759024 1505969 1285276 4651456
41769 4651456 7042527 4672007 442240 -78436 2493292 2062720 -2960687 -6649174
41761 -6649174 -4686226 -372241 1952368 3585688 6820865 8998533 7242720 4863729
41753 4863729 6213997 8311693 5026976 -2177519 -5389540 -1955458 2099120 1357662
41745 1357662 -2566322 -5588398 -6668841 -6566234 -5529411 -4483167 -4982092 -6188776
$$ packed form
41802G587578l040588K289907R96256m466250m449588N43281J146322l824604
41794c217686n181678N89600N363149K784080k535616l565759m46819K913356
41786c297373N093186N593166K660152k820277n613141k540702K590102M025950
41778E691063J467816p87522k91496R86643J43718k451198l253055k20693L366180
41769D651456K391071k370520m229767n20676K571728m30572n023407l688487
41761f649174J962948M313985K324609J633320L235177K177668j755813k378991
41753D863729J350268K097696l284717p204495l212021L434082M054578p41458
41745A357662l923984l022076j080443J02607J036823J046244m98925j206684
$$ plain form
41737 -6188776 -5102067 -1265951 1840967 1424002 -1523145 -4606728 -6331553 -5324823
41729 -5324823 -1141102 2889642 1751469 -4208332 -8130080 -5233089 779331 2991873
41721 2991873 93785 -3586941 -4681778 -3528503 -1429980 1054317 2982133 3081786
41713 3081786 1585982 216089 -48114 213405 456356 1156593 2627446 3917962 3896917
41704 3896917 3172804 3886777 7002843 10551486 11839551 10993387 10236046 9482306 5767043
41695 5767043 -1271002 -6686907 -6412666 -3551375 -3988321 -7444061 -8383932 -5324542 -3035491
41686 -3035491 -4321465 -5777303 -4401070 -2709614 -3187408 -2577928 2805494 9480670
41678 9480670 10704720 6335221 2650425 2618060 2464199 -742889 -3884389 -3541672 -2649309
$$ packed form
41737f188776J086709L836116L106918m16965k947147l083583j724825J006730
41729e324823M183721M030744j138173n959801l921748K896991O012420K212542
41721B991873k898088l680726j094837J153275K098523K484297J927816R9653
41713C081786j495804j369893k64203K61519K42951P00237J470853J290516k1045
41704C896917p24113P13973L116066L548643J288065q46164p57341p53740l715263
41695E767043p038045n415905K74241K861291m36946l455740r39871L059390K289051
41686c035491j285974j455838J376233J691456m77794O09480N383422O675176
41678I480670J224050m369499l684796l2365j53861l207088l141500L42717Q92363
$$ plain form
41669 -2649309 -6385793 -13163990 -15070024 -8264034 1294718 5195841 2782080 222320
41661 222320 1027934 2612768 2785754 3937841 7558803 9430415 5511106 -588391 -2156917
41652 -2156917 424310 776490 -2828635 -5285324 -4022282 -3036501 -5134633 -7333859
41644 -7333859 -7535932 -8771567 -12052574 -11829918 -4984854 1507375 -386946 -7435184
41636 -7435184 -10098777 -6608107 -3338265 -3193835 -2967398 -1853852 -3187137 -6407429
41628 -6407429 -6085440 -1439906 1172503 -1548777 -4687143 -4018341 -2783364 -4455030
41620 -4455030 -5366627 -1153877 4409032 4326600 -830382 -4099614 -2676336 -840871 -2431121
41611 -2431121 -5819432 -7223290 -5001366 149575 6061429 9376431 7540424 1516090
$$ packed form
41669b649309l736484o778197j906034O805990R558752L901123k413761k559760
41661B22320Q05614J584834J72986J152087L620962J871612l919309o099497j568526
41652b156917K581227L52180l605125k456689J263042R85781k098132k199226
41644g333859k02073j235635l281007K22656O845064O492229j894321p048238
41636g435184k663593L490670L269842J44430K26437J113546j333285l220292
41628f407429L21989M645534K612409k721280l138366O68802J234977j671666
41620d455030r11597M212750N562909q2432n156982l269232J423278J835465j590250
41611b431121l388311j403858K221924N150941N911854L315002j836007o024334
$$ plain form
41603 1516090 -4697683 -7303745 -4956621 701675 5471998 5528353 1797319 -591747
41595 -591747 836237 2354625 176692 -3046793 -2384468 1005127 1302710 -2709075 -5321097
41586 -5321097 -1801421 5718322 11539823 12174679 7896506 1693028 -2471296 -3057486
41578 -3057486 -2834413 -4590006 -5805125 -1950457 5270845 8613641 5389986 1216654
41570 1216654 1430509 4257413 5668965 5645521 5338656 2989562 -1800696 -3791098 1274139
41561 1274139 8224104 7646985 -1249524 -9515359 -10471386 -6646479 -3489718 -2162088
41553 -2162088 -1381054 -1651257 -3751142 -5692417 -4707826 -1143746 1863282 1808877 -1299123
41544 -1299123 -5343055 -7393814 -5791495 -1773349 1837216 3594345 3817540 2669032
$$ packed form
41603A516090o213773k606062K347124N658296M770323N6355l731034k389066
41595e91747J427984J518388k177933l223485O62325L389595K97583m011785k612022
41586e321097L519676P519743N821501O34856m278173o203478m164324n86190
41578c057486K23073j755593j215119L854668P221302L342796l223655m173332
41570A216654K13855K826904J411552k3444l06865k349094m790258j990402N065237
41561A274139O949965n77119q896509q265835r56027L824907L156761J327630
41553b162088P81034k70203k099885j941275R84591L564080L007028n4405l108000
41544a299123m043932k050759J602319M018146L610565J757129K23195j148508
$$ plain form
41536 2669032 250227 -1670097 -1078420 818816 767249 -1313889 -1881309 433436 2639295
41527 2639295 2823356 3409237 5994747 7122131 3513226 -1686083 -2885453 -101458
41519 -101458 2176151 2684220 4213163 7033809 7440066 4154704 976244 712972 817682
41510 817682 -1822008 -5015435 -3938683 1888273 7601288 8758490 5953746 3377736
41502 3377736 3861323 5857836 5608287 2338575 -147883 1412015 4567041 4055198 -842149
41493 -842149 -5498226 -6555259 -5212012 -2995479 1099475 6824170 10257623 8823757
41485 8823757 5609696 4751966 5052912 2515867 -2691944 -6585137 -7622314 -7759554 -7551896
41476 -7551896 -5236668 -1411509 278233 -1059869 -1388872 1947384 5238364 3204356
$$ packed form
41536B669032k418805j920324N91677J897236n1567k081138n67420K314745K205859
41527B639295J84061N85881K585510J127384l608905n199309j199370K783995
41519a01458K277609N08069J528943K820646M06257l285362l178460k63272J04710
41510H17682k639690l193427J076752N826956N713015J157202k804744k576010
41502C377736M83587J996513k49549l269712k486458J559898L155026n11843m897347
41493h42149m656077j057033J343247K216533M094954N724695L433453j433866
41485H823757l214061q57730L00946k537045n207811l893193j037177j37240K07658
41476g551896K315228L825159J689742j338102l29003L336256L290980k034008
$$ plain form
41468 3204356 -3358905 -8249266 -7329439 -2453489 1894083 3514338 3464800 3432934 3068151
41459 3068151 373631 -4789727 -8512912 -6429551 181201 4656057 2919701 -1285618
41451 -1285618 -1671811 2056628 4385733 1911398 -2682743 -5138694 -4813392 -3729801
41443 -3729801 -2851165 -1604407 -43972 632049 -232126 -1721925 -2217275 -846466 1731700
41434 1731700 3608324 3025109 54350 -3154034 -4097829 -1993952 1631981 4053710
41426 4053710 3320285 -22178 -3031146 -3053507 -798099 -40722 -3537755 -9563838 -13272238
41417 -13272238 -11603160 -6391312 -2325148 -2042268 -3827206 -4460558 -3432032 -2737677
41409 -2737677 -2700785 -762661 3844226 6773799 3491907 -3567321 -7070228 -4331657
$$ packed form
41468C204356o563261m890361R19827M875950M347572J620255m9538l1866l64783
41459C068151k694520n163358l723185K083361O610752M474856j736356m205319
41451a285618l86193L728439K329105k474335m594141k455951L25302J083591
41443c729801Q78636J246758J560435O76021q64175j489799m95350J370809K578166
41434A731700J876624n83215k970759l208384r43795K103877L625933K421729
41426D053710p33425l342463l008968k2361K255408P57377l497033o026083l708400
41417a3272238J669078N211848M066164K82880j784938o33352J028526O94355
41409b737677L6892J938124M606887K929573l281892p059228l502907K738571
$$ plain form
41401 -4331657 -291556 541983 235220 2104651 3620410 184888 -6250666 -8539749
41393 -8539749 -4197185 1663550 4186616 4342503 4689612 4475201 2352106 352965 1024459
41384 1024459 2596227 952125 -4229173 -8400442 -7328315 -1516469 4458448 6006864
41376 6006864 2595203 -1537498 -1876584 894709 2143852 404792 -459097 1952700
41368 1952700 3884915 1250277 -3484972 -5232713 -4352411 -4810008 -6002012 -3479936
41360 -3479936 2056650 3832209 -754995 -5458823 -4283961 250282 2379802 1970569
41352 1970569 2556958 3713998 1789298 -2747989 -4699991 -1753328 2033698 2193643
41344 2193643 -140953 -530018 2559790 6160787 6618227 3350309 -980003 -3018614
$$ packed form
41401d331657M040101Q33539l06763J869431J515759l435522o435554k289083
41393h539749M342564N860735K523066J55887L47109k14411k123095j999141O71494
41384A024459J571768j644102n181298m171269J072127N811846N974917J548416
41376F006864l411661m132701l39086K771293J249143j739060q63889K411797
41368A952700J932215k634638m735249j747741Q80302m57597j192004K522076
41360c479936N536586J775559m587204m703828J174862M534243K129520m09233
41352A970569N86389J157040j924700m537287j952002K946663L787026J59945
41344B193643k334596l89065L089808L600997M57440l267918m330312k038611
$$ plain form
41336 -3018614 -1506436 1699479 3144944 818116 -3753427 -6502480 -4614405 432440
41328 432440 4455055 5589779 6253581 8839908 11332214 10079525 5952946 3830346
41320 3830346 5460742 6899887 4894524 2033470 2280274 4168691 2791827 -2481969
41312 -2481969 -6692916 -6321990 -3978287 -4149302 -6736179 -7674602 -5316585 -3192953 -5025836
41303 -5025836 -8918968 -9282731 -4243789 2041217 5394746 6352268 6577970 4611821 -172495
41294 -172495 -2720290 1670870 7866771 5684377 -4868041 -11827259 -8110150 -1557609
41286 -1557609 -2195112 -6969433 -5794501 2066007 7499863 5766413 2092583 2382163
41278 2382163 5736244 7933644 6812816 2713188 -2119096 -4020254 -1836530 99380
$$ packed form
41336c018614J512178L205915J445465k326828m571543k749053J888075N046845
41328D32440M022615J134724O63802K586327K492306j252689m126579k122600
41320C830346J630396J439145k005363k861054K46804J888417j376864n273796
41312b481969m210947L70926K343703j71015k586877r38423K358017K123632j832883
41303e025836l893132l63763N038942O285006L353529R57522K25702j966149m784316
41294a72495k547795M391160O195901k182394j0552418o959218L717109O552541
41286a557609o37503m774321J174932P860508N433856j733450l673830K89580
41278B382163L354081K197400j120828m099628m832284j901158K183724J935910
$$ plain form
41270 99380 -2507413 -6541556 -5435079 443652 4404566 4324133 4834293 7386460 6945960
41261 6945960 1887303 -1353880 1321834 4144829 825787 -4823701 -5121869 -670078
41253 -670078 1717501 137400 -1399233 -1534609 -3380357 -7625472 -10308925 -8488692
41245 -8488692 -3411431 2292331 6348324 6168909 1115099 -4722526 -6549733 -5393765
41237 -5393765 -5962082 -8717125 -9865115 -9109375 -10547451 -14373472 -14698253 -8858832 -2684297
41228 -2684297 -2122660 -4858846 -5334191 -3619273 -3298723 -3879051 -2112459 794074 236793
41219 236793 -3553475 -4862169 -1377560 2200322 1919054 736378 3185015 7760302
41211 7760302 9119490 5619549 319658 -4248606 -7983477 -10217919 -9156057 -5370872
$$ packed form
41270I9380k606793m034143J106477N878731L960914q0433N10160K552167m40500
41261F945960n058657l241183K675714K822995l319042n649488k98168M451791
41253f70078K387579j580101j536633j35376j845748m245115k683453J820233
41245h488692N077261N703762M055993j79415n053810n837625j827207J155968
41237e393765n68317k755043j147990P55740j438076l826021l24781N839421O174535
41228b684297N61637k736186m75345J714918L20550n80328J766592K906533n57281
41219B36793l790268j308694L484609L577882k81268j182676K448637M575287
41211G760302J359188l499941n299891m568264l734871k234442J061862L785185
$$ plain form
41203 -5370872 -2471424 -2628989 -3930299 -3752114 -2335573 -877488 1797783 7528693
41195 7528693 14476312 17549204 13963905 6713906 1704279 2205660 6295397 8980022
41187 8980022 6856471 1490613 -1898333 128974 5366401 8384742 6427855 1780937
41179 1780937 -1388541 -1128323 1349174 3356316 2924894 283288 -2483667 -3759110
41171 -3759110 -4109075 -4903656 -5864570 -5376850 -2860310 748156 4620846 8349066 10670555
41162 10670555 9897976 6124322 1499991 -1916820 -3157506 -1582348 2509930 6432940
41154 6432940 7076894 5081079 4313987 6183620 7509396 5724242 2993175 2443424 3021480
41145 3021480 1687648 -1048546 -1778467 295504 2332448 2509545 2251094 3060359 4236486
$$ packed form
41203e370872K899448j57565j301310J78185J416541J458085K675271N730910
41195G528693O947619L072892l585299p249999n009627N01381M089737K684625
41187H980022k123551n365858l388946K027307N237427L018341j956887m646918
41179A780937l169478K60218K477497K007142m31422k641606k766955j275443
41171c759110l49965p94581r60914M87720K516540L608466L872690L728220K321489
41162A0670555p72579l773654m624331l416811j240686J575158M092278L923010
41154F432940O43954j995815p67092J869633J325776j785154k731067n49751N78056
41145C021480j333832k736194p29921K073971K036944J77097k58451Q09265J176127
$$ plain form
41136 4236486 5010106 6205873 7978952 8169157 5309776 1828051 1482031 3972248 4804828
41127 4804828 1264155 -3652250 -4900408 -1738678 1643234 1558628 -1184537 -3247514
41119 -3247514 -2846485 -732512 1352325 1628380 -1001140 -5183065 -7070949 -4458291
41111 -4458291 -331220 496536 -1936238 -2808290 90269 2822824 1298012 -2453824
41103 -2453824 -3408092 -978607 726890 -253950 -572855 3315505 9512447 12511253 9839103
41094 9839103 4841357 2512339 3908716 5747326 4956210 2143111 155393 457683
41086 457683 1896621 2254783 132339 -3891162 -7123322 -6971708 -4376076 -3430484 -6008514
41077 -6008514 -8800581 -8166499 -5746600 -5605641 -7609909 -8357320 -7571541 -7851671 -8124717
$$ packed form
41136D236486P73620J195767J773079J90205k859381l481725l46020K490217Q32580
41127D804828l540673m916405j248158L161730L381912q4606k743165k062977
41119c247514M01029K113973K084837K76055k629520m181925j887884K612658
41111d458291M127071Q27756k432774q72052K898559K732555j524812l751836
41103b453824r54268K429485J705497r80840l18905L888360O196942K998806k672150
41094I839103m997746k329018J396377J838610p91116k813099j987718L02290
41086D57683J438938L58162k122444m023501l232160J51614K595632R45592k578030
41077f008514k792067O34082K419899J40959k004268p47411P85779k80130k73046
$$ plain form
41068 -8124717 -4000057 3649756 7257754 3313224 -1501227 43489 4934960 5044614
41060 5044614 -360074 -4181266 -2251118 1923121 3419480 1639424 -1089822 -2431881
41052 -2431881 -601950 4377755 8899076 8292542 2335258 -4042662 -6332659 -4654678
41044 -4654678 -1912442 -90903 491974 -41162 -1541987 -3265154 -3588975 -1026611 3573551
41035 3573551 6324144 3968285 -1326011 -3535566 -410640 3385883 2877985 -413255
41027 -413255 -1437097 789349 2338703 279402 -3769985 -5884677 -3664911 1686628
41019 1686628 5920658 5630421 2395161 859514 2130276 2822340 1894217 3117201 7638966
41010 7638966 9869915 5976196 1306777 2603922 6994824 6743449 2131422 688724
$$ packed form
41068h124717M124660P649813L607998l944530m814451J544716M891471J09654
41060E044614n404688l821192J930148M174239J496359j780056k729246j342059
41052b431881J829931M979705M521321o06534n957284o377920k289997J677981
41044d654678K742236J821539N82877n33136j500825j723167l23821K562364M600162
41035C573551K750593k355859n294296k209555L124926L796523n07898l291240
41027d13255j023842K226446J549354k059301m049387k114692K219766N351539
41019A686628M234030k90237l235260j535647J270762O92064r28123J222984M521765
41010G638966K230949l893719m669419J297145M390902k51375m612027j442698
$$ plain form
41002 688724 4560935 7566441 5616528 1974300 367141 38603 -82372 1284064 3623780
40993 3623780 3316038 -893183 -5504807 -7049284 -5095147 -18951 6944215 10978573
40985 10978573 7388651 -547451 -3755443 749274 6386615 7237213 4899027 2709990
40977 2709990 477912 -1411209 271259 5207357 7360499 4150560 1657885 5178421
40969 5178421 10354453 9927479 4433581 -224574 -1677471 -1218405 1149789 5254562
40961 5254562 7453979 5128918 1816319 2008920 3838063 3166468 1858772 4711422
40953 4711422 10264004 12293868 9548649 6700345 5809240 3961793 150998 -2073000
40945 -2073000 -472445 2724520 5155844 7177446 8938907 8907434 6973742 5522440
$$ packed form
41002F88724L872211L005506j949913l642228j607159l28538j20975J366436K339716
40993C623780l07742m209221m611624j544477J954137N076196O963166M034358
40985A0978573l589922p936102l207992M504717N637341Q50598k338186k189037
40977B709990k232078j889121J682468M936098K153142l209939k492675L520536
40969E178421N176032m26974n493898m658155j452897M59066K368194M104773
40961E254562K199417k325061l312599J92601J829143o71595j307696K852650
40953D711422N552582K029864k745219k848304q91105j847447l810795k223998
40945b073000J600555L196965K431324K021602J761461l1473j933692j451302
$$ plain form
40937 5522440 6014504 7353673 8300782 8595505 7438479 4100698 359007 -966374 -304759
40928 -304759 -936745 -3886919 -6460859 -6462797 -4713661 -2577982 35565 3107856 5399953
40919 5399953 6068206 5697782 5089635 4375668 3463606 2167925 219273 -1939595 -3454690
40910 -3454690 -4990368 -8119013 -11334247 -9959929 -2960254 3453011 3159255 -1672157
40902 -1672157 -4448265 -3656008 -2832878 -3043766 -2105921 -649968 -1936661 -4985618 -4681371
40893 -4681371 -379578 2093667 -293483 -2479487 974202 7706456 11465222 10716379
40885 10716379 8891781 8173864 7217837 4469078 790552 -1486689 -995588 1024794
40877 1024794 1585304 -493018 -2513070 -1414642 1453900 2117035 97286 -1016291
$$ packed form
40937E522440M92064J339169R47109K94723j157026l337781l741691j325381O61615
40928c04759o31986k950174k573940j938J749136K135679K613547L072291K292097
40919E399953O68253l70424o08147p13967r12062j295681j948652k158868j515095
40910c454690j535678l128645l215234J374318O999675O413265k93756m831412
40902a672157k776108P92257Q23130k10888R37845J455953j286693l048957L04247
40893d681371M301793K473245k387150k186004L453689O732254L758766p48843
40885A0716379j824598p17917r56027k748759l678526k277241M91101K020382
40877A024794N60510k078322k020052J098428K868542O63135k019749j113577
$$ plain form
40869 -1016291 596314 2660460 3320561 3881854 5301786 5691466 3578807 561117 -1468515
40860 -1468515 -2811831 -3529691 -1636056 3388726 7763066 7369184 3203925 102278
40852 102278 779340 3263274 3762291 610376 -4185391 -6527748 -4119917 816404 3789781
40843 3789781 3078110 979198 92360 477977 821808 259642 -1393805 -3242141 -3108241
40834 -3108241 -128145 2600971 1021654 -3987828 -7019846 -5025539 -432719 3298372
40826 3298372 5467820 6252797 4871336 1652290 -1063613 -1865403 -1600914 -957862 60532
40817 60532 -239142 -3828933 -8235377 -8317895 -4399898 -2874211 -6154747 -8466094 -5664173
40808 -5664173 -2473918 -3866380 -5458980 -810317 6154875 5711852 -2691983 -9867026
$$ packed form
40869a016291J612605K064146O60101N61293J419932L89680k112659l017690k029632
40860a468515j343316p17860J893635N024782M374340l93882m165259l101647
40852A02278O77062K483934M99017l151915m795767k342357K407831M936321K973377
40843C789781p11671k098912q86838L85617L43831n62166j653447j848336J33900
40834c108241K980096K729116j579317n009482l032018J994307M592820L731091
40826C298372K169448P84977j381461l219046k715903q01790K64489O43052J018394
40817F0532k99674l589791m406444q2518L917997J525687l280536k311347K801921
40808e664173L190255j392462j592600M648663O965192m43023q403835p175043
$$ plain form
40800 -9867026 -11132764 -11290782 -13683318 -14187955 -10367165 -7772332 -10591371 -12947398
40792 -12947398 -7728662 533084 1037109 -6722975 -11442332 -6467210 1129509 2165957
40784 2165957 -1391730 -1679248 1480671 1107432 -4160588 -7008684 -3315689 1041753
40776 1041753 24291 -2522704 361576 6331615 6670685 271585 -4065190 -807864
40768 -807864 4429996 3613758 -2980825 -9007074 -10670221 -8629743 -4429689 388928
40760 388928 3351152 3092539 1450814 918230 1331919 1309220 1056138 1147100 432179 -1894103
40750 -1894103 -3800473 -3143638 -1615267 -2770526 -6864913 -10523839 -11027665 -8440472
40742 -8440472 -4151554 142713 2447066 1861580 -176867 -1797095 -3176371 -5260901
$$ packed form
40800i867026j265738j58018k392536n04637L820790K594833k819039k356027
40792a2947398N218736Q261746N04025p760084m719357M975122P596719J036448
40784B165957l557687k87518L159919l73239n268020k848096L692995M357442
40776A041753j017462k546995K884280N970039L39070o399100m336775L257326
40768h07864N237860q16238o594583o026249j663147K040478M200054M818617
40760C88928K962224k58613j641725n32584M13689k2699k53082R0962p14921k326282
40750a894103j906370O56835J528371j155259m094387l658926n03826K587193
40742h440472M288918M294267K304353n85486k038447j620228j379276k084530
$$ plain form
40734 -5260901 -6926477 -5875310 -2229869 839593 484892 -2843083 -5834155 -5447934
40726 -5447934 -2247717 -440794 -3021459 -7195903 -7411006 -3095790 379978 -447398
40718 -447398 -2672292 -2556443 -953685 119819 1879737 5212727 6553924 2752726
40710 2752726 -2783947 -4479818 -2893946 -2770170 -4595819 -4475997 -1490716 1248936
40702 1248936 2667607 4611181 6603344 6132174 4690574 6787961 11611371 12499444
40694 12499444 6922921 280346 -3153620 -6164760 -11287446 -14232403 -10682966 -4573180
40686 -4573180 -2664778 -4247247 -3334390 888105 3072801 830330 -1899699 -1630832
40678 -1630832 398438 2618228 6410000 11787846 14036455 9119219 383598 -4380016
$$ packed form
40734e260901j665576J051167L645441L069462l54701l327975k991072L86221
40726e447934L200217J806923k580665m174444k15103M315216L475768q27376
40718d47398k224894J15849J602758J073504J759918L332990J341197l801198
40710B752726n536673j695871J585872J23776j825649J19822K985281K739652
40702A248936J418671J943574J992163m71170j441600K097387M823410Q88073
40694A2499444n576523o642575l433966l011140n122686k944957L549437O109786
40686d573180J908402j582469R12857M222495K184696k242471k730029K68867
40678a630832K029270K219790L791772N377846K248609m917236q735621m763614
$$ plain form
40670 -4380016 -2055962 3153028 6281695 7132253 7738701 7542645 4486366 -305302 -2687847
40661 -2687847 -1025798 1377549 866202 -1886088 -3763742 -3841614 -3492735 -3054367 -1421316
40652 -1421316 1134733 2446383 1419599 -352584 -614648 1234706 4203624 6879349
40644 6879349 8256732 8311178 7771220 6767257 4506151 1240952 -746618 161392 2418573
40635 2418573 3518748 3474123 3692852 3764662 2576948 1615863 3250190 6035189 5985808
40626 5985808 2939228 1114273 2017305 1464415 -3660114 -9687467 -10961765 -7660344
40618 -7660344 -4761178 -4715447 -5281345 -4453848 -3695908 -4843677 -6292483 -4657227 198208
40609 198208 3861322 2384491 -2287549 -4087635 -492425 4027663 3958095 -102729 -3024986
$$ packed form
40670d380016K324054N208990L128667Q50558O06448j96056l056279m791668k382545
40661b687847J662049K403347n11347k752290j877654p7872L48879M38368J633051
40652a421316K556049J311650j026784j772183k62064J849354K968918K675725
40644F879349J377383N4446n39958j003963k261106l265199j987570R08010K257181
40635B418573J100175m4625K18729P1810j187714r61085J634327K784999m9381
40626E985808l046580j824955R03032n52890n124529o027353j274298L301421
40618g660344K899166M5731n65898Q27497P57940j147769j448806J635256M855435
40609A98208L663114j476831m672040j800086L595210M520088o9568m060824k922257
$$ plain form
40600 -3024986 -2220306 299683 1895812 1566300 -1201015 -5808183 -8886694 -7459575
40592 -7459575 -3977776 -3749094 -6857708 -7648701 -3495261 1179484 1752003 -803093 -3595604
40583 -3595604 -6196712 -7951139 -5888927 289901 5204767 4252642 -429777 -4480484
40575 -4480484 -7559772 -10309325 -9753773 -4235483 790755 -638678 -5167658 -4792753
40567 -4792753 359772 2560469 -610524 -3007407 -970392 1350835 925032 1795808
40559 1795808 7130639 12076859 10625857 4808394 1030283 796486 967645 602571 1497695
40550 1497695 3137779 2548976 -973480 -5213235 -8772463 -11488700 -11516450 -6527831 1342848
40541 1342848 5777036 3408818 -1941993 -4008108 -1178818 2911005 4601709 3973031
$$ packed form
40600c024986Q04680K519989J596129l29512k767315m607168l078511J427119
40592g459575L481799K28682l108614p90993M153440M674745N72519k555096k792511
40583c595604k601108j754427K062212O178828M914866r52125m682419m050707
40575d480484l079288k749553N55552N518290N026238j429433m528980L74905
40567d792753N152525K200697l170993k396883K037015K321227m25803Q70776
40559A795808N334831M946220j451002n817463l778111k33797J71159l65074Q95124
40550A497695J640084n88803l522456m239755l559228k716237k7750M988619P870679
40541A342848M434188k368218n350811k066115K829290M089823J690704o28678
$$ plain form
40533 3973031 3379852 3660978 3000168 -192329 -4262426 -5696050 -3516857 -485477 776857
40524 776857 913208 1740208 2986812 3315087 3235334 4401086 6626039 8101806 8325425
40515 8325425 8387866 8403643 7232091 5207456 4645288 6604065 9171175 10143935 9639852
40506 9639852 8712168 7061245 4065507 1189403 1259039 5047819 9703219 11069011 7451446
40497 7451446 1301618 -2722741 -1908949 1996643 4864164 4692903 3018147 1769473
40489 1769473 659180 -958411 -1348194 1773168 6903777 9143058 6174080 1712720
40481 1712720 849520 3238326 3756610 -127955 -4783321 -5639793 -3357826 -2122078 -3460497
40472 -3460497 -5148645 -5591355 -5443919 -4571449 -1674559 1563098 530710 -5044595 -8267129
$$ packed form
40533C973031n93179K81126o60810l192497m070097j433624K179193L031380J262334
40524G76857J36351Q27000J246604L28275p9753J165752K224953J475767K23619
40515H325425O2441J5777j171552k024635n62168J958777K567110R72760n04083
40506I639852r27684j650923k995738k876104O9636L788780M655400J365792l617565
40497G451446o149828m024359Q13792L905592K867521j71261j674756j248674
40489A769473j110293j617591l89783L121362N130609K239281k968978m461360
40481A712720q63200K388806N18284l884565m655366q56472K281967J235748j338419
40472c460497j688148m42710J47436Q72470K896890L237657j032388n575305l222534
$$ plain form
40463 -8267129 -4308687 1142729 -704486 -7922966 -9659470 -2360311 4436603 2177410
40455 2177410 -4497040 -5824559 -1580485 266931 -3269168 -6679344 -5596020 -2590217
40447 -2590217 -1404796 -1278789 -153930 700639 -944541 -3624679 -3489943 259683 3735991
40438 3735991 2740024 -2144607 -5660619 -3669811 1563006 3689272 295716 -4198186
40430 -4198186 -5283523 -4416162 -4799967 -4651301 -507373 4702632 4052290 -2709004 -8027695
40421 -8027695 -7808775 -6726646 -8985977 -10582566 -6254527 831209 2870676 -1656331
40413 -1656331 -6690427 -6979297 -2918283 2211854 5578533 5637090 3062735 776226 815023
40404 815023 2088991 3003582 4140720 5913695 6294897 4180532 2339732 3228540 4631504
$$ packed form
40463h267129L958442N451416j847215p218480j736504P299159O796914k259193
40455B177410o674450j327519M244074J847416l536099l410176J083324L005803
40447b590217J185421J26007J124859Q54569j645180k680138J34736L749626L476308
40438C735991r95967m884631l516012J990808N232817K126266l393556m493902
40430d198186j085337Q67361l83805J48666M143928N210005o50342o761294n318691
40421h027695K18920J082129k259331j596589M328039P085736K039467m527007
40413a656331n034096k88870M061014N130137L366679N8557k574355k286509L8797
40404H15023J273968R14591J137138J772975L81202k114365j840800Q88808J402964
$$ plain form
40395 4631504 3801050 2889703 4800543 6481808 3223734 -2217977 -2683253 1667816 3144350
40386 3144350 -856830 -3741502 -1211122 1502064 -1158480 -5785682 -6285867 -3890093
40378 -3890093 -3717497 -5222141 -3674474 893573 3646145 3345864 3925477 6817746 7811891
40369 7811891 3659393 -2950208 -7615325 -9840501 -11695052 -13490682 -13656959 -11504701
40361 -11504701 -7871638 -3894582 -739053 398050 -378034 -973374 628360 4075496
40353 4075496 7583952 10461542 13084657 14664883 13035176 7446723 361350 -4507122
40345 -4507122 -5413495 -3444839 -1025654 -106989 -831694 -1178485 1026978 4772486 5951517
40336 5951517 2516222 -1883121 -2144121 1151028 2271353 -1647738 -6597349 -7037971
$$ packed form
40395D631504q30454r11347J910840J681265l258074n441711m65276M351069J476534
40386C144350m001180k884672K530380K713186k660544m627202n00185K395774
40378c890093J72596j504644J547667M568047K752572l00281N79613K892269R94145
40369G811891m152498o609601m665117k225176j854551j795630j66277K152258
40361a1504701L633063L977056L155529J137103p76084n95340J601734L447136
40353D075496L508456K877590K623115J580226j629707n588453p085373m868472
40345d507122r06373J968656K419185R18665p24705l46791K205463L745508J179031
40336E951517l435295m399343k61000L295149J120325l919091m949611m40622
$$ plain form
40328 -7037971 -2309342 3937666 8001745 7932751 3724416 -1890792 -4929931 -4690444 -4764618
40319 -4764618 -7436959 -9595377 -7032581 -576631 5207747 7581304 6871432 4142779
40311 4142779 979023 -161190 1259032 2335710 1039095 -282487 833895 2205633
40303 2205633 1047447 -362620 1134075 2549004 -858431 -5923570 -4708638 2690358
40295 2690358 7095505 3779862 -1080745 -613040 3401103 5537646 4946305 3844346
40287 3844346 2617630 1009835 472938 1432629 1485675 -560956 -2334437 -2262168 -2275952
40278 -2275952 -3363637 -2920290 84746 1855220 -298310 -2992318 -2132429 650581
40270 650581 1692671 1917547 4429072 7975736 8202771 4287029 -12773 -1330481 284338
$$ packed form
40328g037971M728629O247008M064079o8994m208335n615208l039139K39487p4174
40319d764618k672341k158418K562796O455950N784378K373557p09872k728653
40311D142779l163756j140213J420222J076678j296615j321582J116382J371738
40303B205633j158186j410067J496695J414929l407435n065139J214932P398996
40295B690358M405147l315643m860607M67705M014143K136543n91341j101959
40287C844346j226716j607795n36897R59691N3046k046631j773481P2269j3784
40278b275952j087685M43347L005036J770474k153530k694008Q59889K783010
40270F50581J042090K24876K511525L546664K27035l915742m299802j317708J614819
$$ plain form
40261 284338 2370321 2016302 -1589634 -5247260 -5013371 -2316646 -2635387 -6590696 -7889142
40252 -7889142 -3094449 2471074 3034804 1075547 2219238 6147236 8619914 8712586 8021515
40243 8021515 5984261 1823617 -1810483 -2428951 -1723072 -1342129 769099 4513682 4003803
40234 4003803 -3012748 -8019509 -3104246 5754111 7338778 2779026 2196736 6475266
40226 6475266 6237373 -720235 -4856691 -898154 4027619 3211906 604870 2223592
40218 2223592 6148776 7453867 6162082 4514463 2152638 -958929 -2086289 -489794
40210 -489794 372340 -1185081 -2309835 -1782022 -2795523 -6403683 -8808302 -8628147 -9639415
40201 -9639415 -12239477 -10179937 -1310152 6321681 5999183 2718434 4111994 7688225
$$ packed form
40261B84338K085983l54019l605936l657626K33889K696725l18741l955309j298446
40252g889142M794693N565523N63730j959257J143691L927998K472678R2672o91071
40243H021515k037254m160644l634100o18468P05879L80943K111228L744583n09879
40234D003803p016551n006761M915263Q858357J584667m559752n82290M278530
40226F475266k37893o957608m136456L958537M925773q15713k607036J618722
40218B223592L925184J305091j291785j647619k361825l111567j127360J596495
40210d89794Q62134j557421j124754N27813j013501l608160k404619J80155j011268
40201i639415k600062K059540Q869785P631833l22498l280749J393560L576231
$$ plain form
40193 7688225 6587560 2853206 4245551 10478168 13066135 8473130 2405201 435327
40185 435327 2032595 4745554 7385522 7890135 4249111 -977637 -2357665 987088
40177 987088 4372877 4661588 3459588 2484303 966331 -891594 -780098 1420409 2508587
40168 2508587 1225670 697908 3257255 6379985 6549771 4337087 2776175 2799519 3020700
40159 3020700 2526557 1348422 -748804 -3515278 -4877025 -2745356 1657470 4194344
40151 4194344 2324885 -1899260 -4182102 -2571309 1269258 4754415 6726177 6994909
40143 6994909 5549929 3437008 2699596 3608334 3420941 168315 -3809164 -5044132 -4159926
40134 -4159926 -3906477 -3171083 1467701 7844881 8326533 516659 -7870491 -8955028 -4782635
$$ packed form
40193G688225j100665l734354J392345O232617K587967m593005o067929j969874
40185D35327J597268K712959K639968N04613l641024n226748j380028L344753
40177I87088L385789K88711j202000r75285j517972j857925J11496K200507J088178
40168B508587j282917n27762K559347L122730J69786k212684j560912K3344K21181
40159C020700m94143j178135k097226k766474j361747K131669M402826K536874
40151D194344j869459m224145k282842J610793L840567L485157J971762K68732
40143F994909j444980k112921p37412R08738j87393l252626l977479j234968Q84206
40134d159926K53449P35394M638784O377180M81652p809874q387150j084537M172393
$$ plain form
40125 -4782635 -2517296 -3540639 -3555607 -1244201 -57022 -1468849 -2367655 -559805 1584652
40116 1584652 915704 -2177304 -5095282 -6578125 -7292797 -8074866 -8736192 -8243491 -5925975
40107 -5925975 -2792463 -1030462 -1635130 -3432751 -4914134 -5469778 -4140242 380335
40099 380335 6648596 9717078 6315811 -498429 -4459339 -2901324 1772783 6148908
40091 6148908 8598409 8859293 7714972 7062135 8134746 9665324 9409505 7125908 4572648
40082 4572648 3121105 2741705 2632328 1700379 -480018 -2130796 -426804 4268720 7306102
40073 7306102 5107079 29712 -2507709 -502626 3368356 5873805 6206666 5358403
40065 5358403 4400095 3323722 1120315 -2057268 -3276162 -68450 4828048 6072525
$$ packed form
40125d782635K265339j023343j4968K311406J187179j411827q98806J807850K144457
40116A584652o68948l093008k917978j482843p14672p82069o61326M92701K317516
40107e925975L133512J762001o04668j797621j481383n55644J329536M520577
40099C80335O268261L068482l401267o814240l960910J558015M674107M376125
40091F148908K449501K60884j144321o52837J072611J530578k55819k283597k553260
40082D572648j451543l79400j09377r31949k180397j650778J703992M695524L037382
40073G306102k199023n077367k537421K005083L870982K505449L32861q48263
40065E358403r58308j076373k203407l177583j218894L207712M896498J244477
$$ plain form
40057 6072525 3806677 3946343 8396944 11014374 7234722 1806389 1250718 3753544
40049 3753544 3541747 1200442 1569294 4104198 3997836 1671175 2369743 6084186 6387766
40040 6387766 945271 -4462323 -4847579 -2296156 -648438 105962 1206072 2218119
40032 2218119 3648022 7604535 13040490 14821053 10229338 2317995 -5178627 -11449327
40024 -11449327 -15053959 -12670879 -5171917 245445 -1295558 -5559025 -5598726 -1253652
40016 -1253652 2696177 4600031 6378604 7771797 6117087 1856339 -666098 986356
40008 986356 4185313 5214594 4007837 3379353 4762964 6338174 5750329 3793598 3662997
39999 3662997 6006697 7120768 4267749 437017 118773 2230553 2270859 413735 1171111
$$ packed form
40057F072525k265848J39666M450601K617430l779652n428333n55671K502826
40049C753544k11797k341305L68852K534904j06362k326661O98568L714443L03580
40040F387766n442495n407594l85256K551423J647718P54400J100110J012047
40032B218119J429903L956513N435955J780563m591715p911343p496622o270700
40024a1449327l604632K383080P498962N417362j541003m263467l9701M345074
40016a253652L949829J903854J778573J393193j654710m260748k522437J652454
40008I86356L198957J029281j206757o28484J383611J575210n87845j956731j30601
39999C662997K343700J114071k853019l830732l18244K111780M0306j857124P57376
$$ plain form
39990 1171111 4706122 5528016 1838574 -937974 485437 1244439 -3125192 -8167905
39982 -8167905 -7246408 -2259393 -106912 -1385757 -549475 3797185 6584353 5022545
39974 5022545 2885274 3918076 6218058 5973132 3213271 1131817 1798346 4489648
39966 4489648 6988961 7456916 5918728 4194874 3639705 3559864 2855694 1851724 834288
39957 834288 -1457202 -5258445 -7245848 -4075734 2091161 5120067 2306472 -2591964
39949 -2591964 -4267397 -1484956 2716601 4540302 2705609 -485848 -1454407 391178
39941 391178 1853567 691281 -985358 -578538 38052 -2628257 -7343897 -9408326 -7925518
39932 -7925518 -6840072 -7981574 -8047603 -4510600 -202226 941645 -482753 -1138731 -117054
$$ packed form
39990A171111L535011Q21894l689442k776548J423411P59002m369631n042713
39982h167905R21497M987015K152481j278845Q36282M346660K787168j561808
39974E022545k137271J032802K299982k44926k759861k081454O66529K691302
39966D489648K499313M67955j538188j723854n55169p9841p04170j003970j017436
39957H34288k291490l801243j987403L170114O166895L028906k813595m898436
39949b591964j675433K782441M201557J823701j834693l191457r68559J845585
39941C91178J462389j162286j676639M06820O16590k666309m715640k064429J482808
39932g925518J085446j141502o6029L537003M308374J143871j424398o55978J021677
$$ plain form
39923 -117054 803637 553761 -481960 -2165991 -4338538 -5294276 -3109471 1219621 3997743
39914 3997743 2973925 -21535 -1427846 -67414 2186689 3480906 4141778 4975690
39906 4975690 4864560 2204115 -1694355 -3447576 -2525135 -2309707 -4580833 -6152472 -3944111
39897 -3944111 -425391 290148 -443843 1836988 6097451 5994118 -120068 -5571505 -4697902
39888 -4697902 -570330 657434 -1117282 -1399129 1233477 4194752 6006770 7226480
39880 7226480 7051187 4085537 559648 760126 4241051 5377011 1645574 -2082668
39872 -2082668 -624515 3820454 5296317 3142036 2451638 5793413 9198305 8020216
39864 8020216 3349721 -14043 39621 1480104 2258245 2815696 3807982 3804047 1193718
$$ packed form
39923a17054R20691k49876j035721j684031k172547r55738K184805M329092K778122
39914C997743j023818k995460j406311J360432K254103J294217O60872Q33912
39906D975690j11130k660445l898470j753221R22441K15428k271126j571639K208361
39897c944111L518720P15539p33991K280831M260463j03333o114186n451437Q73603
39888d697902M127572J227764j774716k81847K632606K961275J812018J219710
39880G226480j75293k965650l525889K00478L480925J135960l731437l728242
39872b082668J458153M444969J475863k154281o90398L341775L404892j178089
39864H020216m670495l363764N3664J440483P78141N57451R92286l935k610329
$$ plain form
39855 1193718 -2685871 -4456302 -2806153 40464 1591753 2235494 3706947 5490199
39847 5490199 4956928 1286173 -2781001 -4236973 -3475927 -3136082 -4128153 -4705709 -3432382
39838 -3432382 -1280034 -149466 -575671 -1653237 -2260229 -1596238 600079 3444724 5171424
39829 5171424 4917559 3783987 3353470 3716019 3835225 3328281 2822598 2815479 3119931 3338645
39819 3338645 3314762 3463117 4962022 8532680 12253977 12119597 6469251 -1294106 -6421524
39810 -6421524 -8173065 -8991045 -9429578 -7554182 -3467337 -488099 -488816 -1500860 -1793880
39801 -1793880 -2917461 -5917875 -7577104 -4374226 1508469 4338411 2528426 302840
39793 302840 1351838 4452599 6585655 7254195 7710819 8175790 8237526 8655136 10213285
$$ packed form
39855A193718l879589j770431J650149K846617J551289O43741J471453J783252
39847E490199n33271l670755m067174j455972P61046L39845r92071n77556J273327
39838c432382K152348J130568m26205j077566o06992O63991K196317K844645J726700
39829E171424k53865j133572m30517L62549J19206n06944n05683p119L04452K18714
39819C338645k3883J48355J498905L570658L721297j34380n650346p763357n127418
39810f421524j751541q17980m38533J875396M086845K979238p17j012044k93020
39801a793880j123581l000414j659229L202878N882695K829942j809985k225586
39793C02840J048998L100761K133056O68540M56624M64971O1736M17610J558149
$$ plain form
39784 10213285 11257398 8918571 3386711 -1116168 -1120607 1545816 1963207 -1423315 -4723007
39775 -4723007 -3697012 1015788 5266613 6381508 4644522 1073997 -3259511 -5951750
39767 -5951750 -4611473 -383301 2635063 2674492 2365422 4087676 6052935 5305908 2345906
39758 2345906 70543 -227482 764680 2421490 3832136 2923997 -828300 -3881248 -2363273
39749 -2363273 2103002 3933085 1121222 -2227438 -1712950 2026492 4960621 4313067
39741 4313067 627952 -2807100 -2159157 3089113 8268558 8246532 4258170 2531718 5253544
39732 5253544 7091546 3008959 -4306180 -8313867 -7136074 -4276963 -2652750 -1930887
39724 -1930887 -981159 632446 3264799 6296441 7265465 4995540 2698884 4130382
$$ packed form
39784A0213285J044113k338827n531860m502879m439K666423M17391l386522l299692
39775d723007J025995M712800M250825J114895j736986l570525m333508k692239
39767e951750J340277M228172L018364L9429l09070J722254J965259p47027k960002
39758B345906k275363k98025R92162J656810J410646r08139l752297l052948J517975
39749b363273M466275J830083k811863l348660N14488L739442K934129o47554
39741D313067l685115l435052O47943N248270N179445k2026l988362j726452K721826
39732E253544J838002m082587p315139m007687J177793K859111J624213P21863
39724a930887R49728J613605K632353L031642R69024k269925k296656J431498
$$ plain form
39716 4130382 7229760 6312523 1041434 -2009454 1312482 6777921 8351024 6431621
39708 6431621 5256491 5493117 4682667 3012587 3002763 4089604 2935516 -592732 -2864592
39699 -2864592 -2680457 -2856325 -4191642 -3324252 760506 3431139 1600347 -525645 1945783
39690 1945783 6113758 5741082 1648557 422966 3408738 4426090 -98165 -5354196
39682 -5354196 -5472528 -1403347 2131219 3533842 4259296 4736512 4346869 3906914 4955301
39673 4955301 7434438 10118469 12048153 11964493 8356009 2122226 -2764556 -3395783 -908263
39664 -908263 2327738 5680048 8006906 5943017 -1338319 -8173133 -8418789 -4324659
39656 -4324659 -4046617 -10146989 -15804500 -14096631 -6731755 -906576 -372020 -2552855
$$ packed form
39716D130382L099378r17237n271089l050888L321936N465439J573103j919403
39708F431621j175130K36626q10450j670080r824J086841j154088l528248k271860
39699b864592J84135j75868j335317Q67390M084758K670633j830792k125992K471428
39690A945783M167975l72676m092525j225591K985772J017352m524255n256031
39682e354196j18332M069181L534566J402623P25454M77216l89643m39955J048387
39673D955301K479137K684031J929684q3660l608484o233783m886782o31227K487520
39664i08263L236001L352310K326858k063889p281336o834814k45656M094130
39656d324659K78042o100372n657511J707869P364876N825179N34556k180835
$$ plain form
39648 -2552855 -3180603 -1246563 813751 820823 67122 1978456 7201137 11745168 11801139
39639 11801139 8885224 7449059 8349167 8170515 5063952 1620398 783783 1918159
39631 1918159 2670271 2491472 2387456 2671943 2812975 2760808 3063095 3967607 5162597
39622 5162597 6206930 6911284 7362804 7373905 6035657 2954094 93694 237604 2502248
39613 2502248 2137332 -2789484 -7281483 -5786517 -585982 1025624 -3026764 -7424675
39605 -7424675 -7583132 -4696279 -1777688 149228 249853 -2757447 -7049043 -7888372 -3903749
39596 -3903749 897316 3665232 6470200 10490211 11785401 7681292 2858625 3132249
39588 3132249 6420158 6320797 2431008 198715 1484599 2397038 1060360 723490 3110473
$$ packed form
39648b552855o27748J934040K060314P072p53701J911334N222681M544031N5971
39639A1801139k915915j436165R00108j78652l106563l443554q36615J134376
39631A918159P52112j78799j04016K84487J41032n2167L02287R04512J194990
39622E162597J044333P04354M51520J1101j338248l081563k860400J43910K264644
39613B502248l64916m926816m491999J494966N200535J611606m052388m397911
39605g424675j58457K886853K918591J926916J00625l007300m291596q39329L984623
39596c903749M801065K767916K804968M020011J295190m104109m822667K73624
39588C132249L287909r9361l889789k232293J285884R12439j336678l36870K386983
$$ plain form
39579 3110473 4595015 2152318 -1454176 -2010794 -52149 825131 -476628 -1986767
39571 -1986767 -2145763 -994254 1139031 3798879 5951913 7109627 7999640 8671841 7465860
39562 7465860 4009239 1787366 4560749 10441852 12762393 7949183 184004 -3432860
39554 -3432860 -797337 3998483 6370097 5768713 4382449 3639087 3447258 3586946 3938611
39545 3938611 3728006 2438710 1614780 3695793 8115491 10535116 7950472 3366117
39537 3366117 2689577 6863340 9748009 5371898 -4316819 -11088090 -9516879 -2498317
39529 -2498317 2869940 3189741 895921 -630819 -1440939 -3385794 -6068584 -6929384 -5131684
39520 -5131684 -3036267 -2966523 -4172723 -4276456 -2622760 -675686 448511 1279414 2500270
$$ packed form
39579C110473J484542k442697l606494n56618J958645Q77280j301759j510139
39571a986767j58996J151509K133285K659848K153034J157714Q90013O72201j205981
39562G465860l456621k221873K773383N881103K320541m813210p765179l616864
39554c432860K635523M795820K371614o01384j386264p43362j91829J39688L51665
39545C938611k10605j289296q23930K081013M419698K419625k584644m584355
39537C366117o76540M173763K884669m376111r688717o771271J571211P018562
39529b498317N368257L19801k293820j526740q10120j944855k682790q60800J797700
39520e131684K095417O9744j206200j03733J653696J947074J124197Q30903J220856
$$ plain form
39511 2500270 3246617 1848679 -1768269 -5196996 -5837273 -3919149 -2092818 -1606487 -493447
39502 -493447 2984692 6598470 6523446 2948218 184796 618532 1625927 -11819 -3354146
39493 -3354146 -5147839 -4363423 -2434687 -519053 867813 618406 -1691239 -3750033
39485 -3750033 -2583722 1071627 3006653 991749 -2065799 -1824186 1841825 4556540
39477 4556540 2778263 -1820277 -4260269 -2240700 1284005 2364305 1272648 1281416 3378138
39468 3378138 5578689 7376898 10664458 14891790 15694442 11219057 6132644 5629270
39460 5629270 8459087 10059056 9899521 10788917 12892510 13935662 14190329 15546148 16179170
39451 16179170 12272203 5395824 1934169 3929637 6615711 6776460 6987237 8675634
$$ packed form
39511B500270P46347j397938l616948l428727o40277J918124J826331M86331J113040
39502d93447L478139L613778p5024l575228k763422M33736J007395j637746l342327
39493c354146j793693P84416J928736J915634J386866k49407k309645k058794
39485c750033J166311L655349J935026k014904l057548K41613L666011K714715
39477D556540j778277m598540k439992K019569L524705J080300j091657Q768K096722
39468C378138K200551J798209L287560M227332Q02652m475385n086413n03374
39460E629270K829817J599969j59535Q89396K103593J043152K54667J355819O33022
39451A6179170l906967o876379l461655J995468K686074J60749K10777J688397
$$ plain form
39443 8675634 7832678 2496176 -1293077 2709425 11071747 14874356 11159895 4354918
39435 4354918 -1487535 -5641603 -7192060 -4878363 -642693 1696484 1525317 1029454
39427 1029454 464600 -1298404 -2231880 1113501 7157308 10308580 9065355 7282624
39419 7282624 6574814 4128572 -58987 -1004018 2658360 4801674 1514442 -1643262
39411 -1643262 1534051 7255756 7806826 4388195 4815446 10004412 12202800 7675211
39403 7675211 2478504 2471424 4678326 3193207 -1302636 -2975252 908330 7264096 11306791
39394 11306791 10664690 6701294 3605556 4679799 8314107 9667891 7211426 4628099
39386 4628099 4965187 6670499 7719402 9595356 13415547 15500441 11649350 3878800
$$ packed form
39443H675634q42956n336502l789253M002502Q362322L802609l714461o804977
39435D354918n842453m154068j550457K313697M235670K339177j71167m95863
39427A029454n64854j763004r33476L345381O043807L151272j243225j782731
39419G282624p07810k446242m187559r45031L662378K143314l287232l157704
39411a643262L177313N721705N51070l418631M27251N188966K198388m527589
39403G675211n196707p080K206902j485119m495843j672616L883582O355766M042695
39394A1306791o42101l963396l095738J074243L634308J353784k456465k583327
39386D628099L37088J705312J048903J875954L820191K084894l851091p770550
$$ plain form
39378 3878800 -1774582 -2874469 -1552606 810980 4593460 7916216 7243313 3203528
39370 3203528 975790 3014579 5628715 5037712 2906648 2943626 5240104 7389148 8846758
39361 8846758 10590758 11926739 11168938 8960381 7872914 8609953 8998428 7199265 4244486
39352 4244486 2836969 4449932 7703914 9300134 7218439 3344261 1688809 3450537
39344 3450537 5735212 6349945 7397990 11538495 16634417 17813164 14242786 10166229
39336 10166229 8941227 9611124 10296650 11383490 13368687 14573421 13719286 12555225
39328 12555225 12881268 12662695 8755857 2769355 218426 3268562 7953703 10048507
39320 10048507 10359428 11774498 13877037 13973988 11888266 9953565 8842000 7227998
$$ packed form
39378C878800n653382j099887J321863K363586L782480L322756o72903m039785
39370C203528k227738K038789K614136n91003k131064L6978K296478K149044J457610
39361H846758J744000J335981p57801k208557j087467P37039L88475j799163k954779
39352D244486j407517J612963L253982J596220k081695l874178j655452J761728
39344C450537K284675O14733J048045M140505N095922J178747l570378m076557
39336A0166229j225002O69897O85526J086840J985197J204734q54135j164061
39328A2555225L26043k18573l906838n986502k550929L050136M685141K094804
39320A0048507L10921J415070K102539R6951k085722j934701j111565j614002
$$ plain form
39312 7227998 5717696 6957675 10543612 11850564 8458958 4410051 4763827 8542273
39304 8542273 10931656 10470687 9517086 8760804 6494977 3514609 3412819 6433000 7927434
39295 7927434 5620469 4131013 8577662 16966199 23187118 25262919 26029801 27089290
39287 27089290 27157721 26352035 27173160 29902013 31147513 29156079 27369554 29989126 36085558
39278 36085558 40760326 40855246 37255510 32713353 29790240 30107051 33053476 35578434
39270 35578434 35714292 35973896 40236892 47163708 50715934 49008865 48609240 56274778
39262 56274778 69441970 80289347 87898836 99731173 119709018 141527767 158145144
39255 158145144 173041703 195836835 228671908 262664469 287279052 298041914 295308354
$$ packed form
39312G227998j510302J239979L585937J306952l391606m048907L53776L778446
39304H542273K389383m60969r53601p56282k265827k980368j01790L020181J494434
39295G927434k306965j489456M446649Q388537O220919K075801P66882J059489
39287B7089290O8431q05686Q21125K728853J245500j991434j786525K619572O096432
39278C6085558M674768R4920l599736m542157k923113L16811K946425K524958
39270C5578434J35858K59604M262996O926816L552226j707069l99625P665538
39262E6274778J3167192J0847377P609489J1832337J9977845K1818749J6617377
39255A58145144J4896559K2795132L2835073L3992561K4614583J0762862k733560
$$ plain form
39248 295308354 281796557 263888961 250616868 247210695 250938263 254745814 252814198
39241 252814198 241683935 219923466 190111934 159087289 132897869 112095981 93737731
39234 93737731 76510322 61717014 50541671 42833072 38057274 35561380 34212513 32961819
39226 32961819 31221682 28139311 22859748 16234235 10647200 7511793 6850565 9384971
39218 9384971 15499559 21251686 20233770 12291569 5851883 7399328 12759843 14097578
39210 14097578 11625149 11182271 12754272 10315587 3316943 -682665 2201174 5523278
39202 5523278 2441298 -3702998 -4634694 1069694 7625231 11093892 12677124 13740182
39194 13740182 13275774 11231655 9962639 10733389 11804180 11427119 10235288 9273109 8037461
$$ packed form
39248B95308354j3511797j7907596j3272093l406173L727568L807551j931616
39241B52814198j1130263k1760469k9811532l1024645k6189420k0801888j8358250
39234I3737731j7227409j4793308j1175343p708599m775798k495894j348867j250694
39226C2961819j740137l082371n279563o625513n587035l135407o61228K534406
39218I384971O114588N752127j017916p942201o439686J547445N360515J337735
39210A4097578k472429m42878J572001k438685o998644l999608K883839L322104
39202E523278l081980o144296r31696N704388O555537L468661J583232J063058
39194A3740182m64408k044119j269016P70750J070791l77061j191831r62179j235648
$$ plain form
39185 8037461 6272429 5659890 7375695 9390851 9006543 7410605 8445224 12371264
39177 12371264 14326787 11000507 5951974 4996880 8083612 9814871 7500256 4290798
39169 4290798 3578134 4564302 5205006 5664274 6232890 5195093 1946383 -573137 23231
39160 23231 1493672 574581 -1690312 -2217114 -1283735 -1121647 -984996 1200349 3585458
39151 3585458 2552598 -398089 -48844 3842335 5594788 2863207 590319 2930784
39143 2930784 6727908 6660590 2509027 -2288742 -5443301 -5703093 -1887581 3911981 5688702
39134 5688702 650677 -5755654 -6510300 -2258978 912932 663030 -381083 -1348195 -4602853
39125 -4602853 -9665426 -11483430 -7325209 -1248180 1254863 81854 -1101933 -1105138 -2041154
$$ packed form
39185H037461j765032o12539J715805K015156l84308j595938J034619L926040
39177A2371264J955523l326280n048533r55094L086732J731259k314615l209458
39169D290798p12664R86168O40704M59268N68616j037797l248710k519520N96368
39160B3231J470441r19091k264893n26802R33379J62088J36651K185345K385109
39151C585458j032860k950687L49245L891179J752453k731581k272888K340465
39143B930784L797124o7318m151563m797769l154559k59792L815512N799562J776721
39134E688702n038025o406331p54646M251322L171910k49902j044113r67112l254658
39125d602853n062573j818004M158221O077029K503043j173009j183787l205r36016
$$ plain form
39116 -2041154 -4411301 -5037540 -1438635 3931431 6220263 4245036 1476296 663360
39108 663360 412004 -1123321 -2048006 141475 2974853 1416215 -4116446 -7207944 -4461211
39099 -4461211 -247204 343333 -1086318 -16543 3096525 3846638 1216771 -1227761
39091 -1227761 -1376520 -1278570 -2840128 -4419881 -3403010 113428 3689436 5086955 3405833
39082 3405833 -935927 -6082115 -9300593 -8864529 -5561116 -1912018 359361 1843202
39074 1843202 3794067 5143325 3003411 -2646251 -6993610 -6018045 -2469268 -2091471
39066 -2091471 -4663827 -4166976 1398506 6363884 6145120 3917287 4394153 5964701 4545292
39057 4545292 1476940 1237459 3555768 4168276 2266359 1013429 966732 -976241 -5356116
$$ packed form
39116b041154k370147o26239L598905N370066K288832j975227k768740q12936
39108F63360k51356j535325r24685K189481K833378j558638n532661l091498K746733
39099d461211M214007N90537j429651J069775L113068P50113k629867k444532
39091a227761j48759R7950j561558j579753J016871L516438L576008J397519j681122
39082C405833m341760n146188l218478M36064L303413L649098K271379J483841
39074A843202J950865J349258k139914n649662m347359R75565L548777L77797
39066b091471k572356M96851N565482M965378k18764k227833M76866J570548j419409
39057D545292l068352k39481K318309O12508j901917j252930m6697j942973m379875
$$ plain form
39048 -5356116 -8205761 -6638765 -2135312 2606150 5941789 5859699 1112462 -4820368
39040 -4820368 -5585229 -59510 5232910 4269303 -1112859 -4456238 -2553100 2428497
39032 2428497 6597249 7759006 6429414 4953723 4748377 4227933 1207107 -2930237
39024 -2930237 -4371163 -2467340 -890954 -2304434 -5066885 -6384651 -5633601 -3410621
39016 -3410621 -562718 664036 -1720471 -4999849 -3148683 4695714 11195989 9832588
39008 9832588 3553615 171137 1744980 3398200 1353750 -2713467 -5407925 -5685838
39000 -5685838 -4311752 -2099419 148703 1515720 1465534 -144748 -3062103 -5924105
38992 -5924105 -6732256 -5214799 -3417773 -2735814 -2140568 -935382 -906396 -3058823 -4348697
$$ packed form
39048e356116k849645J566996M503453M741462L335639q2090m747237n932830
39040d820368p64861N525719N292420r63607n382162l343379J903138M981597
39032B428497M168752J161757j329592j475691k05346n20444l020826m137344
39024b930237j440926J903823J576386j413480k762451j317766P51050K222980
39016c410621K847903J226754k384507l279378J851166P844397O500275j363401
39008I832588o278973l382478J573843J653220k044450m067217k694458k77913
39000e685838J374086K212333K248122J367017n0186j610282k917355k862002
38992e924105q08151J517457J797026O81959N95246J205186K8986k152427j289874
$$ plain form
38983 -4348697 -1407762 3587651 4826185 541462 -5100000 -8345980 -10144260 -12393649
38975 -12393649 -13438752 -10488898 -4831147 -1298756 -2458541 -5688498 -6884118 -5452277
38967 -5452277 -4107265 -4437592 -4836835 -3641403 -2414696 -3881559 -7360782 -9011378
38959 -9011378 -7012583 -3865185 -2436102 -2201320 -1210068 367791 1073914 1074706 1618315
38950 1618315 2336618 1579668 -736513 -2682148 -2788888 -1426336 219292 1207430 1099221
38941 1099221 396919 492658 2205386 4867460 7594114 10259552 12098874 11059077 6595185
38932 6595185 1758336 52430 1192632 2510123 3493541 5651314 8282323 8170167
38924 8170167 4382112 285358 -633854 1275328 3226176 3328273 1425943 -1476546
$$ packed form
38983d348697K940935M995413J238534m284723n641462l245980j798280k249389
38975a2393649j045103K949854N657751L532391j159785l229957j195620J431841
38967e452277J345012l30327l99243J195432J226707j466863l479223j650596
38959i011378J998795L147398J429083K34782R91252J577859P06123P92N43609
38950A618315P18303p56950k316181j945635j06740J362552J645628R88138j08209
38941A099221p02302R5739J712728K662074K726654K665438J839322j039797m463892
38932F595185m836849j705906J140202J317491R83418K157773K631009j12156
38924H170167l788055m096754r19212J909182J950848J02097j902330k902489
$$ plain form
38916 -1476546 -3469955 -3130442 -1676381 -1976940 -4404351 -5688695 -3334195 760411
38908 760411 2973378 2640149 1782555 1207896 -486895 -3923037 -7082982 -7454617 -5226894
38899 -5226894 -3507594 -5077581 -8847955 -10160633 -5743363 1858404 6572437 5896001
38891 5896001 3463750 3274014 3899004 1356330 -3731790 -5804781 -1732208 4804201
38883 4804201 7988446 6564931 3708586 1970557 1236530 1145165 2367557 4467578 4907923
38874 4907923 2161150 -1532032 -2777416 -1870460 -2498557 -6132394 -9249626 -7920159
38866 -7920159 -3452198 -941619 -2751750 -6053413 -7238219 -6293342 -5472465 -5597283 -5712286
38857 -5712286 -5263957 -4388427 -2574402 574652 3218781 2506174 -1206075 -3699995 -1894132
$$ packed form
38916a476546j993409L39513J454061l00559k427411j284344K354500M094606
38908G60411K212967l33229q57594n74659j694791l436142l159945l71635K227723
38899e226894J719300j569987l770374j312678M417270P601767M714033o76436
38891E896001k432251j89736O24990k542674n088120k072991M072573O536409
38883D804201L184245j423515k856345j738029p34027r1365J222392K100021M40345
38874D907923k746773l693182j245384R06956o28097l633837l117232J329467
38866g920159M467961K510579j810131l301663j184806R44877Q20877j24818j15003
38857e712286M48329Q75530J814025L149054K644129p12607l712249k493920J805863
$$ plain form
38848 -1894132 2637425 6883848 10578862 14132844 14790089 9850947 3095216 2096739
38840 2096739 7612322 11350438 7450495 722672 -1436254 -360501 -2196581 -5931426
38832 -5931426 -4327944 3425986 9021533 7229772 2719796 977936 -92893 -4149410
38824 -4149410 -8436036 -8664237 -7117399 -8481138 -10914941 -9033527 -3820848 -1703491
38816 -1703491 -4275744 -6342646 -4590219 -1407659 666307 1714394 765400 -3666626
38808 -3666626 -7780555 -4642284 4940173 10890076 7374094 1226714 1652445 7421889
38800 7421889 10678754 8790671 5309049 2391560 -376970 -1402086 1552309 5809606
38792 5809606 5783026 804340 -4194726 -5901245 -5661757 -5359255 -5213944 -5869881 -7748988
$$ packed form
38848a894132M531557M246423L695014L553982O57245m939142o755731r98477
38840B096739N515583L738116l899943o727823k158926J075753j836080l734845
38832e931426J603482P753930N595547j791761m509976j741860j070829m056517
38824d149410m286626k28201J546838j363739k433803J881414N212679K117357
38816a703491k572253k066902J752427L182560K073966J048087r48994m432026
38808c666626m113929L138271R582457N949903l515982o147380M25731N769444
38800G421889L256865j888083l481622k917489k768530j025116K954395M257297
38792E809606k6580m978686m999066j706519K39488L02502J45311o55937j879107
$$ plain form
38783 -7748988 -8063706 -3606268 2969227 5110008 1687345 -1218070 483603 3588297
38775 3588297 3896988 2135417 257490 -2746798 -7022857 -8572263 -4909526 -273508
38767 -273508 94030 -2211964 -2055780 878895 2971890 3672428 4948168 4995880 -107831
38758 -107831 -7990460 -10378058 -4046770 4545863 8137286 6853794 4668242 2871163
38750 2871163 960294 -216240 -473394 -2047775 -5239012 -5674472 -637872 4939386
38742 4939386 4479825 -325420 -1901956 1704741 4355965 1700649 -2785364 -4125326
38734 -4125326 -3029540 -3261632 -5465126 -7240918 -7052268 -5035516 -1769685 1248769
38726 1248769 1801992 121101 -4032 4008161 9216949 10370578 6233859 268985
$$ packed form
38783g748988l14718M457438O575495K140781l422663k905415J701673L104694
38775C588297L08691j761571j877927l004288m276059j549406L662737M636018
38767b73508L67538k305994J56184K934675K092995P00538J275740M7712n103711
38758a07831p882629k387598O331288Q592633L591423j283492k185552j797079
38750B871163j910869j176534k57154j574381l191237m35460N036600N577258
38742D939386m59561m805245j576536L606697K651224k655316m486013j339962
38734d125326J095786k32092k203494j775792J88650K016752L265831L018454
38726A248769N53223j680891j25133M012193N208788J153629m136719n964874
$$ plain form
38718 268985 -3585150 -3284176 1309231 7313640 9144319 4133355 -2604108 -3155900 3103645
38709 3103645 8669394 7965777 3749702 1494684 1645145 881141 -1868295 -4706648 -6560427
38700 -6560427 -7816381 -7610186 -4164329 1350075 4241337 1522730 -3761289 -5571083
38692 -5571083 -2051448 2293111 2571319 -47403 -406458 2567155 3634153 -1074011
38684 -1074011 -7647349 -9437853 -6140478 -2952983 -1878878 243485 4514136 6912744
38676 6912744 4886761 1822848 1718278 3705173 5150698 5899445 5761851 2366148 -3811782
38667 -3811782 -6764861 -3128444 1035443 -1324674 -6488169 -5328163 1482735 3772192
38659 3772192 -1821894 -6088476 -1534365 6334994 7711490 1867907 -4465251 -7350570
$$ packed form
38718B68985l854135L00974M593407O004409J830679n010964o737463n51792O259545
38709C103645N565749p03617m216075k255018J50461p64004k749436k838353j853779
38700f560427j255954K06195L445857N514404K891262k718607n284019j809794
38692e571083L519635M344559K78208k618722l59055K973613J066998m708164
38684a074011o573338j790504L297375L187495J074105K122363M270651K398608
38676F912744k025983l063913j04570J986895J445525P48747j37594l395703o177930
38667c811782k953079L636417M163887k360117n163495J160006O810898K289457
38659C772192n594086m266582M554111P869359J376496n843583o333158k885319
$$ plain form
38651 -7350570 -7870831 -7138214 -4929223 -1815280 1443001 4945259 7289519 5461314
38643 5461314 555806 -596340 5460925 12021276 10870868 4521065 2244912 5896285
38635 5896285 8377627 6287150 4965000 8284848 11631084 9873659 5991852 5680943
38627 5680943 7573035 5411507 -1872983 -8293629 -9084319 -6107297 -3825749 -3308875
38619 -3308875 -2211212 995542 4692600 5952982 3907746 797042 -496844 468056
38611 468056 1747632 1766940 868484 163973 141544 673077 1259504 966041 -908109 -3911853
38601 -3911853 -6950387 -9359100 -10475917 -9053887 -4991447 -1002721 -165456 -2001438
38593 -2001438 -3457599 -3578875 -4196526 -5754557 -5971444 -3858343 -1854795 -2176167 -3668048
$$ packed form
38651g350570n20261P32617K208991L113943L258281L502258K344260j828205
38643E461314m905508j152146O057265O560351j150408o349803k276153L651373
38635E896285K481342k090477j322150L319848L346236j757425l881807l10909
38627E680943J892092k161528p284490o420646p90690K977022K281548N16874
38619c308875J097663L206754L697058J260382k045236l110704j293886R64900
38611D68056J279576J9308q98456p04511k2429N31533N86427k93463j874150l003744
38601c911853l038534k408713j116817J422030M062440L988726Q37265j835982
38593b001438j456161j21276o17651j558031k16887K113101K003548l21372j491881
$$ plain form
38584 -3668048 -4084610 -3102881 -1380591 890941 2637944 1674775 -1965739 -4798271 -4283965
38575 -4283965 -2281150 -1827963 -2785684 -3180470 -2559135 -1320491 892063 3242367 2886374
38566 2886374 -379986 -1612804 2504582 6955820 4330115 -3926738 -8751059 -6076403
38558 -6076403 -1613473 -1364441 -3474326 -2760278 1283842 4826702 5098551 2308964 -1623524
38549 -1623524 -3919104 -2736777 -15134 27635 -3009041 -4237167 -397205 5084098
38541 5084098 6998222 5249285 3303534 2637161 2962956 5474134 10677645 14452686
38533 14452686 11965076 5476939 2840075 7194367 12998260 13838617 9591811 3666912
38525 3666912 -2324927 -7698310 -10012290 -7526735 -2563078 1143575 3121698 5068234
$$ packed form
38584c668048m16562R81729J722290K271532J747003r63169l640514k832532N14306
38575d283965K002815M53187r57721l94786O21335J238644K212554K350304l55993
38566B886374l266360j232818M117386M451238k625705q256853m824321K674656
38558f076403M462930K49032k109885P14048M044120L542860K71849k789587l932488
38549a623524k295580J182327K721643M2769l036676j228126L839962N481303
38541E084098J914124j748937j945751o66373L25795K511178N203511L775041
38533A4452686k487610o488137k636864M354292N803893Q40357m246806n924899
38525C666912n991839n373383k313980K485555M963657L706653J978123J946536
$$ plain form
38517 5068234 6623062 5964083 3703190 2220413 1346625 -1253333 -5041201 -6209162
38509 -6209162 -3627318 -1096786 -1451317 -2154365 73716 3341892 3303334 -221822 -3594553
38500 -3594553 -5218354 -6669433 -8247369 -7930183 -5660096 -4559809 -6017334 -6818480
38492 -6818480 -3552781 2296132 5839084 4017123 -1971461 -7986240 -9776038 -6395798
38484 -6395798 -1727464 -569825 -2665459 -3484277 -1570346 -810323 -3283467 -4693472
38476 -4693472 -1118615 3633738 2986138 -2548914 -6390223 -5432359 -2541184 -46234
38468 -46234 2879846 5659093 5400240 2431324 1117508 2727234 2881548 -684602 -3037593
38459 -3037593 771030 7548565 10272240 7867488 5268860 5178931 5175127 3088514 610757
$$ packed form
38517E068234J554828o58979k260893j482777q73788k599958l787868j167961
38509f209162K581844K530532l54531p03048K228081L268176l8558l525156l372731
38500c594553j623801j451079j577936L17186K270087J100287j457525q01146
38492f818480L265699N848913L542952j821961n988584o014779j789798L380240
38484f395798M668334J157639k095634q18818J913931P60023k473144j410005
38476d693472L574857M752353o47600n535052l841309R57864K891175K494950
38468d6234K926080K779247k58853k968916j313816J609726J54314l566150k352991
38459c037593L808623O777535K723675k404752k598628q9929l804k086613k477757
$$ plain form
38450 610757 224999 1603259 2495391 1526344 -684549 -2281884 -2165170 -1917947 -4592046
38441 -4592046 -10270399 -14475248 -13205308 -8227847 -4724320 -4740187 -6049017 -6858831 -7958333
38432 -7958333 -9630593 -9745563 -6501189 -1097652 3485447 4986117 2779969 -1741901
38424 -1741901 -5140161 -4393270 -399408 2803728 3242648 3372136 5836811 8893875 8313506
38415 8313506 2825257 -4418428 -9347966 -10251596 -8053514 -5238967 -4473669 -6474240
38407 -6474240 -8817278 -8264681 -4653324 -1030414 580248 1787609 4943890 9072818
38399 9072818 10612179 7710569 2087814 -3178786 -6211448 -6931545 -6783930 -7735350 -9851640
38390 -9851640 -10282531 -6953865 -2756809 -2582601 -5989808 -7362791 -4841063 -3646445
$$ packed form
38450F10757l85758J378260Q92132r69047k210893j597335J16714K47223k674099
38441d592046n678353m204849J269940M977461L503527j5867j308830q09814j099502
38432g958333j672260j14970L244374N403537M583099J500670k206148m521870
38424a741901l398260P46891L993862L203136M38920J29488K464675L057064n80369
38415H313506n488249p243685m929538r03630K198082K814547P65298k000571
38407f474240k343038N52597L611357L622910J610662J207361L156281M128928
38399I072818J539361k901610n622755n266600l032662p20097J47615r51420k116290
38390i851640m30891L328666M197056J74208l407207j372983K521728J194618
$$ plain form
38382 -3646445 -6931181 -8873341 -3248805 5106461 5736270 -1940770 -7425331 -4412475
38374 -4412475 1233231 1690779 -2378491 -6074136 -8211670 -9294151 -6948492 -96326
38366 -96326 5950871 5312556 296749 -1767444 1144432 4473066 4982772 4003045 3070678
38357 3070678 1953224 1417774 2968970 5193921 4926943 2660368 2230060 4254900 4573817
38348 4573817 817475 -3731240 -5044908 -3619937 -2399746 -2160476 -1552893 -107652
38340 -107652 965600 410411 -1556902 -2997762 -1901755 994649 2194974 -109288
38332 -109288 -3179235 -3671764 -2431016 -2009800 -1636256 594712 2194087 -1030518 -7171473
38323 -7171473 -9601668 -6863577 -4451411 -4982351 -3726886 2521038 8650159 8443533
$$ packed form
38382c646445l284736j942160N624536Q355266O29809p677040n484561L012856
38374d412475N645706M57548m069270l695645k137534j082481K345659O852166
38366i6326O047197o38315n015807k064193K911876L328634N09706r79727r32367
38357C070678j117454n35450J551196K224951k66978k266575m30308K024840L18917
38348D573817l756342m548715j313668J424971J220191K39270O07583J445241
38340a07652J073252n55189j967313j440860J096007K896404J200325k304262
38332a09288l069947m92529J240748M21216L73544K230968J599375l224605o140955
38323g171473k430195K738091K412166n30940J255465O247924O129121k06626
$$ plain form
38315 8443533 3687152 627954 1042469 2190218 2649988 2750966 1429093 -1978838 -4337038
38306 -4337038 -2191155 2412917 4393863 3115123 2628165 4853442 7320865 7950307
38298 7950307 7550473 6795595 4932497 2774259 3159851 6530194 9017253 7030510 1678595
38289 1678595 -3164568 -5582565 -6769598 -8549636 -11059410 -12389754 -10130678 -4185612
38281 -4185612 1805941 3304098 -232996 -4515655 -5245054 -2655705 -276428 -158907
38273 -158907 -949701 -656458 387914 593207 257589 1469204 4326069 5553694 2919079
38264 2919079 -562105 237998 5767324 11211822 12726559 11011642 8211840 4899691
38256 4899691 1542350 -462209 -1210765 -2744407 -5080372 -5054554 -1590674 1344933 378000
$$ packed form
38315H443533m756381l059198M14515J147749M59770J00978j321873l407931k358200
38306d337038K145883M604072J980946j278740m86958K225277K467423O29442
38298G950307l99834p54878j863098k158238L85592L370343K487059j986743n351915
38289A678595m843163k417997j187033j780038k509774j330344K259076N945066
38281d185612N991553J498157l537094m282659p29399K589349K379277J17521
38273a58907p90794K93243J044372K05293l35618J211615K856865J227625k634615
38264B919079l481184Q00103N529326N444498J514737j714917k799802l312149
38256D899691l357341k004559p48556j533642k335965K5818L463880K935607r66933
$$ plain form
38247 378000 -1897910 -1205323 1632071 2963091 2978185 4402483 5940652 3592828 -1204479
38238 -1204479 -1487692 4850976 10387152 7813641 102629 -3783508 -992849 2569055
38230 2569055 1461621 -2161330 -2663351 879864 3996330 3641447 2171954 2973732 4836706
38221 4836706 3919001 98224 -2676734 -2622618 -2383820 -3504810 -3150848 359830 2601924
38212 2601924 -1464182 -9088301 -12022661 -6874893 1219816 5536650 4504604 861425
38204 861425 -2351045 -3456406 -2235739 46801 1680686 2044960 1573953 927231 1073658
38195 1073658 2725745 4339946 2739000 -2245249 -6102868 -5333417 -2386837 -1676094
38187 -1676094 -3270813 -4596038 -5735105 -7900985 -8781239 -5419384 -492592 566286
$$ packed form
38247C78000k275910O92587K837394J331020J5094J424298J538169k347824m797307
38238a204479k83213O338668N536176k573511p711012l886137K790659L561904
38230B569055j107434l622951n02021L543215L116466l54883j469493Q01778J862974
38221D836706r17705l820777k774958N4116K38798j120990L53962L510678K242094
38212B601924m066106p624119k934360N147768Q094709M316834j032046l643179
38204H61425l212470j105361J220667K282540J633885L64274m71007o46722J46427
38195A073658J652087J614201j600946m984249l857619P69451K946580P10743
38187a676094j594719j325225j139067k165880q80254L361855M926792J058878
$$ plain form
38179 566286 -1940981 -2876732 -1319616 -1462333 -3850036 -3515098 1012511 4271737 2712264
38170 2712264 282087 1258893 3423319 2692688 -474819 -3371813 -5085415 -4680850 -430268
38161 -430268 5383541 6402898 1322494 -2526715 308680 5150288 5410966 3174221
38153 3174221 4014522 6260175 4329413 -502796 -1964036 246493 381654 -2895092
38145 -2895092 -4610497 -2667072 -918261 -1658506 -2321729 -1510498 -1580265 -2984572 -2266642
38136 -2266642 1706152 5049959 5020920 3751131 3311596 2163837 -513829 -1802285 133154
38127 133154 2224527 1102886 -1777697 -3001372 -2348433 -1810344 -1653847 -466357 2232664
38118 2232664 5358371 7064044 5676326 1983686 409449 4316080 10069275 10571527
$$ packed form
38179E66286k507267r35751J557116j42717k387703L34938M527609L259226j559473
38170B712264k430177R76806K164426p30631l167507k896994j713602M04565M250582
38161d30268N813809J019357n080404l849209K835395M841608K60678k236745
38153C174221Q40301K245653j930762m832209j461240K210529J35161l276746
38145b895092j715405J943425J748811p40245o63223Q11231o9767j404307P17930
38136b266642L972794L343807k9039j269789m39535j147759k677666j288456J935439
38127A33154K091373j121641k880583j223675O52939N38089J56497J187490K699021
38118B232664L125707J705673j387718l692640j574237L906631N753195N02252
$$ plain form
38110 10571527 5583336 2838855 6744588 12056545 12527433 10092408 10196842 12535671
38102 12535671 12480694 8712263 3743777 -824482 -4278893 -4309563 -60173 4232129 4126645
38093 4126645 1695211 1691471 3107342 1434508 -2027239 -1239605 3792289 5622228 939401
38084 939401 -4288068 -4862984 -4336457 -7770792 -12474612 -12298008 -7067861 -1307591 3488797
38075 3488797 8595296 11863402 8983369 1240718 -4308926 -4034795 -1907578 -2309318
38067 -2309318 -3365714 -853951 4536217 7870882 6412934 1940573 -2719254 -6239114
38059 -6239114 -7616529 -5493300 -404613 3856876 3312541 -1677739 -6323701 -6411009 -2557754
38050 -2557754 1254054 2577297 2490624 2896559 3774320 4069368 3755724 3376938 2482107
$$ packed form
38110A0571527m988191k744481L905733N311957M70888k435025J04434K338829
38102A2535671n4977l768431m968486m568259l454411l0670M249390M292302j05484
38093D126645k431434l740J415871j672834l461747P87634N031894J829939m682827
38084I39401n227469n74916N26527l434335m703820J76604N230147N760270M796388
38075C488797N106499L268106k880033p742651n549644K74131K127217m01740
38067b309318j056396K511763N390168L334665j457948m472361m659827l519860
38059f239114j377415K123229N088687M261489n44335m990280m645962q7308L853255
38050b557754L811808J323243q6673M05935Q77761K95048l13644l78786q94831
$$ plain form
38041 2482107 428336 -1663455 -1737113 349721 2655732 4038854 5166819 6097333 5191881
38032 5191881 1873322 -1498395 -2470681 -1788242 -1714394 -2271430 -1719990 -79296 748035
38023 748035 367414 426781 1133472 308805 -2539262 -3975630 -958612 4463386 7567793
38014 7567793 6960911 5275559 4406161 3263995 916723 -858151 104817 2972340 4528222
38005 4528222 2758962 -995041 -3175312 -1168922 3902641 7564247 6332497 1800836
37997 1800836 -1074768 9797 2391008 2875245 2039801 2234748 3501863 4477281 6014648
37988 6014648 10055868 14731645 14533959 7338105 -1440644 -4377260 -441215 4517809
37980 4517809 5067852 1695501 -1139718 -593561 1811712 2359681 -428325 -3606551 -2703126
$$ packed form
38041B482107k053771k091791p3658K086834K306011J383122J127965R30514r05452
38032E191881l318559l371717r72286O82439P3848n57036N51440J640694Q27331
38023G48035l80621N9367P06691q24667k848067j436368L017018N421998L104407
38014G567793o06882j685352q69398j142166k347272j774874R62968K867523J555882
38005D528222j769260l754003k180271K006390N071563L661606j231750m531661
37997A800836k875604J084565K381211M84237q35444J94947J267115R75418J537367
37988F014648M041220M675777j97686p195854q778749k936616L936045M959024
37980D517809N50043l372351k835219N46157K405273N47969k788006l178226R03425
$$ plain form
37971 -2703126 2708434 7437793 6134771 -241573 -5155814 -3672214 2778311 8981283
37963 8981283 11353602 9885541 6358648 2375340 -1122236 -3432487 -3636795 -1144069
37955 -1144069 2582398 3847239 554389 -3878143 -3457290 2459694 7399323 6167483
37947 6167483 1826048 568557 2153992 852018 -4594910 -7931898 -4330355 2411169
37939 2411169 5053089 2170926 -1618176 -2871108 -2750082 -3494602 -4841725 -5032037 -3606932
37930 -3606932 -2083002 -2208083 -3757113 -4238210 -1638620 2527512 4502041 3136140
37922 3136140 1495197 2515799 5151765 6479559 5594851 3441364 949732 -171634
37914 -171634 2762070 9233415 13165007 9359712 1355820 -2112295 1564825 6275300
$$ packed form
37971b703126N411560M729359j303022o376344m914241J483600O450525O202972
37963H981283K372319j468061l526893l983308l497576k310251k04308K492726
37955a144069L726467J264841l292850m432532M20853N916984M939629j231840
37947F167483m341435j257491J585435j301974n446928l336988L601543O741524
37939B411169K641920k882163l789102j252932J21026p44520j347123j90312J425105
37930c606932J523930j25081j549030m81097K599590M166132J974529j365901
37922C136140j640943J020602K635966J327794q84708k153487k491632j121366
37914a71634K933704O471345L931592l805295q003892l468115L677120M710475
$$ plain form
37906 6275300 6638922 4444111 3501645 3505755 2749078 2639478 4962149 7671624 8014362
37897 8014362 7519077 9099745 10932831 8478873 2013980 -2986846 -3378965 -1620951
37889 -1620951 -614270 282842 2360812 4500346 5298052 5371084 5389692 4274706 1439512
37880 1439512 -1357604 -2419510 -2380124 -2241870 -1356159 539309 1579557 708021 287496
37871 287496 2679738 5904239 6263253 4207589 3691803 5923381 7659008 6463306 4331455
37862 4331455 4724928 8330816 12782258 14654140 11324482 3267083 -4915491 -8274451
37854 -8274451 -7009299 -5567964 -5868714 -5112937 -1655529 1279185 720102 -918898 116461
37845 116461 2450477 1753312 -2278126 -5802819 -6789183 -6394658 -4783713 -595431 4734443
$$ packed form
37906F275300L63622k194811r42466M110p56677j09600K322671K709475L42738
37897H014362m95285J580668J833086k453958o464893n000826l92119J758014
37889a620951J006681Q97112K077970K139534P97706P3032J8608j114986k835194
37880A439512k797116j061906L9386J38254Q85711J895468J040248q71536m20525
37871B87496K392242L224501L59014k055664n15786K231578J735627j195702k131851
37862D331455L93473L605888M451442J871882l329658q057399q182574l358960
37854h274451J265152J441335l00750P55777L457408K934714n59083j639000J035359
37845A16461K334016o97165m031438l524693r86364L94525J610945M188282N329874
$$ plain form
37836 4734443 6911694 4677855 1796576 1455598 2489710 3071060 4118786 6204236
37828 6204236 6635940 3217153 -1687215 -4341890 -4653272 -4450498 -3071923 876887 4806641
37819 4806641 4196132 -673350 -4556037 -4426652 -2600518 -1593018 -237495 2759367
37811 2759367 5157877 4536022 2912463 4268291 8548797 11663248 11238456 9048070
37803 9048070 7154281 4860814 1234161 -1904916 -2247719 -879443 -795688 -1942786 -1212079
37794 -1212079 1842546 3021426 -309927 -4174449 -3159795 1205510 2229645 -1968214
37786 -1968214 -5527795 -3490266 1373542 3363519 1763679 168625 423043 1273109
37778 1273109 1721565 2047642 2068247 1383284 916531 1739953 3006140 3263991 2819642
$$ packed form
37836D734443K177251k233839k881279l40978J034112N81350J047726K085450
37828F204236M31704l418787m904368k654675l11382K02774J378575L948810L929754
37819D806641o10509m869482l882687J29385J826134J007500J355523K996862
37811B759367K398510o21855j623559J355828M280506L114451m24792k190386
37803I048070j893789k293467l626653l139077l42803J368276Q3755j147098P30707
37794a212079L054625J178880l331353l864522J014654M365305J024135m197859
37786a968214l559581K037529M863808J989977j599840j595054K54418Q50066
37778A273109M48456L26077K0605o84963m66753Q23422J266187K57851m44349
$$ plain form
37769 2819642 2569691 1979871 855517 1316258 4648443 7860252 7316377 4403135 3127551
37760 3127551 3227462 864400 -4239275 -7965529 -8511686 -8251817 -7918252 -5019953 -133507
37751 -133507 1390307 -2481736 -5977356 -3446073 2529674 5559485 4388904 2469383
37743 2469383 1327886 -409655 -2763564 -3732142 -2407002 328193 3167294 4012584
37735 4012584 435910 -6315615 -10115475 -6613237 802138 5518578 6073040 5650876
37727 5650876 5372834 3574987 740545 -581000 -772688 -2656222 -5504735 -4926875 -27043
37718 -27043 4277400 4035073 1189572 -207740 1038378 3893664 6939637 7655218 3689528
37709 3689528 -2692265 -5001508 -299971 6371886 8256012 4816023 333657 -2723598
$$ packed form
37769B819642k49951n89820j124354M60741L332185L211809n43875k913242j275584
37760C127551R9911k363062n103675l726254n46157K59869L33565K898299M886446
37751a33507J523814l872043l495620K531283N975747L029811j170581j919521
37743B469383j141497j737541k353909r68578J325140K735195K839101Q45290
37735D012584l576674o751525l799860L502238P415375M716440N54462m22164
37727E650876k78042j797847k834442j321545j91688j883534k848513N77860M899832
37718b7043M304443k42327k845501j397312J246118K855286L045973P15581l965690
37709C689528o381793k309243M701537O671857J884126l439989m482366l057255
$$ plain form
37701 -2723598 -5018132 -6679838 -6379530 -3824619 -359901 2685715 4243001 3092167
37693 3092167 -415682 -3280392 -3248858 -2445675 -4472506 -8305516 -8762729 -3815549 1972926
37684 1972926 3182455 262491 -1846241 -388830 2451247 3148718 898889 -2577528
37676 -2577528 -5664560 -7912704 -9093981 -8758228 -7217532 -5982141 -6223469 -7034261 -6039357
37667 -6039357 -1912287 3986654 8311209 7962393 2565658 -4318764 -7255315 -3830353
37659 -3830353 2597457 6469347 6179165 4826169 4799250 4287119 678781 -4664692 -7470410
37650 -7470410 -5564981 -687109 4323991 7990624 9688256 8916665 6335437 4210269
37642 4210269 4244252 5322389 4705577 1563360 -1755285 -2418884 -263596 2390020 3402177
$$ packed form
37701b723598k294534j661706L00308K554911L464718L045616J557286j150834
37693C092167l507849k864710L1534Q03183k026831l833010m57213M947180N788475
37684A972926J209529k919964k108732J457411K840077O97471k249829l476417
37676b577528l087032k248144j181277L35753J540696J235391k41328q10792R94904
37667f039357M127070N898941M324555l48816n396735o884422k936551L424962
37659c830353O427810L871890k90182j352996k6919n12131l608338n343473k805718
37650g470410J905429M877872N011100L666633J697632p71591k581228k125168
37642D210269L3983J078137o16812l142217l318645o63599K155288K653616J012157
$$ plain form
37633 3402177 2448714 549108 -898731 -899612 150510 614670 143492 1250985 5745639
37624 5745639 9949048 7587288 -1074410 -7397297 -5077082 1121871 2312264 -1732364
37616 -1732364 -3361164 469292 4210968 3771858 3030920 6187571 9679859 7674798
37608 7674798 1770499 -1218859 754246 3412607 3987096 4519292 6340703 6662178 3208897
37599 3208897 -1543789 -3761518 -3547668 -4065392 -6645060 -9127032 -8669650 -4729958 452376
37590 452376 3478327 2484225 -957028 -3148436 -2072810 784463 2852558 3535329 3815188
37581 3815188 3895607 3012751 1352498 334195 401403 -69630 -2537604 -5755605 -6802620
37572 -6802620 -4541844 -870356 1714327 2693112 3104204 3552014 3662862 3018087 1652750
$$ packed form
37633C402177r53463j899606j447839q81J050122M64160m71178J107493M494654
37624E745639M203409k361760q661698o322887K320215O198953J190393m044628
37616a732364j628800L830456L741676m39110p40938L156651L492288k005061
37608G674798n904299k989358J973105K658361N74489N32196J821411L21475l453281
37599C208897m752686k217729K13850n17724k579668k481972M57382L939692N182334
37590D52376L025951r94102l441253k191408J075626K857273K068095O82771K79859
37581C815188Q0419q82856j660253j018303O7208m71033k467974l218001j047015
37572f802620K260776L671488K584683R78785M11092M47810J10848o44775j365337
$$ plain form
37563 1652750 -102666 -1498344 -1519454 -118157 1099681 458189 -1905165 -4778908 -7732907
37554 -7732907 -10555733 -11538358 -8890374 -4128628 -1423112 -2480319 -4307097 -3537393
37546 -3537393 -1048141 -357418 -2738093 -5871662 -6694008 -4136119 326229 3699587
37538 3699587 3830348 1766795 817033 2329838 3804846 2473269 -838859 -3237583
37530 -3237583 -3729372 -3478582 -3225874 -2898100 -3073094 -4348635 -5668916 -5649641 -5089329
37521 -5089329 -5495189 -5525303 -2312610 3175381 5748060 2710720 -2052920 -3244807 -1113925
37512 -1113925 -61346 -1569954 -2332987 49858 2850531 1869287 -2468783 -5495813
37504 -5495813 -4714321 -3260315 -5621352 -11594953 -16624086 -17417974 -14828586 -11090043
$$ packed form
37563A652750j755416j395678k1110J401297J217838o41492k363354k873743k953999
37554g732907k822826r82625K647984M761746K705516j057207j826778P69704
37546c537393K489252O90723k380675l133569q22346K557889M462348L373358
37538C699587J30761k063553r49762J512805J475008j331577l312128k398724
37530c237583m91789K50790K52708L27774j74994j275541j320281J9275N60312
37521e089329m05860l0114L212693N487991K572679l037340m763640j191887K130882
37512a113925J052579j508608p63033K382845K800673r81244m338070l027030
37504e495813P81492J454006k361037n973601n029133p93888K589388L738543
$$ plain form
37496 -11090043 -6926330 -2632637 296457 795411 273089 1047888 3421720 5793126
37488 5793126 6783475 5826011 2935757 -233594 -517816 3041248 6683048 6049898 2082645
37479 2082645 -464178 39525 524846 -1022135 -2427442 -1547964 124406 466565 251428
37470 251428 917507 1401627 293356 -918571 -109035 1495139 1070312 -1119237 -2408537
37461 -2408537 -2446816 -3261674 -4539199 -3064665 1868032 6266265 6776622 5192317 5138654
37452 5138654 6783764 7813712 7785917 8124149 8748704 8066899 6095978 4550378 3746620
37443 3746620 2426250 958867 1367061 3151184 2627556 -1455128 -4766265 -2941314
37435 -2941314 1974355 4237632 2254154 -103511 353876 2436591 3602275 3351347
$$ packed form
37496a1090043M163713M293693K929094M98954n22322P74799K373832K371406
37488E793126R90349r57464k890254l169351k84222L559064L641800o33150l967253
37479B082645k546823N03703M85321j546981j405307Q79478J672370L42159k15137
37470B51428O66079M84120j108271j211927Q09536J604174m24827k189549j289300
37461b408537l8279q14858j277525J474534M932697M398233N10357j584305n3663
37452E138654J645110J029948k7795L38232O24555o81805j970921j545600q03758
37443C746620j320370j467383M08194J784123n23628m082684l311137J824951
37435b941314M915669K263277j983478k357665M57387K082715J165684k50928
$$ plain form
37427 3351347 2298161 371670 -2510544 -5522481 -7635692 -8030309 -5785984 -1134987
37419 -1134987 2987468 3278697 442620 -1440565 -415171 1564424 2950977 4751460
37411 4751460 6844994 6534439 3503603 2000573 4335202 6160021 3127327 -1109743
37403 -1109743 261089 6284914 8954449 4710558 -1230480 -3186222 -1818551 -603545
37395 -603545 -599706 -1464024 -3511040 -5798640 -5511501 -2050194 1182030 1616294 1157862
37386 1157862 2258645 3395515 1874780 -1359905 -3523496 -4716910 -6789016 -8611636
37378 -8611636 -6814808 -1317919 3686645 5206446 4919569 5876336 8043370 8858601 7025688
37369 7025688 4249879 3374336 5309722 7737261 7161956 2907790 -1322718 -1042754 3795626
$$ packed form
37427C351347j053186j926491k882214l011937k113211l94617K244325M650997
37419a134987M122455K91229k836077j883185J025394J979595J386553J800483
37411D751460K093534l10555l030836j503030K334629J824819l032694m237070
37403a109743J370832O023825K669535m243891n941038j955742J367671J215006
37395f03545L839q64318k047016k287600K87139L461307L232224M34264m58432
37386A157862J100783J136870j520735l234685k163591j193414k072106j822620
37378h611636J796828N496889N004564J519801k86877R56767K167034Q15231j832913
37369G025688k775809q75543J935386K427539n75305m254166m230508K79964M838380
$$ plain form
37360 3795626 8320124 7945707 3219320 -1121177 -1223498 2601065 7177146 9571073
37352 9571073 8486028 4280961 -487603 -1441703 3661242 10646453 11737335 4758348
37344 4758348 -3197239 -4424619 -578238 458747 -3708930 -7195602 -5508817 -2133682
37336 -2133682 -2454026 -5716755 -7319797 -6106643 -4720968 -4221688 -2909244 -406090
37328 -406090 890340 -746095 -3993628 -6261332 -6036481 -3188697 1168737 4546147
37320 4546147 4351375 199843 -5585138 -9926171 -11046597 -9108998 -5758621 -2775531
37312 -2775531 -436022 2388687 5900451 7993214 6326589 1292831 -4093123 -6954164
37304 -6954164 -6642406 -4869058 -4484844 -7151116 -11235560 -12926917 -10420943 -5995944
$$ packed form
37360C795626M524498l74417m726387m340497j02321L824563M576081K393927
37352I571073j085045m205067m768564r54100N102945O985211J090882o978987
37344D758348p955587j227380L846381J036985m167677l486672J686785L375135
37336b133682l20344l262729j603042J213154J385675M99280J312444K503154
37328d06090J296430j636435l247533k267704K24851K847784M357434L377410
37320D546147j94772m151532n784981m341033j120426J937599L350377K983090
37312b775531K339509K824709L511764K092763j666625n033758n385954k861041
37304f954164L11758J773348L84214k666272m084444j691357K505974M424999
$$ plain form
37296 -5995944 -2944839 -1797300 -1036477 -178648 -12682 -519543 -765405 -756611 -1547473
37287 -1547473 -3310966 -4728676 -4612266 -3258581 -2109582 -2480595 -4137520 -4824446 -2381447
37278 -2381447 2004251 4313354 2732925 350819 820210 3061791 3143402 363382 -1985446
37269 -1985446 -1952472 -1657000 -3531002 -6404280 -7076692 -4360688 -70133 3224048 4285503
37260 4285503 3440479 1531875 -1143461 -4636248 -7934925 -8638665 -5245171 424619
37252 424619 4187691 3052577 -2609350 -9807588 -14831548 -15039247 -10488609 -4286056
37244 -4286056 -392613 -479301 -2984867 -5006668 -4794240 -2750399 -442348 1376198 3436295
37235 3436295 6116879 7859613 7200415 5763219 6389524 8118662 6693232 1538780
$$ packed form
37296e995944L051105J147539P60823Q57829J65966n06861k45862Q794p90862
37287a547473j763493j417710J16410J353685J148999l71013j656925o86926K442999
37278b381447M385698K309103j580429k382106M69391K241581Q1611k780020k348828
37269a985446L2974K95472j874002k873278o72412K716004M290555L294181J061455
37260D285503q45024j908604k675336l492787l298677p03740L393494N669790
37252D24619L763072j135114n661927p198238n023960k07699M550638O202553
37244d286056L893443q6688k505566k021801K12428K043841K308051J818546K060097
37235C436295K680584J742734o59198j437196O26305J729138j425430n154452
$$ plain form
37227 1538780 -1656236 1598325 7639880 9147519 4603691 -964032 -3527232 -3911079
37219 -3911079 -4215328 -4494312 -3947992 -2540667 -597371 1240135 1658343 258824 -1076031
37210 -1076031 -696999 -74545 -1278471 -2695862 -1000482 3224837 5954733 5664641 4499184
37201 4499184 3363823 657052 -3200394 -4922324 -3753191 -3007770 -4137754 -4150335 -1825918
37192 -1825918 -1480096 -6159294 -11189822 -9898062 -3183380 2005217 2169245 -45206
37184 -45206 -1791679 -3182899 -4106096 -2931307 45808 1842369 1279754 915766 2592961
37175 2592961 4188286 3225386 1025013 277806 609709 109521 -177003 2352951 6055730
37166 6055730 5432931 -829792 -6419250 -5402512 -570544 750550 -2601875 -4530590
$$ packed form
37227A538780l195016L254561O041555J507639m543828n567723k563200l83847
37219c911079l04249k78984N46320J407325J943296J837506M18208j399519j334855
37210a076031L79032O22454j203926j417391J695380M225319K729896k90092j165457
37201D499184j135361k706771l857446j721930J169133P45421j129984j2581K324417
37192a825918L45822m679198n030528J291760O714682N188597J64028k214451
37184d5206j746473j391220r23197J174789K977115J796561n62615l63988J677195
37175B592961J595325r62900k200373p47207L31903n00188k86524K529954L702779
37166F055730o22799o262723n589458J016738M831968J321094l352425j928715
$$ plain form
37158 -4530590 -1148940 4272170 7347614 8320968 8987162 8614089 6812100 6408602 8661590
37149 8661590 8924120 2828950 -5349325 -6832314 -185979 6997359 8492930 5726448
37141 5726448 2723948 496341 -1423786 -2566279 -3120250 -4310173 -5399451 -4059771
37133 -4059771 -1252874 -1377302 -5360220 -8052336 -5539719 -1066942 -59719 -2533845
37125 -2533845 -4387743 -3799941 -2403759 -1579294 -932131 338544 2756613 6177896 8704635
37116 8704635 7889291 4315463 1491177 855394 68463 -2091143 -3071202 -1330344 342084
37107 342084 -301695 -824201 949142 1776956 -1783704 -6101454 -4772145 1360525 4861751
37098 4861751 2201767 -2201832 -3238433 -1437544 -500426 -2150540 -4996559 -6214741
$$ packed form
37158d530590L381650N421110L075444R73354O66194l73073j801989m03498K252988
37149H661590K62530o095170q178275j482989O646335P183338J495571k766482
37141E726448l002500k227607j920127j142493n53971j189923j089278J339680
37133d059771K806897j24428l982918k692116K512617M472777J007223k474126
37125b533845j853898N87802J396182Q24465O47163J270675K418069L421283K526739
37116H704635q15344l573828k824286o35783p86931k159606r80059J740858J672428
37107C42084o43779n22506J773343Q27814l560660m317750J329309O132670L501226
37098D861751k659984m403599j036601J800889R37118j650114k846019j218182
$$ plain form
37090 -6214741 -3732620 1477059 5687601 6814560 7065026 8733172 9630190 6633642
37082 6633642 1857158 253907 2038836 2895791 1541205 1298599 3157514 2982476 -1830998
37073 -1830998 -7325140 -7719277 -2486413 3670450 6019382 3555843 -711579 -2544336
37065 -2544336 -1134006 -441377 -3500900 -6895181 -5097881 783461 4252970 3394056
37057 3394056 2996870 5322391 5984135 2488540 -60212 2774369 6541152 4798471
37049 4798471 35499 -164598 4407499 6308608 2543828 -1117405 53254 2698457
37041 2698457 1933756 -555535 643 3409929 5410281 4977317 5443185 8258571 10295096
37032 10295096 8750352 5103435 2215873 516389 -435199 649500 4183993 6316359
$$ packed form
37090f214741K482121N209679M210542J126959K50466J668146Q97018k996548
37082F633642m776484j603251J784929Q56955j354586k42606J858915j75038m813474
37073a830998n494142l94137N232864O156863K348932k463539m267422j832757
37065b544336J410330O92629l059523l394281J797300N881342L469509q58914
37057C394056l97186K325521O61744l495595k548752K834581L766783j742681
37049D798471m762972k00097M572097J901109l764780l661233J170659K645203
37041B698457p64701k489291N56178L409286K000352m32964M65868K815386K036525
37032A0295096j544744l646917k887562j699484r51588J084699L534493K132366
$$ plain form
37024 6316359 2738908 -4307139 -7492686 -3974730 891644 1488689 -742064 -1339105
37016 -1339105 -473572 -1721748 -5247303 -7309198 -6045065 -3372491 -1206156 237568
37008 237568 309949 -1893695 -4771926 -5370839 -3785505 -2617587 -1597918 2719293 10425754
36999 10425754 15892514 14530829 8493990 3037661 220555 -1093617 -1772976 -2030031
36991 -2030031 -2426285 -2497379 -220911 4591261 8314496 7719791 4465545 2502211 2505720
36982 2505720 1998028 -158157 -2709923 -4869665 -6969042 -8319293 -7501125 -5260194
36974 -5260194 -4302327 -5179053 -4783254 -627611 4968503 7127925 4552137 1427004 2208808
36965 2208808 5715269 6432348 1833751 -4015109 -5785874 -3694212 -2016032 -2124364
$$ packed form
37024F316359l577451p046047l185547L517956M866374N97045k230753n97041
37016a339105Q65533j248176l525555k061895J264133K672574K166335J443724
37008B37568P2381k203644k878231n98913J585334J167918J019669M317211P706461
36999A0425754N466760j361685o036839n456329k817106j314172o79359k57055
36991b030031l96254p1094K276468M812172L723235n94705l254246j963334L509
36982B505720n07692k156185k551766k159742k099377j350251Q18168K240931
36974e260194R57867q76726L95799M155643N596114K159422k575788l125133P81804
36965B208808L506461P17079m598597n848860j770765K091662J678180j08332
$$ plain form
36957 -2124364 -1129394 2281370 4961180 4087257 1322099 -301112 -852333 -2037172 -3523894
36948 -3523894 -3921731 -3927001 -5306386 -7525394 -8231779 -6715736 -4456510 -2521556 -709180
36939 -709180 788291 942959 -588138 -2846331 -4481375 -4392068 -2145147 1094006 2983924
36930 2983924 2796314 2748910 4783795 7057495 6002349 1459197 -2697085 -3305117 -1217994
36921 -1217994 714370 1203580 1040086 1112403 1140112 441448 -628787 -758308 360471
36912 360471 949523 -589551 -2820970 -2874448 -1026269 -857823 -3699493 -5880969 -3787404
36903 -3787404 809202 3415326 2945375 1805246 1142475 -68052 -1453481 -802212 1763792
36894 1763792 2546179 -854497 -5677053 -7194834 -4511383 -1086880 57353 -298975
$$ packed form
36957b124364R94970L410764K679810q73923k765158j623211n51221j184839j486722
36948c523894l97837n270j379385k219008p06385J516043K259226J934954J812376
36939g09180J497471J54668j531097k258193j635044Q9307K246921L239153J889918
36930B983924j87610m7404K034885K273700j055146m543152m156282o08032K087123
36921a217994J932364M89210j63494P2317K7709o98664j070235j29521J118779
36912C60471N89052j539074k231419n3478J848179J68446k841670k181476K093565
36903c787404M596606K606124m69951j140129o62771j210527j385429O51269K566004
36894A763792P82387l400676m822556j517781K683451L424503J144233l56328
$$ plain form
36886 -298975 453904 2807897 4681261 4820067 4885413 6777260 9027380 8197683 3792450
36877 3792450 -729870 -2496245 -2253658 -1681668 -368125 2302693 4329547 3037970
36869 3037970 -1117453 -5128902 -7149808 -7494822 -6624507 -4489415 -1812547 -168115
36861 -168115 -584880 -2977352 -6363436 -8817619 -8579982 -6577859 -6201878 -8650178 -10208209
36852 -10208209 -6783796 186574 5414692 6520850 5843273 5759619 5689392 4494798 2881258
36843 2881258 1922500 1124109 -585193 -2995411 -4766079 -4874052 -3402735 -1201384 1059983
36834 1059983 3329011 5174645 4996280 2124345 -441199 1508735 7077075 9872197
36826 9872197 6278439 740488 -646113 1248900 1041833 -2197057 -3989696 -2087297
$$ packed form
36886b98975P52879K353993J873364J38806O5346J891847K250120q29697m405233
36877C792450m522320j766375K42587N71990J313543K670818K026854j291577
36869C037970m155423m011449k020906l45014Q70315K135092K676868J644432
36861a68115m16765k392472l386084k454183K37637K002123L75981k448300j558031
36852a0208209L424413O970370N228118J106158o77577q3654p0227j194594j613540
36843B881258r58758p98391j709302k410218j770668j07973J471317K201351K261367
36834A059983K269028J845634j78365k871935k565544J949934N568340K795122
36826I872197l593758n537951j386601J895013k07067l238890j792639J902399
$$ plain form
36818 -2087297 213268 -576311 -3558832 -5682327 -5636931 -4351402 -3586792 -4367603 -5228095
36809 -5228095 -2907720 3060478 8051107 7657375 3598383 771547 494047 1202021 3589295
36800 3589295 8902425 13442096 11843273 5791144 2323053 2998738 2529703 -662865
36792 -662865 -1451086 1444122 1160172 -5690139 -11454483 -8627006 -1705018 362103 -1929599
36783 -1929599 -1540710 2019873 2476977 -1468021 -3463794 409077 6314549 9066515
36775 9066515 7969095 4838433 1414307 176333 3127134 8321401 11403722 11334268
36767 11334268 10774746 10570313 8372960 3506557 -1308303 -4265656 -6363695 -7857348
36759 -7857348 -7016424 -3815514 -882656 610484 2056181 3233991 1593072 -2514401
$$ packed form
36818b087297K300565p89579k982521k123495M5396J285529P64610p80811q60492
36809e228095K320375N968198M990629l93732m058992k826836k77500P07974K387274
36800C589295N313130M539671j598823o052129l468091O75685m69035l192568
36792f62865p88221K895208k83950o850311n764344K827477O921988K067121k291702
36783a929599L88889L560583M57104l944998j995773L872871N905472K751966
36775I066515j097420l130662l424126j237974K950801N194267L082321o9454
36767A1334268n59522k04433k197353m866403m814860k957353k098039j493653
36759g857348Q40924L200910K932858J493140J445697J177810j640919m107473
$$ plain form
36751 -2514401 -4654268 -2864869 -705155 -697470 357966 5143810 9310061 7073765 670369
36742 670369 -2001695 1793356 6886361 8358234 7147625 6387971 6670474 6938738 6803996
36733 6803996 5952175 3714369 992013 461252 3076276 6139548 6574017 4558193 2170924
36724 2170924 4569 -2496909 -4203291 -2571275 2763242 8595647 11284396 10155859
36716 10155859 7098035 3923744 1284832 -577578 -1627826 -2673532 -4757628 -7259162
36708 -7259162 -7831729 -5384387 -2143167 -989370 -1213887 668691 5264921 8086101
36700 8086101 5156511 -862656 -3300019 14880 4101566 3720603 -56425 -2492690
36692 -2492690 -2216825 -2061950 -3380568 -3402524 164583 4698053 5572424 2346160 -731010
$$ packed form
36751b514401k139867J789399K159714P685J055436M785844M166251k236296o403396
36742F70369k672064L795051N093005J471873j210609p59654K82503K68264j34742
36733F803996q51821k237806k722356n30761K615024L063272M34469k015824k387269
36724B170924k166355k501478j706382J632016N334517N832405K688749j128537
36716A0155859l057824l174291k638912j862410j050248j045706k084096k501534
36708g259162n72567K447342L241220J153797k24517J882578M596230K821180
36700H086101k929590o019167k437363L314899M086686l80963l777028k436265
36692b492690K75865J54875j318618k1956L567107M533470Q74371l226264l077170
$$ plain form
36683 -731010 -395320 1904215 2858492 1929532 1385326 2578093 4067618 3647842 946766
36674 946766 -2539467 -5148026 -6132877 -5673155 -4640270 -4120784 -4433516 -4715265 -4085345
$$ packed form
36683g31010L35690K299535R54277r28960n44206J192767J489525m19776k701076
36674I46766l486233k608559r84851M59722J032885N19486l12732k81749O29920
$$ [...]
##END NTUPLES=NMR SPECTRUM
##END=
