##TITLE=31Pdec_LR-0154-OMe-B-IPS
 D2O, 64 sc
 14.3.2023
##JCAMPDX= 6.0         $$ Bruker NMR JCAMP-DX V2.0
##DATA TYPE= NMR SPECTRUM
##DATA CLASS= NTUPLES
##ORIGIN= UXNMR, Bruker Analytische Messtechnik GmbH
##OWNER= root
$$ XWIN-NMR		Version 3.5
$$ Tue Mar 14 14:30:03 2023 Russian Standard Time (UT+4h)  she@DPX200
##.OBSERVE FREQUENCY= 81.013821
##.OBSERVE NUCLEUS= ^31P
##.ACQUISITION MODE= SIMULTANEOUS
##.ACQUISITION SCHEME= undefined
##.AVERAGES= 64
##.DIGITISER RES= 16
##SPECTROMETER/DATA SYSTEM= spect
##.PULSE SEQUENCE= zgpg30
##.SOLVENT NAME= D2O
##.SHIFT REFERENCE= (INTERNAL, D2O, 0, 248.564)
##AUDIT TRAIL= $$ (NUMBER, WHEN, WHO, WHERE, WHAT)
$$ ##TITLE= Audit trail, XWIN-NMR		Version 3.5
$$ ##JCAMPDX= 5.01
$$ ##ORIGIN= Bruker BioSpin GmbH
$$ ##OWNER= she
$$ F:/spectra/data/she/nmr/P31/1/pdata/1/auditp.txt
$$ ##AUDIT TRAIL=  $$ (NUMBER, WHEN, WHO, WHERE, WHAT)
(   1,<2023-03-14 14:28:53.64 +0400>,<she>,<DPX200>,
      <continue with go, POWCHK disabled, PULCHK disabled
       configuration hash MD5:
       00 E9 B6 7A A2 85 ED C7 34 08 36 98 17 FE 4E 26
       data hash MD5: 32K
       AC B8 2D 0B BC 54 CC AB 92 D4 D1 26 82 62 B8 A2>)
(   2,<2023-03-14 14:28:56.46 +0400>,<she>,<DPX200>,
      <Start of raw data processing
       efp BC_mod = 2 LB = 1 FT_mod = 6 PKNL = 1 PHC0 = -11025.5 PHC1 = 171.4102 SI = 64K 
       data hash MD5: 64K
       7D 98 0C 9D 09 C5 A6 60 F9 28 6D D0 E4 05 36 F4>)
(   3,<2023-03-14 14:29:09.73 +0400>,<she>,<DPX200>,
      <pk PHC0 = -3.380125 PHC1 = 0 
       data hash MD5: 64K
       BD 65 2A BB 9B 6F 19 CA 48 BC 71 CA CA 08 6E 94>)
(   4,<2023-03-14 14:29:15.21 +0400>,<she>,<DPX200>,
      <abs ABSG = 5 
       data hash MD5: 64K
       BB C9 98 0D 43 BE 0F BF 0B FD DB 12 0F 3A 90 6E>)
$$ ##END=
$$ 
$$ hash MD5
$$ 87 A1 37 27 ED 3F E1 AA 90 7B 7C F5 ED 69 77 B1
##$RELAX= 
##$RELAX= 
##$RELAX= 
##$RELAX= 
##$RELAX= 
##$RELAX= 
##$RELAX= 
##$RELAX= 
##$RELAX= 
$$ Bruker specific parameters
$$ --------------------------
##$DU= <F:/spectra>
##$EXPNO= 1
##$NAME= <P31>
##$PROCNO= 1
##$TYPE= <nmr>
##$USER= <she>
##$AMP= (0..31)
100 100 100 100 100 100 100 100 100 100 100 100 100 100 100 100 100 100 
100 100 100 100 100 100 100 100 100 100 100 100 100 100 
##$AQSEQ= 0
##$AQ_mod= 1
##$AUNM= <au_zg>
##$AUTOPOS= <>
##$BF1= 81.014009
##$BF2= 200.13
##$BF3= 200.13
##$BF4= 200.13
##$BF5= 200.13
##$BF6= 200.13
##$BF7= 200.13
##$BF8= 200.13
##$BYTORDA= 1
##$CFDGTYP= 0
##$CFRGTYP= 5
##$CHEMSTR= <none>
##$CNST= (0..31)
1 1 145 1 1 1 1 1 1 1 1 1 1 1 1 1 1 1 1 1 1 1 1 1 1 1 1 1 1 1 1 1 
##$CPDPRG= <waltz16>
##$CPDPRG1= <>
##$CPDPRG2= <waltz16>
##$CPDPRG3= <>
##$CPDPRG4= <mlev>
##$CPDPRG5= <mlev>
##$CPDPRG6= <mlev>
##$CPDPRG7= <mlev>
##$CPDPRG8= <mlev>
##$CPDPRGB= <>
##$CPDPRGT= <>
##$D= (0..31)
0 1 0 0 0 0 0 0 0 0 0 0.03 2e-05 3e-06 0 0 0 0 0 0 0 0 0 0 0 0 0 0 0 0 
0 0 
##$DATE= 1678789645
##$DBL= (0..7)
120 120 120 11 120 120 24 19 
##$DBP= (0..7)
150 150 150 150 150 150 150 150 
##$DBP07= 0
##$DBPNAM0= <>
##$DBPNAM1= <>
$$ [...]
##$SUBNAM3= <"">
##$SUBNAM4= <"">
##$SUBNAM5= <"">
##$SUBNAM6= <"">
##$SUBNAM7= <"">
##$SUBNAM8= <"">
##$SUBNAM9= <"">
##$SW= 501.771253377433
##$SWIBOX= (0..15)
0 1 3 0 0 0 0 0 0 0 0 0 0 0 0 0 
##$SW_h= 40650.406504065
##$TD= 32768
##$TD0= 1
##$TE= 0
##$TE2= 300
##$TE3= 300
##$TEG= 300
##$TL= (0..7)
0 120 53 12 22 120 120 120 
##$TP= (0..7)
150 150 150 150 150 150 150 150 
##$TP07= 0
##$TPNAME0= <>
##$TPNAME1= <>
##$TPNAME2= <>
##$TPNAME3= <>
##$TPNAME4= <>
##$TPNAME5= <>
##$TPNAME6= <>
##$TPNAME7= <>
##$TPOAL= (0..7)
0.5 0.5 0.5 0.5 0.5 0.5 0.5 0.5 
##$TPOFFS= (0..7)
0 0 0 0 0 0 0 0 
##$TUNHIN= 0
##$TUNHOUT= 0
##$TUNXOUT= 0
##$USERA1= <user>
##$USERA2= <user>
##$USERA3= <user>
##$USERA4= <user>
##$USERA5= <user>
##$V9= 5
##$VALIST= <valist>
##$VCLIST= <CCCCCCCCCCCCCCC>
##$VD= 0
##$VDLIST= <DDDDDDDDDDDDDDD>
##$VPLIST= <PPPPPPPPPPPPPPP>
##$VTLIST= <TTTTTTTTTTTTTTT>
##$WBST= 1024
##$WBSW= 4
##$XGAIN= (0..3)
0 0 0 0 
##$XL= 0
##$YL= 0
##$YMAX_a= 2927
##$YMIN_a= -3317
##$ZGOPTNS= <>
##$ZL1= 120
##$ZL2= 120
##$ZL3= 120
##$ZL4= 120
##$ABSF1= 248.5645
##$ABSF2= -253.2056
##$ABSG= 5
##$ABSL= 3
##$ALPHA= 0
##$AQORDER= 0
##$ASSFAC= 0
##$ASSFACI= 0
##$ASSFACX= 0
##$ASSWID= 0
##$AUNMP= <proc_1d>
##$AZFE= 0.1
##$AZFW= 0.5
##$BCFW= 0
##$BC_mod= 2
##$BYTORDP= 0
##$COROFFS= 0
##$CY= -3
##$DATMOD= 1
##$DC= 0
##$DFILT= <>
##$DTYPP= 0
##$F1P= 0
##$F2P= 0
##$FCOR= 1
##$FTSIZE= 65536
##$FT_mod= 6
##$GAMMA= 0
##$GB= 0
##$INTBC= 1
##$INTSCL= 6.047779e-11
##$ISEN= 30
##$LB= 1
##$LEV0= 0
##$LPBIN= 0
##$MAXI= 10000
##$MC2= 0
##$MEAN= 0
##$ME_mod= 0
##$MI= 50
##$NCOEF= 0
##$NC_proc= -8
##$NLEV= 6
##$NOISF1= 182.463
##$NOISF2= 159.3651
##$NSP= 0
##$NTH_PI= 0
##$NZP= 0
##$OFFSET= 248.5645
##$PC= 4
##$PHC0= -11028.88
##$PHC1= 171.4102
##$PH_mod= 1
##$PKNL= yes
##$PPARMOD= 0
##$PSCAL= 0
##$PSIGN= 0
##$REVERSE= no
##$SF= 81.0140089999694
##$SI= 65536
##$SIGF1= 159.3651
##$SIGF2= -187.1042
##$SINO= 113.3802
##$SIOLD= 16384
##$SREGLST= <1H.CDCl3>
##$SSB= 0
##$STSI= 65536
##$STSR= 0
##$SW_p= 40650.406504065
##$SYMM= 0
##$S_DEV= 0
##$TDeff= 32768
##$TDoff= 0
##$TI= <>
##$TILT= no
##$TM1= 0
##$TM2= 0
##$TOPLEV= 0
##$USERP1= <user>
##$USERP2= <user>
##$USERP3= <user>
##$USERP4= <user>
##$USERP5= <user>
##$WDW= 1
##$XDIM= 65536
##$YMAX_p= 309865530
##$YMIN_p= -71711104
$$ End of Bruker specific parameters
$$ ---------------------------------
##NTUPLES= NMR SPECTRUM
##VAR_NAME=  FREQUENCY,     SPECTRUM/REAL,   SPECTRUM/IMAG
##SYMBOL=    X,             R,               I
##VAR_TYPE=  INDEPENDENT,   DEPENDENT,       DEPENDENT
##VAR_FORM=  AFFN,          ASDF,            ASDF
##VAR_DIM=   65536,         65536,           65536
##UNITS=     HZ,            ARBITRARY UNITS, ARBITRARY UNITS
##FACTOR=    0.620285442955139, 1,           1
##FIRST=     20137.2065510682, 0,            0
##LAST=      -20513.1999529968, 0,           0
##MIN=       -20513.1999529968, -71711104,   0
##MAX=       20137.2065510682, 309865530,    0
$$ Real data points
##PAGE= N=1
##DATA TABLE= (X++(R..R)), XYDATA
$$ [...]
41986c455390O405260M814515p90613o182602o481458j522369K791753J528086
41978b892818j957591j006064K776865J000482o877837j0079707k677183O052469
41970a5661384N353788p33434r31371N065383P495650K962278j575112j207380
41962G68418P87991P51582j22788n32138j703199l041846j428474L114567O398190
41953D992303N917050K734322k387769q670415j1471315o223554L089983P182815
41945d836580M503744K822253N751518O762336P66535o682012p523077k146772
41937e82055L275148N021469K630612k981201p545936n446152J402630L089118
41929a136367m083183r806598l833400Q297549J2898037P096620J34876j684150
$$ plain form
41986 -3455390 2949870 7764385 6973772 791170 -5690288 -7212657 -4420904 -2892818
41978 -2892818 -4850409 -5856473 -3079608 -2079126 -8956963 -19036670 -21713853 -15661384
41970 -15661384 -10307596 -11041030 -11972401 -6907018 588632 3550910 1975798 768418
41962 768418 1556409 2307991 2185203 1653065 -50134 -3091980 -4520454 -1405887 4992303
41953 4992303 10909353 13643675 11255906 2585491 -8885824 -15109378 -12019395 -4836580
41945 -4836580 -332836 2489417 8240935 15003271 15769806 9087794 1564717 -582055
41937 -582055 2693093 7714562 10345174 7363973 -181963 -5628115 -4225485 -1136367
41929 -1136367 -5219550 -15026148 -18859548 -10561999 2336038 9432658 9567534 7883384
41921G883384j012992r59716k82493J561707K429377K140208K563598K215773
41913A6538846k461070r363164j1202692n556370J837648N586739O168670N141550
41905F690157J740573k701657l444776N19801L512575J459696j969930j903528
41897C902911j7406n82502k836907k926168n67719J481634K283988K189741j81181
41888B746391n261010q784947o159267N63471N098851N229063L633756J709095
41880a224597j341741l508323p81674N519959Q300762M244463j264359k022042
41872G922448O00414J159201j349915l193033k416999j113473j188315j408636
41864i88308K33359L250981N138772M495352K579716J269689J39898k714280o576510
$$ plain form
41921 7883384 6870392 5910676 5628183 7189890 9619267 11759475 14323073 16538846
41913 16538846 14077776 4714612 -6488080 -12044450 -10206802 -4620063 1548607 6690157
41905 6690157 8430730 5729073 2284297 2804098 6316673 7776369 5806439 3902911
41897 3902911 3885505 3303003 466096 -2460072 -3027791 -1546157 737831 2927572 2746391
41888 2746391 -2514619 -11299566 -17458833 -16895362 -11796511 -6567448 -2933692 -1224597
41880 -1224597 -2566338 -6074661 -6856335 -1336376 6964386 11208849 9944490 7922448
41872 7922448 8522862 9682063 8332148 5139115 2722116 1608643 420328 -988308
41864 -988308 -754949 2496032 7634804 12130156 14709872 15979561 16119459 13405179 6828669
41855F828669p493253l803635L83162O81918j054266n08867J067882n58295l061037
41846g517722M32089Q239612R173700l23255p904873k648098P481074O987163
41838A3919690l520501q670273k203961M540233J417636n572062n181206K000993
41830c269451O041361K603215k568511k684623K212608O511103N342929j93529
41822A3995102l678910j110321K805096N38655o378796q120678r82996O573937
41814C641089O355684J559232m39566K17441r77345l293114l045331j906406l861105
41805a749421o184942k870689L975861N796118J031595k532718m97366K311314
41797g20248J561098j292P9127j583565o646720r156439m120901L675402O572156
$$ plain form
41855 6828669 -664584 -4468219 -4085057 -3403139 -4457405 -4966272 -3898390 -4456685 -7517722
41846 -7517722 -7085633 1153979 10327679 10004424 2099551 -548547 6932527 13919690
41838 13919690 10399189 1728916 -475045 4065188 5482824 -89238 -5270444 -3269451
41830 -3269451 2771910 5375125 2806614 121991 2334599 8845702 14188631 13995102
41822 13995102 10316192 9205871 12010967 12549622 6170826 -1949852 -2932848 3641089
41814 3641089 9996773 11556005 11116439 11333880 10356535 7063421 4018090 2111684 -1749421
41805 -1749421 -7934363 -10805052 -6829191 -1033073 -1478 -2534196 -3031562 -720248
41797 -720248 840850 839558 918685 -664880 -7311600 -16468039 -20588940 -16913538 -10341382
41788a0341382N066794M438788M430300J053860l677421l348913J531902K946380
41780B100308j940148n851840k859021K529677L085575L9135q2571L541095N141553
41771E703763J632405l174472m349462j558842J930770K843436J13745l706360
41763e65017l641607J788355O678930M374478k467527m567179L27663L789101
41755E717197j84931o009438o022140k164128l88122O36224N195144R099912M624649
41746A0504367m603307o679411o03164J273825n798957r538503m82175J1051751
41738d875574R876310j025540o193307j279518L331398R04376l238438l317789
41730e818082j550948j428703j497327J74850K125906L269705M621454M977603
$$ plain form
41788 -10341382 -5274588 -835800 3594500 4648360 970939 -2377974 -846072 2100308
41780 2100308 160160 -5691680 -8550701 -6021024 -2935449 -2896314 -2978885 562210 5703763
41771 5703763 7336168 4161696 -187766 -1746608 184162 3027598 3141343 -565017
41763 -565017 -4206624 -2418269 4260661 8635139 6167612 1600433 1928096 5717197
41755 5717197 5532266 -477172 -6499312 -8663440 -9051562 -8415338 -3220194 5879718 10504367
41746 10504367 5901060 -778351 -1381515 -107690 -5906647 -15445150 -15927325 -4875574
41738 -4875574 5000736 3975196 -2218111 -3497629 -166231 738145 -2500293 -5818082
41730 -5818082 -7369030 -8797733 -10295060 -10120210 -7994304 -4724599 -103145 4874458
41722D874458J121707n158405o689365r58386N172791M707439l36123l093765
41714c59649j304824J512329J735949q83971l847971m117951j237382J344024
41706g159446M13471k082153j916720M25575P83036r36229l47316L227655M966815
41697b625312K918981J337449K715404L185261k30903l965082m069476k564733
41689c298411k818213l504876k061170L07900J778763L685147O571165P064775
41681G725080L480647j49525n85497q41229l732264n568015k899583r7611k359201
41672e027198n978965m354598M13043J592204L12996L371154J0114019J2343967
41664A2786622P357839R04949l428129p517485j0178981o245694K758019P228106
$$ plain form
41722 4874458 5996165 837760 -5851605 -6809991 -1637200 3070239 2734116 -359649
41714 -359649 -1664473 -152144 1583805 699834 -3148137 -7266088 -8503470 -7159446
41706 -7159446 -6745975 -8828128 -10744848 -10319273 -9536237 -10472466 -10819782 -7592127 -2625312
41697 -2625312 293669 1631118 4346522 7531783 7300880 3335798 -733678 -3298411
41689 -3298411 -6116624 -9621500 -11682670 -11374770 -9596007 -5910860 660305 7725080
41681 7725080 11205727 11056202 10470705 9629476 5897212 329197 -2570386 -2667997 -5027198
41672 -5027198 -11006163 -15360761 -14947718 -13355514 -13042518 -9671364 442655 12786622
41664 12786622 20144461 21049410 17621281 10103796 -75185 -6320879 -3562860 3665246
41656C665246L104059k141632j597133J827106L127666L227003L353169K73630
41648A4839114n747969o887019k34539L921792l080482j2267871q814500M662028
41640a3609446J1035534L842347m974552m694224M10862K106387J186309J860022
41632b836761K305878m48899k698585J71817M699990M558030J306156J351966
41624H409592M301290L284575l164003p882376n516740N38222M075041L559712
41616G605313J149124j314590k806721l040764l527467n416019n766456o71243
41608a3788823P073173R448322M601770K06377J612259L407327j093601p784667
41600C682137p606287j140414J890660k613605p338913m545766L639460R025190
$$ plain form
41656 3665246 6769305 4627673 3030540 4857646 7985312 11212315 14565484 14839114
41648 14839114 9091145 2204126 1969587 5891379 2810897 -9456974 -18271474 -13609446
41640 -13609446 -2573912 1268435 -3706117 -8400341 -7989479 -5883092 -4696783 -2836761
41632 -2836761 -530883 -979782 -3678367 -3506550 1193440 5751470 7057626 8409592
41624 8409592 12710882 15995457 12831454 4949078 -567662 -29440 4045601 7605313
41616 7605313 8754437 7439847 4633126 1592362 -1935105 -7351124 -13117580 -13788823
41608 -13788823 -6715650 2732672 7334442 7540819 9153078 12560405 11466804 3682137
41600 3682137 -3924150 -5064564 -3173904 -5787509 -13126422 -17672188 -14032728 -5007538
41592e007538P352931J810818j254815J071556M818803L384859l056216n847854
41584C272544K68678P666463N481847m021784q209188k764092K950276J523367
41576F168111k192101j651077J2514k932987p207452m998344L550684J0284998
41568A034346R772539L981435k257894n372984m222224j432416j556735m387546
41560d441479l646864L293874Q948830N412046l261762o265868j423957L111147
41552A725967J995757j015859j271722j2785p9520q61565r09312j161609k502063
41543d092711l450000k787203j753420j684732j837747j005755Q05625L136873
41535a2669070N378240O085714M468382K465998K423255K935628N61921m286340
$$ plain form
41592 -5007538 2345393 4156211 2901396 3972952 8791755 12176614 9120398 3272544
41584 3272544 3541222 11207685 16689532 12667748 4458560 1694468 4644744 6168111
41576 6168111 3976010 2324933 2337447 -595540 -7802992 -12801336 -9250652 1034346
41568 1034346 10806885 14788320 12530426 7157442 2935218 1502802 -53933 -4441479
41560 -4441479 -8088343 -4794469 4154361 9566407 6304645 38777 -1385180 1725967
41552 1725967 3721724 2705865 1434143 1421358 1341838 480273 -429039 -1590648 -4092711
41543 -4092711 -7542711 -10329914 -12083334 -13768066 -15605813 -16611568 -15805943 -12669070
41535 -12669070 -7290830 -1205116 3263266 5729264 8152519 11088147 11650068 7363728
41527G363728p177285n985106l332722j713400l28780J606792K430256J197754
41519e938763m0218M96722J646802K068746K709712M045139L797842N30505k881403
41510F435084k895322p34695m46717k490562l224929r04093J632945J550098J27620
41501i50571R0114J105482Q60598n54670o43777J126702K287753J659168J298634
41492F279433K171119J353167k910046o265053l391280L435223O554173L402650
41484A0629386j048732k818875l443643m227731k730161J458070L440287K49281
41476A507882l484138k161032K437728M429353K034074k210416o013263p414399
41468a0874211l945805L173181P452063M966841L69908l1827K858523M616364
$$ plain form
41527 7363728 186443 -5798663 -9131385 -10844785 -11173565 -9566773 -7136517 -5938763
41519 -5938763 -5978981 -5482259 -3835457 -1766711 943001 4988140 8785982 9316487 6435084
41510 6435084 3539762 2805067 2358350 -132212 -3357141 -4261234 -2628289 -1078191 -950571
41501 -950571 -860457 245025 1105623 550953 -92824 1033878 3321631 4980799 6279433
41492 6279433 8450552 9803719 6893673 628620 -2762660 672563 7226736 10629386
41484 10629386 9580654 6761779 3318136 -909595 -3639756 -2181686 1258601 1507882
41476 1507882 -1976256 -4137288 -1699560 2729793 4763867 2553451 -3459812 -10874211
41468 -10874211 -14820016 -11646835 -4194772 772069 1141977 1110150 3968673 8585037
41460H585037N094859N625810L258111l744145q749370m775619L170100L869829
41452A2334612l707111r785518q372988k519658L831686Q769258Q202668R8389
41444H851338p498746m664085M367497O456076P84664p56095L962198K808500
41436A4311347p017985j0296329O98206J0023767K417434j1178758j0479832K820900
41428h701250J0136783N356333n47876q16388K24l99554J309440K899059j958681
41419G278090r205524p053903L785396Q259609M39434o559462j763557O751557
41411A931640O536631N67024j92434M289600N036198M19216k155874K14410J577218
41402A8223629k418744p793195q133785k095615O110021J0050710N428505m886319
$$ plain form
41460 8585037 13679896 19305706 22563817 18819672 10070302 5294683 8464783 12334612
41452 12334612 8627501 -1158017 -9531005 -12050663 -8218977 550281 8752949 8851338
41444 8851338 1352592 -3311493 1056004 7512080 8296744 7540649 11502847 14311347
41436 14311347 7293362 -3002967 -2304761 7719006 10136440 -1042318 -11522150 -8701250
41428 -8701250 1435533 6791866 6243990 5427602 5427826 5028272 6337712 9236771 7278090
41419 7278090 -1927434 -8981337 -5195941 3063668 3503102 -3056360 -4819917 1931640
41411 1931640 8468271 9035295 8842861 13132461 18168659 18587875 16432001 16646411 18223629
41402 18223629 15804885 8011690 -122095 -2217710 3892311 13943021 19371526 14485207
41394A4485207j1288665p512020Q75867L303958j458110m325904J97280O270267
41386E47880N854405k86418n177885n108411j717759K472992N490803M560726
41378F636333j243207p036133n818117K413139R114968O960250j536417p480580
41370B010236n834266K49744M391880L896620J280300P2395J88028j519514n825604
41361a090181q277162m337466L607444Q051102N608146P83227p75567Q81628K142669
41352F593840J634217R41370J491240L000249L521972K46079o836491j1627911
41344a035435p308370L199657Q405298L457648k696585r63797M262129L517875
41336A0838420j801069k983978J69381l91113n397003n546185L024877J1482436
$$ plain form
41394 14485207 3196542 -4315478 -3439611 -135653 -1593763 -5919667 -5722387 547880
41386 547880 6402285 6115867 937982 -4170429 -5888188 -3415196 2075607 6636333
41378 6636333 5393126 -1643007 -7461124 -5047985 4066983 11027233 9490816 2010236
41370 2010236 -3824030 -3574286 817594 4714214 5994514 6066909 6254937 4735423 -1090181
41361 -1090181 -9367343 -13704809 -10097365 -2046263 3561883 4345110 3569543 4451171 6593840
41352 6593840 8228057 9169427 10660667 13660916 17182888 17428967 10592476 -1035435
41344 -1035435 -8343805 -5144148 3261150 6718798 4022213 3058416 7320545 10838420
41336 10838420 9037351 6053373 6222754 5831641 434638 -5111547 -2086670 9395766
41328I395766J0947751L844541j923540l211033k073335j715741m727589j0056032
41320D80788j1012290l051591O788712P416220O40944j161426M162672M540714
41312H804743m589577j0235729l163009N221847J008085q667466o732630O394107
41304a1959629J3877756Q111003r45877l424606j245821N07441J995565M073974
41296A0989806L987509k4576n246562q071723p154263k756850K984632N991298
41288F99271M503826J745040P13689k14906k307063k382552M16198L8221o333431
41279c121707j0074775l339448O362491O179712j918387m927126p0351K889103
41271h020488K00605p56945K812652L522375j396014l488989K304015Q178386
$$ plain form
41328 9395766 20343517 24188058 22264518 19053485 16980150 15264409 10536820 480788
41320 480788 -10531502 -13583093 -6794381 621839 1262783 101357 4264029 8804743
41312 8804743 4215166 -6020563 -9183572 -3961725 -2953640 -11621106 -18353736 -11959629
41304 -11959629 1918127 10029130 9083253 5658647 4412826 4920267 6915832 10989806
41296 10989806 14977315 14952739 9706177 1634454 -5519809 -8276659 -5292027 699271
41288 699271 5203097 6948137 7661826 7446920 5139857 2757305 3173503 3211724 -3121707
41279 -3121707 -13196482 -16535930 -10173439 -3993727 -5912114 -10839240 -10909591 -8020488
41271 -8020488 -7819883 -8576828 -5764176 -2241801 -3637815 -7126804 -4822789 3355597
41263C355597N714138j929917o537183n421239m31192N517905O919418k88889
41255F898638r386565p843571L943509J0349268K934831o901088n868790K255546
41247c618222N994847M224074K747992J045705m375762q955678n439255K915572
41239e460727O196114K844237K02215J574054K872325J713149P15141J248413
41231A1904921J253260l58958k741730n527836p295570m498869K359536N507450
41223F02204J61517o055195k870226O665404J0130611M052126k396879k341502
41215G948060L56569k41641l670266o212206o019374k873498J833272M068141
41207d810943J431359j896549m89190L234437K651079j522503k308718J120202
$$ plain form
41263 3355597 9069735 7139818 602635 -4818604 -5249796 268109 7187527 6898638
41255 6898638 -2487927 -10331498 -6387989 3961279 6896110 -4978 -5873768 -3618222
41247 -3618222 2376625 6600699 9348691 10394396 6018634 -2937044 -8376299 -5460727
41239 -5460727 735387 3579624 3781839 5355893 8228218 9941367 10656508 11904921
41231 11904921 13158181 12799223 10057493 4529657 -2765913 -7264782 -4905246 602204
41223 602204 763721 -5291474 -8161700 -1496296 8634315 12686441 10289562 7948060
41215 7948060 8304629 8062988 4392722 -1819484 -7838858 -10712356 -8879084 -4810943
41207 -4810943 -3379584 -5276133 -5765323 -2530886 120193 -1402310 -3711028 -2590826
41199b590826K193830o68699j109833K793325L972217j001883m834252j471768
41191b717889L743359L319431n49870j344238R08230K080691J733449O48075l801148
41182D020090j1227576j2735840k208997J0961645J1987223J534165n539011k268536
41174e476837K149539q88895o294748n193765J172994N145316M198178J490682
41166c697536q91185k476168j337524L070598O145517L220084k976254n469528
41158d411996k586954J088648K554506L344121M369750L555136J64571l207262
41150D870520m689976n068539m292181p38638L976427M509441m80183m685175
41142f598304k682353J876708K100815j369462k264664M54514J633520J35084
$$ plain form
41199 -2590826 -396996 -1065695 -2175528 617797 4590014 3588131 -1246121 -2717889
41191 -2717889 1025470 4344901 3795031 2450793 3359023 5439714 7173163 7821238 4020090
41182 4020090 -7207486 -19943326 -22152323 -11190678 796545 2330710 -3208301 -5476837
41174 -5476837 -3327298 -4216193 -10510941 -15704706 -14531712 -9386396 -5188218 -3697536
41166 -3697536 -4588721 -7064889 -8402413 -5331815 813702 4033786 1057532 -4411996
41158 -4411996 -6998950 -5910302 -3355796 -11675 4358075 7913211 8077782 4870520
41150 4870520 180544 -4887995 -9180176 -9918814 -5942387 -1432946 -1913129 -6598304
41142 -6598304 -9280657 -7403949 -5303134 -6672596 -8937260 -8482746 -6849226 -6714142
41134f714142J354980O389312P120051j294933r526338n266527P565871J1916613
41126A1544887J413238r748116o708959N062978Q503416m28222q974906p829713
41118g165397k424016m1232K331229Q784802J2615496N672322n930775q752095
41110E090334k454968N72608l566177m470719K878221P654582J141167p762978
41102i17930o893697m67458k97422m841036l028233M894515P136851Q04393l598102
41093g208119p98345J380194k013258l494415K489979P874845L761642m494682
41085b502159n856306l94691L324171K552833J166916l35493m408758p403499
41077a3856986k126668R132083J3980366O133111n119524o651750J969200R001157
$$ plain form
41134 -6714142 -5359162 1030150 8150201 6855268 -2671070 -7937597 -371726 11544887
41126 11544887 12958125 3210009 -3498950 1564028 10067444 9639222 664316 -7165397
41118 -7165397 -9589413 -9630645 -7299416 1485386 14100882 19773204 13842429 5090334
41110 5090334 2635366 3207974 -358203 -4828922 -1950701 5703881 6845048 -917930
41102 -917930 -7811627 -8279085 -8576507 -13417543 -16445776 -11551261 -4414410 -3610017 -7208119
41093 -7208119 -8006464 -6626270 -8639528 -12133943 -9643964 -1769119 1992523 -2502159
41085 -2502159 -8358465 -8753156 -5428985 -2876152 -1709236 -2044729 -6453487 -13856986
41077 -13856986 -15983654 -6851571 7128795 13261906 8142382 1490632 3459832 12460989
41069A2460989N659869l986780r139945n496210N60759J304347k135590k661765
41061c434326J392417L816732P51623k960485j574884K550322L256803M17290
41053D215492p02107J746705L890154K507789j006925l537155l632523j730549
41045A750881L73436M82601j431607k514041r69646Q98479K41777j529318q31147
41036c528585K404337M494991K924093j136067m562352m540265m03331M745849
41028C98670N906250J737310l575549n683269m617564k232234J015120L915548
41020c135718L482479L4298r71389K960241N673298Q85884p140314q617980j854175
41011h683376N221322O112665J883229l038873n155532k675212K472079M543798
$$ plain form
41069 12460989 18120858 14134078 4994133 -502077 58682 1363029 -772561 -3434326
41061 -3434326 -2041909 1774823 2526446 -434039 -2008923 541399 3798202 4215492
41053 4215492 3513385 5260090 9150244 11658033 10651108 7113953 3481430 1750881
41045 1750881 2124317 2606918 1175311 -1338730 -2308376 -1409897 -1168120 -2697438 -3528585
41036 -3528585 -1124248 3370743 6294836 5158769 596417 -3943848 -4347179 398670
41028 398670 6304920 8042230 4466681 -1216588 -5834152 -8066386 -7051266 -3135718
41020 -3135718 346761 381059 -590330 2369911 8043209 8929093 1788779 -6829201 -8683376
41011 -8683376 -3462054 2650611 4533840 1494967 -3660565 -6335777 -3863698 680100
41003F80100J201669j565502J917339O686473M034963l782320o258602j362896
40995A551224J889015j160034m590282m130206l703927m792654j152868Q317326
40987g772406J2419908L595564p652272o260006N215953J0593125L504949n627562
40979H017253o362949q10066L344152L415503J077607k499686o240755p647234
40971g706175n352843j142373K497179M829763N802712M855415J979268j691077
40963D071869m734182n408561j759980N294291R890505O569274j914900o728176
40955E280140m228898k43135o04570k727359j409566J399351n4896m084311k373972
40946i047216O231988J1080658L997282q015255j1572493m634158K701417L446737
$$ plain form
41003 680100 1881769 316267 2233606 8920079 12955042 9172722 2914120 1551224
40995 1551224 3440239 2280205 -2310077 -6440283 -10144210 -14936864 -16089732 -7772406
40987 -7772406 4647502 8243066 590794 -5669212 -453259 10139866 13644815 8017253
40979 8017253 1654304 844238 4188390 7603893 8681500 6181814 -58941 -7706175
40971 -7706175 -13059018 -14201391 -11704212 -6874449 -1071737 3783678 5762946 4071869
40963 4071869 -662313 -6070874 -7830854 -2536563 7353942 13923216 12008316 5280140
40955 5280140 1051242 808107 203537 -2523822 -3933388 -2534037 -2588933 -6673244 -9047216
40946 -9047216 -2815228 8265430 12262712 4247457 -7325036 -11959194 -9257777 -5811040
40938e811040Q83120k35143n77350j000216J453060O993899R212422M188750k000977
40929A3106525k102581O57966j776563q167059r112121j697409O028737O465275
40921C402770Q50809n162067p470731l808441M787695J0993822P032815l788079
40913F838593q574225j536963P691305P181654j987476r326352q992128l864429
40905a2570021J301269M456744N074096L278344L55072k259241l866591l542895
40897g773223o77063K585244K820727N10173k56059J366736J440371j274744k158478
40888c416316J276866L981314J053362l968135m316590J11980L824370L868819
40880B415670J576090j323602l321986k291931J290243K887119J55750k494363
$$ plain form
40938 -5811040 -4927920 -5163063 -5740413 -6740629 -5287569 1706330 10918752 15107502 13106525
40929 13106525 11003944 11661910 9885347 1718288 -7393833 -9091242 -3062505 3402770
40921 3402770 4253579 -908488 -8379219 -12187660 -7399965 3593857 10626672 6838593
40913 6838593 -1735632 -3272595 4418710 11600364 9612888 286536 -8705592 -12570021
40905 -12570021 -11268752 -6812008 -1737912 1540432 1895504 -363737 -4230328 -7773223
40897 -7773223 -8450286 -5865042 -3044315 -2534142 -2790201 -1423465 16906 -1257838 -3416316
40888 -3416316 -2139450 1841864 2895226 -1072909 -5389499 -5277519 -1453149 2415670
40880 2415670 3991760 2668158 -653828 -2945759 -1655516 1231603 1387353 -1107010
40872a107010m61372L474836L792417J047255k65886K70831k09371j537774j713961
40863C289965k096518m550601n852161k238611K893807L679095J625645K065904
40855a183475L426722M42266l759336r72260O568721P106017j761485q270522
40847A596648n032226N68847R81204Q30533N562306Q954044L412020n742330q318332
40838B812714n117552l612407l161869K164776R251093Q438820R0213m574237
40830F291551j105517J880533k158133p184390n059640K025172O335069N775008
40822F799653L770077K092225j78138k833483m444202m933948n244859n525449
40814a0498124n283946l799085R2725N891020R067428N118367l085616o919528
$$ plain form
40872 -1107010 -1568382 1906454 5698871 6746126 6480240 6751071 6541700 5003926 3289965
40863 3289965 1193447 -3357154 -9209315 -11447926 -8554119 -4875024 -3249379 -1183475
40855 -1183475 2243247 2685513 -1073823 -2046083 4522638 11628655 9867170 1596648
40847 1596648 -3435578 -2866731 -1885527 -1054994 4507312 13461356 16873376 11131046 2812714
40838 2812714 -2304838 -5917245 -9079114 -6914338 2336755 10775575 10865788 6291551
40830 6291551 5186034 7066567 4908434 -2275956 -7335596 -5310424 1024645 6799653
40822 6799653 10569730 12661955 12483817 9650334 5206132 272184 -4972675 -10498124
40814 -10498124 -15782070 -19581155 -19488430 -13597410 -4529982 588385 -2497231 -9416759
40806i416759k801184L613637O198413N613376M542048J907851k886971n278758
40798A491653j667648L684020M627569K558851K437974K560116k358101r107895
40790D226539p627725L295684J1858338R190740J027719k538695j647598l009388
40782A4775614o802263o831130k119883Q90878j018652k737177N71010N733155
40774B461552O633800K841059j368933l745209m967325m557656j326653K114114
40766a915251P22688n313094r037186n833324J63410K946204L869118P526565
40758f870870J1048050O519224n010787j1464751o240100J566456P54159m880374
40750a4578993l071473O992250J2871573P354583k005300n064371j903029J292972
$$ plain form
40806 -9416759 -12217943 -8604306 -2405893 3207483 7749531 9657382 6770411 1491653
40798 1491653 -175995 3508025 8135594 10694445 13132419 15692535 13334434 4226539
40790 4226539 -3401186 -105502 11752836 20943576 21971295 19432600 17785002 14775614
40782 14775614 7973351 1142221 -977662 -86784 -1105436 -3842613 -3271603 2461552
40774 2461552 9095352 11936411 10567478 6822269 1854944 -2702712 -4029365 -1915251
40766 -1915251 -1192563 -6505657 -15542843 -21376167 -21212757 -18266553 -14397435 -6870870
40758 -6870870 4177180 10696404 5685617 -5779134 -12019234 -10452778 -9698619 -14578993
40750 -14578993 -17650466 -10658216 2213357 9567940 7562640 2498269 595240 1888212
40742A888212J998105J271918q37208l966978m985994j864302K606620M850608
40734I60981N376338N998272N454431J914391k827099n509693n438128l472722
40726B456771k27310J928843m99039n781223o276892R71216Q079536O895519P55112
40717H302533j826408p83559k654996p788038r225962l985535L174778P401525
40709g385662P555054L036249m873945r051528l157672P435711J0849062N457752
40701I865021R68473J372747q14727q958080j3434259o300344N087979Q435868
40693c777322L179442k312021m231459m748421m308771j533360J749106K663152
40685a3319654K092770J627550l92428l796013k748508N236803J1444209O629124
$$ plain form
40742 1888212 3886317 5158235 4321027 354049 -4631945 -6496247 -3889627 960981
40734 960981 6337319 12335591 17790022 19704413 16877314 11367621 5929493 2456771
40726 2456771 2229461 4158304 3659265 -2121958 -8398850 -7427634 651902 7547421 8302533
40717 8302533 6476125 5692566 3037570 -4750468 -13976430 -17961965 -14787187 -7385662
40709 -7385662 169392 3205641 -1668304 -10719832 -13877504 -6441793 4407269 9865021
40701 9865021 10833494 12206241 11391514 2433434 -11000825 -17301169 -12213190 -3777322
40693 -3777322 -597880 -2909901 -7141360 -11889781 -16198552 -17731912 -15982806 -13319654
40685 -13319654 -11226884 -9599334 -9991762 -13787775 -16536283 -11299480 144729 6773853
40677F773853m081106p391525q86733M959697L412324p49786j582672j29509P26970
40668A051513J218474J344284l14347j979359j7132L084586L40147p162776q537644
40659a0972254P51940R735629O660213l901583p900175j568989N391940M974964
40651C171685L4625k937426k767043k197513k267241j569930Q50982L944762N352441
40642A615342L509788r2475j771125l32694P86302j401897m191427l010469Q86066
40633d002589J949496l37901j9926N083329Q079504L088092m435582m988000J3540
40624D429963j61324q153154j2591157m743053P172061R139488J730113j833912
40616e010975L139097N929004j405711j0152061p816631K685421P693285L168010
$$ plain form
40677 6773853 2692747 -4698778 -5585511 -625814 2786510 2036724 454052 324543 1051513
40668 1051513 2269987 3614271 3299924 1320565 1303433 4388019 4728166 -2434610 -10972254
40659 -10972254 -10220314 -484685 6175528 2273945 -5626230 -7195219 -1803279 3171685
40651 3171685 3206310 268884 -2498159 -4695672 -6962913 -8532843 -7681861 -3737099 1615342
40642 1615342 5125130 5032655 3261530 2928836 3715138 2313241 -1878186 -4888655 -4002589
40633 -4002589 -2053093 -2390994 -2410920 2672409 10751913 13840005 9404423 4416423 4429963
40624 4429963 4268639 -3884515 -16475672 -21218725 -14046664 -4907176 -3177063 -5010975
40616 -5010975 -1871878 4057126 2651415 -7500646 -15317277 -12631856 -4938571 -1770561
40608a770561j289654Q74024L838635J001680l571299k575255J962404K274458
40600G44432j976301l082310J965569O163933K855513m516368p371452l194900
40592h411884K689100M788006K752709n74148k875862l361754k386367j145900
40584h526100o13510l19708R32705L108561M643402M064480J177657k840457n581967
40575c954937m551057K61852N571036Q035749P424099N113191J390694k984371
40567A6306256m626937j299138L294759L524011J54337j085718O80859J15354
40559A7063783m258895o308314k394772J912691N81978l440682l578396N85616
40551A63009M864448P078241O185850J26546q667523j1212764l582486M709572
$$ plain form
40608 -1770561 -3060215 -2186191 1652444 2654124 -917175 -3492430 -1530026 744432
40600 744432 -1231869 -4314179 -2348610 3815323 6670836 2154468 -5216984 -8411884
40592 -8411884 -5722784 -934778 1817931 1243783 -1632079 -4993833 -7380200 -8526100
40584 -8526100 -9139610 -9459318 -8526613 -5418052 -774650 3289830 4467487 1627030 -3954937
40575 -3954937 -8505994 -8244142 -2673106 5362643 12786742 17899933 19290627 16306256
40567 16306256 11679319 10380181 13674940 17198951 17353288 16267570 16948429 17063783
40559 17063783 12804888 6496574 4101802 6014493 6596471 3155789 -422607 163009
40551 163009 5027457 12105698 18291548 18418094 9750571 -1462193 -5044679 -335107
40543c35107L194172l740821m314521J711513M156735J5788l427349k549404j277823
40534f566817m61370L473109P797898M880790l157457m787621K259597O320333
40526I758462O35148o657459p340338m726994l506946q50880M393817N778588
40518b516602R12958k461652l4562J521085j477854j798238L438569M519890k443764
40509c40170m790893M604356J0634597l86947j4990233j2170888L109571R999422
40501d331185O157908N881601R559230L244709j1675240j6058208m474104N958810
40493e736479M578416J483780M443293M170446n489232j2442270n681860N844888
40485h829018P969135K381642n62179M27088K60293m80722J404524K962408K21836
$$ plain form
40543 -335107 2859065 -881756 -5196277 -3484764 671971 687759 -2739590 -5288994 -6566817
40534 -6566817 -7028187 -3555078 4242820 9123610 5966153 1178532 3438129 9758462
40526 9758462 10393610 3736151 -3604187 -8331181 -11838127 -12689007 -8295190 -2516602
40518 -2516602 -1603644 -4065296 -4099858 -2578773 -4056627 -5854865 -2416296 2103594 -340170
40509 -340170 -5131063 -526707 10107890 9720943 -5269290 -17440178 -14330607 -4331185
40501 -4331185 1826723 7708324 17267554 20512263 8837023 -7221185 -11695289 -5736479
40493 -5736479 -1158063 325717 4769010 8939456 3450224 -8992046 -14673906 -8829018
40485 -8829018 -859883 1521759 959580 1386668 1646961 1166239 2570763 5533171 5755007
40476E755007l124718j636676J936102J217872l086409m660718j184938L311744
40468a472734L943385l78856n745008o148516q56355L063162J016231n61874M903571
40459b236994R898586L530422p206841n167273Q132507J2259396L88448r720228
40451I878023n385451J926349p01157n963220k816644K832891J216987k410641
40443a422863J57263K547520l034361p560770k26676R178287M715204p484898
40435c131294q399772K268400P145926J241689k218774L210846P740590M213489
40427A2071100j954119n521010q024399q506427k857912M840440N160809j28030
40419d919548N01736P894222R270523k57106r125600p917611j756294K233495
$$ plain form
40476 5755007 2630289 993613 2929715 4147587 1061178 -3599540 -4784478 -1472734
40468 -1472734 2470651 2091795 -3653213 -9801729 -10658084 -7594922 -6578691 -7140565 -2236994
40459 -2236994 7661592 11192014 3985173 -1182100 6950407 19209803 19598251 9878023
40451 9878023 4492572 6418921 5717764 -245456 -3062100 -229209 987778 -1422863
40443 -1422863 -1265600 1281920 -1752441 -9313211 -9539887 -361600 4353604 -3131294
40435 -3131294 -11531066 -9262666 -2116740 -875051 -3093825 117021 7857611 12071100
40427 12071100 10116981 4595971 -3428428 -11934855 -14792767 -9952327 -4791518 -4919548
40419 -4919548 -4417812 3476410 12746933 12489827 3364227 -4553384 -6309678 -4076183
40411d076183N701594R822559Q370073j042781r322476q003814o34362M545239
40403E359849N134534K437035k520775n911311l040164K337962O38759p443152
40395c007263r212509K2928Q069789M976952j604870o28571M212419L144088k030557
40386C942406k703484N08494K40932l152812k649789K064398M129378J580269
40378C959792o22474l87915q73594k971383l908582l395193l261133j442549N113723
40369g789308J1603188Q956369j926158q787973m423999L858579O081346L292617
40361A0864661K479877L650395J127527m584950n865341l96365L857047N24342
40353A1657193m830088l047992M002284N728418j100526p516268n719949Q89031
$$ plain form
40411 -4076183 1625411 11447970 19818043 18775262 9452786 1448972 814610 5359849
40403 5359849 10494383 12931418 10410643 4499332 1459168 3797130 4435889 -3007263
40395 -3007263 -12219772 -12196844 -4127055 849897 -754973 -1383544 2828875 5972963 3942406
40386 3942406 1238922 1747416 1988348 -1164464 -3814253 -1749855 2379523 3959792
40378 3959792 3337318 2949403 2075809 -895574 -4804156 -8199349 -11460482 -12903031 -7789308
40369 -7789308 3813880 12770249 10844091 2056118 -2367881 1490698 7572044 10864661
40361 10864661 13344538 16994933 18122460 13537510 7672169 7275804 11132851 11657193
40353 11657193 6827105 3779113 7781397 13509815 12409289 4893021 -826928 62103
40345F2103N036088N395287L665310r44098p074494p586376N01661P872951M919089
40336A1847521k754733k713875L960475M820318k558420o942827l351698p55614
40328A551147m548251o542751q21956M158487K22749n234381j245294Q218458
40320d241792J1050842N988805J440016k12800l616463p981914o807387l81947
40312d762640K928846m29525m622134m567032k077053J65234K799290N295827
40304e269187M259825n79579m183865k978648M41068J605006l79595l092771l398241
40295a3575987O12907O944826R437231M339871l498193n947562k543610j42241
40287d372758j497952j429434L152100O308054J340931q171186j1467838l807356
$$ plain form
40345 62103 5098191 10493478 14158788 13214690 6140196 -1446180 -944519 6928432 11847521
40336 11847521 9092788 6378913 10339388 15159706 12601286 5658459 2306761 1551147
40328 1551147 -2997104 -9539855 -10361811 -6203324 -5980575 -11214956 -12460250 -4241792
40320 -4241792 6809050 12797855 14237871 14025071 10408608 2426694 -4380693 -4762640
40312 -4762640 -1833794 -2263319 -6885453 -11452485 -13529538 -13364304 -10565014 -5269187
40304 -5269187 -1009362 -1588941 -5772806 -8751454 -8310386 -6705380 -7084975 -10177746 -13575987
40295 -13575987 -12963080 -6018254 3418977 7758848 4260655 -1686907 -4230517 -4372758
40287 -4372758 -5870710 -7300144 -4148044 2160010 3500941 -4670245 -16138083 -19945439
40279a9945439P641043J1854110N816171k853790m877240K78521M800468L125895
40271E839739j542587l360545k329531k156084k781826j190980J814859K322604
40263c384351O75214J346150M455902M375296p79020m924715l163576O43402M62815
40254b92883k358262k059658J879666M180250J963861j617763k270689N31882
40246d3596L929072M548888J202123l433201m795859j972066N24210j094907m343854
40237e479190m614390k449148j678938j962007M75883M693561M617192j179917
40229g576954n742059l311467K873004O515005O725779N423262J510936n268042
40221A149464q667462k835035O972206R658149M000185m26949P76718N83654n483198
$$ plain form
40279 -19945439 -12304396 -450286 5365885 2512095 -2365145 -2086624 2713844 5839739
40271 5839739 4297152 936607 -1392924 -3549008 -6330834 -7521814 -5706955 -3384351
40263 -3384351 -2709137 -1362987 3092915 7468211 6689191 1764476 -1399100 -755698 -292883
40254 -292883 -2651145 -4710803 -2831137 1349113 3312974 1695211 -575478 -43596
40246 -43596 3885476 8434364 9636487 6203286 1407427 -564639 -40429 -1135336 -5479190
40237 -5479190 -10093580 -12542728 -14221666 -16183673 -15707790 -11014229 -6397037 -7576954
40229 -7576954 -13319013 -16630480 -13757476 -7242471 -516692 4906570 6417506 1149464
40221 1149464 -7517998 -10353033 -3380827 6277322 10277507 9850558 10627276 11210930 5727732
40212E727732r566271l773195N462521N679874k926688p737838k102700O000990
40204c235575O103052r94533n682441k125093N443984Q400017L775745k611550
40196I073606l857252r93195m60514l342900l689790N83851K880156j157799n243607
40187f207444k143744M407139O164317L717682L423452M598405P87276p607542
40179G139541j2589777j0463772n086129L91898N539820P158346K380707k880595
40171h409961j1388P263163O454897l346883q507738k287815M814038K959307
40163a072380j890613j8220N757315O489652J812438k013746k897633k862753
40155C304060k064757k67555M04375J5040K338178O732340O091202j116259n451485
$$ plain form
40212 5727732 -3838539 -7611734 -2149213 3530661 603973 -7133865 -9236565 -3235575
40204 -3235575 2867477 1872944 -3809497 -5934590 -490606 7909411 11685156 9073606
40196 9073606 5216354 4223159 3762645 419745 -3270045 -2686194 193962 -963837 -6207444
40187 -6207444 -8351188 -3944049 2220268 5937950 9361402 13959807 14747083 7139541
40179 7139541 -5450236 -15914008 -21000137 -20608239 -15068419 -7910073 -5529366 -8409961
40171 -8409961 -8421349 -1158186 5296711 1949828 -6557910 -8845725 -4031687 -1072380
40163 -1072380 -2962993 -2981213 2776102 9265754 11078192 9064446 6166813 3304060
40155 3304060 1239303 971748 1376123 1391163 3729341 10461681 16552883 15436624 9985139
40146I985139p22877N126696K393738n151409p455851l705043l31131O43797J365252
40137B148311J517554Q45082K522385N983330M075056m021391o947134Q26197
40129F949390O441411j358855j0816870m492007J0681738J2764430l13720q675294
40121A1180223l119888L293717J24810n400073n172746l392092m387784l066710
40113i940543L437634P786479M509315j134049k915937j427601K488657R599765
40105A2403720J3335768L791452j3397844j8253913m904898P467896L055876p326605
40097c828548n735497M507672P584170J952189o53957K871506M212169M52444
40089A1362148k191375j242477j177207l291364l771265k327622k567678l553117
$$ plain form
40146 9985139 9262262 14388958 16782696 11631287 4175436 470393 139262 783059 2148311
40137 2148311 3665865 4510947 7033332 13016662 17091718 13070327 6123193 6949390
40129 6949390 13390801 12031946 1215076 -3276931 7404807 20169237 19855517 11180223
40121 11180223 8060335 11354052 11478862 6078789 906043 -2486049 -6873833 -9940543
40113 -9940543 -6502909 1283570 5792885 4658836 1742899 315298 2803955 12403720
40105 12403720 25739488 29530940 16133096 -2120817 -7025715 442181 3498057 -3828548
40097 -3828548 -9564045 -5056373 2527797 4479986 3826029 6697535 10909704 11362148
40089 11362148 9170773 7928296 6751089 3459725 -311540 -2639162 -5206840 -8759957
40081h759957o76309M702778N891481K038894j76124K365653M548201J943526
40073A1878143k327942k864734M56722K988972R75815m472807p928545n149701
40065f444077R58910K936849q80437l304850Q96464O454817N422159r40378m775789
40056C23668k958851R36695L677794M787399L525239l49561l751987l455704j043412
40047A691280k09230q76312m65544J061127J968973K406305K955267J931809j678583
40038H785092n195487n939894m839528l156320o2016L258436L062528N09359K083000
40029a494830P517161O859240k769269q291846j4265J0400650O518039o464231
40021A2260649j0154483k689506N78700m933532o097870K992935R778638N045988
$$ plain form
40081 -8759957 -9436266 -4733488 1157993 3196887 3020763 5386416 9934617 11878143
40073 11878143 9550201 6685467 7142189 10131161 11106976 6634169 -1294376 -6444077
40065 -6444077 -5485167 -2548318 -3428755 -6733605 -5837141 617676 6039835 5099457 323668
40056 323668 -2635183 -1698488 1979306 6766705 10291944 9942383 6190396 2734692 1691280
40047 1691280 1482050 605738 140194 1201321 3170294 5576599 8531866 10463675 8785092
40038 8785092 3589605 -2350289 -7189817 -10346137 -10408153 -7149717 -4087189 -3577830 -1494830
40029 -1494830 6022331 12881571 10112302 1820456 1806191 12206841 18724880 12260649
40021 12260649 2106166 -583340 -4640 -4938172 -11036042 -8043107 1735531 6781519
40013F781519j888253l60816M441170L488671L01930K031586M370024n11327q297715
40004A0356789q828201l198007j125129m066703l853568K451783P989279P557555
39996G283798L882243O35865k291512m224530k098783L267761N615556J827618
39988A3898016k867282k405622J285902J765266j934334m099892j144433L157712
39980G655333L382717n9526k733683l366296m349011n425976k756444L732188
39972c920698P796787N472134R91766p10214j869131n493529o642728J32611Q279929
39963D036927O081920m740461r768912k980685N469112O487244M403616N402033
39955A4390794N456265n04907o820843n694272p37897m59613l334028j385903
$$ plain form
40013 6781519 4893266 4532450 8973620 12462291 12764221 14795807 19165831 18654504 10356789
40004 10356789 1528588 -1669419 -2794548 -6861251 -10714819 -8263036 -273757 7283798
39996 7283798 11166041 11801906 9510394 5285864 3187081 6454842 12070398 13898016
39988 13898016 11030734 8625112 9911014 11676280 9741946 5642054 4497621 7655333
39980 7655333 11038050 10978524 8244841 4878545 529534 -4896442 -7652886 -3920698
39972 -3920698 3876089 9348223 10339989 9629775 7760644 2267115 -4375613 -4243002 4036927
39963 4036927 10118847 5378386 -4390526 -7371211 -1902099 4585145 8988761 14390794
39955 14390794 19847059 19342152 12521309 6827037 6089140 5629527 2295499 909596
39947I09596M555203N658643M01741k848766M2138L098033J466636j111010m78064
39938A1694150N57902j308183k614465R49798N783082M716144j841553n898637
39930A2038238l312340O18457o67477n466003o548147j709337L120593K370430
39922D44414j522909k152101J557652M484741L255214M59186k45050P52478J032340
39913H065965K38319n18163j241467k374180k809613r88195K365608M137020J736571
39904H611865l887502q085477o596808o88953L870406M459925M650723O570654
39896H904833N441709j752482p087296j483985Q784784Q168279m516949j2242072
39888D216821m428703P598289P958384k041402r582296q973436l817888K492478
$$ plain form
39947 909596 5464799 11123442 11525183 8676417 8718555 11816588 13283224 12172214 11694150
39938 11694150 12252052 10943869 8329404 9279202 15062284 19778428 17936875 12038238
39930 12038238 8725898 9344355 8676878 3210875 -3337272 -5046609 -1926016 444414
39922 444414 -1078495 -3230596 -1672944 2811797 6067011 6526197 6281147 7033625 8065965
39913 8065965 8304284 7786121 6544654 4170474 1360861 372666 2738274 6875294 8611865
39904 8611865 4724363 -3361114 -9957922 -10646875 -6776469 -2316544 2334179 8904833
39896 8904833 14346542 12594060 5506764 4022779 12807563 20975842 16458893 4216821
39888 4216821 -211882 7386407 15344791 13303389 3721093 -5252343 -9070231 -6577753
39880f577753P453245O152992j948937p622461l443235M185877N059473J369415
39872D628616J417408K815976k529169r934760o063719P821466J4291697N591752
39864A8039267n176103n350494l21987n95387l917150k036675L518436M623899
39856H783806N30274k104753o29881J066168M05281o04224q213J155284R92412
39847I586154q86750k957407k794675P4650K456803J383283j017829o39024J735519
39838F940724K294226J735842L463543M851407j64092q617019r455908n34899
39830E13824O252929K602076l841796k548501L704121N319915J478266j027931
39822A2452903J90579J775560K005615J429579p02888l560922k299272M267297
$$ plain form
39880 -6577753 875492 7028484 5079547 -2542914 -5986149 -1800272 3259201 4628616
39872 4628616 6046024 8862000 6332831 -3601929 -9665648 -1844182 12447515 18039267
39864 18039267 12863164 7512670 7190683 6595296 2678146 641471 4159907 8783806
39856 8783806 9314080 7209327 6579446 7645614 8050895 7446671 7438458 8593742 9586154
39847 9586154 8699404 5741997 2947322 3021972 5478775 6862058 5844229 5205205 6940724
39838 6940724 9234950 10970792 14434335 19285742 19121650 10504631 1048723 513824
39830 513824 6766753 9368829 5527033 2978532 6682653 12002568 13480834 12452903
39822 12452903 12643482 14419042 16424657 17854236 17151348 13590426 11291154 15558451
39814A5558451Q275814L335956m219799l965797K752850N967581L249215J598839
39806C2553110M261464O652826O135887N936212P701242Q841256Q987264J1127272
39798I2196533J4610482J4537397R866561N121632K602915p6687l414817m358748
39790A31085268k834568k474294k970744L24972O380654O297111m214066j7004268
39782A14590065k1506638j7296681j1464036q036309n846440m125852m424909
39775D1889200p041176q951426o393008O20170O323729L861991n811192j2506745
39767A1991543q533468R39573N124347K422876q4437j27995k735977q228514q817348
39758h049400j273654O692910Q036737N721233M597011K467516l324665p901580
$$ plain form
39814 15558451 23834265 27170221 22950422 18984625 21737475 27705056 30954271 32553110
39806 32553110 36814574 43467400 49603287 55539499 63240741 72081997 81069261 92196533
39798 92196533 106807015 121344412 131210973 136332605 138935520 138858833 135444016 131085268
39790 131085268 128250700 125776406 122805662 123130634 129511288 135808399 131594333 114590065
39782 114590065 93083427 75786746 64322710 56286401 50439961 46314109 41889200
39775 41889200 34848024 25896598 19503590 20123760 26447489 30309480 24498288 11991543
39767 11991543 3458075 4397648 9521995 11944871 11860434 11732439 8996462 767948 -8049400
39758 -8049400 -9323054 -2630144 5406593 11127826 15724837 18192353 14867688 6966108
39750F966108o069302j630614p33829j178885K170089N887302K861058m005662
39742D266265m787530R82523K779508l505742q147822l198895M318861L501153
39734c791679k852888k578866O209992J1153554M051541o322904o767381J166315
39726B67684M350224j437295n580360n07163N351629J103230p890012p170079
39718a1512142M060584J0947898N255212l297894l181979K633637M564672J951403
39710A1421391Q38104J753254L3135m106462n116151j343974K741900L703024
39702I924221K274819o23382m952944q087803o042286K46129M353861K005436
39694i01949l714231o097320j746848O520577J1850646Q852735j006184r985410
$$ plain form
39750 6966108 896806 -733808 -1467637 -2646522 -476433 5410869 8271927 4266265
39742 4266265 -521265 461258 3240766 -264976 -8412798 -11611693 -7292832 -3791679
39734 -3791679 -6644567 -9223433 -3013441 8140113 12191654 5868750 -898631 267684
39726 267684 4617908 3180613 -2399747 -2906910 2444719 3547949 -4342063 -11512142
39718 -11512142 -7451558 3496340 8751552 5453658 2271679 4905316 9469988 11421391
39710 11421391 12259495 14012749 14045884 9939422 4823271 3479297 6221197 9924221
39702 9924221 12199040 11575658 6622714 -1465089 -7507375 -7261246 -2907385 -901949
39694 -901949 -4616180 -10713500 -12460348 -5939771 5910875 14763610 13757426 3772016
39686C772016j1645590o717084j88919M744192P268884O530287K859433j70778
39678F452441Q83433M361285N015210J75197p481163j2101659q575545K577174
39670h693627J2532220J1039053o59911q853358m143638O047973Q383711K065304
39662A7717727k555419o83257K052167J120071p59948j034077j892199m040072
39654I924993l551901Q73898L871274J181969l679396n129906l555266k746628
39646b810963k582901L30309N858458Q748148M756051l737902r404582p351020
39638f194402n86996L190064Q38249k651632j622203K517281M640242L743118
39630C873721K189649k56915m983963q563765n803697J172774M524807K427911
$$ plain form
39686 3772016 -7873574 -14590658 -14779577 -10035385 -2766501 3763786 6623219 6452441
39678 6452441 7335874 11697159 16712369 16887566 9406403 -2695256 -11270801 -8693627
39670 -8693627 3838593 14877646 14217735 5364377 1220739 7268712 15652423 17717727
39662 17717727 15162308 14479051 16531218 17651289 16891341 15857264 13965065 9924993
39654 9924993 6373092 7246990 11118264 12300233 8620837 3490931 -64335 -2810963
39646 -2810963 -5393864 -5063555 794903 9543051 14299102 10561200 1156618 -6194402
39638 -6194402 -6781398 -3591334 -2753085 -5404717 -7026920 -4509639 130603 3873721
39630 3873721 6063370 5806455 822492 -7741273 -13544970 -12372196 -7847389 -5419478
39622e419478J404418M807113P026052L049727l413921o311048n543374l517137
39614g917648P71700P541860J0771718M915699n082440q256141k120305M059743
39606D684186K220917l804528m140333L576290J0853083Q849475q88242q628180
39598A2722668q132360k545417J933968L737254M242487K699413j679968n151473
39590G826572l357418J282227K458544l74849k024279r37192p71307j888185J6572
39581B230685M437399M210305k609847p440191l514562L797465N672902K472705
39573I256861L27573M25384k72657j467890n48514J457813J895057J783949K533442
39564A5391018P56035n879522j0771343n750714N104719R054209K670592l673972
$$ plain form
39622 -5419478 -4015060 792053 7818105 10867832 7453911 1142863 -4400511 -7917648
39614 -7917648 -7145948 395912 11167630 16083329 11000889 2744748 624443 4684186
39606 4684186 6905103 3100575 -1039758 2536532 13389615 22239090 21350848 12722668
39598 12722668 4590308 2044891 3978859 7716113 11958600 14658013 12978045 7826572
39590 7826572 4469154 5751381 8209925 7835076 5810797 4873605 4102298 2214113 2230685
39581 2230685 6668084 10878389 8268542 828351 -2686211 1111254 6784156 9256861
39573 9256861 9584434 10009818 9737161 8269271 7720757 9178570 11073627 12857576 15391018
39564 15391018 16147053 10267531 -503812 -6254526 -1149807 7904402 10574994 6901022
39556F901022j788385L313103L127246j420072l257437j60986M170277O870220
39548A7754988P609675N490274J91283m406265l412695J522304L041161j493455
39540B6297270n111195o69468Q144633J0790713L984943m077228n027402l20901
39532C4011365L368788L822737L111415J381014k377480m904425j398786N776445
39524D2791073Q065865K456963l883142l667058J139130L623723J271553k872853
39516D8925254n127659l808179M90049M633395N521995M606197O417054J1113994
39508G2772100J3142858R719697N607486O038275R742356J3058438J6167479K0222153
39500A66470842K2445042J9889048J5220001J3204777J3484137J1845196O933822
$$ plain form
39556 6901022 5112637 8425740 11552986 10132914 6875477 6714491 10884768 17754988
39548 17754988 25364663 30854937 31046220 26639955 23227260 24749564 27790725 26297270
39540 26297270 21186075 20516607 28661240 39451953 43436896 39359668 34332266 34011365
39532 34011365 37380153 41202890 44314305 45695319 43317839 38413414 37014628 42791073
39524 42791073 50856938 53313901 49430759 45763701 46902831 50526554 51798107 48925254
39516 48925254 43797595 39989416 40479465 45112860 50634855 55241052 61658106 72772100
39508 72772100 85914958 95634655 101242141 107280416 117022772 130081210 146248689 166470842
39500 166470842 188915884 208804932 224024933 237229710 250713847 262559043 269492865
39493B69492865R77297m788079j1012553j7366971k2195958k4305606k3063411
39486A67737584j8561352j3283948j0639296j0120689p735391k957364j76578
39479A04262966q47880l95583L431051N921897M201564L734476R335700J5932906
39471A45577097J6166142J2062331J0957541J4252787J8434777K2779330K7078304
39464B67308309K5914249J5216369J426603o061703r038758j6322372k7376946
39457B51065751l1905582k6072144j7903456j4665051j4642423j3663735j0975950
39450A21237410o481513k67976L291402j059783j0252698j4864357j1715691o593927
39442G3292867l368287N75748N924976P736014L825422r89253k649345k819149
$$ plain form
39493 269492865 270470162 265682083 254669530 237302559 215106601 190800995 167737584
39486 167737584 149176232 135892284 125252988 115132299 107396908 104439544 104262966
39479 104262966 103415086 103019503 106450554 112372451 116574015 120308491 129644191 145577097
39471 145577097 161743239 173805570 184763111 199015898 217450675 240230005 267308309
39464 267308309 293222558 308438927 309865530 303803827 294765069 278442697 251065751
39457 251065751 219160169 193088025 175184569 160519518 145877095 132213360 121237410
39450 121237410 114755897 114487921 117779323 116719540 106466842 91602485 79886794 73292867
39442 73292867 69924580 70500328 76425304 84161318 87986740 86997487 84348142 81528993
39434H1528993l126442j732779J225569K059957O60041J816346N813931N396144
39426I3641760l010675j1916849j2474311o432532k597181m740792q130084o594253
39418C7745083O3020N345913K785983n432475r280724l729602L384185K398995
39410C3280378l848242n568969j957511l38297j850173r18488J699705n66155
39402A9932248n521615l200233N498789O890869l119211j0262983l850809O715351
39394A3082406P723373J120346k869999k782725l285654l471149J96840M758394
39386A4471832M789148J070476k538225n347023o263913j214181Q565697J3401778
39378B6935589Q044061k97100m108945o192132r637275q216428J793116J0185017
$$ plain form
39434 81528993 78402551 76669772 77895341 79955298 80615339 82431685 88245616 93641760
39426 93641760 90631085 78714236 66239925 59807393 57210212 52469420 44339336 37745083
39418 37745083 37808103 43154016 45939999 40507524 31226800 27497198 30881383 33280378
39410 33280378 29432136 23863167 21905656 21567359 19717186 18798698 20498403 19932248
39402 19932248 14410633 11210400 16709189 23600058 20480847 10217864 6367055 13082406
39394 13082406 20805779 21926125 19056126 16273401 12987747 9516598 9713438 14471832
39386 14471832 19260980 20331456 17793231 12446208 6182295 4968114 13533811 26935589
39378 26935589 34979650 34682550 30573605 24381473 14744198 6527770 8320886 18505903
39370A8505903O358324l952248q556860p389002p364354o628053K85858P705881
39362a034551N795563j776673l151665J860741L097249j091167k277940J641380
39354C062937L693200J366822r72777k513210n376292n537801J089547O217031
39346A029457l99340j0372084o077713R483348J4159543J635540q007688j143744
39338C07319Q099418K971244q171917o906585N373133J1230146M015998n540924
39330A1377832o927036j143788M861474N822286P63298n808644p047846k375312
39322d77736Q74640j465814l382473J358637P856429O546895k290528q404901
39314F15149n141262L129726P810678O063491K299202J243448J581574j298503
$$ plain form
39370 18505903 24864227 20911979 12355119 4966117 -2398237 -9026290 -8740432 -1034551
39362 -1034551 4761012 2984339 -167326 1693415 4790664 3699497 1421557 3062937
39354 3062937 6756137 8122959 7150182 4636972 -739320 -6277121 -5187574 1029457
39346 1029457 630117 -9741967 -15819680 -6336332 7823211 9458751 1451063 307319
39338 307319 8406737 11377981 3206064 -3700521 1672612 12902758 16918756 11377832
39330 11377832 4450796 3307008 8168482 13990768 14754066 8945422 1897576 -477736
39322 -477736 396904 -1068910 -4451383 -3092746 4763683 11310578 9020050 615149
39314 615149 -4526113 -1396387 6414291 12477782 14776984 16020432 17602006 16303503
39306A6303503o534409p029482o67613M080205M69879m856468k427571L337782
39298B675826J260178o091814n111436N371411J0417780K735195o357367o378203
39290a478430k644224k849786k801407L252590R606106Q392412K931799O40809
39282A5049869N56808j422712k504846Q15862L406466m49726n483378l140309
39274F828034L902546N917966J265708k975704l025967j873167k420826m496139
39266C122451o796452o501232o25229P553964R103622J799620m968184l673182
39258i84622R17073J831457J356280L416333L592372k343504q003501o239408
39250f457520k017202l162551n530549r50498O562258P216293K795150K442521
$$ plain form
39306 16303503 9769094 2739612 2071999 6152204 6622083 1765615 -661956 2675826
39298 2675826 3936004 -2155810 -7267246 -1895835 8521945 11257140 4899773 -1478430
39290 -1478430 -4122654 -6972440 -9773847 -6521257 3084849 11477261 14409060 15049869
39282 15049869 15606677 14183965 11679119 12494981 15901447 15451721 9968343 6828034
39274 6828034 10730580 16648546 17914254 14938550 11912583 10039416 7618590 3122451
39266 3122451 -3674001 -10175233 -10800462 -3246498 5857124 7656744 2688560 -984622
39258 -984622 -67549 1763908 3120188 6536521 10128893 7785389 -218112 -6457520
39250 -6457520 -8474722 -11637273 -17167822 -18118320 -11556062 -4339769 -1544619 897902
39242H97902N346683L260928k762941l981324l65063J11616k808113k069936J761498
39233f08750J715930n73119K220324O072893K03856j0449027q082303Q147160
39225a353036J6122816L363541j3311382j2731541J495393J0447842O906363p57080
39217A0182916m001845j595011L482684O162028K576056l759648m978063j075358
39209F993759k73519m080272l626702L827830P611454R57085o596263m257573
39201E55799L244168N043658J044476k023672l295257m843982l360135L276921
39193c58024P433861J880038o807014p093620k37448L029806N1651j863581Q31729
39184c132602L900623M418885L846338K292793j587454n456954n594009l203740
$$ plain form
39242 897902 6244585 9505513 6742572 2761248 2396185 2507801 -300312 -2370248 -608750
39233 -608750 1107180 534061 2754385 8827278 9031134 -1417893 -9500196 -1353036
39225 -1353036 14769780 18133321 4821939 -7909602 -6414209 4033633 10939996 10182916
39217 10182916 6181071 4586060 8068744 14230772 16806828 13047180 8069117 6993759
39209 6993759 6720240 2639968 -986734 2841096 10452550 11409635 4813372 555799
39201 555799 3799967 8843625 9888101 7864429 4569172 -274810 -3634945 -358024
39193 -358024 7075837 8955875 2148861 -4944759 -5182207 -2152401 -2100750 -3964331 -3132602
39184 -3132602 768021 5186906 9033244 11326037 9738583 4281629 -1312380 -4516120
39176d516120j841460r74615J321719K864716J627239J009041L216159L045383
39168E752062k692249o120880k8591P703546N111328l641428m824110J639256
39160B898934L169412k310482l215016L530948O353640M34906l308770J115127
39152H668699K816976n874007j3256029o795170M931933N642820k185541k292963
39144h343282Q217327J4413187O780416n973641j0922074o400947R71411O067712
39136D810109P006640L267659k754293n523162j653954N676980R473711N624469
39128B5928159l172046r449985p883401j093356L122668J284502k026515j681576
39120E028450P91659J159164r4488M65751K357690J841458j369242l356404k048343
$$ plain form
39176 -4516120 -6357580 -7332195 -6010476 -3145760 -1518521 -509480 2706679 5752062
39168 5752062 3059813 -3061067 -3089658 4613888 9725216 6083788 1259678 2898934
39160 2898934 6068346 3757864 542848 4073796 10427436 10862342 7553572 8668699
39152 8668699 11485675 5611668 -7644361 -14439531 -9507598 -3864778 -6050319 -8343282
39144 -8343282 -125955 14287232 21067648 15094007 4171933 -2229014 -1257603 4810109
39136 4810109 11816749 15084408 12330115 6806953 5152999 10829979 20303690 25928159
39128 25928159 22756113 13306128 5422727 4329371 7452039 8736541 6710026 5028450
39120 5028450 5820109 6979273 6884785 7350536 9708226 11549684 10180442 6824038 4775695
39111D775695M52681J792637J587705l04567l597963n464574k931178J931223
39103a758341L492689M06446k228443l57923L266595L416864n08911m516607n116207
39094c903838k058303K257582M166830J540120k816040l019388K004268N372586
39086C543817J184779n747845n327746K952475Q047874L204817l549487j354307
39078B954377O322980O250591m060391j1339357n558047N632583Q577560K672222
39070A1452518j772635p12351l46528m016363n956925j777320L471123L258739
39062C600258o99358k751295k435866k613291k125430J978793O465346M313606
39054E732763l774350p620100j031496Q309250P909365k932387j1472182p342674
$$ plain form
39111 4775695 5228376 7021013 8608718 8304151 4706188 -758386 -3689564 -1758341
39103 -1758341 1734348 2140794 -87649 -445572 2821023 6237887 5728976 1212369 -3903838
39094 -3903838 -5962141 -3704559 462271 2002391 -813649 -3833037 -1828769 3543817
39086 3543817 4728596 -1019249 -6346995 -3394520 4653354 7858171 4308684 2954377
39078 2954377 9277357 15527948 11467557 128200 -5429847 202736 8780296 11452518
39070 11452518 9679883 8967532 8621004 4604641 -1352284 -3129604 341519 3600258
39062 3600258 2900900 149605 -2286261 -4899552 -7024982 -5046189 1419157 5732763
39054 5732763 1958413 -5661687 -6693183 1616067 9525432 6593045 -4879137 -12221811
39046a2221811M654009J0955583N978495k434630m621662q71054J836995P43783
39038D019708q51862q10156m54250M15399L634937O109973J001370j0319331j5145474
39029a2399686n399790R037274J1907983K056319o498734m778988J295386K899078
39021a881158K21847k025382k963324l370485j053335M949314R421409O772504
39013A0071390n03089m964493m062189j231183J280815M183149N897946K466037
39005A3138383n168775r525927n758620J641491N075277L507673J623320J782679
38997F315501K102045J835478L056036N517799M704626j693845q549255q678664
38989D609721k104003L999073M284124L87978l314786n077688n046914k708170
$$ plain form
39046 -12221811 -7567802 3387781 9366276 6931646 2309984 1438930 3275925 4019708
39038 4019708 3167846 2357690 1903440 2318839 5953776 12063749 13065119 2745788 -12399686
39029 -12399686 -17799476 -8762202 3145781 5202100 -1296634 -6075622 -4780236 -1881158
39021 -1881158 -1659311 -3684693 -6648017 -10018502 -11071837 -6122523 3298886 10071390
39013 10071390 9568301 4603808 541619 -689564 591251 4774400 10672346 13138383
39005 13138383 7969608 -1556319 -7314939 -5673448 -598171 2909502 4532822 6315501
38997 6315501 8417546 10253024 13309060 18826859 23531485 21837640 13288385 4609721
38989 4609721 2505718 6504791 10788915 11176893 7862107 2784419 -2262495 -4970665
38981d970665J630503M849380M103481J095679K4216J581915K271708p2573l506419
38972G007225n703884o974568p483573m746055K433849R408239R629599L293681
38964F864513k128138j478625J692239J177730k447536l036268J375362N159471
38956G178748L058685k516652n202405l067843K43860J309811K31169j420993
38948a85620k628589k606084j097099P21468J719360K701033M306699M211363
38940G142531L20737m062850l477803J040781K539265j182145m177337k599749
38932d456570r86658k944031k719007N426190J4413199J1637089k218506j2207799
38924E943907q744535R24409M544375N44355l502807k905737r1062J227703J057364
$$ plain form
38981 -4970665 -3340162 1509218 5612699 6708378 6732594 8314509 10586217 10513644 7007225
38972 7007225 1303341 -5671227 -13154800 -17900855 -15467006 -6058767 3570832 6864513
38964 6864513 4736375 3257750 4949989 6127719 3680183 643915 2019277 7178748
38956 7178748 10237433 7720781 2518376 -549467 -305607 1004204 1235373 -185620
38948 -185620 -2814209 -5420293 -6517392 -5795924 -4076564 -1375531 2931168 7142531
38940 7142531 7463268 3400418 -77385 963396 3502661 2320516 -1856821 -4456570
38932 -4456570 -5443228 -8387259 -11106266 -5680076 8733123 20370212 18151706 5943907
38924 5943907 -2800628 -1876219 2668156 3212511 -290296 -3196033 -3287095 -2059392 -1002028
38915a002028J718972L673730L987003j37086o111903p151166j276572M201064
38907b097986K028228m074004m606640J395412N552314L544537K60971j31559
38899A871273l5051j066893J47212M220548N478017J532189j814460j094557j789086
38890G449192p077170r181526j794483P035958O240142p07588k654491K70119
38882d19847n13299l853788m92417P462493O584194m771156j0788511k794077
38874i586408O434109L423065m731342l515449M835200O175874j938396p320561
38866f223908l048721L570100M413585J832176J984680M698893N238953J806231
38858A4271989k886721n328162m133781p47539J726959J565506K19173r6322N89716
$$ plain form
38915 -1002028 716944 4390674 8377677 8240591 2128688 -5022478 -6299050 -2097986
38907 -2097986 -69758 -4143762 -8750402 -7354990 -1802676 1741861 2002832 1871273
38899 1871273 1836222 769329 916541 5137089 10615106 12147295 10332835 9238278 7449192
38890 7449192 372022 -8809504 -10603987 -3568029 2672113 1964525 -689966 -419847
38882 -419847 -933146 -4786934 -5279351 2183142 8767336 3996180 -6792331 -9586408
38874 -9586408 -3152299 270766 -4460576 -7976025 -3140825 3035049 1096653 -6223908
38866 -6223908 -9272629 -5702529 -1288944 543232 2527912 7226805 12465758 14271989
38858 14271989 11385268 6057106 1923325 1175786 2902745 4468251 4687424 4591102 5180818
38849E180818J151125J650039J936032J45636l924131o054120k727342K466686
38841a75257K886241j173123k491281J966245N871829K571315n274995r397038
38833e216064o620201j427566J153772J020464P62779J347052J972005K387731
38825d620028L013669L289725K148540L90235L04148J838475J514219k612242
38817E266741o882848o195294j078837L155272L822381L141632K962151K160417
38809F351615O37665Q03759K500441J320438m262343q373594n199858K121690
38801d100187N402285K371237j566034j881767j86405j85640k243620l630290
38793f020421k319955O23579K177541J073406j17459J567081M525787M564169
$$ plain form
38849 5180818 6331943 7981982 9918014 10063650 6139519 85399 -2641943 -175257
38841 -175257 2710984 1537861 -953420 1012825 6884654 9455969 4180974 -5216064
38833 -5216064 -11836265 -13263831 -12110059 -11089595 -10326816 -8979764 -7007759 -4620028
38825 -4620028 -1606359 1683366 3831906 4222141 4526289 6364764 7878983 5266741
38817 5266741 -1616107 -7811401 -8890238 -5734966 -1912585 1229047 4191198 6351615
38809 6351615 6989280 7793039 10293480 11613918 7351575 -1022019 -6221877 -4100187
38801 -4100187 1302098 3673335 2107301 225534 39129 -146511 -2390131 -6020421
38793 -6020421 -8340376 -7716797 -5539256 -4465850 -4583309 -3016228 1509559 6073728
38785F073728J816550P96237K430398J978511k524141o050892m670689j562836
38777a713134l89178N07335J799645r32032p429405p527226L733410J3891562
38769A940977R558042j703715k692871M921113L694936q334398j2167811L84853
38761d398874J1326028M708536q332390q605449J422094N070546j026381n484222
38753e320112l152130l33267r62415k159651k634988l164806o04890O464877R320527
38744b546855L45115j0254181n786126R524075J3548510n4537j1180034m581436
38736a0985469P139140N326257n480970p542818J143039O901890M428566K208914
38728C138549M298604L695630k608183o341515j935303L327010P45708o081468
$$ plain form
38785 6073728 7890278 8686515 11116913 13095424 10571283 4520391 -150298 -1713134
38777 -1713134 -2102312 -1594977 204668 -727364 -8156769 -15683995 -11950585 1940977
38769 1940977 11499019 9795304 7102433 12023546 15718482 7384084 -4783727 -4398874
38761 -4398874 6927154 11635690 3303300 -5302149 -3880055 1190491 164110 -5320112
38753 -5320112 -8472242 -8805509 -9767924 -11927575 -14562563 -17727369 -18332259 -11867382 -2546855
38744 -2546855 -2201740 -12455921 -18242047 -8717972 4830538 4776001 -6404033 -10985469
38736 -10985469 -3846329 1479928 -4001042 -11543860 -10400821 -3498931 929635 3138549
38728 3138549 7437153 11132783 8524600 2183085 247782 3574792 4320500 -1760968
38720a760968o939146L17684P767929P828744O90059p129536q529721k044810
38712i799765N656414O257683K01903l665482p02196L290296K237937n42452N29564
38703C463902K434772r55457o327198m765787K873929N863939N54392l716299
38695e73807J71761O179452N615923N6482l590883l969073l556910k109045L59678
38686a416422k86553m998160o221844Q88285P970162N223640j988105j737619
38678b566616L770356K332675n278332n010018N486705J0592955K043087p342458
38670D028354n181492J331155M06842m341687l751029j170395m052236o747192
38662a9477680K50014J0256789Q524541k817501o848983J321662Q077320M239988
$$ plain form
38720 -1760968 -8700114 -8382430 -614501 7214243 7904302 774766 -7754955 -9799765
38712 -9799765 -4143351 2114332 2316235 -1349247 -2051443 1238853 3476790 2934338 3463902
38703 3463902 5898674 4943217 -1383981 -6149768 -3275839 2588100 3142492 -573807
38695 -573807 -402046 5777406 11393329 11449811 7858928 3889855 332945 -1776100 -1416422
38686 -1416422 -1702975 -6701135 -12922979 -12034694 -4064532 1159108 -828997 -2566616
38678 -2566616 1203740 3536415 -1741917 -6751935 -1265230 9327725 11370812 4028354
38670 4028354 -1153138 178017 584859 -3756828 -7507857 -8678252 -12730488 -19477680
38662 -19477680 -19227666 -8970877 -446336 -3263837 -10112820 -8791158 -713838 3526150
38654C526150k399583k595573R01118J882015P92730M9874q35051o01781L536612
38645D256511P313094K291342q325247r551144K966921J3276072P438650n992360
38637A3673839r750018k838108K014160j33461j915609J272009M525874K875921
38629I724607k057985o419740q064830n444825J207041P095902O845388J675383
38621D560941k133537j806096m35922r05698k043660j473968J079856L862052
38613G03968M444327J577900k845556n201065m561754l112448j451213K066793
38605h379048N871149N066816k34597l090072n49354R08750l209507o161789p32472
38596a0510124P305042P251325N47076k102301J514763K606441k834284p366399
$$ plain form
38654 3526150 1126567 -1469006 -567888 1314127 2106857 2156731 1321680 719899 4256511
38645 4256511 11569605 13860947 5535700 -4015444 -1048523 12227549 19666199 13673839
38637 13673839 3923821 1085713 3099873 2966412 1050803 2322812 6848686 9724607
38629 9724607 7666622 1246882 -6817948 -12262773 -11055732 -3959830 2885558 4560941
38621 4560941 2427404 621308 185386 -720312 -2763972 -4237940 -3158084 703968
38613 703968 5148295 6726195 3880639 -1320426 -5882180 -8994628 -10445841 -8379048
38605 -8379048 -2507899 2558917 2324320 -765752 -1315106 -406356 -3615863 -9777652 -10510124
38596 -10510124 -3205082 4046243 4593319 2491018 4005781 6612222 3777938 -3588461
38588c588461m339944K440692N262313K114939l227636n629917j844803N650775
38580c162042Q407952J596027p409438p638274l61140L292695J49073j227220
38572f352367L239344N426063q61582q590902p850624L39817P782220J0165405
38564C297374P754488J192432o529137r167996m779519M60103J344531R20701
38556e507023L016483M125834J81092m502298l491160J292933L724122L598163
38548B438146L941912K843631k064100m947519R27455R533227Q007731l950260
38540A6730223j2810396j0811870m789001k252669o75099L536605N918827J812549
38532c340831m303308n504851k819461j255711k49899L743256Q395242P695082
$$ plain form
38588 -3588461 -7928405 -5487713 -225400 1889539 -1338097 -6968014 -8812817 -3162042
38580 -3162042 5245910 6841937 -567501 -8205775 -8566915 -5274220 -5125147 -6352367
38572 -6352367 -3113023 2313040 1451458 -7139444 -14990068 -14650251 -6868031 3297374
38564 3297374 11051862 12244294 5715157 -3452839 -8232358 -7772255 -6427724 -5507023
38556 -5507023 -2490540 1635294 1816386 -2685912 -6177072 -4884139 -1160017 2438146
38548 2438146 6380058 9223689 7159589 2212070 3139525 12672752 20680483 16730223
38540 16730223 3919827 -6892043 -11681044 -13933713 -14608812 -11072207 -5153380 -3340831
38532 -3340831 -7644139 -13148990 -15968451 -17224162 -17474061 -13730805 -5335563 2359519
38524B359519J915459k083197q80927J422610M89252j951733j406111K852602
38516B717474O869238O602833K420299r87364J95334L733163L367571l051114
38508B1867434j0065846j1271727p096394l194325k815864l754489k121603K997715
38500a5455099Q137585Q030953J568777m552165k256450O292338R101277K47677
38492A1114893j0446555j0041228m2054O970973N291082J117577L85442J350265
38484E700395R18591k17263j307837l100572l672028j14723M149426K422313l152432
38475A625870l023759L123270L650579n221616j0570922l434203N200420K758666
38467e891695k861595K391033J1836790P564370p771182j2815096k108948N543521
$$ plain form
38524 2359519 4274978 2191781 1310854 2733464 3222716 1270983 -135128 2717474
38516 2717474 9586712 16189545 18609844 17622480 17817814 21550977 24918548 21867434
38508 21867434 11801588 529861 -6566533 -9760858 -12576722 -16331211 -18452814 -15455099
38500 -15455099 -7317514 713439 2282216 -2269949 -4526399 1765939 10867216 11114893
38492 11114893 668338 -9372890 -9414944 -2443971 2847111 3964688 4350130 5700395
38484 5700395 6618986 6401723 5093886 1993314 -1678714 -1793437 2355989 4778302 1625870
38475 1625870 -1397889 1725381 5375960 154344 -10416578 -13850781 -8650361 -5891695
38467 -5891695 -8753290 -6362257 5474533 13038903 5267721 -7547375 -9656323 -4112802
38459d112802o21304o167128K100027J3332033J1678216J378336m359841n904314
38451G323223j0067438j1559229k058638R563276P311712n204461q846270Q66942
38443a2670883P965748K952518l927745k383787K033534M62186m419941n648966
38435a5637336l828474k815789j583832J854422N047645N884585O410248O992577
38427B324046M002466j891356l427239J528273M571628n3334n368925l080050
38419a394491K626435K366325l460025p144024o529481n089727k440382M580282
38411a6485088J2527805J2983470M528759m571553o995963l880763q13671j003385
38403c710389l193639l412321O80450N515044M693710j513408m859824j030505
$$ plain form
38459 -4112802 -4734106 -10901234 -8801207 4530826 16209042 17587378 13227537 7323223
38451 7323223 -2744215 -14303444 -16362082 -6798806 512906 -4691555 -13537825 -12670883
38443 -12670883 -4705135 -1752617 -5680362 -8064149 -6030615 -5568429 -9988370 -15637336
38435 -15637336 -19465810 -22281599 -23865431 -22011009 -16963364 -11078779 -4668531 2324046
38427 2324046 6326512 4435156 1007917 2536190 7107818 7054484 1685559 -1394491
38419 -1394491 1231944 3598269 138244 -7005780 -13535261 -18624988 -21065370 -16485088
38411 -16485088 -3957283 9026187 13554946 8983393 1987430 -1893333 -2707004 -3710389
38403 -3710389 -6904028 -10316349 -9635899 -4120855 572855 -940553 -5800377 -6830882
38395f830882L417339J669046k581388k808975j444179l714793n312991J071061
38387a6535762J0168360R328630r35168o063885K50053O793603L242321m673013
38379A575139o176481j485767K199158L125893M035540M171168J381290j262488
38371G563452O14127M252432K908272l628503q554781p757038l664820P95161
38363g471698N581473Q973672N693162n697898j6584071j5277563j080908J2866078
38355a2997753J3854476M167493l156236j896043R09900j760405n013433l16044
38347f208045R520415J2966031N844315m060580q650951p539230l579485J186165
38339e21365L148787j024273p296969o935145N70707N570045L017458j38030K061473
$$ plain form
38395 -6830882 -3413543 -1744497 -4325885 -7134860 -8579039 -12293832 -17606823 -16535762
38387 -16535762 -6367402 2961228 2026060 -4037825 -3787772 3005831 6248152 1575139
38379 1575139 -4601342 -6087109 -3887951 -762058 3273482 7444650 8825940 7563452
38371 7563452 8177579 12430011 15338283 11709780 3154999 -4602039 -8266859 -7471698
38363 -7471698 -1890225 7083447 12776609 7078711 -9505360 -24782923 -25863831 -12997753
38355 -12997753 856723 5024216 1867980 -28063 881837 -878568 -5892001 -6208045
38347 -6208045 3312370 16278401 22122716 18062136 9411185 1871955 -1707530 -521365
38339 -521365 2627422 1603149 -5693820 -12628965 -12058258 -6488213 -3470755 -3608785 -1547312
38330a547312L970354p96377o363416l378464M970958P386119J672052l740343
38322B173571l850819j797717P0781L164407N753826L286691k303977l173770
38314C322993J646849L449951j969792o524127k569624M296132L533985m093075
38306A093292p585238j569427O784464Q029257K173567k651359q59989M026942
38298I441509M170706k212867p924405o189115k12911J457721k268696l715581
38290g453639R96716N631785M002119k91035l60202K873880L480226J044151K58509
38281A0182510J515159M06326k929823k461873L020531N519475q81323j0072627
38273D298355j1515667m323889K778511L937434J869024O85509l29501k684944
$$ plain form
38330 -1547312 2423042 1626665 -4736751 -8115215 -3144257 4241862 5913914 2173571
38322 2173571 -1677248 -3474965 -3404184 -239777 5514049 8800740 6496763 3322993
38314 3322993 4969842 8419793 6450001 -74126 -2643750 1652382 5186367 1093292
38306 1093292 -6491946 -8061373 -1276909 6752348 8925915 6274556 5414567 9441509
38298 9441509 13612215 11399348 3474943 -2714172 -2927083 -1469362 -3738058 -7453639
38290 -7453639 -6456923 -825138 3176981 2885946 2525744 5399624 8879850 9924001 10182510
38281 10182510 11697669 12103995 9174172 6712299 9732830 15252305 14370982 4298355
38273 4298355 -7217312 -11541201 -8762690 -4825256 -2956232 -2270723 -2600224 -5285168
38265e285168l500245N00230O194752O850098J648511k804079k159560n39611
38257I04928l311774p672410o443392L64667M774219K681842l00560J710730N409215
38248a882535L877620k157899n300597k348253K064667K980834R63478p85861
38240b588546r59483l06645j97933j657268l304681j116258N984053J1599659
38232G452898Q530545m42533n182172k294715J125715l8130j536403N43718J484866
38223I643789l173349p768663m976920J221545J697661k115736m56141P544260
38215A616446J0894658L504983o522177q881528m163398K29165R72479K60066
38207b089306N71841K393443M369564L417098k047710p929077q001545k545354
$$ plain form
38265 -5285168 -8785413 -8285183 -2090431 4759667 6408178 3604099 1444539 904928
38257 904928 -2406846 -10079256 -16522648 -16157981 -11383762 -8701920 -9002480 -7291750 -1882535
38248 -1882535 1995085 -162814 -5463411 -7811664 -5746997 -2766163 -1802685 -2588546
38240 -2588546 -3548029 -3854674 -4052607 -5709875 -9014556 -10130814 -4146761 7452898
38232 7452898 15983443 15540910 10358738 8064023 9189738 9151608 7615205 8158923 9643789
38223 9643789 6470440 -1298223 -6275143 -5053598 -3355937 -5471673 -5927814 1616446
38215 1616446 12511104 16016087 9493910 612382 -3551016 -3321851 -2349372 -2089306
38207 -2089306 -1517465 875978 5245542 8662640 6614930 -1314147 -9315692 -11861046
38199a1861046J952308K465547K091216J983984q48808m945831l161115M823216
38191g500529Q205456O97801q037656n857381L877447Q239391L497214l045684
38183G6059o284575o943057m130499L847001J1274269R037859j245019p131228
38175a499190k157043O174080Q427280M936462J311691n37114j841680k622054
38167A2192432k483390k244941j711859Q46993M882962O761258M492647n6227
38159B2679875m486155p610498p780009m263843n33326q54023l399525k653903
38151h901407J345448L283625K371800L201391N268124J719846p516657j1685325
38143a0913155m813253L944615M010790p20154o6956M792611M324182j901310
$$ plain form
38199 -11861046 -9908738 -7443191 -5351975 -3367991 -4216799 -9162630 -12323745 -7500529
38191 -7500529 704927 1402728 -6634928 -12492309 -8614862 -375471 3121743 76059
38183 76059 -6208516 -13151573 -17282072 -13435071 -2160802 6877057 5632038 -1499190
38175 -1499190 -3656233 2517847 10945127 15881589 17193280 16656166 14814486 12192432
38167 12192432 9709042 7464101 5752242 6599235 11482197 18243455 22736102 22679875
38159 22679875 18193720 10583222 2803213 -1460630 -1993956 -2847979 -6247504 -8901407
38151 -8901407 -7555959 -4272334 -1900534 1300857 6568981 8288827 772170 -10913155
38143 -10913155 -15726408 -11781793 -7771003 -8491157 -8558113 -3765502 558680 -1342630
38135a342630l932667J701322N878632J436218n872203o736227j566492K310240
38127h123807K236517J831537K873320K620910K05004k46882L749497P354946
38119A2501042M499059k203045l979139R14859L547867k258917r385073p445474
38111c808821J076658M095730k156613q448129o974510r41178L361969N225335
38103h569559N772679L632549o6274L37546N798339Q229656K624614l374980j154567
38094A3230003L681685m20703j0716169j1706261J593737J4333859J1298735l352820
38086A7942066j3180751j0654111l176506m1139j153721p22406K885372N333836
38078b767360L255511r39602k700095j254486O14869J076140M74282p16338j585129
$$ plain form
38135 -1342630 -5275297 -3573975 2304657 3740875 -2131328 -8867555 -10434047 -8123807
38127 -8123807 -5887290 -4055753 -1182433 1438477 1643481 1396599 5146096 12501042
38119 12501042 17000101 14797056 10817917 11732776 15280643 13021726 3636653 -3808821
38111 -3808821 -2732163 1363567 -793046 -9241175 -16215685 -17156863 -13794894 -8569559
38103 -8569559 -2796880 835669 769395 1106941 6905280 15134936 17759550 14384570 13230003
38094 13230003 16911688 16490985 5774816 -5931445 -4337708 9996151 21294886 17942066
38086 17942066 4761315 -5892796 -9069302 -9110441 -10264162 -10986568 -8101196 -2767360
38078 -2767360 488151 -451451 -3151546 -4406032 -3791163 -2715023 -2240741 -2957079 -4542208
38069d542208L82842N639367Q798423M500870l235793m900232L00454K778005
38061I721728k006520o115349k815140J863694O9l839101m35926P251731P937979
38052A1563165N62412l962802n33773K772100r51013n960050l305405M937496
38044E122130Q252888J932352p071243q946549k733503K687312j52002o920654
38036g829269o593690K732348R888291O414647r37250j019008M389232M544156
38028A1589457k297086o818500m377229j092378j900607l102594p51228K592722
38020f157443L977356M991734O086901L515879l177944p679293o017996k469314
38012f930120j276055K92959M493986O095911P69383n660468n294969o28498N71455
$$ plain form
38069 -4542208 -4159366 1480001 10278424 14779294 11543501 6643269 6943723 9721728
38061 9721728 7715208 1599859 -1215281 648413 648482 -3190619 -3626545 3625186 11563165
38052 11563165 12125577 8162775 7629002 10401102 9450089 3490039 184634 5122130
38044 5122130 13375018 15307370 8236127 -710422 -3443925 -756613 -908615 -7829269
38036 -7829269 -14422959 -11690611 -1802320 4612327 3675077 2656069 7045301 11589457
38028 11589457 9292371 2473871 -1903358 -2995736 -4896343 -7998937 -8750165 -6157443
38020 -6157443 -2180087 2811647 8898548 12414427 9236483 1557190 -4460806 -6930120
38012 -6930120 -8206175 -7913216 -3419230 2676681 3446064 -2214404 -7509373 -8137871 -7566416
38003g566416j158909P76341N566237N495155J07891j807174K926470N961428
37995A0301023J243160m973823m737276r77341j158348m488650m889061k613016
37987a2293332k654484l536469J327782J0264592J2208548K876089p173064o659189
37979e639527J311297N147471N40623o802671j0421665q210829j189824O346260
37971a8918865Q184030L904467J772499P011618J1784323O350450m012282n895684
37963A0180556L47839O64497q882117j4250576n739664O253264P581880Q00752
37955c043569k306026K82902J780451M46920K70943J515648J469783J835097N395868
37946G648017P854092K847031o613968j1040946p630509j997773J852482M597147
$$ plain form
38003 -7566416 -8725325 -7948984 -2382747 3112408 3220299 1413125 4339595 10301023
37995 10301023 11544183 6570360 1833084 855743 -302605 -4791255 -9680316 -12293332
37987 -12293332 -14947816 -18484285 -17156503 -6891911 5316637 8192726 1019662 -5639527
37979 -5639527 -4328230 819241 1359864 -5442807 -15864472 -24075301 -25265125 -18918865
37971 -18918865 -10734835 -6830368 -5057869 1953749 13738072 20088522 16076240 10180556
37963 10180556 10528395 11192892 2310775 -11939801 -17679465 -11426201 -3844321 -3043569
37955 -3043569 -5349595 -5066693 -3286242 -2839322 -2568379 -1052731 417052 2252149 7648017
37946 7648017 15502109 18349140 11735172 694226 -6936283 -8934056 -7081574 -2484427
37938b484427N610657K777929j409258j333004L298677O574466M247201k266688
37930A5015553q568118r649635k540400Q413965J2842977O609014j914642l896126
37922A6312588k057042k823554l824070J12958M845133L103893k217953l606312
37914I845641k885744o065676r157063m511173K814608K023265l230266l24652
37906a1491060Q473476Q472246n52460k542683N715152P118940n666422j5200051
37898e672862p075681O809083Q142016n92458n073200k530844K09514K157565
37890c626867N903060P359391J941148m871221n260095j578230m29880q37926
37882a400620J025649K146881j216190m068761l63167N599074N987762K075444
$$ plain form
37938 -2484427 3126230 5904159 4494901 3161897 6460574 13035040 17282241 15015553
37930 15015553 6447435 -3202200 -5742600 2671365 15514342 22123356 20208714 16312588
37922 16312588 14255546 11431992 7607922 7720880 12566013 15669906 13451953 9845641
37914 9845641 6959897 894221 -8262842 -12774015 -9959407 -7936142 -11166408 -11491060
37906 -11491060 -3017584 5454662 4902202 2359519 8074671 15193611 9527189 -5672862
37898 -5672862 -12748543 -5939460 2202556 1610098 -3463102 -5993946 -5784432 -3626867
37890 -3626867 2276193 9635584 11576732 6705511 1445416 -132814 -562694 -1400620
37882 -1400620 -374971 1771910 555720 -3513041 -3876208 1722866 7710628 9786072
37874I786072k2149m10555k224337l349235j330019l75239l465166m308150K003676
37865c695102P456790K535038p107366q632526j769125K834323J312052o13109
37857g679025j5132O54202J704443N268661P615432L259098m582040p692893n263023
37848f730277k897539j604041K070131O799295P316641L331889o70175k454177
37840E161747j787423K518164P817840O108922l847288j0376282n364760J781368
37832B012288m16613n473429r36944P726385N329358n821366q594974L69819O418757
37823F13281K748512p28568J569045J491581m502886o432202R93133P528626M348169
37814G628691k157273l023893p48468j295563l024770k686883k930733n448465
$$ plain form
37874 9786072 9763923 9353368 7129031 3779796 2449777 2074538 -1390628 -5698778 -3695102
37865 -3695102 3761688 6296726 -810640 -9443166 -11212291 -8377968 -7065916 -7679025
37857 -7679025 -7694157 -7039955 -5335512 -66851 7548581 10807679 6225639 -1467254 -6730277
37848 -6730277 -9627816 -11231857 -9161726 -2362431 4954210 8286099 7615924 5161747
37840 5161747 3374324 5892488 13710328 19819250 15971962 5595680 230920 2012288
37832 2012288 1595675 -3877754 -4814698 2911687 8241045 2419679 -6175295 -5805476 613281
37823 613281 3361793 2633225 4202270 5693851 1190965 -5241237 -4248104 3280522 7628691
37814 7628691 5471418 2447525 1699057 403494 -2621276 -5308159 -8238892 -13687357
37806a3687357n166944J109011P808869Q670607M725826j17674l641219k581442
37798b880323M900298J1226859N565707q292641j3329665l782978N960074M259908
37790C627239q43917J880055P221147M133560m389201o745933j325949L649607
37782G206608M033290J776625k572804q314408r337900j214195R165243J0882973
37774A1625432L842571k479129l042226j467797j628033k881588l398655k322824
37766a752249P45132M183613M304385N91817k286772j469984n05341k536520l969332
37757b695251o77962L943529L552074j666551n817754n156883o75295M490284
37749d703809O777680M518956R06092M28740J310295j729896o100866k840850
$$ plain form
37806 -13687357 -18854301 -17745290 -9936421 -1265814 3460012 3342338 -298881 -2880323
37798 -2880323 2019975 13246834 18812541 10519900 -2809765 -6592743 -632669 3627239
37790 3627239 2783322 4663377 11884524 16018084 11628883 4882950 3557001 7206608
37782 7206608 11239898 13016523 10443719 2129311 -7208589 -8422784 742459 11625432
37774 11625432 15468003 12988874 9946648 8478851 6850818 3969230 570575 -1752249
37766 -1752249 -1007117 3176496 7480881 8072698 5785926 4315942 3810601 1274081 -2695251
37757 -2695251 -3373213 570316 4122390 2455839 -3361915 -8518798 -9194093 -4703809
37749 -4703809 2073871 6592827 7498919 7927659 9237954 7508058 1407192 -1433658
37741a433658O972604R389520j545774j1933902p616566M649131Q647429L171807
37733A0300591m7037K163532J186270n890939j0392253o386752O23949L155079
37725e287560J346862m48689l96772N05831P94025k08646j042330Q79536M536460
37716F78717M978638J196089n82849L452983P179362L387207m903673r498656
37708E887818q612314n579628j339057K891432J295960p294898j1338685r06621
37700b4995993J3928347J4071806p44567j1031901n697054M820349P541597L855724
37692A748308P04663j757292m910109m701224P88721N033730K908612l54596J646971
37683A107784N141221L010464k612648m028958m23140K344686J716748j42249
$$ plain form
37741 -1433658 5538946 14928466 13382692 1448790 -6167776 -1518645 7128784 10300591
37733 10300591 10253554 12417086 13603356 7712417 -2679836 -9066588 -8442639 -5287560
37725 -5287560 -3940698 -4389387 -4786159 -4280328 -3486303 -3694949 -4737279 -3857743 678717
37716 678717 5657355 6853444 6270595 9723578 16902940 20290147 15386474 5887818
37708 5887818 -2724496 -8304124 -9643181 -6751749 -5455789 -12750687 -24089372 -24995993
37700 -24995993 -11067646 3004160 2259593 -8772308 -14469362 -9649013 -2107416 1748308
37692 1748308 2452971 695679 -4214430 -8915654 -8126933 -3093203 -184591 -539187 1107784
37683 1107784 6249005 9259469 6646821 2617863 2194723 4539409 6256157 6113908
37675F113908k712362o549235p839302k242776N929660P049011J65720m509071
37667d594447k72074O217465M735378m256068j1171675j0025421l703598K075045
37659b0995395M608604M073863K215876J846002L834626M328305o29552p227872
37651g945543o524457K637979R653142N854599l444707p349214n064740m124438
37643a6307379n664234k575774O638876J2991290J0114027L311061J54805k01058
37635H461614j885572l258690q68577K278467O62105m241208n994387l173551
37627h019799k89687M44350J540385M212181O034169N839356N856461P026772
37619B2644188O164585M59448p326663j0776268o878654J44727L123194q66m141936
$$ plain form
37675 6113908 3401546 -3147689 -10986991 -13229767 -7300107 -251096 -85376 -4594447
37667 -4594447 -4866521 1350944 6086322 1830254 -9341421 -19366842 -23070440 -20995395
37659 -20995395 -16386791 -12312928 -10097052 -8251050 -4416424 -88119 -717671 -7945543
37651 -7945543 -14470000 -11832021 -2178879 3675720 231013 -7118201 -12182941 -16307379
37643 -16307379 -21971613 -24547387 -17908511 -4917221 5196806 8507867 8662672 8461614
37635 8461614 6576042 3317352 2448775 4727242 5389347 1148139 -4846248 -8019799
37627 -8019799 -8309486 -7865136 -6324751 -2112570 3921599 9760955 15617416 22644188
37619 22644188 28808773 29268221 21941558 11165290 4286636 4431363 7554557 7553691 3411755
37610C411755m157903j248244O25791J587910L867635N317598J995531l615128
37602G784945m848338j589080l31663k489066k007572L069815O551046N103768
37594A1243855L189455K627126j909585j1002396j5113594q727956M84694M725044
37586a4483357P328603J1645129J0630920K0906q906297m540288N693643O700176
37578A4089435q74030m936061l378506l518332m547777P24310Q387103O174919
37570A2121061n634704j2877232q524021J88104O322673R514517P415395k488185
37562F037608j1384726o768483O393641R880976J97723o710839k662113J469898
37554c546315j612667k867839L099988N503988k201497p819512j320761O424880
$$ plain form
37610 3411755 -746148 -1994392 -1368601 219309 4086944 9404542 11400073 7784945
37602 7784945 2936607 1347527 1015864 -1473202 -3480774 -410959 6140087 11243855
37594 11243855 14433310 17060436 15150851 4148455 -10965139 -19693095 -19208401 -14483357
37586 -14483357 -7154754 4490375 15121295 15142201 6235904 1695616 7389259 14089435
37578 14089435 13215405 8279344 4900838 1382506 -3165271 -2440961 5946142 12121061
37570 12121061 6486357 -6390875 -14914896 -14726792 -8404119 1110398 8525793 6037608
37562 6037608 -5347118 -12115601 -5721960 4159016 4356739 -2354100 -5016213 -3546315
37554 -3546315 -5158982 -8026821 -4926833 577155 -1624342 -9443854 -10764615 -4339735
37546d339735K508974n317205l257140L801444K192814n347723n073070L159649
37538a1671992O617067K060216r47569J792235L993314K289841N55289J62237
37530D850638j753018m170438l412426j531039k766643l893186L66772N284347
37522g024993K684254l089889q16358P180446O842569l923582j0374987m333361
37514a2855901L567591K358647k582811r06694N450318O734099K52684p655143
37506e637210r876242l455239Q431816J5862559J0427329k495411p891052j170767
37498D195783N739982L333749j906451r28388K179406o00148n377160l408110
37490C228663K193056J348005m861025n778545P2695K610022j785684m130805
$$ plain form
37546 -4339735 -1830761 -7147966 -10405106 -6603662 -4410848 -9758571 -14831641 -11671992
37538 -11671992 -5054925 -2994709 -3942278 -2150043 1843271 4133112 4688401 4850638
37530 4850638 3097620 -1072818 -4485244 -6016283 -8782926 -12676112 -12309340 -7024993
37522 -7024993 -4340739 -7430628 -8246986 -1066540 5776029 1852447 -8522540 -12855901
37514 -12855901 -9288310 -6929663 -9512474 -10419168 -4968850 1765249 2017933 -5637210
37506 -5637210 -15513452 -18968691 -10536875 5325684 15753013 13257602 5366550 4195783
37498 4195783 9935765 13269514 11363063 10434675 12614081 12013933 6636773 3228663
37490 3228663 5421719 6769724 1908699 -3869846 -3797151 -1187129 -2972813 -7103618
37482g103618R11304N623066K856854j934986q37010L076061K126710k354764
37474B363617k999780P47217K640444P91686m34891M56859k95141l630545m938121
37465e298655k059463N50292p78228k754258o57207L918726N543537K875616k75772
37456A064588r37736m01906j317699l594548m247095j197130L054394L119083
37448d458049k165149o130878j706509Q198213J2881965P458539j135031m228000
37440H715101k193260j017442k531742l576918k453145p49195N08237K192904
37432a105460M480454N720400M021411r74597o589656p509459j373555N682066
37424B351604M761174k920851o228972n28992M914499K089531k677558l89260
$$ plain form
37482 -7103618 -6192314 -569248 2287606 352620 -484390 2591671 4718381 2363617
37474 2363617 -636163 111054 2751498 3543184 3108293 3565152 3270011 -360534 -5298655
37465 -5298655 -7358118 -6807826 -7586054 -10340312 -10997519 -7078793 -1535256 1340360 1064588
37456 1064588 126852 -275054 -1592753 -5187301 -9434396 -10631526 -7577132 -4458049
37448 -4458049 -6623198 -12754076 -14460585 -6262372 6619593 14078132 12943101 8715101
37440 8715101 6521841 5504399 2972657 -604261 -3057406 -3806601 -3298364 -1105460
37432 -1105460 3374994 9095394 13116805 12142208 5552552 -1956907 -3330462 2351604
37424 2351604 7112778 4191927 -2037045 -2566037 2348462 4437993 1760435 1371175
37416A371175M501389K441973l440872l140235J124900r93147o644733k403944
37408g183494R562943R458010p942394j9658083p111836J4546443J7879287K025863
37400A1576739j0093196o734948J285248K881076R50833P83030J19309k925978
37392b157887l827814j05088L044124J341674j772198k162301j919668l699915
37384a1259073m228867K41328O366017P754913L804383p34771k838140l117245
37376d011455k348227o69727N63919K6989q17676O16790L869654N668069M141526
37367G039862M89631l096203m830431l315990J011193M639416M192877J051619
37359G181974l38745R55323J363742m72024p54939K589059M656389M99188n842318
$$ plain form
37416 1371175 5872564 8314537 4873665 1733430 2858330 1865183 -4779550 -7183494
37408 -7183494 2379449 11837459 3895065 -15763018 -22874854 -8328411 9550876 11576739
37400 11576739 1483543 -5251405 -3966157 -1085081 -134248 648782 768091 -2157887
37392 -2157887 -5985701 -6090789 -3046665 -1704991 -3477189 -5639490 -7559158 -11259073
37384 -11259073 -15487940 -15246612 -8880595 -1125682 2678701 1943930 -894210 -4011455
37376 -4011455 -6359682 -7029409 -6465490 -6438501 -7256177 -6639387 -2769733 2898336 7039862
37367 7039862 7529493 4433290 -397141 -3713131 -2701938 1937478 6130355 7181974
37359 7181974 6843229 7798552 9162294 8690270 7935331 10524390 15180779 15679967 9837649
37350I837649o027583J44116M446706K737902l48549j380062l842687q733924
37342c166432q135389K897258J4112284J1098653l656346j2400370o010178M638809
37334f21711N426357k165006o082525j614689M200662M320186M49596j547842
37326B365028k73621N74458j217393k672296k04051M150283M716512L10609l933772
37317C815757m172408k470898j377722M95337L347188K783372k223770m022439
37309c825583K572884R250008N279578m366796n478855K160608L599209o319064
37301B871989j2728665l575952J0506500J1019886k009283j1147013n633795O653405
37293d042928J1470666M696001n309639p996345j849977M349383K513292m008331
$$ plain form
37350 9837649 3810066 3954182 8400888 11138790 10790241 9410179 5567492 -3166432
37342 -3166432 -11301821 -8404563 5707721 16806374 13150028 749658 -5260520 -621711
37334 -621711 4804646 2639640 -3442885 -5057574 -856912 3463274 3912870 2365028
37326 2365028 2091407 2665865 1448472 -1223824 -1427875 2722408 7438920 7749529 3815757
37317 3815757 -356651 -2827549 -4205271 -3709934 -362746 2420626 196856 -3825583
37309 -3825583 -1252699 7997309 13276887 8910091 3431236 5591844 9191053 2871989
37301 2871989 -9856676 -13432628 -2926128 8093758 6084475 -5062538 -10696333 -4042928
37293 -4042928 7427738 12123739 6814100 -1182245 -3032222 1317161 3830453 -177878
37285a77878n096839J650827P997030P503334L090518m12386l348985o735847
37277D469774p836707n144799j842693j1003K621108O264149O188614P87051m204863
37268A290631m296507k352256j544320L61430M487972O376706L863412J659356
37260I846424K137798J33819o294305r331671m071872J624544j56414l808756
37252i920433p14084N090384M717131O92281J246473M160829J467841l940659
37244B799763k401952M085726L916584l711517o781793j167711K383106l016515
37236c894309q685204m829255M201441P589394L652421k05911R08921M127528
37228B865026L906318q32300m866493k720569L088062M021795j837501n646005
$$ plain form
37285 -177878 -5274717 -3623890 4373140 11876474 14966992 14554606 11205621 4469774
37277 4469774 -3366933 -8511732 -10354425 -10365428 -7744320 -1480171 4708443 5495494 1290631
37268 1290631 -3005876 -5358132 -6902452 -6541022 -2053050 4323656 8187068 9846424
37260 9846424 11984222 12118041 5823736 -3507935 -7579807 -5955263 -6111677 -9920433
37252 -9920433 -10634517 -5544133 -827002 -134721 1111752 5272581 6740422 2799763
37244 2799763 397811 4483537 8400121 4688604 -2093189 -3260900 -877794 -3894309
37236 -3894309 -12579513 -17408768 -13207327 -5617933 -1965512 -2171423 -1262502 2865026
37228 2865026 6771344 5939044 1072551 -1648018 1440044 5461839 3624338 -2021667
37220b021667j514727L421430J076218l345960q57799M371584K074453m847945
37212a644413m543566K509968M009059j892184k895488N237889J0218570L461129
37204A4460964o507369q645837m209451P15036N118531P704533L601343n172142
37196G065608p305104J038436Q089471M180189l691430n297673l853397o626634
37188f400534q804331j682406R700886J2440031N704432N57903J551581J999943
37180A5067505k042956n396774l772198l63472O89766L4619l71714o67953j032165
37171B144658q44356q12318j682171j001284L751542Q711198O112739m912609
37163A1467399j4658592j2930312n23713J1583562J3500517N548846l531691o376540
$$ plain form
37220 -2021667 -3536394 -114964 961254 -2384706 -3242505 1129079 3203532 -1644413
37212 -1644413 -6187979 -3678011 331048 -1561136 -4456624 781265 10999835 14460964
37204 14460964 7953595 -692242 -4901693 -4186657 931874 8636407 12237750 7065608
37196 7065608 -239496 798940 8888411 13068600 9377170 4079497 226100 -6400534
37188 -6400534 -15204865 -16887271 -7186385 5253646 10958078 11515981 13067562 15067505
37180 15067505 13024549 7627775 3855577 3492105 4181871 4216490 3844776 3176823 2144658
37171 2144658 1300302 487984 -1194187 -2195471 1556071 10267269 16380008 11467399
37163 11467399 -3191193 -16121505 -16645218 -5061656 8438861 13987707 10456016 4079476
37155D079476l665795p09916m3556m29388j177963k550244k484159J485980O512569
37146A017004O324778J26322n755934o333040k685016K221763N847473M013027
37138D776377m876245j2498293q043023M371844Q077825j262423p300346J294412
37130a5459872J1369844O125601o850072p781886K662025N394198m011369p583361
37122a6134892M455256J6449847J1594920k989117r325530m989424j281675k353133
37114d573748j719634K992108N765708L532711P78302P79828J179072N05824R98135
37105A0238306K277522N3536n306691o522992o05638M761238K445306k811916
37097D528671k469754J423412J32557n980395p018629L26672P232066O632405
$$ plain form
37155 4079476 413681 -296235 -339791 -769179 -1947142 -4497386 -6981545 -5495565 1017004
37146 1017004 7341782 7468104 1712170 -4620870 -7305886 -5084123 763350 4776377
37138 4776377 -99868 -12598161 -20641184 -16269340 -8191515 -9453938 -16754284 -15459872
37130 -15459872 -4090028 2035573 -4814499 -12596385 -9934360 -4540162 -8551531 -16134892
37122 -16134892 -11679636 4770211 16365131 13376014 4050484 -938940 -2220615 -4573748
37114 -4573748 -6293382 -3301274 2464434 5997145 6775447 7555275 8734347 9240171 10238306
37105 10238306 12515828 12569364 7262673 739681 134043 4895281 7340587 4528671
37097 4528671 2058917 3482329 3614886 -2365509 -9384138 -9057466 -1825400 4807005
37089D807005K722192J638517J728431m35596k375497j642695k301866o900947
37081b760456q505576r32089Q363744P405389j488246m613261K217801Q458723
37073H146029O232806Q92844k0718J732579M31755l945408o840989n305305J14071
37064A437664N547783M972529l216762j0650949p324088L863208R426252L780856
37056G836493l958581m664916r55705N77866p6463J82460Q73061R59925K376030
37047C150170M934857L940462j578805m694702q64550L690957R73185o303282
37039C248292q535562k453501N716997Q365905L531853m073641o739142j725918
37031b664717L706770R41654o100702m857034N881110J1528865L343661p235984
$$ plain form
37089 4807005 7529197 9167714 10896145 10460549 8085052 6442357 4140491 -2760456
37081 -2760456 -11266032 -12198121 -3834377 3571012 2082766 -2530495 -312694 8146029
37073 8146029 14378835 15271679 15250961 16983540 17415295 13469887 6628898 1323593 1437664
37064 1437664 6985447 11957976 8741214 -1909735 -9233823 -5370615 4055637 7836493
37056 7836493 3877912 -787004 -1742709 -1164843 -1241306 -1058846 -185785 774140 3150170
37047 3150170 8085027 12025489 10446684 5751982 4887432 8578389 9551574 3248292
37039 3248292 -5287270 -7740771 -2023774 6342131 9873984 5800343 -938799 -2664717
37031 -2664717 1042053 1983707 -4116995 -8974029 -3092919 8435946 11779607 4543623
37023D543623n798139L284761N057309k468375o925369j496094O605776Q520725
37015A1324217M441544n52586l861455n425453n070374k669207O41011K449949
$$ plain form
37023 4543623 -1254516 2030245 7087554 4619179 -2306190 -3802284 2803492 11324217
37015 11324217 15765761 15213175 11351720 5926267 855893 -1813314 -1172303 1277646
$$ [...]
##END NTUPLES=NMR SPECTRUM
##END=
