##TITLE=31Pdec_LR-0154-OMe-CH2Cl2
 CD3CN, 64 sc
 15.2.2023
##JCAMPDX= 6.0         $$ Bruker NMR JCAMP-DX V2.0
##DATA TYPE= NMR SPECTRUM
##DATA CLASS= NTUPLES
##ORIGIN= UXNMR, Bruker Analytische Messtechnik GmbH
##OWNER= root
$$ XWIN-NMR		Version 3.5
$$ Wed Feb 15 14:34:30 2023 Russian Standard Time (UT+4h)  she@DPX200
##.OBSERVE FREQUENCY= 81.013821
##.OBSERVE NUCLEUS= ^31P
##.ACQUISITION MODE= SIMULTANEOUS
##.ACQUISITION SCHEME= undefined
##.AVERAGES= 64
##.DIGITISER RES= 16
##SPECTROMETER/DATA SYSTEM= spect
##.PULSE SEQUENCE= zgpg30
##.SOLVENT NAME= CDCl3
##.SHIFT REFERENCE= (INTERNAL, CDCl3, 0, 248.564)
##AUDIT TRAIL= $$ (NUMBER, WHEN, WHO, WHERE, WHAT)
$$ ##TITLE= Audit trail, XWIN-NMR		Version 3.5
$$ ##JCAMPDX= 5.01
$$ ##ORIGIN= Bruker BioSpin GmbH
$$ ##OWNER= she
$$ F:/spectra/data/she/nmr/P31/1/pdata/1/auditp.txt
$$ ##AUDIT TRAIL=  $$ (NUMBER, WHEN, WHO, WHERE, WHAT)
(   1,<2023-02-15 14:33:20.56 +0400>,<she>,<DPX200>,
      <continue with go, POWCHK disabled, PULCHK disabled
       configuration hash MD5:
       00 E9 B6 7A A2 85 ED C7 34 08 36 98 17 FE 4E 26
       data hash MD5: 32K
       5A BD 01 9D 54 8F 9E 93 52 40 62 B0 E0 0E C6 EE>)
(   2,<2023-02-15 14:33:25.12 +0400>,<she>,<DPX200>,
      <Start of raw data processing
       efp BC_mod = 2 LB = 1 FT_mod = 6 PKNL = 1 PHC0 = -10957.14 PHC1 = 16.21271 SI = 64K 
       data hash MD5: 64K
       A8 A2 02 3B 04 F8 A4 32 B1 F5 82 74 AA F4 D2 03>)
(   3,<2023-02-15 14:33:38.32 +0400>,<she>,<DPX200>,
      <pk PHC0 = -4.854159 PHC1 = 0 
       data hash MD5: 64K
       90 98 BD 67 B7 05 C2 C2 50 80 A2 91 25 00 22 C6>)
(   4,<2023-02-15 14:33:47.31 +0400>,<she>,<DPX200>,
      <abs ABSG = 5 
       data hash MD5: 64K
       E6 B6 9E A5 55 C6 77 F0 DD 8A 9D CA 10 F8 BC 94>)
$$ ##END=
$$ 
$$ hash MD5
$$ A1 31 97 57 92 50 FF 08 FA 69 6F D8 28 2C AD D1
##$RELAX= 
##$RELAX= 
##$RELAX= 
##$RELAX= 
##$RELAX= 
##$RELAX= 
##$RELAX= 
##$RELAX= 
##$RELAX= 
$$ Bruker specific parameters
$$ --------------------------
##$DU= <F:/spectra>
##$EXPNO= 1
##$NAME= <P31>
##$PROCNO= 1
##$TYPE= <nmr>
##$USER= <she>
##$AMP= (0..31)
100 100 100 100 100 100 100 100 100 100 100 100 100 100 100 100 100 100 
100 100 100 100 100 100 100 100 100 100 100 100 100 100 
##$AQSEQ= 0
##$AQ_mod= 1
##$AUNM= <au_zg>
##$AUTOPOS= <>
##$BF1= 81.014009
##$BF2= 200.13
##$BF3= 200.13
##$BF4= 200.13
##$BF5= 200.13
##$BF6= 200.13
##$BF7= 200.13
##$BF8= 200.13
##$BYTORDA= 1
##$CFDGTYP= 0
##$CFRGTYP= 5
##$CHEMSTR= <none>
##$CNST= (0..31)
1 1 145 1 1 1 1 1 1 1 1 1 1 1 1 1 1 1 1 1 1 1 1 1 1 1 1 1 1 1 1 1 
##$CPDPRG= <waltz16>
##$CPDPRG1= <>
##$CPDPRG2= <waltz16>
##$CPDPRG3= <>
##$CPDPRG4= <mlev>
##$CPDPRG5= <mlev>
##$CPDPRG6= <mlev>
##$CPDPRG7= <mlev>
##$CPDPRG8= <mlev>
##$CPDPRGB= <>
##$CPDPRGT= <>
##$D= (0..31)
0 1 0 0 0 0 0 0 0 0 0 0.03 2e-05 3e-06 0 0 0 0 0 0 0 0 0 0 0 0 0 0 0 0 
0 0 
##$DATE= 1676457123
##$DBL= (0..7)
120 120 120 11 120 120 24 19 
##$DBP= (0..7)
150 150 150 150 150 150 150 150 
##$DBP07= 0
##$DBPNAM0= <>
$$ [...]
##$SUBNAM3= <"">
##$SUBNAM4= <"">
##$SUBNAM5= <"">
##$SUBNAM6= <"">
##$SUBNAM7= <"">
##$SUBNAM8= <"">
##$SUBNAM9= <"">
##$SW= 501.771253377433
##$SWIBOX= (0..15)
0 1 3 0 0 0 0 0 0 0 0 0 0 0 0 0 
##$SW_h= 40650.406504065
##$TD= 32768
##$TD0= 1
##$TE= 0
##$TE2= 300
##$TE3= 300
##$TEG= 300
##$TL= (0..7)
0 120 53 12 22 120 120 120 
##$TP= (0..7)
150 150 150 150 150 150 150 150 
##$TP07= 0
##$TPNAME0= <>
##$TPNAME1= <>
##$TPNAME2= <>
##$TPNAME3= <>
##$TPNAME4= <>
##$TPNAME5= <>
##$TPNAME6= <>
##$TPNAME7= <>
##$TPOAL= (0..7)
0.5 0.5 0.5 0.5 0.5 0.5 0.5 0.5 
##$TPOFFS= (0..7)
0 0 0 0 0 0 0 0 
##$TUNHIN= 0
##$TUNHOUT= 0
##$TUNXOUT= 0
##$USERA1= <user>
##$USERA2= <user>
##$USERA3= <user>
##$USERA4= <user>
##$USERA5= <user>
##$V9= 5
##$VALIST= <valist>
##$VCLIST= <CCCCCCCCCCCCCCC>
##$VD= 0
##$VDLIST= <DDDDDDDDDDDDDDD>
##$VPLIST= <PPPPPPPPPPPPPPP>
##$VTLIST= <TTTTTTTTTTTTTTT>
##$WBST= 1024
##$WBSW= 4
##$XGAIN= (0..3)
0 0 0 0 
##$XL= 0
##$YL= 0
##$YMAX_a= 3207
##$YMIN_a= -2034
##$ZGOPTNS= <>
##$ZL1= 120
##$ZL2= 120
##$ZL3= 120
##$ZL4= 120
##$ABSF1= 248.5645
##$ABSF2= -253.2056
##$ABSG= 5
##$ABSL= 3
##$ALPHA= 0
##$AQORDER= 0
##$ASSFAC= 0
##$ASSFACI= 0
##$ASSFACX= 0
##$ASSWID= 0
##$AUNMP= <proc_1d>
##$AZFE= 0.1
##$AZFW= 0.5
##$BCFW= 0
##$BC_mod= 2
##$BYTORDP= 0
##$COROFFS= 0
##$CY= -3
##$DATMOD= 1
##$DC= 0
##$DFILT= <>
##$DTYPP= 0
##$F1P= 0
##$F2P= 0
##$FCOR= 1
##$FTSIZE= 65536
##$FT_mod= 6
##$GAMMA= 0
##$GB= 0
##$INTBC= 1
##$INTSCL= 6.047779e-11
##$ISEN= 30
##$LB= 1
##$LEV0= 0
##$LPBIN= 0
##$MAXI= 10000
##$MC2= 0
##$MEAN= 0
##$ME_mod= 0
##$MI= 50
##$NCOEF= 0
##$NC_proc= -9
##$NLEV= 6
##$NOISF1= 182.463
##$NOISF2= 159.3651
##$NSP= 0
##$NTH_PI= 0
##$NZP= 0
##$OFFSET= 248.5645
##$PC= 4
##$PHC0= -10961.99
##$PHC1= 16.21271
##$PH_mod= 1
##$PKNL= yes
##$PPARMOD= 0
##$PSCAL= 0
##$PSIGN= 0
##$REVERSE= no
##$SF= 81.0140089999694
##$SI= 65536
##$SIGF1= 159.3651
##$SIGF2= -187.1042
##$SINO= 113.3802
##$SIOLD= 16384
##$SREGLST= <1H.CDCl3>
##$SSB= 0
##$STSI= 65536
##$STSR= 0
##$SW_p= 40650.406504065
##$SYMM= 0
##$S_DEV= 0
##$TDeff= 32768
##$TDoff= 0
##$TI= <>
##$TILT= no
##$TM1= 0
##$TM2= 0
##$TOPLEV= 0
##$USERP1= <user>
##$USERP2= <user>
##$USERP3= <user>
##$USERP4= <user>
##$USERP5= <user>
##$WDW= 1
##$XDIM= 65536
##$YMAX_p= 494172012
##$YMIN_p= -74710184
$$ End of Bruker specific parameters
$$ ---------------------------------
##NTUPLES= NMR SPECTRUM
##VAR_NAME=  FREQUENCY,     SPECTRUM/REAL,   SPECTRUM/IMAG
##SYMBOL=    X,             R,               I
##VAR_TYPE=  INDEPENDENT,   DEPENDENT,       DEPENDENT
##VAR_FORM=  AFFN,          ASDF,            ASDF
##VAR_DIM=   65536,         65536,           65536
##UNITS=     HZ,            ARBITRARY UNITS, ARBITRARY UNITS
##FACTOR=    0.620285442955139, 1,           1
##FIRST=     20137.2065510682, 0,            0
##LAST=      -20513.1999529968, 0,           0
##MIN=       -20513.1999529968, -74710184,   0
##MAX=       20137.2065510682, 494172012,    0
$$ Real data points
##PAGE= N=1
##DATA TABLE= (X++(R..R)), XYDATA
$$ [...]
12850A9607319n238848m502215l63545j030033m503103Q74179J4313742J6267117
12842C5424613l508696k4895423k1726122J472149J6228484R252224n032685j0659246
12834c444702q852337o326224k801637J844356K177605k160159j958040O578167
12826a4942971J2550614N635529p661929j2675926n298999O387546J3624785J2661583
12818A0280232M638962l178803k011058O196846Q500282l23875q379597n167966
12810A0555023J489192J79945l233943K539036R856912K425115j3107736j1511656
12802h08112J0934557K5871149J3107410j0706307j9033036j2230262p824266
12795f88867q742116m931910J505027j901112j2142739j0703806N739147J6015653
$$ y = [19607319, 14368471, 9866256, 9502711, 8472678, 3969575, 4843754, 19157496, 35424613, 31915917, 7020494, -14705628, -13233479, 2995005, 12247229, 7214544, -3444702, -12297039, -18623263, -21424900, -19580544, -17402939, -19563098, -21521138, -14942971, -2392357, 3243172, -4418757, -17094683, -22393682, -16006136, -2381351, 10280232, 14919194, 11740391, 9729333, 15926179, 24426461, 24102586, 15722989, 10555023, 12044215, 12224160, 8990217, 11529253, 21386165, 23811280, 10703544, -808112, 10126445, 35997594, 49105004, 38398697, 19365661, 7135399, -688867, -9430983, -14362893, -12857866, -14758978, -26901717, -37605523, -31866376, -15850723]
12787a5850723N789627r580955p752444P735725J4493681M897088n093596j220574
12779f582171J0222331J4367671P694709j763805p059746o805371j391770O468735
12771A5150583R470481K867078o453468p176971n49466O16170p111655j0703957
12763c891205j997259P182041L960824l268842O72157R666236N391975r133297
12755H582630j1221203L408151J1457759K87183j1437939o661860J796366k809997
12747f598910r567087j385412J0228027L957703j0432826n874482J3334008J5135388
12739H796409n805991j6067162K694011K3198209J5095469j0295130k1009209
12732c393394r569292O043756J1705258O390900o375117j7752462j4449031L205542
$$ y = [-15850723, -10061096, -19642051, -27394495, -19658770, -5165089, -268001, -5361597, -6582171, 3640160, 18007831, 25702540, 23938735, 16878989, 10073618, 8681848, 15150583, 24621064, 27488142, 21034674, 13857703, 13308237, 13924407, 6812752, -3891205, -5888464, 1293577, 5254401, 1985559, 2657716, 12323952, 17715927, 8582630, -2638573, 769578, 12227337, 12514520, 1076581, -5585279, -3788913, -6598910, -16165997, -17551409, -7323382, -3365679, -13798505, -19672987, -6338979, 8796409, 2990418, -13076744, -10382733, 12815476, 27910945, 17615815, -3393394, -12962686, -6918930, 4786328, 11177228, 4802111, -12950351, -27399382, -24193840]
12724b4193840J4708040O556749o403209m330053O102116N142228n880101q755246
12716a7053316o30342L754865O15344K612152J2626193J5437246L282137r604576
12708A1039703q213425K020077N855736k58548p389908q276888l768026J828678
12700g162601N953631Q521156R257419N471260m376988j4643416j6529791j0328295
12692b3837625m954740k090841O482168J9074980J8042830k911431k1132184j4104316
12684b5431159O488316J2705568K507519k497353M292174P335665P49572j765982
12676D384320N477416Q902128R10398o691194m774910j956031o713729j2353247
12668a2814849j0291718k874108N108656J2248913J2485837m36248j5125092j0511323
$$ y = [-24193840, -9485800, -2929051, -9332260, -13662313, -7560197, -2417969, -8298070, -17053316, -17683658, -13928793, -13313449, -10701297, 1924896, 17362142, 20644279, 11039703, 2826278, 4846355, 10702091, 10443543, 3053635, -5223253, -8991279, -7162601, -1208970, 7312186, 16569605, 22040865, 17663877, 3020461, -13509330, -23837625, -28792365, -30883206, -24401038, -5326058, 12716772, 9805341, -11326843, -25431159, -18942843, -6237275, -3729756, -6227109, -1934935, 5400730, 6150302, 4384320, 9861736, 18763864, 19674262, 12983068, 8208158, 6252127, -461602, -12814849, -23106567, -25980675, -20872019, -8623106, 3862731, 3426483, -11698609, -22209932]
12660b2209932J1025081K1737780R424954m603356j519244O816245L259274n371374
12652A8559428n828125l731440q290139j1090320m148960o08555j1353285j8543093
12644d5034489j824925K3751486K7724872J1085895M69742L531220M146637k116386
12636B1734052k747296J189098o104211k0930544j8013923P688441K7118336J8173299
12628B8107252m954749j7373981j5432970q088566K659427J4986954J7168811
12621A7072178K663967j5182051j8717401q453563J911632N215338M524591L334865
12613g630444J930853n2382l218870o772578n591271L935215J4287037J3083836
12605I971396J101432o881508k292036P097139J0436901O207072j693420r057946
$$ y = [-22209932, -11184851, 10552929, 19977883, 15374527, 13855283, 20671528, 23930802, 18559428, 12731303, 8999863, 709724, -10380596, -14529556, -15138111, -26491396, -45034489, -46859414, -23107928, 4616944, 15702839, 16172581, 19703801, 23850438, 21734052, 18986756, 20175854, 14071643, -6858901, -24872824, -17184383, 9933953, 28107252, 23152503, 5778522, -9654448, -17743014, -15083587, -96633, 17072178, 19736145, 4554094, -14163307, -22616870, -20705238, -15489900, -10965309, -7630444, -5699591, -5751973, -8970843, -15743421, -21334692, -17399477, -3112440, 9971396, 11072828, 4191320, 1899284, 8996423, 19433324, 25640396, 23946976, 14889030]
12597A4889030j0062096k648198L213586l809841j6433560j5935176j420316P786112
12589b4420459L902046K363650J1956963J6696766L855864j0518840n549444J0284308
12581H570854J2516421j434709j1388828o786885J952009L868900K56511m905101
12573B649172j1320233j5539045j0332117M505443J8872755K2731691J4646684
12566B6214350O19901j0214171j0838945l056278L381516K746004j44148J6832
12558H725061l08588n472444j0543524q457134j337752M344400P824078J0180910
12550D955007P797548M18344k068120O030679J2380711K785823j4383166j7926921
12542a0095n458767L977989Q7980n457661j646002L981540K90573q025573q223789
$$ y = [14889030, 4826934, 2178736, 5392322, 1582481, -14851079, -30786255, -32206571, -24420459, -20518413, -18154763, -6197800, 10498966, 14354830, 3835990, -1713454, 8570854, 21087275, 19652566, 8263738, 1476853, 3428862, 7297762, 7554273, 2649172, -8671061, -24210106, -34542223, -30036780, -11164025, 11567666, 26214350, 26834251, 16620080, 5781135, 2724857, 6106373, 8852377, 8708229, 8725061, 8416473, 2944029, -7599495, -16056629, -17394381, -13049981, -5225903, 4955007, 12752555, 13170899, 11102779, 17133458, 29514169, 32299992, 17916826, -10095, -5468862, -1490873, -1402893, -6860554, -8506556, -4525016, -4234443, -12260016, -20483805]
12533b0483805J356498J0977059J3707679J0881881O043850J047085k581043l943337
12525A7005867m829263p999353j2466272j2291660k263531J3747829K1966734
12518A2870351J1722457r182330j8997410p214174J0738739J1782868o025931
12511E694570k2203302j9388587r98539J6471907K0284157R515980o334489j4691440
12503a1649743j0726933j722923K580666J646747J284567K821823K636691J46058
12495a2983047j729235k606624l707256k967181J071983L319793p44546m900326
12487b5246439J55408J1201734J6391852J3152570R080940N973476j658814j0909771
12479A8140956j0442415j057789O55501j2189005k2881051j4255936O321465J7731031
$$ y = [-20483805, -19127307, -8150248, 5557431, 16439312, 22483162, 23530247, 20949204, 17005867, 12176604, 4177251, -8289021, -20580681, -22844212, -9096383, 12870351, 24592808, 15410478, -3586932, -10801106, -62367, 11720501, 5694570, -16508732, -35897319, -36895858, -20423951, -139794, 9376186, 3041697, -11649743, -22376676, -24099599, -21518933, -19872186, -18587619, -15765796, -13129105, -12983047, -14712282, -17318906, -21026162, -23993343, -22921360, -19601567, -20346113, -25246439, -25091031, -13889297, 2502555, 15655125, 24736065, 30709541, 29050727, 18140956, 7698541, 6640752, 7296253, -4892752, -27773803, -42029739, -35708274, -17977243]
12471a7977243J2051621r73824r192409p020459M138464J4348894J0842647m836246
12463A381445j3311879k428856J2708617R428742r611680k0825062j3661480j060668
12455c7380821M871291P895085J2188194J0030749l163850j4503966q995165P523330
12447b1535153J4963130O367313l969648j687106Q453811J0203895k448180j7368234
12439g020172j8010653j816838J6736195K1017389Q818746o974820j3269766r450628
12431i970547m114639k358990p21852N051845J1830945J2527253N971519j417460
12423A6798074m548217n365394o881958o577455j620688K998459K96414n571816
12415a0472581k645594R316851J3959748J030519j5451455j4165490L527631J5146285
$$ y = [-17977243, -5925622, -6899446, -16091855, -23112314, -18973850, -4624956, 6217691, 1381445, -11930434, -14359290, -1650673, 7778069, -1833611, -22658673, -36320153, -37380821, -32509530, -24614445, -12426251, -2395502, -5559352, -20063318, -29058483, -21535153, -6572023, -204710, -4174358, -5861464, 2592347, 12796242, 10348062, -7020172, -25030825, -26847663, -10111468, 10905921, 19724667, 12749847, -519919, -9970547, -14085186, -16444176, -17166028, -12114183, -283238, 12244015, 18215534, 16798074, 12249857, 6884463, 2505, -6574950, -8195638, -5197179, -4900765, -10472581, -13118175, -3801324, 10158424, 11188943, -4262512, -18428002, -14900371, 245914]
12407B45914Q296589m475682o430993J086663N682636L145178j375613n161049
12399A013643r173236j0416232m456789M486977O199857r87233p072978m436210
12391b4842201K847893O986073O490281M311208K469898K577402N502888O888283
12383A3231725L40293j0572259j2504178j139469R934783Q560687K018841K489758
12375A2360181M417779m681489j7108316j2578212O635721J3813653j355448j4885670
12367a3381801n646696J1962450J2760346K57341l686179L262336M185239m194906
12359E518130p136372j214070r28486j0080552j1959298J184478J1746367M919491
12351g950312o069986j670104J1750923J2962910L52801p073162m61080Q157909
$$ y = [245914, 8542503, 4066821, -2364172, -1277509, 4405127, 7550305, 6174692, 1013643, -8159593, -18575825, -23032614, -18545637, -12345780, -13333013, -20405991, -24842201, -21994308, -15008235, -8517954, -4206746, -1736848, 840554, 6343442, 13231725, 13572018, 2999759, -9504419, -10643888, -709105, 7851582, 9870423, 12360181, 16777960, 12096471, -5011845, -17590057, -10954336, 2859317, 1503869, -13381801, -19028497, -7066047, 5694299, 5951640, 2265461, 5527797, 9713036, 5518130, -1618242, -2832312, -3760798, -13841350, -25800648, -24616170, -12869803, -7950312, -14020298, -15690402, -3939479, 9023431, 9376232, 2303070, 1841990, 9999899]
12343I999899Q217327M962661M838321K348566p496340j4635198o081605J1604873
12335A3758504J6467445N48270j6799653j3581856M372820J0948970l022770j5904724
12327c212994o893398J2116104J3037351o496355j8741172o204771J3520557J4064348
12319A1189670l358510j5087889q552867M963715R396348L052328l693263k391505
12311d481973M686356P658667J481543n334313n19010J2534432J5475778M70899
12303C1972379j6430645j7158918o390730r79256l106831j206778O413158P700169
12295H12548j892190j0933779r548096k038314L313826N490152O040764L239279
12287e515810k815114o983300n879355j399696M734072J1709429J3589672L745974
$$ y = [9999899, 18217226, 23179887, 28018208, 30366774, 22870434, 8235236, 2153631, 13758504, 30225949, 30774219, 13974566, 392710, 4765530, 15714500, 12691730, -3212994, -10106392, 2009712, 15047063, 8550708, -10190464, -16395235, -2874678, 11189670, 7831160, -7256729, -15809596, -10845881, -1449533, 1602795, -2090468, -4481973, 204383, 7863050, 9344593, 4010280, 3491270, 16025702, 31501480, 31972379, 15541734, -1617184, -8007914, -8987170, -12094001, -13300779, -6887621, 812548, -1079642, -12013421, -21561517, -23599831, -20286005, -14795853, -8755089, -5515810, -8330924, -15314224, -21193579, -22593275, -17859203, -6149774, 7439898, 11185872]
12279A1185872j1305344j4711437j736583J2244400J3269857O672463M578993
12272B0198221O710288M873413k269764j0332545j7292693j9377614p812468J6381638
12264h921524L2100757J9881120r525469k5312049j4855916M238185J1368396
12257H973500N864201j457680m606308l113247J996292N577531R06166q921432
12249E219023j0997539j63098J2292212J4207524P985341K525540j591080q397146
12241B1080777j4362109j1963323k992191K522371N68509k750424k231917m01666
12233a0529973p52111q98342L095855R165255J0649288N133837j038938L58841
12225A5183712P904580R648514k055151j7697253k0455311q987378k38386n174108
$$ y = [11185872, -119472, -14830909, -16567492, -4323092, 8946765, 15619228, 20198221, 26908509, 31781922, 29512158, 19179613, 1886920, -17490694, -25303162, -8921524, 23179233, 43060353, 33534884, 8222835, -6633081, -2394896, 8973500, 14837701, 13380021, 8773713, 5660466, 7656758, 13234289, 14140455, 5219023, -5778516, -5941614, 6350598, 20558122, 28543463, 31069003, 29477923, 21080777, 6718668, -5244655, -8236846, -5714475, -5145966, -7896390, -10128307, -10529973, -11282084, -12180426, -9084571, 80684, 10729972, 15863809, 14824871, 15183712, 23088292, 32736806, 30681655, 12984402, -7470909, -16458287, -16696673, -21870781]
12217b1870781j2430632n696586J0820118J7891065Q989296k048585k634949K937526
12209d043528N126124M781323P606560J0517473N267801o445311j2391396o400603
12201D018443K920132M595006J58871n89709M668880P649097K705903m744110
12193B1382513o970366m717793l331406l078930r68150J174586n66168l005384
12185h1098P57478Q621198J0367041K835981o038330j0425386j2414218j1731019
12177a8108353l283051R269117J2098478K320469m007050L459801J1529561N348414
12169A8627386o339265o922914j82939N3691j945800P022753J8415863J0857519
12161C9586294j1229207j9463129o185994M210462k842457j0613542m990120J198649
$$ y = [-21870781, -34301413, -39997999, -29177881, -11286816, -2297520, -4346105, -6981054, -4043528, 1082596, 5863919, 13470479, 23987952, 29255753, 22810442, 10419046, 4018443, 6938575, 11533581, 11692452, 11102743, 15771623, 23420720, 26126623, 21382513, 14412147, 9694354, 6362948, 3284018, 2315868, 3490454, 2924286, -81098, 676380, 9297578, 19664619, 22500600, 16462270, 6036884, -6377334, -18108353, -21391404, -12122287, -23809, 2296660, -1710390, 1749411, 13278972, 18627386, 12288121, 5365207, 5182268, 5235959, 3290159, 10312912, 28728775, 39586294, 28357087, 8893958, 2707964, 6918426, 4075969, -6537573, -11527693, -10329044]
12153a0329044l347067m739011P409354J4015090j906788j9922061j1510179J1941082
12145a8388624J6234343j079324j0116430J505184J4237593J3448344P188559
12138B3029645K004250p765042j8417058j3709734N907787J7032536Q194127l255262
12130A3021249j610363L870296Q71361l736021j040874J112009m487940o795275
12122A204442L366984J2456122N513806o659615n423786L583863K395991n275217
12114A1162590q92328J2975365J3528636m048391j7032090r879515N549597J2437101
12106B3800965J0124651L756069o680382j5758750j0246662Q709760J7729653
12099C1435304J565762k2520516k7922118j4270204p17271O353263J5701642K5549488
$$ y = [-10329044, -13676111, -18415122, -11005768, 3009322, 1102534, -18819527, -30329706, -18388624, -2154281, -3233605, -13350035, -11844851, 2392742, 15841086, 23029645, 25033895, 17268853, -1148205, -14857939, -8950152, 8082384, 16276511, 13021249, 11410886, 15281182, 16152543, 12416522, 11375648, 12487657, 7999717, 1204442, 4571426, 17027548, 22541354, 15881739, 10457953, 14041816, 16437807, 11162590, 10270262, 23245627, 36774263, 32725872, 15693782, 5814267, 11363864, 23800965, 33925616, 37681685, 31001303, 15242553, 4995891, 13705651, 31435304, 33001066, 10480550, -17441568, -31711772, -32429043, -26075780, -10374138, 15175350]
12091A5175350K0664598o47064j7894627j5621965k943715L787574L174287J691260
12083G385698k612382j3399577k1126785j2460701P545255J8514678J1376368
12076d777446j491041n588389j306111L322739N781337P615099P661951M258480
12068A5476619o50552m909952q929872j1273023p702822R79664O865075N559720
12060d585143J814158k34796l500551q171075n976949O029045J5952390J3444873
12052A4771952O071183M740351K600483j1840607k7525428k1714533K049527J3182458
12044a7664614j416669j6650173o831998J6581031K4056304J0751449j537227
12037G288103J039213Q501887O671210l378483j0834667j0472748o319309l761832
$$ y = [15175350, 35839948, 35192884, 17298257, 1676292, -1267423, 2520151, 5694438, 7385698, 4773316, -8626261, -29753046, -42213747, -34668492, -16153814, -4777446, -6268487, -11856876, -13162987, -9840248, -4058911, 3556188, 11218139, 15476619, 14826067, 9916115, 986243, -10286780, -17989602, -17009938, -10144863, -4585143, -2770985, -3005781, -6506332, -14677407, -20654356, -14625311, 1327079, 14771952, 20843135, 25583486, 28183969, 16343362, -11182066, -32896599, -30847072, -17664614, -19081283, -35731456, -42563454, -25982423, -1926119, 8825330, 7288103, 8327316, 16829203, 23500413, 20121930, 9287263, -1185485, -7504794, -11266626]
12029a1266626k510514J447947P554232Q338181j00758r192472q402070k281228
12021a6413308m272905j2885123j0108352J0260971K8640253K5148154O212602
12014B6582292p359716q065645k895745L569213R777894P195818j0679391l0213209
12006a2088489k7558149r87832K2310299J9061733k267545j5302256r079146L202585
11998b2708800N933043Q41716M31611P519734J0820900L103056n862129l743121
11990c663990L817815J745528q099792p979753N079283J0739209k271729j5426105
11982a6059534q881949O111384N197134j0230040j6752082o026688O334223Q492029
11974c1815523O134795N334483K356835l154662k264413Q177090J8133989J8799474
$$ y = [-11266626, -13777140, -12329193, -4774961, 3563220, 3462462, -5730010, -14132080, -16413308, -20686213, -33571336, -43679688, -33418717, -4778464, 20369690, 26582292, 19222576, 11156931, 8261186, 11830399, 21608293, 28804111, 18124720, -12088489, -39646638, -40634470, -18324171, 737562, -1529983, -16832239, -25911385, -22708800, -16775757, -15934041, -15502430, -7982696, 2838204, 5941260, 79131, -3663990, 153825, 1899353, -6200439, -14180192, -9100909, 1638300, -633429, -16059534, -24941483, -18830099, -13632965, -23863005, -40615087, -46641775, -40307552, -31815523, -25680728, -20346245, -17989410, -21144072, -23408485, -15231395, 2902594, 21702068]
11966B1702068J2656137M070498p504098j8646400j8718063m525842J0501203
11959d64497J0768245k765264j4720116j3005683n25840Q896676N402131n060101
11951a1474449p445132J321710O513733j795904j1030070m703885J0396707J3938156
11943d279134L080059o781894q907244j0006120q892237L956094K1293091K0013197
11935I475812l053504k0516789j2801644M840744R359697L615343L838985R943875
11927D702519J0035651L758601O32428J725616N17132k900824l276323j115161
11919A4079639L99074L439495Q531783O873491o956454k1204836j9969793n217949
11911b0025550P233734R376431O270000L554499J548500o61777m198438r984864
$$ y = [21702068, 34358205, 38428703, 30924605, 12278205, -6439858, -10965700, -464497, 10303748, 7538484, -7181632, -20187315, -20713155, -11816479, -6414348, -11474449, -18919581, -17597871, -11084138, -12880042, -23910112, -28613997, -18217290, -4279134, -1199075, -7980969, -16888213, -26894333, -35786570, -31830476, -10537385, 9475812, 6422308, -14094481, -26896125, -22055381, -12695684, -9080341, -5241356, 4702519, 14738170, 18496771, 19129199, 20854815, 21371947, 18471123, 15194800, 14079639, 14478713, 17918208, 26449991, 33323482, 26367028, 5162192, -14807601, -20025550, -12791816, -3415385, 2854615, 6409114, 7957614, 7295837, 3097399, -6887465]
11903f887465j3381424o744805O467298J1372561L704448j676714M678043J0027178
11895G559120K601169n641003k07361P800757M96366j2623212q965031P338401
11887a640794J2136614L368279K030336J0665062P309444j2018983k0981362p114280
11879f245684N114821m524689j7271091p293667J4891997K0035044N864065l926978
11871F643818J791316J0711806J1789125P673732J745027q081224j9142894k1728416
11863h597710j1107089O256845J9137895J8867041M461659j2818494j6374072
11856a73925l896683P513672N082027j018601L940747J2960294Q543730o497718
11848B6453543j1762707j677875O887459K559011n772053q182518q053840q473590
$$ y = [-6887465, -20268889, -27013694, -20546396, -9173835, -5469387, -7146101, -2468058, 7559120, 10160289, 4519286, 4311925, 12112682, 12609048, -14164, -8979195, -1640794, 10495820, 13864099, 15894435, 26559497, 33868941, 21849958, 868596, -6245684, -1130863, -5655552, -22926643, -30220310, -15328313, 4706731, 10570796, 6643818, 8435134, 19146940, 30936065, 38609797, 40354824, 32273600, 13130706, -8597710, -19704799, -13447954, 5689941, 24556982, 29018641, 16200147, -173925, -4070608, 3443064, 8525091, 7506490, 11447237, 24407531, 32951261, 26453543, 14690836, 13012961, 19900420, 22459431, 16687378, 8504860, 451020, -8022570]
11840h022570l066249P844366R430351m040131j3257896n83004J9420854J8930052
11832B6655773p43271j1192966q67982R441062K309041r715584q106201O33447
11824H413319j426508j1558834j1350315J182963P914043R20017n001222K365996
11816h540541J2935389J1703096K324303q68042M161466O630429J161623o529687
11808B2978036j0792889j1854424j0389810n419078J536031O958564R654141R028077
11800A1698648K159246r849195j6585895r990574J271541J760508o889479o661766
11792c3086966R047454K3181184J8396237M91682j1938175j2236872q288871o090266
11784b0524593l256484K052416N963688M850758N67294k208708r48207K758649
$$ y = [-8022570, -11088819, -3244453, 6185898, 2145767, -11112129, -11695133, 7725721, 26655773, 25912502, 14719536, 13851554, 23292616, 25601657, 15886073, 7779872, 8413319, 6986811, -4572023, -15922338, -14739375, -6825332, -5905315, -10906537, -8540541, 4394848, 16097944, 18422247, 17554205, 21715671, 28346100, 29507723, 22978036, 12185147, 330723, -10059087, -15478165, -13942134, -6983570, 2670571, 11698648, 13857894, 4008699, -12577196, -22567770, -21296229, -19535721, -26425200, -33086966, -24039512, -858328, 17537909, 18029591, 6091416, -6145456, -14434327, -20524593, -23781077, -21728661, -15764973, -10914215, -10346921, -12555629, -13503836, -10745187]
11776a0745187M665375K375262j049894q54991J827191J326059k477683k583421
11768g517289L165554O435052Q73328o869136o790455m85178L236523L471801
11760d479800O607921J1980180J0150815j972011j4192176j5791858q172329j49104
11752a6018362L638793M471725L770681J267617k105491l378019k65691N987047
11744b631700J0187193O783835l567023j1970716r877016K45552P469228O360406
11736B999759K576208K041233J245210n349808j2639621q701131Q065232K3244181
11728A3481263K1933276N937548q810145j0346912k555499J237060n661010j5222172
11720f591j3822919M47700J3070037J0002876l266359p899141K196554J1353498
$$ y = [-10745187, -6079812, -3704550, -4754444, -5609435, -3782244, -2456185, -4933868, -7517289, -4351735, 2083317, 2956645, -3912491, -10702946, -11188124, -7951601, -4479800, 2128121, 14108301, 24259116, 22287105, 8094929, -7696929, -15869258, -16018362, -12379569, -7907844, -4137163, -2869546, -4975037, -8353056, -8618747, -2631700, 7555493, 14339328, 10772305, -1198411, -11075427, -10829875, -3360647, 2999759, 5575967, 7617200, 8862410, 3512602, -9127019, -17828150, -9762918, 13481263, 35414539, 41352087, 32541942, 22195030, 19639531, 20876591, 15215581, -6591, -13829510, -13381810, -311773, 9691103, 6424744, -1474397, 722157, 12075655]
11712A2075655N389055p278407r851928l701412l130645p791097k354182J3253477
11704c389484J7110274L61919j2846090m575K1776946J7800469j2708154l4162649
11696f061344k3303494M172987K0092415J5523216j064523j8350235k5247053
11689c4238031j4879790M466270J4443275J0062558N185534Q477412J0260759
11682C777987L035960k063078O087706J7514090J5396044J146284j0794084j4460617
11674A9640292j3065155o727129L825170Q454590l85603j2537918j3237699m901459
11666a8934911R56846N200456J3598947J5852970j270767k3118835j9786135P060581
11658b0440848K1266474O076454j0234546n82732J7577855J2205455j0661022
$$ y = [12075655, 17464710, 10186303, 334375, -3367037, -6497682, -14288779, -16642961, -3389484, 13720790, 14082709, 1236619, 1232044, 23008990, 40809459, 28101305, -6061344, -29364838, -25191851, -5099436, 10423780, 9359257, -8990978, -34238031, -49117821, -44651551, -30208276, -20145718, -14960184, -6482772, 3777987, 6813947, 4750869, 10838575, 28352665, 43748709, 44894993, 34100909, 19640292, 6575137, -151992, 3673178, 12127768, 11742165, -795753, -14033452, -18934911, -17978065, -12777609, 821338, 16674308, 15403541, -7715294, -27501429, -20440848, 825626, 6902080, -3332466, -3915198, 13662657, 25868112, 15207090]
11651A5207090j7458766j289681Q418560o531220k4737861j6861672J3177333
11644c0076217L4227116K6440879Q51944j7193472j5323453l440811N58896q015162
11636a1970280j5595477p759394J1475979K3036573J5205465l021306j3428870
11629b057310r215519K34341L607745J198605J484275P735825J3735337J2886702
11621B9610001N696382l800752j2645719j6328077r354111M545940J0458853Q50265
11613I032782j0594791o914294O081774Q883856K01836j654044Q553253J2533888
11605B6124260m62428j4518346j3099284m436455l165190m070532M464727J4942471
11597E779223J2793721L637045L030176O491168k453652j7878894j5324811P086613
$$ y = [15207090, -2251676, -3541357, 4877203, -1654017, -26391878, -43253550, -30076217, 4150899, 30591778, 31443722, 14250250, -1073203, -4514014, -3955118, -11970280, -27565757, -35325151, -23849172, -812599, 14392866, 11371560, -2057310, -11272829, -11038488, -7430743, -6232138, -4747863, 2987962, 16723299, 29610001, 35306383, 31505631, 18859912, 2531835, -6822276, -2276336, 8182517, 9032782, -1562009, -8476303, -2394529, 6489327, 6691163, 5037119, 13590372, 26124260, 25661832, 11143486, -1955798, -6392253, -9557443, -13627975, -9163248, 5779223, 18572944, 22209989, 25240165, 31731333, 29277681, 11398787, -3926024, 3160589]
11589C160589K0680972Q021120j3088175j8924222j0479179j573360L428970N643457
11581c129828L053923l06885O457058J9778233J8709292j681393j5712740n825829
11573B1341831O693271l243232j9508453j0346237J5099968J7883081o858498
11566B1061731k1044291n448599J2100265O654691m500541K117418J2975649L397510
11558B7313833j5587320j2979021J0580638K2304294O825363j4381290j7714635
11551F361862o590537K291684K802514j17253j241723J209444M697559K709601
11543A2123151o110384j0760664j194375J3232056J3348492j958360j3970613
11536D709303j2262464o638227n851278l189445O957377J4934523J1261714K951014
$$ y = [3160589, 23841561, 31862681, 18774506, -149716, -10628895, -12202255, -8773285, -3129828, -75905, -382790, 6074268, 25852501, 44561793, 42880400, 27167660, 21341831, 28035102, 24791870, 5283417, -5062820, 10037148, 27920229, 21061731, 17440, -5431159, 6669106, 13323797, 8823256, 10940674, 23916323, 27313833, 11726513, -1252508, 9328130, 31632424, 38457787, 24076497, 6361862, -228675, 2063009, 4865523, 4748270, 3506547, 4715991, 9413550, 12123151, 6012767, -4747897, -5942272, 7289784, 20638276, 18679916, 4709303, -7553161, -14191388, -20042666, -23232111, -16274734, -1340211, 9921503, 12872517]
11528A2872517P05255J138155l750054r146215n303498M464629R560371R968062
11520B0509222J1914120J0727688l001427k1684863k5305631j0857147J878269
11513a5819769O63900j435910R746310K3176868J7799607m408979j9130698j2414657
11505a823328L300817R349169L698988l561788p359404r264381p257119L043934
11497i873112J5900928J6451845Q00752j3962400j0030502O157516J1741387q26421
11489A6359993j3561995q708327P390224J4789964O267799o939709j1746583o324563
11481b473197K435509P473121O607067K542378j571028o118501j1428068j2008620
11473a4541339k415597J0724063J3325439L665739m358830k660995N56569o68562
$$ y = [12872517, 13577772, 14715927, 10965873, 1819658, -3483840, 980789, 10541160, 20509222, 32423342, 43151030, 40149603, 18464740, -6840891, -17698038, -15819769, -15155869, -16591779, -6845469, 16331399, 34131006, 29722027, 10591329, -1823328, 1477489, 10826658, 14525646, 10963858, 3604454, -5659927, -12917046, -9873112, 6027816, 22479661, 23280413, 9318013, -712489, 5445027, 17186414, 16359993, 2797998, -5910329, 1479895, 16269859, 22537658, 15597949, 3851366, -2473197, -37688, 7435433, 14042500, 16584878, 15013850, 8895349, -2532719, -14541339, -16956936, -6232873, 7092566, 10758305, 6399475, 3738480, 4295049, 3626487]
11465C626487J815783J0549612R062673j1446824k7863045j4637517J3128502
11458a5764329J7898429l208673j4669469L40177J5430133O908446r169337p593587
11450i828210N161397P279027n77016k022548L167207J814104n363397n653309
11442f022745j47473k507051j1831237j0721236N267953J7626573J2221810q71950
11434C014644m913175m13151M3883p411637j3442886q962221M292631J6272318
11426a1519594J8260132J0181348n96706p358557r156276p830038m616367j722204
11418a4358262j522065j237267M431567J1807237R491770k557480p795942J988353
11410B47911R824187j325710j8097467j4737517M775231J0712657m719333j3455073
$$ y = [3626487, 5442270, 15991882, 25054555, 13607731, -14255314, -28892831, -15764329, 2134100, -1074573, -15744042, -15403865, 26268, 6934714, -2234623, -9828210, -4666813, 2612214, 2035198, 12650, 3179857, 4993961, -369436, -6022745, -6170218, -8677269, -20508506, -31229742, -25961789, -8335216, 3886594, 3014644, -1898531, -2311682, -2267799, -9679436, -23122322, -32084543, -27791912, -11519594, 6740538, 16921886, 16325180, 8966623, -189653, -8019691, -12636058, -14358262, -15880327, -17117594, -12686027, -878790, 8612980, 6055500, -1740442, 247911, 10072098, 8746388, -9351079, -24088596, -19313365, -8600708, -13320041, -26775114]
11402b6775114L433928K3800425J7870650n794492j3820121J754756J3910051
11395A4380083K793080j6027758j6276560J184182J1194214O32340j3726883r586220
11387b5433522Q896158J6555001L174010j1325149n442165J2963820J9130056
11380A8518209P271840m814144n639850m061981q186310r656545n91142Q928478
11372A768555N418681n782512q449338N6349P055675M649975j918962n458987
11364b660564m489011P99668R235466J3706707N969170j0118676j8966042j1475121
11356a7998403L789700J2152806R831026M435854L080080N796947Q518337P351722
11348C6958069N42995r519056j5902160j2366717p40739Q966295Q044357j649550
$$ y = [-26775114, -23341186, 459239, 18329889, 12535397, -1284724, 470032, 14380083, 17173163, 1145405, -15131155, -13946973, -2752759, -2120419, -15847302, -25433522, -16537364, 17637, 3191647, -8133502, -13575667, -611847, 18518209, 25790049, 20975905, 15336055, 11274074, 3087764, -6568781, -7159923, 1768555, 7187236, 1404724, -7044614, -6988265, 67410, 4717385, 2798423, -2660564, -7149575, -6349907, 2885559, 16592266, 22561436, 12442760, -6523282, -17998403, -14208703, -2055897, 7775129, 12210983, 15291063, 21088010, 29606347, 36958069, 37501064, 27982008, 12079848, -286869, -1027608, 7938687, 15983044, 14333494]
11340A4333494r632730q522743k188846j99787m751705o841484J623607J4283734
11332a896460J5114126p71127j6958694j3887004M891208J4956973K800621j5449404
11324a1199761j6070894J82994J1965015Q635502N45592k284008l037982m052119
11316a5315661J488022J3214935J5972269K843298r383849m850710N463880L193260
11308A2625444n016893n09933J1098114P128614j1579695j9594259r416745k391911
11300a7657264q716539r478548O571172J9482851J2048966j32158L088018J2269789
11292A7476287R810838L597341P901074R543568j0484863l5034586l0662703l214326
11284c1067370Q265236o116444j3470401M597481K2945162J8487061O965285R457105
$$ y = [14333494, 4700764, -3821979, -6010825, -6210612, -10962317, -17803801, -16180194, -1896460, 13217666, 12446539, -4512155, -18399159, -13507951, 1449022, 4249643, -11199761, -27270655, -27087661, -15122646, -6487144, -5941552, -8225560, -11263542, -15315661, -13827639, -612704, 15359565, 18202863, 8819014, 3968304, 9432184, 12625444, 7608551, 7098618, 18196732, 25325346, 13745651, -5848608, -15265353, -17657264, -26373803, -35852351, -29281179, -9798328, 2250638, 2118480, 5206498, 17476287, 27287125, 30884466, 38785540, 48329108, 37844245, 2809659, -27853044, -31067370, -22802134, -28918578, -42388979, -37791498, -14846336, 3640725, 10606010, 20063115]
11276B0063115J4245785K670131j1949602n857920J1354303J0588658p813199
11269C3301271j4760311j014599R067380q62727j3896732r675859M040777O973592
11261A3172792k382912r012815n798448M23528L096581L384829M492561P224781
11253A4600897J0290023R738501J551877j0130041j3260433l885912M462188j781667
11245A1585433j4294291j2690346M987278J8094772J3405386K260580j390220
11238B1958592l493596j4340095k3454706j2945326R120343J4579913j877117
11231a0451992j1233021O270538K8902185K4934076m02586j5089009q383212l52995
11223A4193984m209703p759531k18229P741423M716100r00895J809444M851089
$$ y = [20063115, 34308900, 36979031, 25029429, 19171509, 30525812, 41114470, 33301271, 18540960, 17526361, 26593741, 25731014, 11834282, 2158423, 6199200, 13172792, 10789880, 1777065, -4021383, -3597855, -501274, 2883555, 7376116, 14600897, 24890920, 34629421, 36181298, 26051257, 12790824, 8904912, 13367100, 11585433, -2708858, -15399204, -10411926, 7682846, 21088232, 23348812, 21958592, 18464996, 4124901, -19329805, -32275131, -23154788, -8574875, -10451992, -21685013, -15414475, 13487710, 38421786, 38019200, 22930191, 14546979, 14193984, 9984281, 2224750, 2006521, 9747944, 14464044, 13563149, 15372593, 20223682]
11215B0223682l182138j2903191p737584O642731J0451275L095787K574004J0909515
11207C0074081P911955j2313228k5169209j1870790R764356J1806544k689146
11200G514563r178814j404070M936991L724491N932381J3206444J0354204o900806
11192B8185384j9483491j3307017j081956j90940m801044J019977J3863767J5749137
11184A9953817K908434r839515j1964096p214933q99267O286972J0076932M199766
11176A3508110o152380p060710K868391P910934j252319j2394267r563461M159639
11168g976063J2427830P416380m032669j1548755j0009381o34063R161552R680930
11160D485761o18839j0758010r262953J217207P045333O52685j0487422j2836453
$$ y = [20223682, 17041544, 4138353, -3599231, 3043500, 13494775, 16590562, 19164566, 30074081, 37986036, 25672808, 503599, -11367191, -1602835, 10203709, 7514563, -1664251, -3068321, 1868670, 5593161, 11525542, 24731986, 35086190, 28185384, 8701893, -4605124, -5687080, -5878020, -10679064, -9659087, 4204680, 19953817, 22862251, 13022736, 1058640, -6156293, -7055560, -768588, 9308344, 13508110, 7355730, 295020, 3163411, 11074345, 9822026, -2572241, -12135702, -7976063, 4451767, 11868147, 7835478, -3713277, -13722658, -14356721, -5195169, 4485761, 3866922, -6891088, -16154041, -14936834, -7891501, -7238816, -17726238, -30562691]
11152c0562691k170963J1274841J3478711K610292q273113o980768L202660R834707
11144g586324Q103552L232984p06638m125887n584673l121747q95511k796582
11136a3480826j733082R319871J7759849M470846k0892203k3931916M315729K7784559
11128C612827J5240434j3717637j8999860J481960J5619059R347877L20082J98549
11120A3103291k635782j4200833j7845790j579222J8212573J8049788R2443j2076890
11112A119578m327903J2801864J7606749N78473k3805501k9294553p548144J7999821
11104a4869616J8860981j415699j3094523k826584J0231740P092459l499822m045996
11096c567060K237358J8630j0182529j2902796l360802N922819N557218J494598
$$ y = [-30562691, -32733654, -21458813, -7980102, -5369810, -13642923, -20623691, -17421031, -7586324, 517228, 3750212, 3043574, -1082313, -6666986, -9788733, -10684244, -13480826, -15213908, -5894037, 11865812, 16336658, -4555545, -28487461, -24171732, 3612827, 18853261, 5135624, -13864236, -12382276, 3236783, 12584660, 12904742, 13103291, 10467509, -3733324, -21579114, -23158336, -4945763, 13104025, 13196468, 1119578, -3208325, 9593539, 27200288, 27778761, 3973260, -25321293, -32869437, -14869616, 3991365, 2575666, -10518857, -13345441, -3113701, 3978758, 478936, -3567060, -1329702, -1311072, -11493601, -24396397, -27757199, -21834380, -16277162, -14782564]
11088a4782564K514543O979042Q169463M862527J59627m647026q361427o117136
11080a1222951M451281J4545144J1297921l562785j1638394j683203J2810168
11073A4997181J1477621l531434j2120928p824032m451313p723278l619018J3215607
11065D20406K2102746P237102j2446377r799736P185986Q076329j0609999k0600369
11057h433912p671667Q435985P919280j941118n626389l411003k517196j388587
11049a4634607L297494O706951M357807K2233k623259m904723m459015M189089
11041h048030J4959165J2647921l023564j3517125r880657n537096r870822j0314091
11033c2584299L162900J5422890Q785429p016008j0016673m7801N339270J573583
$$ y = [-14782564, -12268021, -5288979, 2880484, 7743011, 7902638, 3255612, -5105815, -11222951, -6771670, 7773474, 19071395, 15508610, 3870216, 2187013, 14997181, 26474802, 22943368, 10822440, 2998408, -1452905, -9176183, -12795201, 420406, 22523152, 29760254, 17313877, 7514141, 14700127, 22776456, 12166457, -8433912, -16105579, -7669594, 249686, -1691432, -7317821, -10728824, -13246020, -14634607, -11337113, -4630162, -272355, -250122, -2873381, -7778104, -12237119, -8048030, 6911135, 19559056, 16535492, 3018367, -6862290, -12399386, -22270208, -32584299, -29421399, -13998509, -5213080, -12229088, -22245761, -22293562, -16954292, -15380709]
11025a5380709O38098O600410Q613626K76572r928809j0664695J53657J5598924
11017d092926K3854695J4773551q461455k6666741k2609621o88128J7221402J3981478
11009G312255p273667k5684029k0722289M911953K3030787J3031947p530781o444784
11001a9368608J2382821J3410447j0100465j9606006N610340K8660070J1680760
10994B2669359k1169218k1056026Q634854K2295839O472752p369376k785341n77878
10986G114965j2247643j6559361L85522J8403617J6320587K895957l949691m394938
10978G969015n832545n932106k608724k510047o189110k849789Q443944J1448826
10970A939464j161741j3319393r973610K004754R671182J2615029J3135848O247099
$$ y = [-15380709, -14742611, -8142201, 471425, 747997, -9180812, -19845507, -19691850, -4092926, 19761769, 34535320, 26073865, -592876, -23202497, -23890625, -6669223, 7312255, 38588, -25645441, -46367730, -41455777, -18424990, -5393043, -12923824, -19368608, -6985787, 6424660, -3675805, -23281811, -17671471, 10988599, 22669359, 1500141, -19555885, -10921031, 11374808, 17847560, 10478184, 7692843, 7114965, -5132678, -21692039, -21306517, -2902900, 13417687, 16313644, 12363953, 7969015, 2136470, -3795636, -6404360, -8914407, -15103517, -17953306, -9509362, 1939464, 777723, -12541670, -22515280, -20510526, -10839344, 1775685, 14911533, 21158632]
10962B1158632o736806j2023903m443234K245957j001853l208748M167926R499810
10954I657781K836520m015902J007864O962462K45863q450827k312596J0299605
10946A6230770R402732k021264m808153J240878k575691j9205393k7507658j3527404
10938d2771183J0078634K2121600J6167651J701601p187348k932911P374841P718839
10930A2271724n170293j3771658m611205R627012R335749j011705k507845N113576
10922I275355N198825m061747o450546J651070M080592m956066q761394K705535
10914a318376J3815832P892976p234488j4002893j0795245o798559l349485K684170
10906a9106068O033190O97930n558918j018619R255264Q764715n079784j6276313
$$ y = [21158632, 14421826, 2397923, -2045311, 200646, -801207, -4009955, 157971, 9657781, 12494301, 8478399, 9486263, 16448725, 16694588, 8243761, 5931165, 16230770, 25633502, 23612238, 18804085, 20044963, 17469272, -1736121, -29243779, -42771183, -32692549, -10570949, 5596702, 7298303, 110955, -2821956, 4552885, 12271724, 7101431, -6670227, -11281432, -1654420, 7681329, 6669624, 4161779, 9275355, 14474180, 10412433, 3961887, 5612957, 9693549, 4737483, -4023911, -1318376, 12497456, 20390432, 13155944, -846949, -11642194, -18440753, -21790238, -19106068, -13072878, -12374948, -17933866, -18952485, -9697221, -932506, -6012290, -22288603]
10898b2288603j2768993O7862J1978523K0529699K4726549J8022619j244463j9517974
10890A9505219k0354670n056216R262984J1638050P064362L373478r7408n517680
10882A9818119q524667n681711k499319m580339o974405k960660K197366o92566
10874i898182o778775k625084J0911154J7354323Q807892l885758r574139j0286932
10866e975501j0272181o490441J791069P257322O615249N602601N049130k369964
10858A207284j3107374r677662J0006973K0116942K953638k0114031j7732591
10851b6346821N074897J6764834O784714n230151m453944K227514N254215M344905
10843D420163o20960r366923j1304570K598805J8623954J4857894l146566q362320
$$ y = [-22288603, -35057596, -34989734, -23011211, -2481512, 22245037, 40267656, 39023193, 19505219, -849451, -5905667, 3357317, 14995367, 22059729, 25433207, 25335799, 19818119, 11293452, 5611741, 3112422, -1467917, -8442322, -11402982, -9205616, -9898182, -16676957, -19302041, -8390887, 8963436, 17771328, 13885570, 4311431, -5975501, -16247682, -22738123, -20947054, -13689732, -7074483, -1471882, 3577248, 1207284, -11900090, -21577752, -11570779, 8546163, 11499801, -8614230, -26346821, -21271924, -4507090, 2277624, -2952527, -7406471, -5178957, 75258, 4420163, 3799203, -5567720, -16872290, -14273485, 4350469, 19208363, 16061797, 7699477]
10835G699477L755835P844834p271567j8967637r743320L953244J913084o406760
10827a7222810k639142O830939M425658n762753n056005Q213815J7474690J3430682
10819A9695074J788689r839097j6235543j1293801L782854J4464812R647013j865115
10811A0144886n285797j651576l75466J26549N816999R740086K330436p423590
10803A3422527l540600Q273303P127116q639838j7335268p343574P148619R589604
10795H701889J336466p865950j2932913j0618661J132572J4724658J7177206P721908
10787A9377175j485545m578857p046034r610444m922735N192760P862612J108736
10779E897668j199254N542214O699730m935467j2676251k331874J2367020J0413235
$$ y = [7699477, 11455312, 19300146, 12028579, -6939058, -16682378, -12729134, -10816050, -17222810, -19861952, -13031013, -8605355, -14368108, -19424113, -11210298, 6264392, 19695074, 21483763, 11644666, -4590877, -15884678, -12101824, 2362988, 12010001, 10144886, 4859089, 3207513, 2832047, 2958596, 8775595, 18515681, 20846117, 13422527, 9881927, 18155230, 25282346, 16642508, -692760, -8036334, -887715, 8701889, 10038355, 2172405, -10760508, -21379169, -20246597, -5521939, 11655267, 19377175, 17891630, 13312773, 6266739, -3343705, -8266440, -3073680, 4788932, 5897668, 4698414, 10240628, 16940358, 12004891, -671360, -3003234, 9363786, 19777021]
10771A9777021l543875q094853J674739J0793189R757567L787958j865285q286443
10763B4000018j3292402j0376371n95241N541974J559418o975524r803268k461549
10755a2402945J0071553J6639754R858640m031853j0818733o890505l160361n799313
10747f533763n805483L034440R663192L551943n255704j948557O906334L994454
10739G606856q270059j0841438K48009Q040015K483876o816114r628311p605333
10731b4782499l055159O181369J4940205J1920928p23295o533868l25451L777035
10723A399265k053787n708521J236093O172975k081622j0836849l332324J1998613
10715c206157J3589096P211r976708o854156m91844r80266n827601q336364o258340
$$ y = [19777021, 16233146, 8138293, 9813032, 20606221, 30363788, 34151746, 32286461, 24000018, 10707616, 331245, -263996, 5277978, 6837396, -138128, -9941396, -12402945, -2331392, 14308362, 24167002, 20135149, 9316416, 2425911, -734450, -6533763, -12339246, -9304806, 358386, 3910329, -1345375, -3293932, 3612402, 7606856, -663203, -11504641, -11256632, -3216617, -732741, -7548855, -17177166, -24782499, -27837658, -21656289, -6716084, 5204844, 4481549, -2052319, -2377770, 1399265, -654522, -6363043, -5126950, 1046025, -1035597, -11872446, -15204770, -3206157, 10382939, 10390150, 413442, -6440714, -6932558, -7912824, -13740425, -22076789, -28335129]
10706b8335129j86874P190440R844615M502150k972435m449360k07073M116760
10698a0496906O626318P320354L160549n214019q080230N21023J0341971Q085779
10690A2264839k638251q674821q675018r888206q577552M774845K1163835J8029012
10682A7778683n322386k0149061q022095J1568806R936537r407817j8328196n333650
10674b7279179J1251032J1414171j804300j0833667o415570M673591J0325381
10667h668541O418325p39559l804711l746435o415222j1080572r358695J934371
10659c5461039J3742802J5686576Q819745J802512j202877k311037l064863k979111
10651d967292k959476l463995j051661N989399J0363016L614748q409471r444211
$$ y = [-28335129, -28522003, -21331563, -11486948, -6984798, -9957233, -14406593, -14613666, -10496906, -3870588, 3449766, 6610315, 1396296, -6683934, -6162911, 4179060, 12264839, 9626588, 951767, -7723251, -17611457, -26189009, -21414164, -250329, 17778683, 12456297, -7692764, -15714859, -4146053, 5790484, -3617333, -21945529, -27279179, -16028147, -4613976, -6418276, -17251943, -23667513, -18993922, -8668541, -2250216, -2989775, -6794486, -10540921, -16956143, -28036715, -37395410, -35461039, -21718237, -6031661, 2788084, 4590596, 3387719, 1076682, -1988181, -4967292, -7926768, -11390763, -12442424, -6453025, 3909991, 7524739, -884732, -10328943]
10643a0328943L392480J1558444O52934j5953613j4582928K700691R566592m210022
10635a7204365j5371129k546734J9430899K1315226L903533n285913L393139Q639330
10627A6273986m025687j7801378j2556851L521696R294679K902221j838344j002047
10619e231725j473920k678389J734306P152642L180407n615415m521439M698467
10611b755066L398271j2591596k2313929j0700031P939789J1739628K633717j267978
10603b3917195M141323N584981k406008p034409K088960J4834480J3899306J14306
10595G305744q068834j063414P865612K455254j1598782j4217485j2950J4957727
10587b377128J7033228J0703472N277580K44297p265121j2839664j2800836j1128737
$$ y = [-10328943, -6936463, 4621981, 5274915, -10678698, -25261626, -22560935, -12994343, -17204365, -32575494, -35122228, -15691329, 5623897, 9527430, 4241517, 7634656, 16273986, 12248299, -5553079, -18109930, -14588234, -5293555, -2391334, -4229678, -5231725, -6705645, -9384034, -7649728, -497086, 2683321, -2932094, -7453533, -2755066, 643205, -11948391, -34262320, -44962351, -37022562, -25282934, -22649217, -23917195, -19775872, -14190891, -16596899, -23631308, -21542348, -6707868, 7191438, 7305744, -763090, -1826504, 6039108, 8494362, -3104420, -17321905, -17334855, -2377128, 14656100, 25359572, 30637152, 30881449, 23616328, 10776664, -2024172, -13152909]
10579a3152909r133153n18522J3155293J7036756O352640j208984O133257J1080745
10571B9745123m146574k2590500j6503891N122852Q670512r287385j7631771l929134
10563c0550768O826754k343021j2383523l702927J0941139J1311732L047713K353428
10555a4499473O282462K467937n199337l844292M364221O193093J1408l130394
10547g354375J617381O930666N490533j153389n567388k367296M520481L549616
10539E666229q498817j5951933k985767J9542847K4377504O358656r696201n038223
10531A3774295Q843391J0622526l093697j9077692k3097219r105915J4058776
10524g075535K4462251J1058675p334396o864190M502727K467373r049243o035903
$$ y = [-13152909, -22286062, -22804584, -9649291, 7387465, 13740105, 12531121, 18664378, 29745123, 25598549, 3008049, -13495842, -8372990, 297522, -8989863, -26621634, -30550768, -23724014, -26067035, -38450558, -42153485, -31212346, -19900614, -16852901, -14499473, -8217011, -5749074, -10948411, -14792703, -10428482, -4235389, -4223981, -7354375, -5736994, 1193672, 6684205, 5530816, -36572, -2403868, 2116613, 5666229, -2832588, -18784521, -21770288, -2227441, 22150063, 28508719, 18812518, 13774295, 22617686, 33240212, 30146515, 11068823, -12028396, -21134311, -7075535, 17386716, 28445391, 21110995, 14246805, 18749532, 21216905, 12167662, 6131759]
10516F131759O915743J587043j7425943j3008702J6359808K4462525n386694k7415103
10508g779564q770470J6687150R339075j2102278j3066859l757814p933986j2656238
10500d0040984K06596J1594775L950991J55127J3889745J1879062j7681388k1427902
10492c7473978K1615290L2627058l2971790n8506764P6721942K57248619K34911635
10485D94172012j4414168k25162704j95925411l7560436L3120538m897288k5110781
10478B4221762O830017J3124201k4915106l5761060M991485L5190139J9117193
10471D2798631l512895j659720J210330j1304433j5613115j719247L430441j0300468
10463C329524j4783831K397619J3751855K983395p252185l47722N685164k935138
$$ y = [6131759, 13047502, 14634545, -2791398, -15800100, 559708, 25022233, 19635539, -7779564, -16550034, 137116, 9476191, -2626087, -15692946, -19450760, -27384746, -40040984, -39834388, -28239613, -24288622, -24133495, -10243750, 1635312, -16046076, -37473978, -15858688, 16768370, -16203420, -74710184, 2011758, 259260377, 494172012, 479757844, 254595140, 58669729, 21109293, 54229831, 49332543, 24221762, 31051779, 44175980, 19260874, -16500186, -11508701, 23681438, 42798631, 39285736, 37626016, 38836346, 27531913, 11918798, 10199551, 13629992, 3329524, -11454307, -9056688, 4695167, 7678562, 426377, 78655, 5763819, 2828681]
10455B828681q927789J056935J1278879Q821701O248580J1124004P084155j1877065
10447B7638081k1538070p333430P078908p71721j3102692m241521J2716825Q102673
10439H549053j2516407j6803938J864346J6031587Q266942p006661j0951911m451113
10431a7018102L470476J1107431J7106524J3209361l062055j7502455j4158928
10424f847748K093513R747769j131113j5252990j3084107K073083R338447K76508
10416a2786638j0303676p320915M554757J2426295J4246618J3795116P208179
10409B1819736q776934k1699795j5194725N697918J8298205J2012326j487159
10402A0669572q870291r663366p230669j239982N676211P538487O042856Q556621
$$ y = [2828681, -6099108, -5042173, 6236706, 15058407, 21306987, 32430991, 39515146, 27638081, 6100011, -1233419, 5845489, 5073768, -8028924, -12270445, 446380, 8549053, -3967354, -20771292, -18906946, -2875359, 5391583, -1615078, -12566989, -17018102, -13547626, -2440195, 14666329, 27875690, 24813635, 7311180, -6847748, -4754235, 4993534, 3862421, -11390569, -24474676, -22401593, -13063146, -12786638, -23090314, -30411229, -25856472, -13430177, 816441, 14611557, 21819736, 13042802, -8656993, -23851718, -18153800, 144405, 12156731, 10669572, 1799281, -7864085, -15094754, -16334736, -10658525, -3120038, 2922818, 11479439]
10394A1479439J1513516K198575j6573141k1819803k281157K1058217K2101552
10387B7677198M888028o446448l979882j270517n805360q594865n065663n825282
10379d422791j6261558k1679771q082243J2764525J7241951M361935l358561M909469
10371a4527044J2861578N886960l935429J015581J1818923N558077j6132486k6673051
10363b4126891j4313669K320747N705896L236022P019105J0459660K690458q865171
10355a5873843r841059k732287p81837n006290m474033N185904J8131424K8142677
10347A2750656K9332086J4750068j1002114k6212037j6506021K426205N335198
10340A0874041o414191j0879633k365366L209496p37724j622852O064009R314022
$$ y = [11479439, 22992955, 25191530, 8618389, -13201414, -15482571, 5575646, 27677198, 32565226, 26118778, 22138896, 20868379, 15063019, 6468154, 1402491, -4422791, -20684349, -42364120, -50446363, -37681838, -20439887, -16077952, -19436513, -14527044, -1665466, 4221494, 286065, 1301646, 13120569, 18678646, 2546160, -24126891, -38440560, -36119813, -30413917, -27177895, -20158790, -9699130, -7008672, -15873843, -25714902, -28447189, -29229026, -34235316, -38709349, -33523445, -15392021, 12750656, 42082742, 56832810, 45830696, 19618659, 3112638, 5538843, 10874041, 4459850, -6419783, -8785149, -5575653, -6313377, -7936229, -1872220, 7441802]
10332G441802P91426o695471j647158P509076P466523l12168o413473q200483
10324e9926p735025n425822l818925p174004j1104744n344364P189267R863128
10316b3610415q81104o245491M943517J5643712Q018167n302885j162205J4644447
10308F047743J5596258k360659j4456492o722429M719226K792151n331874n512435
10300e228511k78133R75579R29677N886580R319486K540597o146477k839514O632735
10291A1792019M511817p497487q595261N830718J4119507L276855r480303n375986
10283H581879O509529Q006107K184804J751798K040161p465245j5866752n663177
10275G9104J1552705P346049j6180499k5317832o329633J5081310J5760106M736306
$$ y = [7441802, 8233228, 1537757, -109401, 7399675, 14866198, 14554030, 8140557, -59926, -7794951, -13220773, -17039698, -24213702, -35318446, -40662810, -33473543, -23610415, -24491519, -30737010, -25793493, -10149781, -2131614, -7434499, -8596704, 6047743, 21644001, 19283342, 4826850, -1895579, 2823647, 5615798, 283924, -5228511, -5506644, -4531065, -3601388, 2285192, 11604678, 14145275, 7998798, 5159284, 11792019, 16303836, 8806349, 211088, 6041806, 20161313, 23438168, 13957865, 8581879, 15091408, 23097515, 25282319, 27034117, 29074278, 21609033, 5742281, 79104, 11631809, 18977858, 2797359, -22520473, -28850106, -13768796, 1991310, 6727616]
10267F727616k595762r008428j6598189j2484417N456868J4767907L298391o844681
10259a7280695M551127J9670583J2050595q637207j3722910j602007O433460M485063
10251E948009L531785L533393m237937j3224465r368136K707403Q168027Q531311
10243E589390J2387692J0721320o781859k1789950j0105766J3884401J4991756
10236A8896984n808057j4241751p71659Q714988K915562r1936M487391k741619
10228A1359903k1070068k0789726L650030J6590110j76973j5057529o94352K0316909
10220e871696J6917025Q94376n85503O090573p44626j3724020j0117858O110974
10212a030755J2233422M769507k438375o642940j2663591j2510366J851447J6067579
$$ y = [6727616, 4131854, -4876574, -21474763, -33959180, -28502312, -13734405, -10436014, -17280695, -12729568, 6941015, 18991610, 10354403, -3368507, -4970514, 1462946, 5948009, 9479794, 13013187, 8775250, -4449215, -13817351, -11109948, -2941921, 5589390, 17977082, 28698402, 21916543, 126593, -9979173, 3905228, 18896984, 13088927, -1152824, -1924483, 6790505, 9706067, 9614131, 14101522, 11359903, -9710165, -30499891, -26849861, -10259751, -10436724, -25494253, -26188605, -5871696, 11045329, 11939705, 11354202, 17444775, 16700149, 2976129, -7141729, -1030755, 11202667, 15972174, 13533799, 6890859, -5772732, -18283098, -16431651, -364072]
10204c64072J2497944J067301K249200J0421489N255060r673252j2546738j745373
10196G161559M013184Q14926K545023R218098M415678j2016834j8419015n298999
10188g566380J0624850J3636028P781826J622257m764422j0087339p833662N12459
10180C925617L901269r72842n026898k871708R83675M141982Q950048J0977869
10172B4009012J449224j5151039k1723395j1467900L733161J1464403J1659047
10165C972513Q132720J225989o620264r815315p846852m885054r57130N610306
10157a1183087R008874K930167n307722l350894N106055N525237k221706m312112
10149c805188K77549l010345j4774909j4160264P049526K5170424J6842577o627332
$$ y = [-364072, 12133872, 13201173, 15450373, 25871862, 31126922, 21453670, 8906932, 7161559, 11174743, 11989669, 14534692, 23752790, 28168468, 16151634, -2267381, -7566380, 3058470, 16694498, 24476324, 26098581, 21334159, 11246820, 3413158, 3925617, 7826886, 6854044, 1827146, -1044562, -60887, 4081095, 13031143, 24009012, 25458236, 10307197, -11416198, -22884098, -19150937, -7686534, 3972513, 12105233, 13331222, 6710958, -3104357, -10951209, -15836263, -16793393, -11183087, -2174213, 755954, -4551768, -7902662, -2796607, 2728630, 506924, -3805188, -3527639, -6537984, -21312893, -35473157, -28423631, -3253207, 13589370, 6962038]
10141F962038j6927453q540509L72350M6209j27889O413924J0288537K945039
10133A432246o498152l040623J0691975J5097641L91936j7213072j5350600L542408
10125a0946241J4653676N280057q624413q230228P37966Q99883p403947q604706
10117b2237953J092517Q622000O202178J303068J595401M639375O294730O753263
10109A4264579M870727j750642q279466o029815L035191P100386K432617k106161
10101A3537416j767137l470135j0996904j5547231r137672K616316R211504Q991271
10093f562572P076346N995372M637913J869909k767964p705924p742727j66467
10085e366114P701145O039653j919062k777339O415555J2395339N320844o934217
$$ y = [6962038, -9965415, -18505924, -18133574, -18087365, -18215254, -11801330, -1512793, 1432246, -5065906, -8106529, 2585446, 17683087, 18075023, 861951, -14488649, -10946241, 3707435, 8987492, 363079, -7867149, -7129183, -6229300, -13633247, -22237953, -21145436, -12523436, -6321258, -5018190, -3422789, 1216586, 7511316, 14264579, 19135306, 17384664, 9105198, 3075383, 6110574, 13210960, 15643577, 13537416, 11770279, 8300144, -2696760, -18243991, -27381663, -24765347, -15553843, -6562572, 513774, 6509146, 11147059, 13016968, 10249004, 2543080, -5199647, -5366114, 2335031, 8374684, 6455622, 3678283, 10093838, 22489177, 27810021, 20875804]
10077B0875804j0836913m489047M126395Q793199Q299164M003754j66296l17943
10069C0288117J022386k899038j1305702j3882056n204484O103962Q633477K739588
10061A5496250k447828k121157M52304Q41207j290482l427458l623148k314657
10053A565031j290056q80756L73759K441913K877483O51071k447465n082118n924172
10044g715310l66700J2660546K0054769O251130j9016455k4309898n50199J9521269
10036F529152P019179j7555718j4815032J1325570K0240565J00709j4478766M28265
10028a206076K0804680J4039951j2890868k8074386j8710538J299734J5355321
10021i382182J7331682R254240k87283k201206M19281m521807j6493652j8484629
$$ y = [20875804, 10038891, 5549844, 9676239, 18469438, 26768602, 30772356, 30606060, 30288117, 31310503, 28411465, 17105763, 3223707, -1980777, 4123185, 12756662, 15496250, 13048422, 10927265, 11379569, 12220776, 10930294, 7502836, 3879688, 1565031, 274975, -605781, -232022, 2209891, 5087374, 5738445, 3290980, -1791138, -7715310, -8082010, 4578536, 24633305, 30884435, 11867980, -12441918, -12992117, 6529152, 13548331, -4007387, -18822419, -7496849, 12743716, 12844425, -1634341, -1206076, 19598604, 33638555, 20747687, -7326699, -26037237, -24737503, -9382182, 7949500, 17203740, 16916457, 14715251, 15134532, 10612725, -5880927, -24365556]
10013b4365556l079603J3446960J4180748M043349k724266l588742l357125j558940
10005g003175K322241J776462o062288j2127880q294981R72959Q008833J1506821
9997h901008R721672j319020j4788455j4932189j539447N651872j994716p099189
9989c5200480L347710J4556781R900745k76252J349175Q177691M125811n753115
9981B28066n702133J194262M83437n859168n403907j349404o041424j4096348
9973c6546619q712778Q020944J6294631R032602j351231n186936l293149M872330
9965a6870206J9029292K6477726J4632752o598805j5838650j0686781n973087
9958D172241o179837l524446J45356m480535j1631800o181149Q322781J3030820
$$ y = [-24365556, -27445159, -13998199, 182549, 4225898, 1501632, -2087110, -5444235, -7003175, -4680934, -2904472, -8966760, -21094640, -29389621, -28416662, -20407829, -8901008, 820664, -498356, -15286811, -30219000, -31758447, -26106575, -28101291, -35200480, -31852770, -17295989, -7395244, -7671496, -6322321, 1855370, 5981181, 228066, -5474067, -4279805, -3796368, -9655536, -15059443, -16408847, -22450271, -36546619, -45259397, -37238453, -20943822, -11911220, -13262451, -18449387, -21742536, -16870206, 2159086, 28636812, 43269564, 36670759, 20832109, 10145328, 4172241, -2007596, -5532042, -5386686, -9867221, -21499021, -27680170, -19357389, -6326569]
9950f326569M828561k241330n229990j2660503j7190925j515356K4486267K8010386
9942A2160541M052997j2996611k051167J4304506J0348493l573023n505730J198703
9934A7938709J142950l797372l788057l487499j1505925k0093804j6442202l827697
9926d3860897O204812J2142629J7289964J7703921J0493018L031523L82333m197287
9918A9190016j3519134j5734653l759192Q894414P247250l106356p823571m903900
9910a3515126p8826N579102J0083090O426354l568624o468386N95297L182086
9902B234967m027968o527711J165264K229093j0032460j5384715l129384N906026
9894b7566888j224248l250781J0798508J0563844j8422977k7148766K6017659
$$ y = [-6326569, -1498008, -3739338, -8969328, -21629831, -38820756, -40336112, -15849845, 12160541, 16213538, 3216927, 1165760, 15470266, 25818759, 22245736, 16740006, 17938709, 19081659, 15284287, 11496230, 8008731, -3497194, -23590998, -40033200, -43860897, -37656085, -25513456, -8223492, 9480429, 19973447, 23004970, 23387303, 19190016, 5670882, -10063771, -13822963, -4928549, 2318701, -787655, -8611226, -13515126, -13593952, -8014850, 2068240, 8494594, 4925970, -1542416, -947119, 2234967, -1793001, -8320712, -7155448, -4926355, -14958815, -30343530, -33472914, -27566888, -28791136, -32041917, -21243409, -10679565, -29102542, -56251308, -30233649]
9887c0233649Q8264128P1935198j2641487o4899124l7856496O832078O835700
9880B8236348j6050425j5825642K21944L108763J32188R440782J5227487j504469
9872B2986976j8379237o644529J4999497J0237145j2019497j4110991N727377
9865B796741J4585231K940163n669836j149796O09983n721356n196484N243310
9857H437956R834452N020910M995433J0417601L681507j6499368k6355088j3584222
9849a4050819M446349R755173O066893K004600l398070p621975j127502J1662874
9841G737523J1362138m629705j3615277m041894N163937j500175q700041J174363
9833g049131J5104184J1517775l027401p491645k401424k744380n641470L397947
$$ y = [-30233649, 58030479, 129965677, 117324190, 52425066, 14568570, 21400648, 28236348, 12185923, -3639719, -3417775, -309012, -176824, 9263958, 24491445, 22986976, 4607739, -2036790, 12962707, 23199852, 11180355, -2930636, 2796741, 17381972, 20322135, 14652299, 13502503, 14112486, 8391130, 3194646, 8437956, 18272408, 23293318, 28288751, 38706352, 42387859, 25888491, -466597, -14050819, -9604470, 150703, 6217596, 8222196, 4824126, -2797849, -3925351, 7737523, 19099661, 14469956, 854679, -3187215, 1976722, 476547, -8223494, -7049131, 8055053, 19572828, 16545427, 9053782, 6652358, 3907978, -1733492, 1664455]
9825A664455J7759133J5461813k641291j1243126j130327P865464J831004p377739
9817B2189386q217278q414447j2684077p127310J3388779K4625613O312602k0140464
9809I932804j7813927J0395136K4807352P085235j6009748j5064267L170655J3993219
9801B0496459J0410784K343406m818557j1376944j2185962k940444P054299M608502
9793A3591543p448427j4301539j0760749m816674j463679K002983M627893J396963
9785a7171686l535091J160055J3991653J7709746L828757j3383560j6904937r202698
9777b3507761l193535p87506N615888J5386235J7519740O867775p091927j0603447
9769B05462q37674J0411243Q158725q285061k1059342j3800167N429330J2443771
$$ y = [1664455, 19423588, 34885401, 32244110, 21000984, 19870657, 27736121, 29567125, 22189386, 13972108, 5557661, -7126416, -14253726, -864947, 23760666, 30073268, 9932804, -7881123, 2514013, 27321365, 34406600, 18396852, 3332585, 6503240, 20496459, 30907243, 33250649, 28432092, 17055148, 4869186, 1928742, 8983041, 13591543, 6143116, -8158423, -18919172, -23735846, -25199525, -23196542, -18568649, -17171686, -20706777, -19546722, -5555069, 12154677, 15983434, 2599874, -14305063, -23507761, -26701296, -27488802, -21872914, -6486679, 11033061, 17900836, 10808909, 205462, -632212, 9779031, 17937756, 9652695, -11406647, -25206814, -19777484, -7333713]
9761g333713m64011j4347429j1424287K061225J0378585J1284323J1304094J0415537
9753A1874324O592529N309323Q801968N955929r753857k2596314j5704394q22834
9745a0343326k006234j5445557j4549599N054110J6868210P070503l697440L534256
9737a3515077J5108004J0375818l046978m235806N086177N639040n151169r022689
9729A237320K555834J4586037J0917475m078417j3305207p932063N066729J1968990
9721B1016698N913845o315556j1076538l255773P516444Q828723J49749q585612
9713A4191980r785244m889981o63600k712956j0040414j2994545j330530K0791700
9705g433590L3041106K0247511o877434k1589291j2822114J958855J023735j1677786
$$ y = [-7333713, -7797724, -22145153, -33569440, -31508215, -21129630, -9845307, 1458787, 11874324, 18466853, 23776176, 32578144, 38534073, 28780216, 6183902, -9520492, -10343326, -12349560, -27795117, -42344716, -37290606, -20422396, -13351893, -17049333, -13515077, 1592927, 11968745, 8921767, 4685961, 9772138, 15411178, 10260009, 1237320, 3793154, 18379191, 29296666, 25218249, 11913042, 3980979, 9047708, 21016698, 26930543, 20614987, 9538449, 6282676, 13799120, 22627843, 22777592, 14191980, 4406736, -483245, -1146845, -3859801, -13900215, -26894760, -28225290, -7433590, 25607516, 45855027, 38977593, 17388302, 4566188, 6525043, 7548778, -4129008]
9697d129008j2157104Q019288K5543904J5306923j2624315k4031653p524637J0953659
9689f42943Q155274m207544m208130K791773k656751j5723716j3311793N031661
9681b4772169J4016775L994913n219593p21715L066648m924113q618322P279372
9673a5898204K6618581K2984389j852772k2273381k2388197p315691J0504655
9666i620620J9926837J3992718j199629q420519j919838L118174m142174j0745416
9658I89533k549392R339269O483337n131211n808756L973735N743244n318712
9650G721047j4730845j3008594m663998N242322J4099241J4342092K802257o332861
9642E470661J206534J3833167Q877009r821033j5519555n54133J2419561O460038
$$ y = [-4129008, -16286112, -8266824, 17277080, 32584003, 19959688, -4071965, -11596602, -642943, 7512331, 3304787, -903343, 1888430, -768321, -16492037, -29803830, -24772169, -10755394, -6760481, -11980074, -12701789, -9635141, -14559254, -23177576, -15898204, 10720377, 33704766, 31851994, 9578613, -12809584, -20125275, -9620620, 10306217, 24298935, 23099306, 14678787, 12758949, 15877123, 11734949, 989533, -1559859, 7779410, 14262747, 9131536, 3322780, 7296515, 13039759, 7721047, -7009798, -20018392, -24682390, -19440068, -5340827, 9001265, 11803522, 5470661, 6677195, 20510362, 29387371, 19566338, 4046783, 3492650, 15912211, 22372249]
9634B2372249p503529j2831967r470975m575640L19211L486994L57560n858297
9626a3704394n272235K276177O610395N088317M383111L946806k416379q117394
9618g205596l65105J3246020J1667993k250637k274979J4975808J8525669o188796
9610D0130377k8701617j9372527N446388J2575038J990492l905110j791101m592977
9602A778963j0262664o356259K530083K513399j000314P465423K0755630J6596270
9594C4020531l859629j5485254q526276Q54077K540065N286432J1159582O757275
9586C2746803q975428j5398674l066286Q526860K921360o176440k52538J0923281
9578B1248938O261218j0008345j5178093m815958L128055j48788k798386L604888
$$ y = [22372249, 14868720, 2036753, -7434222, -12009862, -11690651, -8203657, -7846097, -13704394, -18976629, -16700452, -10090057, -5001740, -618629, 3328177, 911798, -7205596, -7570701, 5675319, 17343312, 15092675, 12817696, 27793504, 46319173, 40130377, 11428760, -7943767, -2497379, 10077659, 12068151, 8163041, 6371940, 1778963, -8483701, -14839960, -12309877, -9796478, -10796792, -3331369, 17424261, 34020531, 30160902, 14675648, 6149372, 7003449, 9543514, 14829946, 25989528, 32746803, 23771375, 8372701, 5306415, 13833275, 16754635, 10578195, 10325657, 21248938, 27510156, 17501811, 2323718, -2492240, 635815, 487027, -2311359, 1293529]
9570A293529R755010O756765J322837J815233K600245m568203j3070090r854327
9562c949001L495374J2166477R297942K785766k15250k927966q645179j1868186
9554A39977p143485J148365N659820O615790P714456P212965K092461l431125
9546B0009224l449716j050343k884368n702683p00627R163411R946965k010879
9538B3320984j2464053q881798L147261J0398167R495833N425538N12268n078851
9530B5875349p242578k836843K150176n96555p761309p466187K046646O991371
9522A1160070k562409j5368740j1496745R552551K4952470J7495205j841662j0327277
9514B1563463m760800j134615o365771r762784n814156m550441r709462p292494
$$ y = [1293529, 11048539, 17805304, 19128141, 20943374, 23543619, 18975416, 5905326, -3949001, -453627, 11712850, 21010792, 23796558, 23581308, 20653342, 12008163, 139977, -7003508, -5855143, -195323, 6420467, 14134923, 21347888, 23440349, 20009224, 16559508, 15509165, 12624797, 6922114, 6221487, 15384898, 25331863, 23320984, 10856931, 1975133, 5122394, 15520561, 25016394, 30441932, 30954200, 25875349, 18632771, 15795928, 17946104, 17349549, 9588240, 2122053, 4168699, 11160070, 8597661, -6771079, -18267824, -8715273, 16237197, 33732402, 31890740, 21563463, 16802663, 15668048, 9302277, -460507, -6274663, -10825104, -20534566, -27827060]
9506b7827060Q805161J9226694Q042203p906372m381812R631296P694026p229767
9498F054369p549044R591363J5582893j182780j6184236r846523M849253J0454842
9490A1770137J0554816J0843164L929891q601979p905132P541486Q627713j7701879
9482A9058217l7666888j8673300J6999316K4118863J562079j3038524m486134
9475a2126371N446765J759367l762801k05823O108023Q419039P790718K144318
9467A5573235j0057054j6038574k975357J5967510J6287240Q07660n515913J529741
9459A5578488J011091j1413095j3322640K822893J2883744J992799r709074l127836
9451c283630O361699k917760j9891293j8455186L79707J1861561N292798n681873
$$ y = [-27827060, -19021899, 204795, 8246998, 340626, -4041186, 5590110, 13284136, 6054369, -1494675, 8096688, 23679581, 22496801, 6312565, -3533958, 1315295, 11770137, 22324953, 33168117, 37098008, 28496029, 20590897, 28132383, 36760096, 19058217, -18608671, -37281971, -20282655, 3836208, 5398287, -7640237, -12126371, -6679606, -4920239, -8683040, -8888863, -2780840, 5638199, 13428917, 15573235, 5516181, -10522393, -13497750, 2469760, 18757000, 19564660, 14048747, 15578488, 16589579, 5176484, -8146156, -5323263, 7560481, 9553280, -155794, -3283630, 3078069, 160309, -19730984, -38186170, -37806463, -25944902, -20652104, -26333977]
9443b6333977p240798k53726P857642J1303307P298053K02792O13508J0585341
9435D032142J5945720M699530j3131724j7322787n115064O485513N031082l090048
9427b465636m771721K384292Q711607M944971o307767j2404724n894506M629896
9419a1173588N474264k353354n125115J332058N430103O44079k678839L861906
9411d588486R744514J498472j3902661j7523602n513560P216108Q791397K905451
9403a1372367j070979l6978K797056K971326j008458m422480J41569J1320010
9395f81301J6104812O007317q714502j0851051P83900J1047036R875178K294721
9387B5866110m225112j0331297j7324838j8777832q338656Q260409J6826782J0210016
$$ y = [-26333977, -33574775, -33828501, -25970859, -14667552, -7369499, -7166707, -6553199, 4032142, 19977862, 24677392, 11545668, -5777119, -10892183, -4406670, 624412, -2465636, -7237357, -4853065, 3858542, 8803513, 2495746, -9908978, -15803484, -11173588, -5699324, -8052678, -13177793, -11845735, -6415632, -5771553, -8450392, -4588486, 5156028, 6654500, -7248161, -24771763, -30285323, -23069215, -14277818, -11372367, -12443346, -12480324, -9683268, -6711942, -7720400, -12142880, -12001311, -681301, 15423511, 21430828, 12716326, 1865275, 2649175, 13696211, 23571389, 25866110, 21640998, 11309701, -6015137, -24792969, -33131625, -24871216, -8044434, 2165582]
9379B165582m272280j3233314j0155264N64218J0027565J3086444J0295529M307693
9371A2786173k378375o229248l810418K762927M940053k413495j1726251j0034806
9363a6103440L007983J1782192M721127q272239p849401P435166J7669875Q786884
9355B1178147q407659j4582430p533726M70520L668197N653289N145375k860713
9347B731000j1203044n371464J0875298J4723418j663584j6299210j0331973L464150
9339a3075409M147309k805224P57793J0073036N394134r822485j0112379R787711
9331e655514K3330930J2130702p593598j2072666l255504R80926m801863j1302073
9323h238660j1321239n230756M177300J1783672J0568833M98161p962219n831266
$$ y = [2165582, -2106698, -15340012, -25495276, -24931058, -14903493, -1817049, 8478480, 12786173, 10407798, 4178550, 368132, 3131059, 8071112, 5657617, -6068634, -16103440, -13095457, -1313265, 3407862, -4864377, -12713778, -5278612, 12391263, 21178147, 12770488, -1811942, -9345668, -8875148, -5206951, 446338, 5591713, 2731000, -8472044, -13843508, -2968210, 11755208, 10091624, -6207586, -16539559, -13075409, -8928100, -11733324, -10975531, -902495, 4491639, -5330846, -15443225, -5655514, 17675416, 29806118, 22212520, 10139854, 6884350, 7865276, 3063413, -8238660, -19559899, -24790655, -20613355, -8829683, 1739150, 2237311, -5724908, -11556174]
9315a1556174L793851J1614256J2366792N659557n624199j3999367j2875405o833601
9307a7454290o867866j2221700r231669O188781J8454815J4032475J412511k348059
9299h035002M126643Q615184N649911J945530L484858P210977N990973l463062
9291B5526012j6726682k3349275j5959731N82451J3876072J7854791J4786420
9284A6590058N190348j1257172k3588458j5450286R355922K3475791J0093919
9277A4410122j3077537j8057946l600514Q482297O226613j013867j589573L313682
9269d906723N094370j373924j2741643j7624515o127477J5179892K5082152J2979674
9261A5561806n862785j1078782m286205j030411l600479r50112P289088P645358
$$ y = [-11556174, -7762323, 3851933, 16218725, 21878282, 16254083, 2254716, -10620689, -17454290, -24322156, -36543856, -45775525, -39586744, -21131929, -7099454, -5686943, -8035002, -3908359, 4706825, 10356736, 12302266, 15787124, 22998101, 28989074, 25526012, 8799330, -14549945, -30509676, -29927225, -16051153, 1803638, 16590058, 21780406, 10523234, -13065224, -28515510, -19159588, 4316203, 14410122, 1332585, -16725361, -20325875, -11843578, -5616965, -6630832, -8220405, -4906723, 187647, -1186277, -13927920, -31552435, -37679912, -22500020, 2582132, 15561806, 9699021, -1379761, -5665966, -6696377, -10296856, -11246968, -3957880, 3687478]
9253C687478l042275r256400o42200J0983486R354102k541538q950248n081453
9245e489048j492215o049995j2411162r532454L854593J8109028K2609316J3942856
9237B3540919k689096j6257442j6356796k777301J1053893J0380018l007904j1650373
9229g764082m770268P767452J0247113K246417m796004o125049o389473p107010
9221a6690904m637237J00189K227471K848237O298294Q760045L578233l198008
9213g13680O54732J0587132P771026j1029753k4980342j8054807P26488J4001796
9205b1037408J6351683R746370l461626j3253583o037014J2461665J7094813p82933
9197A1081967j7014971j0312937O010443Q198662j109090m713903l414059q549944
$$ y = [3687478, 645203, -8611197, -9253397, 1730089, 11084191, 8542653, -407595, -5489048, -6981263, -13031258, -25442420, -34974874, -31120281, -13011253, 9598063, 23540919, 20851823, 4594381, -11762415, -14539716, -3485823, 6894195, 3886291, -7764082, -12534350, -4766898, 5480215, 7726632, 2930628, -3194421, -9583894, -16690904, -21328141, -21227952, -19000481, -16152244, -9853950, -1093905, 2484328, -713680, -58948, 10528184, 18299210, 7269457, -17710885, -35765692, -35039204, -21037408, -4685725, 5060645, 1599019, -11654564, -17691578, -5229913, 11864900, 11081967, -5933004, -16245941, -10235498, -2036836, -3145926, -7859829, -11273888, -19823832]
9189a9823832j3450392k486898J6927750K0430138L730014j2268208j3614093
9182b0555521o694902R28274R119429J2703012M036431q208755n453042J0759506
9174c365568J7326657M447459j0123368j0281941l826500l869297o799016l175486
9166a9667060L744344N103604K135910J950117M705364N203983J829400l225226
9158A780436p178109n899579K624806J0928794P875582m465800j1063763n931015
9150a1328648j032878n621681r896885j108408J4115403J7622642M826191j0558286
9142b982550j4584029n862749P959616J7372014J5343099K687271j0164325j2639276
9134b870929n468615K133033N485099Q084423J1958637J1917901L429222q741935
$$ y = [-19823832, -33274224, -35761122, -18833372, 1596766, 5326780, -6941428, -20555521, -27250423, -26322149, -17202720, -4499708, -463277, -8672032, -14125074, -3365568, 13961089, 18408548, 8285180, -1996761, -5823261, -9692558, -16491574, -19667060, -15922716, -10819112, -8683202, -6733085, -2027721, 3176262, 5005662, 1780436, -5397673, -11297252, -8672446, 2256348, 10131930, 5666130, -5397633, -11328648, -12361526, -17983207, -27880092, -28988500, -14873097, 2749545, 7575736, -2982550, -17566579, -23429328, -15469712, 1902302, 17245401, 19932672, 9768347, -2870929, -8339544, -6206511, -721412, 7363011, 19321648, 31239549, 34668771, 25926836]
9126B5926836j5110710j2388885m944006K730082Q584238Q623769j135215j4827083
9118b540974j7818543m915185R837655J0748086J116205n101606n372001o738586
9110b0784949o843423L272061J7659875J8318670L788356o358134k521902J161333
9102G691887o005771j2505344o800506K580943N448705Q433817J6553803J5993155
9094C1390689k735679k1998450k1255662q317020j882470P22812J0365634J6472653
9086B762507L668059j3695811r545810Q714875J0439297o183053j1461357M212300
9078a1088993J5334839O136390o092480n308231j645081o431360j0696230n445881
9070b5237027O88863M5680Q40633Q736224J3009363M943396p148698j2373916
$$ y = [25926836, 10816126, -1572759, -6516765, -3786683, 4797555, 13421324, 12286109, -2540974, -20359517, -25274702, -15437047, -4688961, -3572756, -8674362, -14046363, -20784949, -27628372, -24356311, -6696436, 11622234, 15410590, 9052456, 6530554, 7691887, 1686116, -10819228, -17619734, -15038791, -9590086, -1156269, 15397534, 31390689, 28655010, 6656560, -14599102, -22916122, -24798592, -24075780, -13710146, 2762507, 6430566, -7265245, -16811055, -8096180, 2343117, -3839936, -15301293, -11088993, 4245846, 10382236, 4289756, -1018475, -2663556, -9094916, -19791146, -25237027, -24548164, -24502484, -23661851, -14925627, -1916264, 3027132, -4121566, -16495482]
9062a6495482j0351725k659451J0038454J7138561O744359r685287p102929J2711574
9054C38074K0105852N113497p799365n116052o611943k2062404k4340121M126417
9046c6246045L1908971K2517961q527446j9726472o266071L957237K148716M415109
9038e818040J2912319J1066284k649034j0068166m523880J594491J313624k89573
9030C538025k716784q537111q389075O237402J9121587P694373j6769488j9902918
9022a9723989K652011J7042326M022624j3572156j0556273L442412O509107K88235
9014i895703L30076P001353Q638605L817148O99764J76376l388568q046429n719482
9005f386860L054595P928438L525273l613055n173140j676338O03215l00178J34332
$$ y = [-16495482, -26847207, -29506658, -19468204, -2329643, 4414716, -5270571, -12373500, 338074, 20443926, 25557423, 17758058, 12642006, 6030063, -16032341, -40372462, -36246045, -4337074, 18180887, 9653441, -10073031, -16339102, -12381865, -10233149, -5818040, 7094279, 18160563, 15511529, 5443363, 919483, 2513974, 3827598, 3538025, 821241, -7715870, -16104945, -9867543, 9254044, 16948417, 178929, -19723989, -17071978, -29652, 3992972, -9579184, -20135457, -16693045, -10183938, -9895703, -9565627, -2564274, 6074331, 9891479, 10591243, 10767619, 7379051, -667378, -6386860, -3332265, 4596173, 8121446, 4508391, -664749, -2341087, -1737872, -2038050, -1903718]
8996a903718M574573P895891M227705k812904m696517k106115l780408r332656
8988g934149p261320L402717N715882q024564j7652222l603571J8397377J7233926
8980B74076n154545j5410323r14651J1558447J492314j0824792J375120K4138737
8972F534383K1241869q981611k8174277j3366866J1345697J3003738l080123p465832
8964h943022N316873J1379965r40655j2750993p482913K916351K045071j513565
8956i972888P276338J7642218Q926785j0210338j1863492L772369O831726j0813622
8948A589096j9456314j553204J6875876Q144353j2623047j3803134L224031J1942097
8940e660246M296274l733819k875851l40612j714790l722064l068006J538745
$$ y = [-1903718, 2670855, 10566746, 14794451, 11981547, 7285030, 5178915, 1398507, -7934149, -15195469, -11792752, -6076870, -14101434, -31753656, -35357227, -16959850, 274076, -4880469, -20290792, -21205443, -9646996, -8154682, -18979474, -17604354, 6534383, 27776252, 18794641, -9379636, -22746502, -11400805, 1602933, -1477190, -8943022, -3626149, 7753816, 6813161, -5937832, -13420745, -10504394, -8459323, -9972888, -2696550, 14945668, 23872453, 13662115, 1798623, 5570992, 12402718, 1589096, -17867218, -19420422, -2544546, 5599807, -7023240, -20826374, -17602343, -5660246, -1363972, -5097791, -7973642, -8314254, -10029044, -13751108, -16819114, -15280369]
8932a5280369J0257937J4906491L938653j4346187j3411120J0787974K4898587
8925B1751966O944905j5889194r393290J2118239J1603047q707817j6039251n138075
8917b749470J30428l289419M413024J8425678J0053911j8501524k8613947o490625
8909b6621944J5345268J2703264K341136K225304J459106q404035j1127664J151817
8901a0927748Q268674p80313n795137N200558J0318634m960076j6609091l936654
8893a9221153J1051865K039607j4383679r189477P892133R449142N40346M119038
8885g702178J3733114N782017j2777851j3602115K716497Q204376l173334q385862
8877a5205336J448024Q642660L729813j525521q38578j969923l984404M152282
$$ y = [-15280369, -5022432, 9884059, 13822712, -523475, -13934595, -3146621, 21751966, 28696871, 12807677, 3414387, 15532626, 27135673, 18427856, 2388605, -2749470, -2619042, -5908461, -1495437, 16930241, 26984152, 8482628, -20131319, -26621944, -11276676, 1426588, 3767724, 5993028, 7452134, -951901, -12079565, -10927748, -2659074, -3439387, -9234524, -4033966, 6284668, 1324592, -15284499, -19221153, -8169288, -6129681, -20513360, -29702837, -21810704, -12361562, -11821216, -7702178, 6030936, 11812953, -964898, -14567013, -11850516, -3646140, -6819474, -15205336, -13757312, -5114652, -1384839, -2910360, -3748938, -5718861, -9703265, -5550983]
8869e550983J7362576J5836329j791422j4311539j2323283q926606j0170331m032860
8861b3908119J1530137J7414724L646580j2507773j2763431k902722J471737j752634
8853a9771501l786476J423827J3466186K4532296K1029402K94717j6756448r448840
8845A0983163Q981011P163015j5123286k4343963n747457J4502898J2730640J618300
8837A0764321J435346N370436k125798j4036875j3603408l205207L134177M133979
8829h133029O828711Q320238K314570m758286k971605K980118J591468o524324
8821c52139j2447706j3949342j2537633m357093J1153415K2035178J8139363O934068
8813A4618111J526021J854988J020807m59924j142094p237072j8380806j8077392
$$ y = [-5550983, 11811593, 27647922, 25856500, 11544961, -778322, -9704928, -19875259, -23908119, -12377982, 5036742, 8683322, -3824451, -16587882, -19490604, -18018867, -19771501, -23557977, -22134150, -8667964, 15864332, 36893734, 37188451, 20432003, 10983163, 19964174, 27127189, 12003903, -12340060, -18087517, -3584619, 9146021, 10764321, 12199667, 17570103, 15444305, 1407430, -12195978, -15401185, -12267008, -8133029, -1304318, 7015920, 9330490, 4572204, 1600599, 4580717, 6172185, -352139, -12799845, -26749187, -39286820, -43643913, -32490498, -10455320, 7684043, 14618111, 16144132, 17999120, 19019927, 18560003, 17417909, 10180837, -8199969, -26277361]
8805b6277361J940719K0462174J3159639r879118j8259317n534693P254843P569004
8797i564110L036753j437394r873395j6154811o322131J4261038K1416657P359982
8789B722589q172741r872958n898525n005642N64225J4479030K0762153P778351
8781A7356482r159724r030365L400209O790479m272992j4094692r302316O582060
8773a1730859J9772790J8215761J124554j6638356j6736215n96028R075866j807288
8765F80225j8481134j8185133q58334J4441900J5622908O219877n482074j2261984
8757a8303749p963846N513325J5511818J3734566P821567O936177N266269n112954
8749B3403173j4568775r008662L909672M683750m551188k037069J5053164K0739447
$$ y = [-26277361, -24336642, -3874468, 9285171, -593947, -18853264, -24387957, -17133114, -9564110, -6527357, -7964751, -17838146, -33992957, -40315088, -26054050, -4637393, 2722589, -5450152, -15323110, -21221635, -26227277, -25663052, -11184022, 9578131, 17356482, 8196758, -833607, 2566602, 9357081, 5084089, -9010603, -18312919, -11730859, 8041931, 26257692, 27382246, 10743890, -5992325, -6588353, 2487513, 680225, -17800909, -35986042, -36844376, -22402476, -6779568, -559691, -6041765, -18303749, -26267595, -20754270, -5242452, 8492114, 16313681, 23249858, 28516127, 23403173, 8834398, -174264, 3735408, 8419158, 3867970, 1830901, 16884065, 37623512]
8741C7623512N7044k4047353k0997191N565428K4895852J9371762K75801j2765597
8733B9979258j2993838o497980j548967j022106j571672o8199n75617r005931
8725c305052j9537906j6600552L235555K1388282J9690701M932159j947547L954891
8717A1810531P669239K99802p442877l566575O213213P857613j77591o619262
8709A6044093n156953k038336m221217q185067n602448M144439J2801820J3469250
8701B1255581P344794J96143l568125k386651K279131M981388Q2710r785172j3465279
8692F934520m856470P004552Q570298P905n844584k030312M898045P425653O600496
8683B8710103M406566k763976j4693872k0185930j0836164L381859N221534n213687
$$ y = [37623512, 37680556, 13633203, -7363988, -1798560, 23097292, 42469054, 42744855, 29979258, 16985420, 10487440, 8938473, 7916367, 6344695, 6276496, 5700879, -3305052, -22842958, -39443510, -36207955, -14819673, 4871028, 9803187, 7855640, 11810531, 19479770, 19779572, 12336695, 8770120, 14983333, 22840946, 22663355, 16044093, 10887140, 8848804, 4627587, -3557480, -9159928, -5015489, 7786331, 21255581, 28600375, 28796518, 25228393, 22841742, 25120873, 30102261, 30184971, 20399799, 6934520, 2078050, 9082602, 17652900, 17660805, 11816221, 9785909, 14683954, 22109607, 28710103, 33116669, 30352693, 15658821, -4527109, -15363273, -11981414, -6759880, -11973567]
8675a1973567j0630243k566903P080719O249691Q37689J901187N357274l51936
8667d096089j1753912j2845497m48140J0015007Q894664N751428R150964R415594
8659A4084019k899180j4507174o552386J2990429J7805102K492062j1307100j0774644
8651A331128p576338r427745l792521J3865537K1568977M339660j5126446q482567
8643c300315J1763401J1644629q369646j4994164J666819J3097217K099624r623791
8635C983774j069365J2373363O776137j0219053j3826814j489232P881081N196661
8627I606552j080561l681529l447992l4619P773907J3642724R246156k405495
8619B9619143j0000289r018005n024569m061743o998811j0560502q878228R67425
$$ y = [-11973567, -22603810, -25170713, -18089994, -11840303, -11002614, -9101427, -3744153, -4096089, -15850001, -28695498, -29143638, -19128631, -10233967, -4482539, 4668425, 14084019, 11184839, -3322335, -9874721, 3115708, 20920810, 23412872, 12105772, 1331128, -6245210, -15672955, -19465476, -5599939, 15969038, 20308698, 5182252, -3300315, 8463086, 20107715, 11738069, -3256095, -1589276, 11507941, 13607565, 3983774, 2914409, 15287772, 22063909, 11844856, -1981958, -3471190, 4409891, 9606552, 8525991, 4844462, 1396470, 1361851, 9135758, 22778482, 32024638, 29619143, 19618854, 10600849, 5576280, 1514537, -5484274, -16044776, -24923004, -23955579]
8611b3955579J1387131J0637371M23010m576227K30081J839343o790511j3030540
8603b3835921o557691K539232L087430K766938J0096250J3922979L551230o818276
8595a247829k55609J0514761L254924j2694316j0046279Q298416J2295897m373038
8587E746927j4662071n121752M781306J434659n01777Q959038J2411180k922569
8579A0124941j7773734j0152520R133254J5047838N806497k110782l269151m474957
8571B331386n946376k010053N581870J0965931J3573577J1650806k045241k3686542
8563A0415358l1226862j2228904J3123023J7110181K443417o293967l52230P679329
8555F69345J0315127J2106027J1551440M61042j5861609j9596352o813288N609113
$$ y = [-23955579, -12568448, -1931077, -1508067, -6084294, -5854213, -4014870, -10805381, -23835921, -30393612, -27854380, -24766950, -22000012, -11903762, 2019217, 5570447, -1247829, -1503438, 9011323, 12266247, -428069, -10474348, -2175932, 10119965, 5746927, -8915144, -14036896, -9255590, -7820931, -8322708, 636330, 13047510, 10124941, -7648793, -17801313, -8668059, 6379779, 12186276, 10075494, 6806343, 2331386, -3614990, -5625043, -43173, 10922758, 24496335, 36147141, 34101900, 10415358, -20811504, -33040408, -19917385, -2807204, -363787, -6657754, -7009984, 669345, 10984472, 23090499, 34641939, 35102981, 19241372, -354980, -7168268, -1559155]
8547a559155M868802l012197q881036j3629371j7532943j2218739N264999K1567363
8539b5132277K1920984R086491j864219k402220L623484Q505036P644138P87522
8531B2168939p586498j0626198o217888l99335k99979n087904p355722l041652
8523a8446237L362069M935291J490884r30375O356j246338q085288j2714759n915121
8514c7543518O760636J0288875K412252k744310K597228P849276K903088m920897
8506a2397370m780896j015946k927761n747258O64921J1032962J1780412N148448
8498A757512N825403J3733826J1510412o069101k0149603j4798855L99041O854502
8490i36863L240159J112775L148536J704532l878317l709731N930792J3646219
$$ y = [-1559155, 3309647, 297450, -8583586, -22212957, -39745900, -51964639, -46699640, -25132277, -3211293, 5875198, 4010979, 1608759, 5232243, 13737279, 21381417, 22168939, 14582441, 3956243, -2261645, -2660980, -2960959, -8048863, -15404585, -18446237, -15084168, -10148877, -8657993, -9588368, -9582012, -10828350, -18913638, -31628397, -37543518, -30782882, -20494007, -18081755, -20826065, -18228837, -10379561, -7476473, -12397370, -17178266, -18194212, -21121973, -26869231, -26204310, -15171348, -3390936, 1757512, 7582915, 21316741, 32827153, 26758052, 6608449, -8190406, -7791365, -936863, 2303296, 3416071, 6564607, 8269139, 4390822, 681091, 6611883, 20258102]
8482B0258102P469096p999461j7065503j3312749n696567k588926M80168R497870
8474h957970J6435833Q630030r052816j7324303r753668m05509J102070L857268
8466a5469065J4346650J9168310N971825j2811925j7105459q927679l736235j748761
8458b0312339P527564J8571573J5050510L58982m562869L731746N815720n373690
8450B0807197j1813689k980459N629367R03541n305125M08988Q434907M927564
8442B1012291l141639k984358k37624n663899j1180151l391331R599406J0229784
8434A4242479K268043K794280Q563637j58311k1366933k6919654m810452K0198138
8426e188773K1633372O043375l437615j806180j631050p744010j1403029o769450
$$ y = [20258102, 27727198, 19727737, 2662234, -10650515, -16347082, -18936008, -18455840, -8957970, 7477863, 16107893, 7055077, -10269226, -20022894, -20428403, -19326333, -15469065, -1122415, 18045895, 24017720, 11205795, -5899664, -14827343, -18563578, -20312339, -12784775, 5786798, 20837308, 21196290, 16633421, 20365167, 26180887, 20807197, 8993508, 6013049, 11642416, 12545957, 7240832, 7649820, 16084727, 21012291, 17870652, 14886294, 14648670, 8984771, -2195380, -5586711, 4012695, 14242479, 16510522, 19304802, 27868439, 27710128, 6343195, -20576459, -25386911, -5188773, 16444599, 22487974, 19050359, 17244179, 15613129, 7869119, -3533910, -10303360]
8418a0303360J425319O508929N696551j896377j3242888j7602916n078619J8021850
8410a6471511L0692364J9547069m915431j9408580j2758025M655370J4680186
8403A6021442R639275l417466j1805143q239019L659611J1950919P345115n444161
8395A9710573j1031885k454720P788710L776384j0250023j4287352j343491J1756835
8387C665031Q476291m756548j0432916n318375n18235j237074j001700M210419
8379f913107R030355Q584612N074757J263735l550819p428975m456584N350999
8371F954973J2238542Q604800j355887r239245j2940772j2971359n846707Q251040
8363f304615J6512435O306278j3468038j8864263l285272J1128773M088643j3636094
$$ y = [-10303360, -8878041, -2369112, 3327439, 1431062, -11811826, -29414742, -34493361, -16471511, 14220853, 33767922, 28852491, 9443911, -3314114, 1341256, 16021442, 25660717, 22243251, 10438108, 2199089, 5858700, 17809619, 25154734, 19710573, 8678688, 6223968, 14012678, 17789062, 7539039, -6748313, -8091804, 3665031, 12141322, 7384774, -3048142, -8366517, -8884752, -10121826, -11123526, -6913107, 2117248, 10701860, 15776617, 17040352, 13489533, 6060558, 1603974, 6954973, 19193515, 27798315, 26442428, 17203183, 4262411, -8708948, -14555655, -6304615, 10207820, 16514098, 3046060, -15818203, -19103475, -7974702, -3886059, -17522153]
8355a7522153j6559992j362208J1736494J1550040Q228144R042803L960646j2733548
8347c659774k4986471j6635664K576530J1950067J0954764J3854450J9889357
8340A3943259J3820692m062567j3468561n187413N316225L546748m523442q038138
8332A346803p565203m970688M539321J7291995J6090189l985629k1201827j6312606
8324a4767645q46415L457915j120944J706931R650904O626485n642907q367211
8316i302887K568423J0932370Q187552L561777K534453j771891r903389j0484009
8308c677601j126433M781951P20325k274353L038489O415603p05462r003912p280707
8299i112100m20658K027935K706362P929760J2604861P690782m321306j2783941
$$ y = [-17522153, -34082145, -35444353, -23707859, -12157819, -3929675, 5113128, 9073774, -3659774, -28646245, -45281909, -42705379, -30755312, -19800548, -5946098, 13943259, 27763951, 23701384, 10232823, 5045410, 10361635, 13908383, 9384941, 1346803, -6218400, -11189088, -6649767, 10642228, 26732417, 22746788, 1544961, -14767645, -15614060, -12156145, -13277089, -11570158, -1919254, 4707231, -935676, -9302887, -6734464, 4197906, 12385458, 15947235, 18481688, 16709797, 6806408, -3677601, -4804034, -22083, 698242, -1576111, 1462378, 7877981, 7172519, -1831393, -9112100, -9532758, -7504823, -4798461, 3131299, 15736160, 23426942, 19105636, 6321695]
8291F321695j1710164j385646J4045914K3068380J2561110j2589708k7356215
8284B955366j6629933L169819O564598o407946j4106536n210042R660038J5373354
8276d631282P654738p126940j6591374r853589R523511K2285413J5122469j722690
8268A4660256q784569k748206M580524O129386M214703k6994p361381j3175874
8260b512155j2093564o921036k057358N829000J7481880J9707252K324479j9585471
8252B173027k1250275l441663R329945N545931q98478K190979Q468108R822987
8244A1940561R090157P510048j072708j3665775j4560507k35666R671828M05465
8236I083403j4596964j4683749k991693K048910l279294o322633j971031R71266
$$ y = [6321695, -5388469, -6774115, 7271799, 30340179, 42901289, 30311581, 2955366, -13674567, -10504748, -3940150, -10348096, -24454632, -29664674, -20004636, -4631282, 3023456, -4103484, -20694858, -30548447, -21024936, 1260477, 16382946, 14660256, 5875687, 3127481, 7708005, 13837391, 18052094, 18025100, 10663719, -2512155, -14605719, -21526755, -23584113, -17755113, -273233, 19434019, 21758498, 2173027, -19077248, -22518911, -13188966, -7643035, -8541513, -6350534, 2117574, 11940561, 21030718, 28540766, 27468058, 13802283, -758224, -993890, 8677938, 9083403, -5513561, -20197310, -23189003, -21140093, -24419387, -30742020, -32713051, -31741785]
8228c1741785j777318j321476R308144K2026273K2606717Q393624p893322j1986185
8220G614672l928368K202981l883493j4719669j4799613j892873J0205808J0534005
8212h666550L065730k464063k832466n02441K090886L406767L118773L123552
8204C40188L520914j56544q262888j0274658J233497J4304579J1676137j432798
8196A0948427l565912Q622221J5135264O122114l801287l503462l032000j0251975
8188A6673390j3291199l227706O861618M513575Q2140N766988J0986349J850416
8180C0215571j1282172j0826517k409673k155238o100658j88004R534864O327811
8172A3115984m718115l801120P682791Q238065p159623j9676180j7413906q175086
$$ y = [-31741785, -33519103, -34840579, -25532435, -3506162, 19100555, 27494179, 19600857, 7614672, 3686304, 5889285, 2005792, -12713877, -27513490, -29406363, -19200555, -8666550, -5600820, -8064883, -10897349, -11399790, -9308904, -5902137, -2783364, 340188, 3861102, 3704558, -4558330, -14832988, -13599491, 705088, 12381225, 10948427, 7382515, 16004736, 31140000, 37262114, 33460827, 29957365, 26925365, 16673390, 3382191, 154485, 7016103, 11529678, 11611818, 17378806, 28365155, 30215571, 18933399, 8106882, 5697209, 3541971, -2558687, -2746691, 6788173, 13115984, 8397869, 4596749, 12279540, 20517605, 13357982, -6318198, -23732104, -31907190]
8164c1907190k23733N451911L746656q556704j6122126j622465K1181543K0867246
8156g184862k977415j6677187l961598J2558528J1676438K882056P18273r0313
8148c056080n918022p016590J905691O928704q03895p519947j329567O822466
8140i987240M654038o1852J765745J482588p605040j1859309k0851J4632563J6035346
8131I035988J0361051Q275597L051941r990375j4052876J587480J5502529O319136
8123C0090471r094728m299162Q800581J153914j9076883j8921153O42290O502765
8115d201905o950873r381096P857069J4920546j219927j1859262J090290J1467651
8107A722493l313165j9383160p148869J6359420J6350467j395642m182573R751443
$$ y = [-31907190, -32130923, -26679012, -22932356, -31489060, -47611186, -49233651, -28052108, -7184862, -10162277, -26839464, -30801062, -18242534, -6566096, -3684040, -2965767, -3056080, -8974102, -15990692, -14085001, -7156297, -7960192, -15480139, -16809706, -9987240, -5333202, -5395054, -3629309, -2146721, -9751761, -21611070, -21631921, -6999358, 9035988, 19397039, 27672636, 30724577, 20734202, 6681326, 8268806, 23771335, 30090471, 20995743, 16696581, 25497162, 26651076, 7574193, -11346960, -10704670, -4201905, -11152778, -20533874, -12676805, 2243741, 1023814, -10835448, -9745158, 1722493, -1590672, -20973832, -28122701, -11763281, 4587186, 3191544, -991029, 8760414]
8099H760414J1209338o633407j7012839n927347P511162O860496J979959L210999
8091I958775Q13383j1676015j7842185m212741J2946488J1030484k186880j899030
$$ y = [8760414, 19969752, 13336345, -3676494, -9603841, -2092679, 4767817, 6747776, 9958775, 10772158, -903857, -18746042, -22958783, -10012295, 1018189, -1168691, -3067721]
$$ [...]
##END NTUPLES=NMR SPECTRUM
##END=
