##TITLE=31Pdec_LR-0154-M1-TFA-BK
 D2O, 64 sc
 17.2.2023
##JCAMPDX= 6.0         $$ Bruker NMR JCAMP-DX V2.0
##DATA TYPE= NMR SPECTRUM
##DATA CLASS= NTUPLES
##ORIGIN= UXNMR, Bruker Analytische Messtechnik GmbH
##OWNER= root
$$ XWIN-NMR		Version 3.5
$$ Fri Feb 17 15:38:18 2023 Russian Standard Time (UT+4h)  she@DPX200
##.OBSERVE FREQUENCY= 81.013821
##.OBSERVE NUCLEUS= ^31P
##.ACQUISITION MODE= SIMULTANEOUS
##.ACQUISITION SCHEME= undefined
##.AVERAGES= 64
##.DIGITISER RES= 16
##SPECTROMETER/DATA SYSTEM= spect
##.PULSE SEQUENCE= zgpg30
##.SOLVENT NAME= D2O
##.SHIFT REFERENCE= (INTERNAL, D2O, 0, 248.564)
##AUDIT TRAIL= $$ (NUMBER, WHEN, WHO, WHERE, WHAT)
$$ ##TITLE= Audit trail, XWIN-NMR		Version 3.5
$$ ##JCAMPDX= 5.01
$$ ##ORIGIN= Bruker BioSpin GmbH
$$ ##OWNER= she
$$ F:/spectra/data/she/nmr/P31/1/pdata/1/auditp.txt
$$ ##AUDIT TRAIL=  $$ (NUMBER, WHEN, WHO, WHERE, WHAT)
(   1,<2023-02-17 15:37:29.23 +0400>,<she>,<DPX200>,
      <continue with go, POWCHK disabled, PULCHK disabled
       configuration hash MD5:
       00 E9 B6 7A A2 85 ED C7 34 08 36 98 17 FE 4E 26
       data hash MD5: 32K
       19 0F 8A 70 96 AD 8A 67 26 4B DE 73 DE E3 86 D7>)
(   2,<2023-02-17 15:37:31.59 +0400>,<she>,<DPX200>,
      <Start of raw data processing
       efp BC_mod = 2 LB = 1 FT_mod = 6 PKNL = 1 PHC0 = -11127.23 PHC1 = 473.6127 SI = 64K 
       data hash MD5: 64K
       D4 4E 87 B3 CC 6A 15 52 66 2E 4D E4 2C F8 31 D6>)
(   3,<2023-02-17 15:37:41.75 +0400>,<she>,<DPX200>,
      <pk PHC0 = -22.01993 PHC1 = 0 
       data hash MD5: 64K
       6E 2D 61 8C 09 C2 44 D6 DC 63 D4 E9 AF 39 93 F0>)
$$ ##END=
$$ 
$$ hash MD5
$$ 2C C3 C6 72 9B 0E 84 17 F6 55 AD 2B 6B 0A 43 43
##$RELAX= 
##$RELAX= 
##$RELAX= 
##$RELAX= 
##$RELAX= 
##$RELAX= 
##$RELAX= 
##$RELAX= 
##$RELAX= 
$$ Bruker specific parameters
$$ --------------------------
##$DU= <F:/spectra>
##$EXPNO= 1
##$NAME= <P31>
##$PROCNO= 1
##$TYPE= <nmr>
##$USER= <she>
##$AMP= (0..31)
100 100 100 100 100 100 100 100 100 100 100 100 100 100 100 100 100 100 
100 100 100 100 100 100 100 100 100 100 100 100 100 100 
##$AQSEQ= 0
##$AQ_mod= 1
##$AUNM= <au_zg>
##$AUTOPOS= <>
##$BF1= 81.014009
##$BF2= 200.13
##$BF3= 200.13
##$BF4= 200.13
##$BF5= 200.13
##$BF6= 200.13
##$BF7= 200.13
##$BF8= 200.13
##$BYTORDA= 1
##$CFDGTYP= 0
##$CFRGTYP= 5
##$CHEMSTR= <none>
##$CNST= (0..31)
1 1 145 1 1 1 1 1 1 1 1 1 1 1 1 1 1 1 1 1 1 1 1 1 1 1 1 1 1 1 1 1 
##$CPDPRG= <waltz16>
##$CPDPRG1= <>
##$CPDPRG2= <waltz16>
##$CPDPRG3= <>
##$CPDPRG4= <mlev>
##$CPDPRG5= <mlev>
##$CPDPRG6= <mlev>
##$CPDPRG7= <mlev>
##$CPDPRG8= <mlev>
##$CPDPRGB= <>
##$CPDPRGT= <>
##$D= (0..31)
0 1 0 0 0 0 0 0 0 0 0 0.03 2e-05 3e-06 0 0 0 0 0 0 0 0 0 0 0 0 0 0 0 0 
0 0 
##$DATE= 1676633771
##$DBL= (0..7)
120 120 120 11 120 120 24 19 
##$DBP= (0..7)
150 150 150 150 150 150 150 150 
##$DBP07= 0
##$DBPNAM0= <>
##$DBPNAM1= <>
##$DBPNAM2= <>
##$DBPNAM3= <>
##$DBPNAM4= <>
##$DBPNAM5= <>
##$DBPNAM6= <>
##$DBPNAM7= <>
##$DBPOAL= (0..7)
0.5 0.5 0.5 0.5 0.5 0.5 0.5 0.5 
##$DBPOFFS= (0..7)
$$ [...]
##$SUBNAM2= <"">
##$SUBNAM3= <"">
##$SUBNAM4= <"">
##$SUBNAM5= <"">
##$SUBNAM6= <"">
##$SUBNAM7= <"">
##$SUBNAM8= <"">
##$SUBNAM9= <"">
##$SW= 501.771253377433
##$SWIBOX= (0..15)
0 1 3 0 0 0 0 0 0 0 0 0 0 0 0 0 
##$SW_h= 40650.406504065
##$TD= 32768
##$TD0= 1
##$TE= 0
##$TE2= 300
##$TE3= 300
##$TEG= 300
##$TL= (0..7)
0 120 53 12 22 120 120 120 
##$TP= (0..7)
150 150 150 150 150 150 150 150 
##$TP07= 0
##$TPNAME0= <>
##$TPNAME1= <>
##$TPNAME2= <>
##$TPNAME3= <>
##$TPNAME4= <>
##$TPNAME5= <>
##$TPNAME6= <>
##$TPNAME7= <>
##$TPOAL= (0..7)
0.5 0.5 0.5 0.5 0.5 0.5 0.5 0.5 
##$TPOFFS= (0..7)
0 0 0 0 0 0 0 0 
##$TUNHIN= 0
##$TUNHOUT= 0
##$TUNXOUT= 0
##$USERA1= <user>
##$USERA2= <user>
##$USERA3= <user>
##$USERA4= <user>
##$USERA5= <user>
##$V9= 5
##$VALIST= <valist>
##$VCLIST= <CCCCCCCCCCCCCCC>
##$VD= 0
##$VDLIST= <DDDDDDDDDDDDDDD>
##$VPLIST= <PPPPPPPPPPPPPPP>
##$VTLIST= <TTTTTTTTTTTTTTT>
##$WBST= 1024
##$WBSW= 4
##$XGAIN= (0..3)
0 0 0 0 
##$XL= 0
##$YL= 0
##$YMAX_a= 3461
##$YMIN_a= -2121
##$ZGOPTNS= <>
##$ZL1= 120
##$ZL2= 120
##$ZL3= 120
##$ZL4= 120
##$ABSF1= 0
##$ABSF2= 0
##$ABSG= 0
##$ABSL= 0
##$ALPHA= 0
##$AQORDER= 0
##$ASSFAC= 0
##$ASSFACI= 0
##$ASSFACX= 0
##$ASSWID= 0
##$AUNMP= <proc_1d>
##$AZFE= 0.1
##$AZFW= 0.5
##$BCFW= 0
##$BC_mod= 2
##$BYTORDP= 0
##$COROFFS= 0
##$CY= -3
##$DATMOD= 1
##$DC= 0
##$DFILT= <>
##$DTYPP= 0
##$F1P= 0
##$F2P= 0
##$FCOR= 1
##$FTSIZE= 65536
##$FT_mod= 6
##$GAMMA= 0
##$GB= 0
##$INTBC= 1
##$INTSCL= 6.047779e-11
##$ISEN= 30
##$LB= 1
##$LEV0= 0
##$LPBIN= 0
##$MAXI= 10000
##$MC2= 0
##$MEAN= 0
##$ME_mod= 0
##$MI= 50
##$NCOEF= 0
##$NC_proc= -8
##$NLEV= 6
##$NOISF1= 182.463
##$NOISF2= 159.3651
##$NSP= 0
##$NTH_PI= 0
##$NZP= 0
##$OFFSET= 248.5645
##$PC= 4
##$PHC0= -11149.25
##$PHC1= 473.6127
##$PH_mod= 1
##$PKNL= yes
##$PPARMOD= 0
##$PSCAL= 0
##$PSIGN= 0
##$REVERSE= no
##$SF= 81.0140089999694
##$SI= 65536
##$SIGF1= 159.3651
##$SIGF2= -187.1042
##$SINO= 113.3802
##$SIOLD= 16384
##$SREGLST= <1H.CDCl3>
##$SSB= 0
##$STSI= 65536
##$STSR= 0
##$SW_p= 40650.406504065
##$SYMM= 0
##$S_DEV= 0
##$TDeff= 32768
##$TDoff= 0
##$TI= <>
##$TILT= no
##$TM1= 0
##$TM2= 0
##$TOPLEV= 0
##$USERP1= <user>
##$USERP2= <user>
##$USERP3= <user>
##$USERP4= <user>
##$USERP5= <user>
##$WDW= 1
##$XDIM= 65536
##$YMAX_p= 333996563
##$YMIN_p= -156363025
$$ End of Bruker specific parameters
$$ ---------------------------------
##NTUPLES= NMR SPECTRUM
##VAR_NAME=  FREQUENCY,     SPECTRUM/REAL,   SPECTRUM/IMAG
##SYMBOL=    X,             R,               I
##VAR_TYPE=  INDEPENDENT,   DEPENDENT,       DEPENDENT
##VAR_FORM=  AFFN,          ASDF,            ASDF
##VAR_DIM=   65536,         65536,           65536
##UNITS=     HZ,            ARBITRARY UNITS, ARBITRARY UNITS
##FACTOR=    0.620285442955139, 1,           1
##FIRST=     20137.2065510682, 0,            0
##LAST=      -20513.1999529968, 0,           0
##MIN=       -20513.1999529968, -156363025,  0
##MAX=       20137.2065510682, 333996563,    0
$$ Real data points
##PAGE= N=1
##DATA TABLE= (X++(R..R)), XYDATA
$$ [...]
43577 9241303 5629644 8537194 10612752 1549450 -13430929 -19321916 -12683456 -4592566
43569 -4592566 -2328698 -781324 4491892 7165270 361399 -10557804 -13841849 -6724170
43561 -6724170 2057758 4208597 927064 -773265 2738080 8196804 10147784 7153730
43553 7153730 1934525 -3455361 -8975951 -12557850 -9943452 -2042249 2668842 -1062484
43545 -1062484 -6351898 -3789965 3279455 3066865 -5833656 -11084684 -4695204 5881236
43537 5881236 9865837 7688099 6696806 9029353 11266073 11718210 10822141 7117551 -491229
43528 -491229 -7911721 -8964633 -3005303 4277517 6926510 3031624 -4995012 -11433537
43520 -11433537 -10554408 -2114935 7735201 13020674 13309364 11123052 7741103 4265029
43512 4265029 3038345 4396951 5130112 3517052 2455479 4019278 4927674 2100142
43504 2100142 -1091020 74072 3185197 1832610 -4320341 -9168958 -9672115 -9463375
43496 -9463375 -11598854 -12745093 -7314783 4905237 16996758 20299610 12208791 -368772
43488 -368772 -6891352 -3985234 1666571 2664750 -364045 -2295532 -1983034 -2390110 -4709061
43479 -4709061 -7618330 -11110988 -15971104 -20003223 -19642239 -15485606 -11994937 -11197235
43471 -11197235 -10296093 -6175366 751110 7871410 13219726 16332076 17521941 16380243
43463 16380243 11108107 1412144 -7735392 -9258742 -2905139 3213156 3037352 201022
43455 201022 1367876 6415157 10330166 10931924 9056679 4722401 -732508 -2224472
43447 -2224472 2551282 7503565 6446259 3517910 6479751 12578720 11725428 2654908
43439 2654908 -5419866 -7941625 -10139126 -14570048 -15308653 -9406569 -3501440 -2652222
43431 -2652222 -2052351 2811452 6569535 3526096 -595641 2942493 10773333 12002919
43423 12002919 5399538 712300 2911929 6033055 5204187 4820691 9326743 13421413
43415 13421413 8951831 -2320786 -10258234 -9590374 -5245589 -3880719 -5874515 -8000003
43407 -8000003 -9026672 -8676037 -4707832 3747340 12106170 15222173 15046411 17027762
43399 17027762 19608103 15495918 4669248 -3251046 -3519139 -3598348 -9508270 -14243542
43391 -14243542 -9459219 -888735 63185 -5209414 -5869214 -396827 2253683 -478711
43383 -478711 -1364534 1529516 811419 -5333134 -7945259 -2696608 2169663 279834 -2231465
43374 -2231465 1220475 5571013 3518042 -1742865 -2770309 412195 3624217 6459116
43366 6459116 8524939 5387003 -2757192 -6243084 315356 7421424 4879666 -1558905
43358 -1558905 -721333 4441944 3310824 -2156889 -1107193 5190744 4499272 -3894423
43350 -3894423 -6283342 2443745 10428849 9519503 8020308 14213317 21512773 20812799
43342 20812799 15988610 15184639 15556543 9131669 -2035636 -8439818 -7585210 -5711106
43334 -5711106 -6965309 -9390544 -10435291 -9284796 -4782766 2970035 10307044 14374487
43326 14374487 17512691 22034818 23686177 16842026 4129665 -5849882 -9166523 -8646690
43318 -8646690 -6614842 -2544479 2103215 3523692 1395183 -329083 367050 1427200
43310 1427200 1686654 2732700 4197184 2380720 -3595425 -8464526 -7291214 -2620469
43302 -2620469 -1388885 -5714072 -10043680 -8096711 -667765 5186128 4539619 51657
43294 51657 -2762666 -3687224 -6866436 -12083028 -13291993 -8443774 -4185037 -5434244 -6300464
43285 -6300464 485151 9484205 8645340 -1572434 -6856219 357316 9596774 7710477
43277 7710477 -2706319 -8214336 -2976044 5684558 8205038 2875191 -4447380 -6198303
43269 -6198303 833064 11965820 17812546 13316828 2452178 -7242583 -11884248 -11565441
43261 -11565441 -7956902 -4512366 -4399391 -4618751 2426628 16645405 25751893 20424613
43253 20424613 8488214 4386563 8551165 8882501 1148272 -5199348 -3529724 239250
43245 239250 -574135 -2803235 -1616253 -353490 -3684884 -7367729 -3734738 6394983
43237 6394983 14988710 17280373 14440628 8547204 1615649 -2267729 -346677 4039832
43229 4039832 5189207 2436086 -602315 -2239226 -3214181 -2863998 -237764 2187260
43221 2187260 1048630 -2690207 -5794734 -8342100 -11760652 -12822298 -6283472 6128220
43213 6128220 15290930 14739857 7050107 -551353 -3330133 -1496069 1184764 1005203
43205 1005203 -1366831 -1496618 2123358 5534506 6505140 9021627 15101919 17713844
43197 17713844 10076486 -2318545 -8666360 -8585670 -10030309 -13781192 -12674561 -6226414
43189 -6226414 -2666695 -4166124 -3221743 2389896 4415193 -215927 -1683164 6197820
43181 6197820 13362770 8083982 -4922247 -12287922 -10981022 -8268632 -8022330 -8248387
43173 -8248387 -8764669 -10872692 -11409366 -6143826 2430068 8155870 9793779 9693210 7341686
43164 7341686 1910128 -2242101 -890779 2364962 2068374 933159 4401275 8580559
43156 8580559 4912924 -4563725 -8300553 -2200176 5224847 6181055 2179527 -2574278
43148 -2574278 -6738947 -8329052 -4942251 -477417 -2597743 -9998542 -11389307 -1995880
43140 -1995880 7735394 6702395 -553729 -303079 11327530 23423533 23907766 13018927
43132 13018927 2063719 562104 5892480 7417646 1310132 -3599199 787154 8068071
43124 8068071 5903730 -4843653 -11099682 -7658928 -3655995 -5864823 -8221122 -4489249
43116 -4489249 -174576 -2738715 -8541094 -9563459 -6817294 -6834735 -9421718 -9305395 -7150535
43107 -7150535 -8583129 -12998805 -12912914 -5653979 2149915 4001007 1588866 1050094 5177280
43098 5177280 11059849 12935480 7302955 -2242334 -6435649 -233305 9842211 12552201
43090 12552201 5394976 -3580961 -7147924 -6436253 -5787732 -5800269 -5161573 -5370556 -8466927
43081 -8466927 -11454118 -8282101 1306282 9059551 7593079 37 -4357177 -2718705
43073 -2718705 -1831837 -6640298 -12537317 -13247326 -10746357 -10671445 -12213628 -10944862 -8710457
43064 -8710457 -10679378 -13698752 -9045392 1849073 6518839 378212 -5469026 -2102764
43056 -2102764 2889032 -1273106 -10414902 -12842116 -8384874 -6481080 -8550315 -6196802
43048 -6196802 2656605 8489501 4343573 -4679634 -10359005 -11749454 -11621230 -8960496
43040 -8960496 -1406944 8056286 12836583 11051487 8182867 9753186 13171637 10168979
43032 10168979 -1187088 -10500103 -6520028 6762805 13433345 6821910 -1445432 1572872
43024 1572872 12614336 19339873 17828224 13310428 8800872 3941273 1906308 6001422
43016 6001422 10511537 5912532 -6474284 -15062257 -13994486 -9000714 -6380358 -5981945
43008 -5981945 -6864611 -10092021 -13098672 -10388217 -2909288 1896966 2164265 4405168
43000 4405168 10794920 13618811 7768538 -304094 -2644413 -1041483 -1314266 -3090438
42992 -3090438 -2641059 -737637 -729350 -2521366 -3926041 -4456389 -3747968 -638961 2830712
42983 2830712 2224082 -1092122 288144 7478686 10993357 4901276 -3179613 -4266465
42975 -4266465 -2177850 -5485474 -11859026 -12101162 -5893111 -1908486 -3836599 -6615369
42967 -6615369 -6077344 -3419565 -379122 2212795 1849379 -2253240 -4547840 393344
42959 393344 8384439 10598270 6431089 2876278 2566811 1939313 809996 3777392 10847894
42950 10847894 15528201 14028070 9022238 3707123 -403208 -229026 5587343 10491400
42942 10491400 6777998 -1517846 -3181769 2399862 4392839 -648257 -2793478 3768547
42934 3768547 10728009 10234777 7234517 8620052 11045579 9277147 6926868 8332563
42926 8332563 8441134 2139782 -3832609 -339282 8819560 13030280 11075462 8984898
42918 8984898 6592210 -169120 -6844154 -4787643 3086483 4925933 -1227793 -4979066
42910 -4979066 -1619146 1363324 -470239 -371184 6287107 12550785 11643096 8260224 9306243
42901 9306243 11352859 6941439 -2154780 -7363695 -5761168 -1960112 406830 2015058
42893 2015058 3647810 4390227 3732485 1844544 -914750 -2032291 2618851 12603247
42885 12603247 20495277 20095799 14440801 11229579 12942627 16121698 17740810 17057194
42877 17057194 13381174 7470511 3308769 3074811 2351485 -3556471 -10421624 -9587736
42869 -9587736 -1089281 5560993 4571287 186771 -2021698 -2397077 -2603069 -1492772 -198018
42860 -198018 -4015144 -12855339 -16423897 -7463030 4921779 5376756 -6223120 -14185788
42852 -14185788 -8728293 2366789 7458122 6394650 5349682 4328041 -626898 -7212849
42844 -7212849 -9122882 -7292180 -9158397 -15663478 -18267386 -12344744 -5451638 -6716412
42836 -6716412 -14038993 -18303051 -16148034 -11808725 -8930927 -7368841 -6852000 -7429815
42828 -7429815 -6661513 -2341767 2026882 567941 -5712345 -9420715 -7803015 -6405850
42820 -6405850 -9007933 -10838947 -6654575 115693 2467410 109846 -2035470 -3131956
42812 -3131956 -6936698 -13317004 -16166153 -11849786 -4810843 -1840963 -3663296 -4903157
42804 -4903157 -1062048 6396103 11608315 10394896 5048760 2503049 6724675 13735370
42796 13735370 15819459 10112713 1177144 -4560240 -4845957 -2068405 144976 -119611
42788 -119611 -2375268 -5064149 -7458908 -9917410 -12335509 -13588893 -13019589 -11125187
42780 -11125187 -8289985 -4717483 -2212298 -3186357 -6330554 -6408011 -919302 5931192
42772 5931192 8959663 8654408 8376859 8240085 6914875 6688837 10204346 13804867 11348160
42763 11348160 4090886 -878326 -2142222 -4956533 -9138229 -6494172 4389765 10829378
42755 10829378 2625299 -11188593 -13319411 -2048962 7868562 7409883 3966305 6389044
42747 6389044 10347340 6292786 -4601696 -11426984 -8357312 -954893 2809994 1911763
42739 1911763 261049 -718734 -3610248 -9737746 -15435018 -15315549 -8692993 -1152046
42731 -1152046 990765 -3040433 -8511840 -10548098 -8145536 -3490775 854437 3790004
42723 3790004 5893058 8087757 9697079 8803803 5636647 3727669 4948777 5037384 -1322835
42714 -1322835 -11049010 -13975890 -5917729 4826489 7981734 3704882 -978802 -4128061
42706 -4128061 -9317550 -15549306 -15992827 -9176272 -3486038 -5781202 -11452569 -11465922 -4903702
42697 -4903702 1668627 4137079 3480811 457859 -5171742 -10258793 -9846969 -4461851
42689 -4461851 -275324 -467919 -1574151 -213500 1694969 1064411 -1444118 -3513393
42681 -3513393 -4483364 -4085579 -1548397 1742450 2629610 1376329 1794035 3798277 1857851
42672 1857851 -5120606 -8938196 -3472958 4792084 5703270 620598 -758350 3629640
42664 3629640 5716205 1017808 -4883709 -6029328 -4253674 -4314236 -6969744 -9900596
42656 -9900596 -10624920 -6762126 1412058 7621587 4996606 -3814187 -8732899 -6098419
42648 -6098419 -2674807 -3361562 -3848798 -174648 3121333 988714 -3455442 -5482120
42640 -5482120 -7024456 -10324118 -10157667 -2295631 6010550 5539368 1109638 5164052
42632 5164052 16951644 22049803 14509152 6072886 8063800 15355554 15971572 8382076
42624 8382076 827456 -1339082 174893 1996707 2258612 369501 -1644472 65155
42616 65155 5006570 6389920 265465 -6916469 -6295162 304869 2765947 -2514767 -8228261
42607 -8228261 -8148300 -5728353 -6491092 -8237431 -5572045 -615056 -1132575 -7884471 -11439465
42598 -11439465 -5086943 4710664 6534234 -232776 -4702010 401282 9581077 13193221
42590 13193221 9659051 4504373 1261148 -717122 -1412017 466489 3318690 3734017
42582 3734017 2612069 4614469 9893282 12195324 8211417 3199777 2734282 3808585
42574 3808585 486492 -5043093 -4910657 1805540 6926698 5282879 1681594 2130396
42566 2130396 4355954 2778826 -1365430 -1987240 1455575 2847052 -438694 -2917812
42558 -2917812 479784 6453461 8224543 4895589 1080700 -723173 -2297021 -4883982
42550 -4883982 -6909444 -6783917 -4106932 1792685 10061693 15155767 11424423 2441613
42542 2441613 -759076 5624299 11573278 7055929 -3122722 -6265086 29468 6205851
42534 6205851 6255935 4510865 5011882 4353654 318264 -1076011 5059539 12206823 10587012
42525 10587012 2045750 -2639382 60512 2676944 181247 -2427546 190350 4586749
42517 4586749 5008969 2965365 3332029 5023031 3183208 -1454215 -3236188 -1483465
42509 -1483465 -2354427 -9129241 -16652196 -17932443 -11705940 -1611225 7421479 10248601
42501 10248601 4597908 -4120599 -6674331 -2146673 -318356 -7506583 -16560954 -17447303
42493 -17447303 -11614347 -7184492 -4865636 632645 7937186 9607125 5311270 2993861
42485 2993861 5366599 6391755 3939605 4442482 10133317 12576636 5682545 -4164682
42477 -4164682 -8252583 -7265912 -5325845 -1141150 5599474 7014956 -2668845 -15356267
42469 -15356267 -18642701 -12557768 -6144311 -2187302 2592944 6011409 2708451 -3468522
42461 -3468522 -2779568 4399985 7486982 2555805 -3238542 -5701025 -8934672 -13475008
42453 -13475008 -12414243 -4860218 -1166643 -7762594 -17124915 -20024258 -18083848 -16484366
42445 -16484366 -13509192 -6436539 -79971 167942 -2197430 -1317513 523472 -1929128
42437 -1929128 -6123698 -5834791 -2469402 -2400506 -5188611 -4083764 2274051 7296164 6275410
42428 6275410 1767328 -1842007 -3529099 -4536282 -6426174 -10419538 -15210131 -16428281
42420 -16428281 -11938551 -6200521 -5458708 -10093068 -15361289 -17638241 -16062878 -10551685
42412 -10551685 -2741735 3228270 5272132 6506755 9828234 12437010 10595238 6585502
42404 6585502 5229105 6254439 6127059 4903859 4796665 4023999 -975968 -8193109 -11149297
42395 -11149297 -6826984 2357437 12647027 19983374 20007244 13364179 8053176 9543868
42387 9543868 11858395 6519420 -3288389 -7621067 -6095369 -7203202 -11892859 -11094315
42379 -11094315 -2143512 4972530 2736701 -3535789 -6537299 -8300871 -13288895 -18337244
42371 -18337244 -17880748 -13500007 -10446758 -8834760 -5334108 -513733 1835176 766216
42363 766216 -1187669 -1742167 -153601 2574115 2508621 -4169607 -14323372 -18862721 -13959869
42354 -13959869 -6306272 -3351148 -3650908 -1913983 1324579 1277055 -3127556 -8563993
42346 -8563993 -12271064 -13084830 -10165219 -5078126 -2401057 -4104272 -6330182 -5637375
42338 -5637375 -4472447 -5728463 -6363663 -2794533 1061256 -1191300 -7147503 -7108259 2699375
42329 2699375 14502948 17886813 10352345 -1475588 -8185176 -5590713 1048730 2227600
42321 2227600 -4281860 -10287816 -8599033 -2969170 -1330279 -3525733 -3311940 134201
42313 134201 1247372 -1901157 -4555931 -3050238 1172926 6069114 10828042 12306572
42305 12306572 6863036 -2137691 -5611919 -810390 4076301 1371409 -5489513 -7846346
42297 -7846346 -4166589 -637659 -1327724 -3327226 -2131073 1956815 4448404 2202215
42289 2202215 -3034987 -6698580 -6396568 -3835046 -1755979 -814470 -420864 -283599 831421
42280 831421 5212835 11989649 15320858 10999960 3038102 -1122329 -601975 -781149 -3652711
42271 -3652711 -4942969 -2063321 1178605 606387 -2320895 -3767249 -3187453 -2434724 -1836937
42262 -1836937 -476515 1001358 666513 -1638158 -2894927 585032 8277460 13386834
42254 13386834 9030180 -1676636 -6162226 2379661 14368011 15357688 5313726 -2524961
42246 -2524961 -1098700 2570910 960768 -2931228 -3315317 -1732202 -2620220 -5116498
42238 -5116498 -6170597 -6761074 -8230798 -6921240 278135 8463473 10157357 5811694
42230 5811694 1865211 492357 -1036801 -1978139 2240452 10515425 13875296 6657883
42222 6657883 -5019133 -10179530 -5862124 470280 526964 -5490408 -9847255 -6421104
42214 -6421104 2667559 10231500 12076149 9473675 5083335 726459 -1029614 1446502
42206 1446502 4416502 2019347 -3917098 -4350739 2806830 6879348 -388984 -10888744
42198 -10888744 -10892588 -992495 5486378 1697735 -6102134 -10841399 -12568828 -12234159 -7745345
42189 -7745345 -216813 3995410 2061254 -769186 711472 4498278 5711184 2841188
42181 2841188 -3410170 -12266883 -20751579 -24387987 -22758154 -19535265 -15477410 -8048356
42173 -8048356 -16058 219302 -8600051 -15993900 -14296393 -9911079 -12059325 -17396277
42165 -17396277 -15787300 -6444288 2321411 6480444 8928461 10347657 7936134 3347321
42157 3347321 2039485 3437649 791631 -7215882 -13255480 -12381478 -8378146 -5993574
42149 -5993574 -4326329 -1596198 582987 1920623 5792928 12066728 13778893 6637218
42141 6637218 -3288959 -7155928 -4211337 580513 5263783 10540164 14238521 13533187
42133 13533187 10809835 10558116 11770321 9975215 5728558 4141130 6238146 7837920
42125 7837920 7629737 9304915 14008144 17419287 16870923 15040937 13418488 8474856
42117 8474856 -1097185 -9018473 -9322177 -5603506 -5876024 -10682310 -12937198 -8655508
42109 -8655508 -1695140 2411482 2189694 -677110 -3361979 -2671488 1548725 3666703
42101 3666703 -1509424 -9096257 -7730598 4338042 13967229 9463597 -3770032 -11375688
42093 -11375688 -9307344 -5432442 -3997170 -93300 7900147 11498018 4920424 -3074781
42085 -3074781 175469 12500546 18778175 11313050 -789242 -5070083 -888662 3381129
42077 3381129 2709251 -956406 -4496534 -7152526 -8672180 -8323389 -6392024 -4102237
42069 -4102237 -2100163 -1045636 -2629212 -7076186 -10687788 -9756497 -6527671 -6490043 -8945582
42060 -8945582 -5899260 6435361 19882751 23414413 17203010 11280724 10885677 10060424
42052 10060424 2210196 -8660779 -12266718 -5177926 5281626 10237513 8534056 5491651
42044 5491651 5150711 6499344 7034228 7317760 9627807 12622128 10872071 2256006 -6664424
42035 -6664424 -7393174 -1262355 1331900 -4544656 -10805159 -8313527 -1098088 -418235
42027 -418235 -7128069 -10015040 -3115771 5299580 6002891 2481558 3445902 7931072 8033648
42018 8033648 3535338 2678035 7741797 10456748 5492896 -583878 202545 4896782
42010 4896782 5165835 296535 -3422904 -3391938 -2477937 -1298492 2874236 8782163 10723414
42001 10723414 7810991 6545991 10502762 13819226 9960192 1827261 -2802414 -2194655
41993 -2194655 -648168 -167990 860027 1657678 -1087572 -6340667 -7994998 -3343536
41985 -3343536 2713228 4559951 2725462 999397 549734 386888 674648 1802289 2177784
41976 2177784 473388 -1317539 -194404 3529322 6843006 7848289 6650393 4001384
41968 4001384 1532684 1507080 3561937 3856908 735405 -1500657 887990 3460883 -862692
41959 -862692 -9760803 -12853059 -6305621 1652145 2941182 167401 106674 2940260 4546422
41950 4546422 5017470 7394910 10337906 9481745 5364006 3237316 4825611 6544614
41942 6544614 6602552 7467863 9485591 8305144 2027616 -4209470 -5074037 -2766622 -3361804
41933 -3361804 -7888961 -11646691 -11275042 -8461700 -6765728 -7870368 -11123620 -14376866
41925 -14376866 -15089760 -12518709 -9028284 -7906637 -9921335 -12840412 -13619066 -10274785
41917 -10274785 -3170358 4022649 6342418 2754883 -2005170 -3097747 -1322144 -127569
41909 -127569 1026747 5277044 10919536 11564607 5632194 82623 998623 5033234 5252604
41900 5252604 2078241 1909147 6041022 8054093 3906918 -1426000 -1244629 3016825
41892 3016825 4245963 334378 -2725862 647710 7817073 11220800 7853206 2570632
41884 2570632 1594651 4960141 7215443 4522516 -1604404 -7777953 -12585391 -14985218
41876 -14985218 -12258375 -4024281 3270572 1586885 -8034755 -15149186 -12521060 -4581224
41868 -4581224 -263180 -1764372 -4820106 -6584331 -7597381 -7867334 -6773974 -6160523
41860 -6160523 -8157105 -10273274 -8225866 -3840937 -3985514 -10019684 -14223531 -9795230
41852 -9795230 291783 7940438 9821641 9150231 10339815 14969082 20950870 23553990
41844 23553990 19653290 12502503 9014269 10742222 11842285 8198627 3386737 1927884
41836 1927884 1927143 -317690 -2824489 -1211143 3810044 8268226 11156785 12513055 8785801
41827 8785801 -1858938 -11960718 -11658387 -2715527 3351025 1675162 -872079 1018056
41819 1018056 2647186 -1020717 -5619524 -4083039 2419528 6822286 5923585 2320297
41811 2320297 -648214 -1103905 1921659 6993244 10011993 8720725 5418897 2571066
41803 2571066 -1242760 -7650087 -13766622 -15262378 -12286485 -8870204 -7968912 -9738965
41795 -9738965 -12666851 -13850533 -10593401 -4422045 -1000417 -3394041 -8112116 -10288118
41787 -10288118 -9425758 -7274460 -4075338 -488908 967473 554486 2817631 8503284
41779 8503284 10104175 2338417 -7445244 -8001610 -443706 3831915 307360 -3837658
41771 -3837658 -3094524 -1459847 -3037489 -3601252 2398140 12129458 17673725 15683207
41763 15683207 9217559 2665562 -1346953 -2225722 -1773171 -2564113 -4114237 -3227502 429376
41754 429376 2972686 2752329 3498338 7131101 7920791 -83730 -12231408 -16838460 -9859303
41745 -9859303 16185 2786415 -1295564 -4706009 -3474962 -561553 135940 -1385256
41737 -1385256 -3074357 -4069027 -4410310 -3950768 -3558404 -5406393 -9634809 -12506996 -10968467
41728 -10968467 -7560018 -6950707 -8641674 -7847198 -3233871 1817842 6014485 11412150
41720 11412150 16069028 13253047 2291754 -7150177 -7683478 -4326159 -4634861 -5453549
41712 -5453549 395557 9248761 10753723 4907918 2199543 6086115 7938236 2659886
41704 2659886 -2412340 169075 6456388 8605874 6155569 2979479 -592288 -5501938
41696 -5501938 -8682094 -6850917 -2350816 83625 -631495 -3035849 -6286861 -8460096
41688 -8460096 -6428203 -1438273 551188 -1544842 -462082 7528646 14263355 11325199
41680 11325199 3955593 3247565 8707319 10080763 4854976 1910856 6212978 10703563
41672 10703563 7632118 -237681 -4768283 -3075263 1622340 5614935 6943558 4788081
41664 4788081 136607 -4268465 -6440626 -6381494 -4568052 -1522841 1017390 1439845 1098574
41655 1098574 2775910 6008607 7410564 6307050 6208103 9042460 11352072 8773324
41647 8773324 2146821 -3418098 -4667729 -3427346 -3697256 -6644560 -9370168 -9077220
41639 -9077220 -7395231 -8246190 -11493615 -12342348 -8665511 -4997919 -5952957 -9015117 -8305979
41630 -8305979 -3210722 1551077 3110705 3157678 4302632 7661478 12880183 16798668
41622 16798668 14185603 4620131 -3567307 -2342920 4503813 5835721 -1317895 -8331435
41614 -8331435 -7942235 -2824831 1313264 3890317 6494561 7502747 4715752 -17040
41606 -17040 -2829418 -2274736 606621 4006652 5494610 3626766 786540 782622 2509220
41597 2509220 551938 -6295526 -12239684 -12638108 -9913692 -8429363 -8396334 -8099098 -7199683
41588 -7199683 -4360803 2956798 11990551 13733378 4395538 -7126775 -10108438 -6289332
41580 -6289332 -5546955 -10152937 -12269369 -6902366 971706 4291878 2788747 1337439
41572 1337439 3538773 9049014 14631582 16954249 16370401 17145185 21164502 23341002
41564 23341002 17867812 7600615 1314853 1829690 3265108 1081353 -2002769 -2826172
41556 -2826172 -3965007 -8305131 -12249125 -10207504 -3370757 1478129 967757 -1724995
41548 -1724995 -2777581 -2820221 -4963485 -9962328 -14489630 -13789563 -6555669 2486911 6744706
41539 6744706 5618109 5418808 10040043 14143387 10480669 1679481 -2179330 1986644
41531 1986644 5662716 1546272 -5896711 -8042437 -4767661 -2106434 -710275 4402582
41523 4402582 12973735 17289984 13211615 5975350 1473894 -1590277 -6185352 -9593214
41515 -9593214 -7839627 -3329127 -1418699 -1964757 -658100 2856278 4334662 1751642
41507 1751642 -2395641 -4895246 -3533830 3164257 12722305 17443595 12716558 4751558
41499 4751558 2879486 5836922 4338355 -3416168 -8809588 -6596399 -1420942 2199820
41491 2199820 6155772 10759904 10666748 4760724 757787 2964993 4464527 -400818
41483 -400818 -4816461 -1073241 4637655 1604153 -6791481 -7692866 580836 6328688
41475 6328688 3005025 -2913353 -4674498 -4250692 -4944597 -4909215 -2570064 -568051 -88147
41466 -88147 1911075 6195871 8518195 6772103 4512059 4028221 2455975 -1530573 -3749463
41457 -3749463 -1648130 777320 187245 315818 5434009 12036241 13133859 7658324
41449 7658324 312806 -5072729 -7094899 -4541166 1924152 7346018 6491630 -218306
41441 -218306 -7692317 -11744870 -11444291 -8295465 -5775131 -7182506 -11222116 -12326509
41433 -12326509 -7856365 -1742201 1695635 3453885 5766499 6808788 4640381 2775960
41425 2775960 5712079 11172880 12834825 9383051 5124706 2465820 -524574 -4989147
41417 -4989147 -8707928 -9367215 -6905483 -2613987 1231171 1904696 -501650 -2010560
41409 -2010560 -235382 1595422 43455 -2545335 -2914890 -3976995 -9365353 -13906038
41401 -13906038 -9426263 649725 3567389 -3785103 -9131571 -2919318 7662981 10053662
41393 10053662 3952423 -1153915 -826336 1221246 2055687 2668090 2854533 823796 -1283698
41384 -1283698 1799019 10243817 17064069 16744221 11797267 7953853 6150217 2985694
41376 2985694 -2473018 -6544301 -6576715 -5578652 -8024716 -12191762 -11354863 -4260765 719204
41367 719204 -3198767 -9906028 -8112340 1371764 5930675 292541 -5184426 -606514
41359 -606514 8694063 11687150 8188572 5649016 5058470 1940360 -1529560 1894654
41351 1894654 10675985 14280926 9196688 4136220 5438061 7782324 5213080 1978240
41343 1978240 4469320 9318253 8307671 1003477 -5510606 -7045874 -5524322 -3350404
41335 -3350404 -668007 2385522 5247918 7932452 9174051 5837173 -1962431 -7788382
41327 -7788382 -5596941 2529535 9720269 12897039 13154078 10450602 4492512 -419618
41319 -419618 1584928 9364508 14771655 12443800 5355684 -93285 -678153 2466136
41311 2466136 5788728 6034983 3581293 2470664 4942876 8089825 8728698 7983936 6919213
41302 6919213 2576802 -5003074 -7086740 2449068 13681566 11155250 -2591826 -7932803
41294 -7932803 3973196 17588374 14417026 -2830483 -16607134 -17213236 -9560478 -2428306
41286 -2428306 -27804 -1739134 -3404673 -498506 5932807 9602927 8133470 6530417
41278 6530417 8013351 8361902 4690599 2432486 6277283 10632870 7450182 -1589463
41270 -1589463 -8688543 -10741679 -8837389 -2847891 4676054 5243068 -4875789 -16227820
41262 -16227820 -18875235 -17041123 -18803710 -18563116 -6488793 9384372 10397061 -3659711
41254 -3659711 -12868407 -7822764 -1935582 -6379812 -12053583 -7539911 1245667 2897434
41246 2897434 -410456 353349 4482232 4883275 1254067 -1551119 -2399300 -1487112 3955407
41237 3955407 12082343 12756893 2226470 -7198957 -4738121 284567 -7116205 -21722684
41229 -21722684 -25068586 -14757287 -7294453 -10917356 -14619614 -9053211 -1414434 -1418767
41221 -1418767 -5815780 -6318533 -3317371 -2704704 -5821108 -9937965 -13336681 -14256420 -10257671
41212 -10257671 -3588557 -1487865 -6264240 -10822478 -9089098 -5026744 -5532947 -9809272
41204 -9809272 -12373849 -12266474 -12167754 -11303269 -6419994 1153328 5475794 3342784 -2481374
41195 -2481374 -7548748 -10046634 -10678665 -10695938 -10577559 -9754029 -7715001 -5094564 -2417942
41186 -2417942 1327352 6338659 9219482 6392712 -89902 -4535565 -5294786 -5494251
41178 -5494251 -6108461 -4375750 -23062 3426092 4984622 6771748 6584451 -1253833
41170 -1253833 -13925248 -18761240 -10571037 -1427430 -4080264 -13095704 -13771472 -4597591
41162 -4597591 2138120 280180 -2784780 -250581 4200560 4790474 2813736 2137473
41154 2137473 2220268 820873 -1293012 -2950222 -5640939 -9442780 -9579025 -2279631 7905637
41145 7905637 11712482 6062877 -2233539 -4503300 345274 5737642 5775686 1687369
41137 1687369 -1245322 -1734732 -3792638 -8902073 -11225426 -4780192 7207486 15356470
41129 15356470 15495882 11524413 7135979 1246052 -6078695 -9219696 -3579588 6522075
41121 6522075 11717541 8722510 3585894 3344042 7648982 10428064 7990038 2856116
41113 2856116 -488395 -967701 -118705 1996204 6222298 10035205 8755097 2888715
41105 2888715 -477946 2803726 7137477 4900051 -2057609 -4784121 135437 6528722
41097 6528722 7612605 3706928 -215312 -548702 2531497 5597536 4627604 -206308
41089 -206308 -3547149 -1985983 258802 -1973434 -5174328 -2087206 5047792 5961492
41081 5961492 -1473913 -6638539 -1804545 6856881 9843854 7820945 7119882 8313776
41073 8313776 7847523 6574578 7976891 10504853 9605628 5655558 2699887 902550
41065 902550 -2484300 -5840225 -4657372 -380499 -136006 -5986498 -10911525 -8024334
41057 -8024334 1026118 9082079 11013659 6501837 -1189023 -7445672 -9743724 -9685734
41049 -9685734 -9809820 -9388458 -6468548 -2643324 -1495712 -3223691 -5309133 -7286612
41041 -7286612 -9494184 -8594658 -1612496 5761460 3426094 -8511569 -17642324 -15417473
41033 -15417473 -7651347 -4043585 -4777029 -4369630 -2586199 -2936908 -4071754 -1375210
41025 -1375210 4490997 8411587 9383424 10891133 12889282 10964585 4746767 79829
41017 79829 244006 1123738 -1434796 -4610686 -3308778 1756511 5312569 4940890 3254846
41008 3254846 3534151 6252696 9557045 10981822 9059343 4824050 1195308 -123944
41000 -123944 86012 1285642 4822642 10628089 14426441 11796406 4341411 -1543123
40992 -1543123 -2129776 419243 2569739 3855261 5474040 7167253 7538180 6008125
40984 6008125 3037202 -253736 -1705479 690872 5649449 8381936 5474389 -1244893
40976 -1244893 -7216530 -9881026 -9224301 -5848784 -1223488 2001556 3077328 4871591
40968 4871591 9084407 11902247 9198396 4140611 3068401 4527012 698310 -8584235
40960 -8584235 -12442861 -4552994 6087220 7553810 1607742 -1673948 -1256141 -5323312
40952 -5323312 -15082502 -20715760 -16620552 -10070710 -8996351 -9762958 -4784068 3876502
40944 3876502 7517346 4354839 1192690 1987362 2878328 422140 -2220045 -1279588 401090
40935 401090 -2446295 -8381130 -9989650 -4141910 3368613 5808722 4393789 5156350
40927 5156350 9053447 10545954 6295466 -64875 -3905503 -5455336 -6379273 -5171701
40919 -5171701 -818733 2887960 2839802 3288180 9564027 17147957 16052382 6227200 -1186076
40910 -1186076 -493546 493049 -5857042 -14279514 -15355935 -10123346 -6685154 -6573938 -4344447
40901 -4344447 1009201 3776812 1312011 -1924176 -1919851 -217119 643379 1146757 1836463
40892 1836463 1194470 -788159 -1041338 1682942 3809086 2041387 -1050772 192895
40884 192895 7449350 16582750 22109887 21760371 17319857 12416732 9165002 6322860
40876 6322860 1405627 -5019669 -8426455 -4953275 3500562 10091183 9644610 4113050
40868 4113050 302326 1657593 3979170 1350908 -5167998 -8600503 -5593814 -44541
40860 -44541 4192971 8745472 15386618 20336227 19418736 15551470 14882676 17311562 17033083
40851 17033083 11745847 5364637 1481184 -403515 -1555095 -1922085 -2260971 -3961412
40843 -3961412 -5956319 -5687169 -3403006 -1582962 -363536 2054547 4955547 5989041
40835 5989041 5724028 5619070 2620500 -6534199 -15658856 -13175421 1350917 13538086
40827 13538086 11752758 947115 -6334391 -6037118 -3464079 -3441882 -6055532 -8511028
40819 -8511028 -6320248 3371742 15541390 19648211 12840690 4662674 3239317 4201229
40811 4201229 759858 -3349839 -1876564 -333765 -8326596 -20817422 -22225040 -9849755
40803 -9849755 1470692 1776492 -675650 4714347 13371198 13666900 4972714 -2600086
40795 -2600086 -2710367 1625109 5249839 6581290 6296653 5400883 5026272 5255332 4516550
40786 4516550 1963613 -931468 -2747364 -4053641 -5319157 -5138690 -2284042 2484462
40778 2484462 7561702 10801419 8592653 -731675 -11389981 -13698453 -5925333 2847384
40770 2847384 5282357 5353251 10158221 17658380 19804416 14507752 7056501 1431895
40762 1431895 -2739657 -5456030 -5223226 -2807063 -837460 -79257 -686371 -5017177 -12929310
40753 -12929310 -16738780 -9575345 2069917 4189880 -5121320 -12554725 -9363634 -2922112
40745 -2922112 -2222332 -2939463 2807129 10486342 10097684 4112388 4085540 10546906 11035578
40736 11035578 1069541 -6886822 -2498376 5709556 3028074 -9196630 -15647163 -8774853
40728 -8774853 2136000 4457271 -3411417 -13427914 -17576930 -13350273 -3951603 4019081
40720 4019081 5630944 2271391 -444395 400219 2820354 4323666 4431199 2299153
40712 2299153 -3284219 -9513596 -9865648 -2174564 7037693 9762996 5274991 -1269082
40704 -1269082 -5679505 -6620334 -4176017 -1113887 -2459454 -8660718 -12275659 -7619690
40696 -7619690 -592106 -878661 -6621220 -7114514 -781641 1579593 -4808743 -9243398
40688 -9243398 -2286034 8304034 9255282 1918711 -2095977 -873506 -3425100 -11722737
40680 -11722737 -16094474 -11788727 -6873377 -7374185 -6139280 4300041 16550535 17259838
40672 17259838 6385601 -3367202 -4392127 -1502779 -1550625 -4833173 -8470347 -10681504
40664 -10681504 -9255253 -2279319 6668999 9618346 3647721 -5419708 -11347364 -14178428
40656 -14178428 -15253086 -11659390 -1721236 8297782 10422488 6098585 4018652 7418137
40648 7418137 10916385 11048496 12127653 17662543 22378622 19179738 10457285 5417110
40640 5417110 7170529 9244430 5896124 -354751 -4281282 -5567481 -6176628 -4132292
40632 -4132292 3486255 12588468 14128312 5885807 -3393721 -4867021 -327584 1941990
40624 1941990 -1361265 -6382578 -9424181 -10450133 -9135955 -3270267 6446719 14182122
40616 14182122 14997201 11004565 8707659 11470116 16813509 20028397 18212181 11417735
40608 11417735 2188007 -5503915 -8121450 -4474535 3478199 11243337 14174493 11106435
40600 11106435 5655887 2264266 1114194 -929420 -4645225 -6989567 -6123080 -4584292
40592 -4584292 -5656226 -9176416 -12663659 -14059565 -11795710 -5259286 2593661 6189205
40584 6189205 3604860 -857496 -2791489 -2949175 -3471592 -3074592 -388417 1808969 1105914
40575 1105914 703149 3910243 6697768 3348901 -2904402 -3740739 939975 3387726
40567 3387726 1890365 3171284 8204400 7451053 -3258115 -12339579 -7425519 6385668
40559 6385668 13715518 10004527 4686463 4967205 6976270 4664482 -803708 -3959215
40551 -3959215 -2313210 1909046 4230491 1239097 -5492659 -9006528 -4448360 3131349
40543 3131349 3230480 -6863123 -17859603 -19489989 -12051034 -4503900 -3749371 -8380833
40535 -8380833 -11699096 -8983090 -2118996 2639731 2203157 1009140 5527444 14767897
40527 14767897 19633758 13242033 -256721 -9094532 -5530387 6768940 16611991 16204186
40519 16204186 8133179 974578 -1411779 -3453345 -9765804 -17329981 -19582002 -15962555
40511 -15962555 -12382101 -12656484 -14369948 -14072606 -12162512 -10636355 -9329585 -6860776
40503 -6860776 -3266285 478579 4313287 8597275 12162721 12203868 6896108 -1433175
40495 -1433175 -6476863 -3562917 4294303 8868898 6865907 4001751 5913257 9035868
40487 9035868 5978276 -2652015 -8424925 -6344833 265734 5847863 7184560 2002778
40479 2002778 -9335857 -19072176 -16744085 -2255571 12152230 16674589 14208951 11607589
40471 11607589 8178870 299746 -8116013 -9222624 -3322682 1308590 783861 259775
40463 259775 4712146 11453139 14749227 13357234 10129901 6941160 3319010 -868990
40455 -868990 -3853858 -3588583 -262200 3346293 4553345 3681176 3205353 3964490 3955242
40446 3955242 1453191 -2503189 -5378483 -4963448 87980 8247618 13165779 8607250
40438 8607250 -2246126 -7432310 -376897 10821009 13620374 6989767 483302 -284582
40430 -284582 747394 -778140 -2584360 -559942 5018111 11372886 17370859 22688053
40422 22688053 25762490 25332884 22097893 17261512 11665901 7437742 7334625 10562294
40414 10562294 12295153 9896136 7000281 8397344 12925759 15069663 12657465 9167130
40406 9167130 7857825 6935217 2777427 -3625411 -6591171 -3190934 1439086 -525035
40398 -525035 -8787611 -13385609 -6710831 5806552 11658866 6911352 498197 1727614
40390 1727614 8701475 12558011 9525295 4013272 1196080 1298063 1881261 2098190 2617522
40381 2617522 3207187 2590864 393298 -2183978 -3912818 -4993505 -6424495 -8188315
40373 -8188315 -8755624 -6807998 -3245618 -936313 -1994554 -5067369 -5649984 -218265
40365 -218265 9131919 15141924 12288973 3091648 -4441152 -5890906 -4577814 -5742772
40357 -5742772 -9344139 -10920519 -7807558 -1921481 2661130 2776713 -2074812 -8786311
40349 -8786311 -12397268 -11058931 -8316095 -8212615 -9577292 -8424094 -5079294 -4725617
40341 -4725617 -10065663 -16841577 -18386385 -12778852 -4223421 1566871 2618290 1720139
40333 1720139 1999021 1852362 -3100037 -12038710 -17074398 -12933062 -4749078 -802202
40325 -802202 -580663 2640617 8992741 10804123 5338016 -194112 222331 3320056 4505817
40316 4505817 6336082 12007181 16301741 11914451 1948197 -2754577 1427204 6309391
40308 6309391 4069749 -1991509 -2246025 6718602 17430675 19171659 9407720 -3077140
40300 -3077140 -7754312 -4415462 -2235030 -6440974 -11485096 -10600168 -6358473 -5743796
40292 -5743796 -8824698 -9601776 -5876273 -873729 3779931 9023776 12395663 9063162
40284 9063162 381033 -5768683 -5537056 -3491691 -3877305 -4231286 -1535086 1393820 616240
40275 616240 -2527116 -4654460 -5940422 -7364612 -5840091 2148603 13799789 21746757
40267 21746757 21673651 14969928 5650995 -2173438 -6048490 -7676849 -11079880 -15249629
40259 -15249629 -12826330 -867602 11502426 13061187 4858746 -3123479 -6882717 -10249314
40251 -10249314 -12985206 -8992141 602859 4044328 -4618176 -14651444 -12899106 -2526078
40243 -2526078 2370367 -2820964 -8687107 -7151878 -1541578 1279159 1211563 2832062
40235 2832062 7281204 10499321 8100098 29387 -8600178 -11226223 -6471471 -666042
40227 -666042 -795585 -5613365 -8049036 -6146316 -5451754 -8664437 -9730474 -3252691 5406924
40218 5406924 6342197 -1332430 -9480649 -13559820 -17285298 -23102911 -25733380 -19927497
40210 -19927497 -9234636 -1027674 3820846 9508868 15161184 14047722 4609108 -4911155
40202 -4911155 -7129838 -5244504 -6152920 -8155922 -3874096 5884700 10739052 5748025
40194 5748025 -910235 -771572 1631818 -3568753 -15380657 -23162214 -22339932 -18933413
40186 -18933413 -17587512 -14965063 -8400776 -2111185 708714 4313319 11802815 16248190
40178 16248190 9268952 -4961873 -13352393 -10543426 -3835767 -1300434 -2692298 -3993742
40170 -3993742 -4296743 -4890028 -5996855 -7450906 -9687005 -12124312 -13029350 -12023908 -10333688
40161 -10333688 -8437290 -6403978 -6110646 -9263841 -13559263 -15211337 -14940904 -16316643
40153 -16316643 -18530105 -17310378 -13549363 -13497771 -18359486 -21482260 -19177242 -16289435
40145 -16289435 -16266090 -13874139 -4634714 5748197 9792471 10142949 13599820 17903220
40137 17903220 15240929 6488189 926896 2086103 4227213 3842711 4543679 8056436
40129 8056436 9778468 7263500 5162983 7144360 9636699 8485575 6125120 7048219
40121 7048219 10621377 13121199 13285315 11718249 8025854 2283002 -3321824 -7055729
40113 -7055729 -9084913 -8860640 -5314374 -1253407 -1879863 -6222506 -6469240 85853 5280918
40104 5280918 2199289 -3534966 -2787606 1799946 -208510 -9661761 -14926456 -8082596
40096 -8082596 4410099 10933314 8935359 5732099 8074909 14622316 18493345 15647047
40088 15647047 9537591 6325928 6713064 6498229 5401830 9018972 18768277 26315389
40080 26315389 23865603 15059446 8993251 7734092 7163831 6173200 6328676 5482375 1191641
40071 1191641 -1754918 2477851 8472887 4917960 -7369054 -14626363 -9592342 -354378
40063 -354378 3538801 2458668 -298355 -5474699 -11494002 -11556962 -4523417 517669 -1936320
40054 -1936320 -4619626 -354871 5421640 5040305 2641399 5852668 10651761 7846841
40046 7846841 -405010 -4168190 -2388911 -2318646 -4478301 -2342272 3383167 4343954 -167781
40037 -167781 -1111118 4311127 7721528 4829270 2926452 7226279 11310376 8526771
40029 8526771 2877090 638353 151675 -1472909 222431 8893482 17117043 15167491
40021 15167491 6215459 2419779 7901804 15063277 16885559 13946884 9015524 3149729
40013 3149729 -1077954 182299 5536234 7596875 2271873 -5138323 -6826090 -3003788
40005 -3003788 -1509577 -6988660 -13760114 -12030729 -651031 9822198 9414849 1526596
39997 1526596 -1501784 5153376 13256281 14188066 10243032 8480256 8885296 5817698
39989 5817698 -1374327 -6630760 -6263569 -3880887 -4714399 -9070570 -13054462 -13090421 -8535205
39980 -8535205 -1851830 2982989 3881545 3027039 4514552 9196772 13040377 11296750
39972 11296750 3883340 -4068310 -7566896 -7241797 -7709775 -10281634 -10928554 -7844108
39964 -7844108 -6240251 -9862367 -11758562 -2519008 13670873 21760577 15990228 6509850
39956 6509850 2689742 1579734 -1067055 -508677 6394892 10765427 4531884 -4080329
39948 -4080329 -1883600 7926742 10874243 4546550 717253 4099273 5138593 -2416161
39940 -2416161 -11219282 -13509454 -12498021 -13762637 -15426807 -14066738 -11789396 -10495039
39932 -10495039 -7017676 -970140 342350 -7138009 -15150814 -13861616 -6372938 -3187708
39924 -3187708 -5942034 -6420216 -392997 6633964 8399075 5630025 2939347 2763844
39916 2763844 4294943 5613344 5637801 5066311 5034653 4423930 758406 -5117258 -8481260
39907 -8481260 -6942498 -3953898 -3641343 -5500106 -7033652 -7962516 -8274455 -5738143 217262
39898 217262 5004863 3914345 -1324658 -5130836 -5385852 -4305172 -3866244 -4317058 -5842551
39889 -5842551 -8255577 -10264330 -11582242 -13690348 -16173874 -15423075 -9920632 -3340475
39881 -3340475 808824 3382220 4673072 844910 -8631764 -15123739 -10733310 -922316
39873 -922316 1644043 -5617820 -12956119 -13010574 -8852922 -6166173 -5854503 -6821481 -8554112
39864 -8554112 -8023151 -1124502 9111633 12389403 4046456 -7254006 -10095143 -4593703
39856 -4593703 -526238 -3735752 -10135090 -12827626 -10545961 -7594469 -7713739 -9887030
39848 -9887030 -10527372 -8936532 -8316116 -10164670 -10676993 -6276605 -356346 830802 -1965218
39839 -1965218 -1510623 4797737 10663038 10012351 4791939 593367 -550516 533525
39831 533525 3585186 7551820 9448591 8664269 9261976 14039486 19403669 20376899 17735492
39822 17735492 15524649 14238252 11845264 9525008 10387081 13379639 14408250 13420183
39814 13420183 14369856 17351063 17011796 11185867 5465432 5298843 7798276 6101525
39806 6101525 -840699 -7686443 -10401137 -9672799 -7035193 -2558086 2385486 4294547
39798 4294547 1859010 -1889060 -4128059 -6122269 -9596614 -12133579 -10731229 -8177918
39790 -8177918 -10026550 -15004238 -14722635 -5448729 5421792 8859591 5739542 3523521
39782 3523521 4667222 4895199 1773772 -1739669 -2996186 -3053229 -2783829 -769297 2640521
39773 2640521 3703728 590016 -3380665 -4708292 -4577711 -5549758 -6377511 -4000147 1067254
39764 1067254 4947981 5200193 2794826 147982 -848616 -69328 -40528 -3565526 -8660466
39755 -8660466 -8942563 -2288680 4029384 1768415 -6738493 -11376973 -8081891 -3385751
39747 -3385751 -3735208 -6639796 -6199380 -2604894 -953949 -3161431 -6150361 -7105544 -5924295
39738 -5924295 -2577777 3370109 9370783 10006417 3186358 -5932046 -9775026 -6143738
39730 -6143738 497812 4448077 3803751 1043355 378999 3916378 9019707 10433931
39722 10433931 6544602 2017903 1881741 4684937 5156768 2431988 515992 294649
39714 294649 -2762125 -10053914 -14554336 -9300768 2085901 9093768 7178699 1775282
39706 1775282 -37677 3045416 7831603 10753036 9375793 3336094 -4488299 -9832082
39698 -9832082 -10850904 -8504891 -3964732 1404896 4329896 2225419 -2070412 -2486903
39690 -2486903 2134668 6099909 4688865 120247 -2339550 -810866 2830235 5985647
39682 5985647 6769455 5310553 4978573 8568059 12003935 7343447 -4961475 -13079768
39674 -13079768 -8720812 345228 621288 -7660757 -11023740 -2405424 9337463 12406869
39666 12406869 6299883 -1746624 -7810431 -11960265 -12049970 -4893740 6594796 13764915
39658 13764915 11547610 3758664 -2115251 -2384731 1433946 5210212 4513376 -2370465
39650 -2370465 -11059461 -13335324 -6168590 3338549 5851744 1312659 -2195884 -708246
39642 -708246 576777 -3358659 -8855598 -9254342 -5114595 -2697200 -4038150 -4817285 -2246049
39633 -2246049 720361 731403 -1084374 -2096988 -2509828 -3780455 -4869051 -2888686 3009102
39624 3009102 9655631 11642277 5808972 -4454450 -10583440 -7530221 -396868 1286832
39616 1286832 -4501641 -10540030 -10621048 -6078943 -839285 3951301 7332399 6234764
39608 6234764 412553 -4354610 -2689541 3625804 9110250 11481152 11156555 7696351
39600 7696351 1779242 -2496370 -2738898 -2912616 -7221154 -12171133 -11321982 -5711442 -2029126
39591 -2029126 -1499748 1306282 8097933 13218076 12293608 7674083 3033202 -957113
39583 -957113 -3128134 -716482 4774882 6812085 2957546 -972594 -128881 2048682
39575 2048682 1092511 -62609 2690610 4995611 32594 -8339776 -8735527 789746
39567 789746 8498279 5054584 -3932793 -6529752 -115264 7382379 8665662 3985620
39559 3985620 -1772014 -4452722 -3265201 -869690 -414868 -854680 2784048 12052242
39551 12052242 20835099 22640300 19805873 19618453 22224357 19731865 9101556 -1351322
39543 -1351322 -2834939 2226859 5374818 4817666 5645996 9454031 11735476 10113276
39535 10113276 8011907 8167200 8705445 8447591 10302276 15417028 18857938 16043556
39527 16043556 9921482 6618677 6646886 5851648 3280659 2266246 4099891 6141627
39519 6141627 6841792 7637578 8513503 6460201 955706 -2842329 -74766 6638504 9669004
39510 9669004 5671765 -576342 -2428351 632668 3054083 589223 -4676654 -7757173
39502 -7757173 -7363767 -6481126 -7091360 -7906756 -8190237 -9959026 -13731646 -15205827 -10241476
39493 -10241476 -1739786 2615687 -422898 -5962821 -7093188 -2317385 3789120 5708675
39485 5708675 2414041 -1414542 -229452 5492646 9164366 6825444 3265396 5471106
39477 5471106 11814456 13259270 5554777 -5200333 -10913623 -10520260 -7674499 -3700164
39469 -3700164 2410781 9045017 12153240 10814165 8838175 9369511 10584904 8915579
39461 8915579 4800102 2244289 2868608 3592971 1676603 -682212 458132 4857548
39453 4857548 8888748 11038687 12239955 11156631 4660841 -5631278 -12735786 -12865861
39445 -12865861 -9797309 -7835870 -5907427 -2736966 -1969532 -5781610 -8239719 -2927156
39437 -2927156 5967838 8694410 4303003 957915 2060130 1396647 -5696344 -14567221
39429 -14567221 -18405181 -16888808 -13829666 -11232580 -9502801 -9561010 -11116615 -11548734
39421 -11548734 -9070638 -4877424 -995134 1421708 1284856 -1703157 -5446635 -8029270
39413 -8029270 -11155469 -16724477 -21378556 -20345646 -15575285 -12885627 -11700363 -6266600
39405 -6266600 2486834 6188879 2312429 -1961694 -2758795 -5750031 -13831235 -19060820
39397 -19060820 -14841900 -7380777 -6160480 -10270582 -13033212 -13313670 -12791587 -8590989
39389 -8590989 595178 6313586 -143421 -13312728 -19448003 -14304354 -5046243 2415980
39381 2415980 6961640 5966173 -2059600 -9567282 -7177966 1210703 3129886 -2138225
39373 -2138225 -2143027 6846740 11582467 2650747 -9436639 -9203439 2072336 10742377
39365 10742377 10900481 8982663 10799652 13751921 12639050 6879318 648956 -882034
39357 -882034 4551475 13884849 20682432 20758777 14906517 6336383 -1788629 -6574160 -7326003
39348 -7326003 -7648948 -11222848 -15514716 -15391090 -13017707 -16113985 -24006437 -24435364 -10133344
39339 -10133344 8496152 14854947 5963785 -6340245 -10974649 -7394569 -1496347 1579571
39331 1579571 288047 -2974059 -3658852 187676 5403476 7865089 7709474 8230587 11061484
39322 11061484 14462800 15169957 10963831 3267314 -2611617 -2662459 766062 3091413
39314 3091413 5469228 11950542 18998228 17214226 6182257 -2201710 -232744 5161071
39306 5161071 4960206 1509117 769635 106274 -5061992 -9508379 -5540794 3008120 6784075
39297 6784075 6586636 9343616 11839226 4395028 -9508726 -13858274 -3630795 7458819
39289 7458819 7926642 3012855 1184971 -277614 -6256349 -11419531 -8726456 -2790278
39281 -2790278 -2997565 -8064640 -8370494 -942211 7519147 11002357 9214625 3450928
39273 3450928 -4651278 -10541351 -10038100 -5569042 -3200406 -3363139 -639469 6392806
39265 6392806 11295574 8507314 1519304 -1476478 1793939 4971859 1468331 -6810969
39257 -6810969 -11867146 -10697844 -9914476 -15894865 -23793039 -22835017 -11527137 31420
39249 31420 4161171 4117941 5825208 8933733 10577049 10809882 8954874 1637094 -9060895
39240 -9060895 -12519514 -2875288 10436746 14350203 9194375 4394403 2357220 -1262356
39232 -1262356 -4461820 -61150 9542661 12054902 2907212 -8126627 -11948559 -11374623
39224 -11374623 -12452105 -14229413 -13568676 -12377157 -13413207 -14873919 -14741571 -14772226 -15167359
39215 -15167359 -11667737 -3619531 1559192 -1271131 -6031586 -4486160 693438 416625
39207 416625 -6565045 -12266847 -10499284 -1952973 9867623 20297209 22551593 13241269
39199 13241269 -819903 -8193421 -5805094 -431363 2422042 3831437 4778962 2080980
39191 2080980 -5503026 -12942354 -14790231 -11450592 -6414492 -960680 4932471 9389481
39183 9389481 10162393 7946038 5472146 4294120 4261028 4939231 5882486 6507018 7009287
39174 7009287 8466303 11070440 13332165 13895354 13061426 11714984 9942236 7903811
39166 7903811 7254239 9943243 14899686 16946492 11235144 -68420 -7630023 -4554516
39158 -4554516 4979669 10826703 9919128 8134351 8402895 5465264 -2818107 -7384593
39150 -7384593 31432 12678763 17231040 12994035 10910651 14797351 16808524 13386037
39142 13386037 12026126 16516324 17787685 8313479 -4061718 -7110906 -1859778 2032850
39134 2032850 3370021 9240387 19451640 23726843 16748554 6186498 2017333 5433305
39126 5433305 12440043 21904807 34490016 47699350 57775797 65080754 73018712 81634473
39118 81634473 85883572 81808734 72547462 65680291 64175223 62275945 52870325 37655943
39110 37655943 25950628 23070362 24734732 25170460 25668079 30658972 39219393 46362603
39102 46362603 50875030 56185824 64230965 73713593 84406767 98593226 118147624 144169931
39094 144169931 178818509 222501396 268905949 307252399 329881063 333996563 317626102
39087 317626102 280794815 231668969 184583944 148582790 122229544 101606466 87773002
39080 87773002 82675410 82310134 78778419 67458471 50050749 33169397 25179829 29994665
39072 29994665 41120710 45647308 37370145 23007071 13205985 11471259 14760028 20109837
39064 20109837 25973984 30500299 33298704 36525403 40561530 41822248 38739533 36064496
39056 36064496 38317934 42545511 42997455 39519084 35340708 30263394 23326843 18923573
39048 18923573 21337082 25033334 20213709 7980544 -41051 1356193 4498280 2270382
39040 2270382 -2071786 -3397067 -3482340 -4556351 -2504597 4980333 10246434 5525762
39032 5525762 -3687700 -5474345 945813 5167656 2573562 575643 5647599 13524488
39024 13524488 16688462 14546509 11246998 8673043 6565057 5683424 6147230 5535320
39016 5535320 2753402 1013238 2719471 4080335 39621 -6961355 -9039795 -4101371
39008 -4101371 447882 -2511339 -10411274 -14770067 -11927536 -6166131 -2917165 -2864436
39000 -2864436 -3985554 -6035805 -9648221 -12282394 -9352440 -839547 6469886 6295112
38992 6295112 567959 -3546641 -3239082 -2505957 -4889668 -8450932 -9900873 -9507044 -8484019
38983 -8484019 -4779705 3921717 14557344 20692917 19905110 15139029 8906872 962417
38975 962417 -7023386 -9516952 -3561349 5579087 9127327 4266737 -3849757 -8699940
38967 -8699940 -8173448 -4179138 298184 2604090 983216 -4311945 -10600208 -14304538
38959 -14304538 -13471922 -9324764 -5389193 -4222146 -4588561 -2950668 1610078 5425677
38951 5425677 4421360 -1251564 -8437163 -14985417 -19729061 -20044510 -13884591 -4599777
38943 -4599777 626888 -1054034 -5007101 -5989024 -4365459 -2596326 427157 6569856
38935 6569856 12499435 12514593 6778917 1106688 -1703705 -4348862 -7575643 -7052445 -1416708
38926 -1416708 2636582 -749814 -6967814 -7443633 -3148648 -3139805 -9736013 -14241267 -10594225
38917 -10594225 -5100716 -6399184 -11656319 -11088791 -3604688 1085734 -3084117 -9980393
38909 -9980393 -10864056 -6466843 -3933561 -5472402 -6649269 -4773760 -2235471 -392190
38901 -392190 3380561 9068282 10123103 2339540 -6827932 -5821339 4478334 10231055
38893 10231055 3409610 -6903652 -7709187 14708 5012835 3197399 984157 1812001
38885 1812001 250573 -7034867 -13548040 -12060223 -5088948 -100379 942015 875608
38877 875608 -62787 -4066482 -10041946 -13964073 -13952928 -10688032 -4942427 706146 826655
38868 826655 -6059110 -12194373 -9243202 -524043 3165842 -901088 -4493635 -1678073
38860 -1678073 3524567 4768771 1095496 -5250194 -11445750 -12439386 -4728568 5234094
38852 5234094 4950138 -7487548 -19047220 -19385849 -14308259 -14547473 -19044995 -18613291
38844 -18613291 -10719363 -1321783 4305465 4498409 -1074988 -8439891 -8270228 3015731
38836 3015731 14633046 13571462 2403054 -5211784 -4130613 -1349996 -1493157 -1443492
38828 -1443492 -506058 -3436706 -10095855 -13074029 -9592688 -5842158 -5457993 -3529798
38820 -3529798 3160701 9347580 10137704 8075949 6096624 2024332 -4374453 -7646335
38812 -7646335 -6021271 -5711978 -9535319 -10861456 -6326472 -4023195 -9316177 -13069421
38804 -13069421 -6552105 1237363 -3762644 -17632675 -24632478 -21703733 -18928674 -17723414
38796 -17723414 -8255212 9015423 18297245 11605334 696105 -2490679 -2678231 -8097479
38788 -8097479 -13374089 -8887567 1511769 5844312 2067315 -1481352 -635256 927272
38780 927272 1173599 2581927 5245707 5627063 3060923 586393 -1242052 -4992363 -10277008
38771 -10277008 -13137881 -12442042 -11474821 -12231882 -13107832 -12969217 -12430138 -10229720 -3793213
38762 -3793213 4872999 9039260 5715232 175246 -742941 3481453 8364646 10282624
38754 10282624 8086952 1776470 -6815804 -13556330 -15366433 -13280935 -10033837 -5973954
38746 -5973954 -101565 5798051 7510802 3720415 -1339023 -2217745 1419026 4060498
38738 4060498 497088 -7501259 -11738328 -6189325 5240059 11682906 6948628 -3876465
38730 -3876465 -11237903 -12404977 -12526387 -15297201 -17459365 -14706074 -9116352 -6380466
38722 -6380466 -7249386 -6618666 -1665614 3468336 3280375 -1888538 -6815913 -7335450 -2915234
38713 -2915234 4293773 9902538 9037713 1733791 -4800244 -3627703 3180405 7896133
38705 7896133 8024196 7509866 7235294 2681482 -5968310 -9884548 -4034749 3146975 844765
38696 844765 -8053304 -11676926 -7514211 -4990063 -8914186 -11485489 -5448865 3799552
38688 3799552 6280032 1480083 -3382102 -5332109 -7816489 -12301972 -15344103 -14992146
38680 -14992146 -14033853 -14750150 -15008363 -12169438 -7571028 -4329572 -2804953 -908713
38672 -908713 2092297 4132966 2500060 -3336457 -10350642 -13265585 -9083939 -1336774
38664 -1336774 2141951 -2463063 -10282389 -13450826 -9972571 -4028894 1299746 6952559
38656 6952559 12532049 13055237 5248964 -5497430 -9628342 -4833676 1384248 1540694
38648 1540694 -3509451 -8195184 -10316688 -11418386 -11062394 -5863598 4572773 14163626
38640 14163626 15521640 8055754 -702415 -2477967 3219513 8598358 6328794 -1888494
38632 -1888494 -7403993 -5274750 72821 1318342 -2558105 -6472072 -6484091 -3163611
38624 -3163611 1121419 4297720 4158250 -412511 -7210593 -12507689 -15060474 -15537622
38616 -15537622 -12917543 -5850171 2557394 6521056 5126430 2926977 1757120 -1789229
38608 -1789229 -7931724 -9697929 -2908554 5213133 4452155 -4663130 -12534202 -13632986
38600 -13632986 -10721059 -7257448 -3448887 -381045 -688011 -3175316 -3131465 -322897
38592 -322897 -516035 -5748499 -8932720 -3169793 7544998 12526594 7553566 -1013147
38584 -1013147 -4931547 -3035200 -538125 -1637022 -4653017 -5071831 -2617078 -2463148
38576 -2463148 -7421608 -12105818 -9689563 -2551493 483201 -2630970 -4551814 -1165945
38568 -1165945 1689878 -1052917 -3998491 374421 9335237 14122781 12648190 9512889
38560 9512889 6280702 982837 -4128455 -4056965 -592195 -889039 -5067299 -4923601 1823706
38551 1823706 5698915 -561782 -10539608 -13859050 -10723615 -8308864 -7597776 -3716719
38543 -3716719 2494006 3246163 -4237156 -12349401 -13120331 -8370900 -6056302 -9574414
38535 -9574414 -14227436 -13181975 -4801366 5590368 10511268 7441741 1126633 -2051667
38527 -2051667 -1186320 -515577 -2721100 -5535294 -5778097 -4134045 -3904853 -6108135 -7720883
38518 -7720883 -5059880 1852242 8792073 11333860 9110075 5610186 4005823 4209898
38510 4209898 3983973 1413321 -3858241 -9671546 -11032881 -3862699 8756454 16836738
38502 16836738 13406714 2586983 -5685621 -7604526 -7944560 -11172592 -15251466 -15918902
38494 -15918902 -13072491 -10166695 -9694783 -11697734 -14924191 -17082521 -15300543 -8973848
38486 -8973848 -1869851 762988 -2281091 -6700960 -7335299 -3654548 132713 404000
38478 404000 -1587361 -2052823 -663397 -1456757 -6523400 -11557106 -10862712 -5559022 -3138949
38469 -3138949 -8466419 -18004971 -23914694 -22024996 -15161486 -10157518 -11927184 -19077506
38461 -19077506 -25167130 -25197169 -20158357 -14238892 -9673743 -6738512 -6306786 -8243178
38453 -8243178 -8990886 -5874002 -2797100 -5657338 -12164998 -13191382 -5799874 2184843
38445 2184843 3620702 1072810 -24238 -467229 -3137507 -5080208 -1510072 5284192
38437 5284192 8571725 7117065 5484975 5233644 2738283 -3592861 -9713451 -10822155
38429 -10822155 -5981537 1940440 7082447 3019115 -9893882 -20704010 -18361473 -6295862
38421 -6295862 787025 -4003174 -11614070 -10980684 -3303222 2861894 4325520 3940534
38413 3940534 2572442 -1702906 -7330132 -9055781 -5283256 -989116 -1358444 -5393760
38405 -5393760 -7843065 -6085128 -3332330 -4723549 -10767411 -15837672 -14404462 -7925085
38397 -7925085 -3064971 -2964729 -3490411 171625 6030991 7580333 2595263 -3512222
38389 -3512222 -4086655 813731 4865311 4028047 2289439 6059034 13821892 16279774
38381 16279774 8626185 -2364658 -7553183 -7223471 -7879303 -11069246 -13005252 -13051117
38373 -13051117 -14036047 -14928731 -12121641 -7953320 -8122198 -9789132 -3710444 8814713
38365 8814713 13751332 5269858 -3379649 753122 10844020 12097706 4539324 252935
38357 252935 3363344 7175752 8606411 11192025 13735636 9355063 -1678155 -9325215
38349 -9325215 -7320212 -370074 4672174 6264772 4470346 -1549089 -9050523 -12083346
38341 -12083346 -9307164 -5089475 -1365106 4169292 10323205 11397107 6499584 1757369
38333 1757369 495278 -552140 -2524333 -1188807 3583714 4374465 -2402866 -10001598
38325 -10001598 -11707465 -9587635 -7339495 -3220222 2954492 4370595 -2716415 -10701042
38317 -10701042 -11190031 -7312443 -6428855 -6880661 -2282240 5922167 10871200 11786411 12803230
38308 12803230 12999472 7726634 -1701326 -8897411 -11641547 -11937902 -9169352 -2278808
38300 -2278808 3459023 1807313 -3626769 -3909052 922085 2420923 -1922106 -5834424
38292 -5834424 -6227981 -6774507 -7761215 -3453990 7105759 16319876 18430168 15241819
38284 15241819 9539609 2429469 -904418 5729947 17053465 18795874 7936994 -1462758
38276 -1462758 589346 5409124 1521098 -6611663 -8245226 -5453666 -7934836 -14438344
38268 -14438344 -14460641 -6333334 265800 33526 -2055237 -2003884 -2676090 -5550222 -6450330
38259 -6450330 -3541821 -1634712 -4254052 -7843086 -7886378 -5337798 -3056423 -524227
38251 -524227 3911567 9002720 12195461 12730455 10984550 7399741 3602147 1571704
38243 1571704 535834 -1770387 -3801603 -851471 6982862 12393198 9625354 1408197
38235 1408197 -6288460 -11898739 -16134901 -16604311 -10979220 -3126927 518918 -351452
38227 -351452 -994787 -297168 -1180042 -2508582 629898 6259377 4427676 -7780861 -18550590
38218 -18550590 -16846390 -8887084 -8532145 -15697092 -17269910 -8699872 -801578 -1740627
38210 -1740627 -5240413 -3328401 536843 96556 -1489364 966290 2585754 -3570674
38202 -3570674 -11461672 -8973782 2176783 7552457 1680533 -4941049 -3452101 1606154
38194 1606154 3297630 3482628 5750056 6508717 1496584 -5460924 -8036691 -6793899
38186 -6793899 -6215630 -6744601 -6143003 -5091106 -5625935 -6894091 -6851857 -5103571 -1282701
38177 -1282701 4481270 7045576 -367667 -14081737 -19928621 -11902441 -2216627 -4055037
38169 -4055037 -12552028 -14077601 -7568123 -3160084 -3727144 -2272922 3133111 5625736
38161 5625736 2423412 -553137 350661 1409932 225796 -256981 543242 -1202540 -4436010
38152 -4436010 -1618373 8337469 14287653 6795589 -8432950 -17565674 -14678818 -5425320
38144 -5425320 1624985 2585078 -212835 -1038555 2846967 6944412 5435244 751272
38136 751272 492350 4356083 3243078 -5351462 -10655672 -3785531 8351972 12707362
38128 12707362 8118741 4696034 8318583 14481450 16811199 14371062 9745864 5253036
38120 5253036 2469865 2418470 5206794 10171154 15097140 15304704 7564096 -3472336
38112 -3472336 -7726054 -1799621 6043181 6680222 816151 -5625487 -10800822 -14682254
38104 -14682254 -12651119 -911433 13554992 17954699 9668839 -115618 -427588 7827091
38096 7827091 15737071 16306800 8544989 -3386565 -12508459 -13932494 -9363488 -4344570
38088 -4344570 -1083519 2126272 4591849 2260981 -4734893 -9054659 -4842218 4118543
38080 4118543 9487910 9349001 9091946 11860376 13412707 8941933 1633565 18008
38072 18008 6775032 14163628 13271527 5487479 667121 4262108 10851816 12017859 6491678
38063 6491678 -494988 -4674292 -5676046 -4579315 -2558004 -1045642 -64191 2500387
38055 2500387 6913537 8599959 3261025 -6081695 -11839318 -11469910 -9492863 -9367333
38047 -9367333 -8814237 -5644602 -3321483 -6103785 -11123673 -10432196 -1310033 9087203
38039 9087203 11108399 2903282 -8235354 -13809724 -11598318 -5647685 -1364241 -1790904
38031 -1790904 -6529653 -11886025 -13280077 -10170299 -7648672 -10162964 -14766333 -14747749
38023 -14747749 -9431131 -5141349 -5779281 -8077376 -7889462 -5331542 -1242596 5022026
38015 5022026 10627826 9025047 152992 -5630019 -787326 8085687 10364910 7292749
38007 7292749 7593286 11380284 10648666 4409702 544031 1249644 -843971 -8138895 -11075643
37998 -11075643 -2022824 12609370 20934708 19605116 13223502 5939978 33281 -2067233
37990 -2067233 -520239 620610 -828496 -2080745 -1209938 -447306 -180149 3147289 8361093
37981 8361093 7191694 -2321276 -8611408 -2541438 6999730 5696511 -3764227 -6378639
37973 -6378639 905589 5604512 1454810 -2135082 2531034 8710042 8063712 4868821
37965 4868821 7179724 11898820 9781537 766408 -6165921 -6636181 -5389301 -7185925
37957 -7185925 -10415741 -10957222 -7299754 -797681 5465310 7639104 4139679 -1896347
37949 -1896347 -5463827 -4770593 -1814112 770981 1277650 -1149647 -5784530 -10766008
37941 -10766008 -15714725 -21288634 -24530782 -19318403 -5618555 6040086 5558592 -3945619
37933 -3945619 -10896367 -10689254 -8727242 -8950562 -8275998 -4489272 -1716869 -3971589 -8889172
37924 -8889172 -11762641 -11323979 -8353572 -3154040 2252031 3974418 1988856 1655591
37916 1655591 5554879 8159685 3383487 -6173044 -12403031 -11204893 -4494759 3963930
37908 3963930 10130702 10622239 7173324 6574741 10832986 12010158 3981776 -5554137
37900 -5554137 -4810463 3480993 5321184 -2875460 -8872280 -4172884 3450398 3542463 -1363104
37891 -1363104 -2408710 972103 2632144 679203 -2325231 -6368838 -12234438 -15463861
37883 -15463861 -11094353 -2942140 651289 -287874 2216391 10110169 15067406 11131714
37875 11131714 3388839 -446363 -345579 -371972 -49524 4060568 10880904 15123394 14479565
37866 14479565 11888976 10651203 10914687 11280166 10887979 9341960 6791895 4551049
37858 4551049 3851996 3814074 2489131 159757 -457308 1937730 5085340 6238785 5882786
37849 5882786 6426456 7940511 7626440 4038285 -277010 -1879971 -904621 -427588 -1751412
37840 -1751412 -2456508 151289 5188928 9003704 9135439 6414457 3424715 1987051
37832 1987051 2522589 4969998 8792872 11582734 9496577 1578305 -6937077 -9039379
37824 -9039379 -4403821 318732 1247200 2376549 7180336 10499712 5946957 -2151036
37816 -2151036 -3538321 2170259 4785889 253079 -2877183 1576520 6402979 2854917
37808 2854917 -4914755 -7120075 -3778067 -1856496 -1329249 3551475 10575895 10023616
37800 10023616 652344 -6334207 -3488289 2515692 2284486 -2756539 -5057790 -2900712
37792 -2900712 -59386 2472277 6768783 11648632 12699195 8706522 3246398 -368178
37784 -368178 -1625424 101411 6651934 16857442 23896053 20705734 8651140 -1991242
37776 -1991242 -2844560 2523381 3284086 -3765185 -9533972 -5699489 3645796 9506692
37768 9506692 11918888 17029928 23044680 20948065 10651354 4505781 9576032 16750684
37760 16750684 15076302 8272899 7169297 11847728 12697602 6608365 998031 1267137
37752 1267137 3685603 3049278 100085 -1471190 64615 4728967 11150069 14993213
37744 14993213 12124743 5190918 1880581 4342871 5755880 717503 -6442463 -8773525
37736 -8773525 -7637857 -9704188 -15132703 -16343303 -9607946 -1361771 532435 -2529831
37728 -2529831 -2657234 3072200 8985652 9133747 4819711 1293493 -53941 -2180988
37720 -2180988 -6026947 -8152757 -6175404 -3032574 -2953683 -5234099 -5380440 -1758060 2109287
37711 2109287 2195119 -1687344 -6819063 -10356888 -10079715 -4918319 2906271 7780723 5746150
37702 5746150 -268415 -2839327 1185467 6230488 4330292 -4869979 -12863792 -11686922
37694 -11686922 -2750554 5238882 6201458 2460937 310453 1717873 2432958 -1573685
37686 -1573685 -7746171 -9251878 -3696394 3172659 4594237 1557344 598790 3606336
37678 3606336 5200958 2083114 -503608 3794655 12320900 16504466 13110112 6527407
37670 6527407 1021216 -2785732 -3869658 -724580 2808276 -933111 -12060859 -19646297
37662 -19646297 -15003514 -3366762 3958846 4842776 5934693 9426165 9273893 1678885
37654 1678885 -8605191 -15708834 -20195431 -24636794 -26305788 -20390026 -8850202 -282245
37646 -282245 15869 -4174360 -5901672 -3647784 -1176431 -590377 486496 4127047 7940190
37637 7940190 8310521 5997070 5243183 7611867 9849130 8653903 4900584 1679036
37629 1679036 242291 -241840 -333457 273453 1541136 2816402 3765083 4894046 7108059
37620 7108059 10438437 12590734 9805573 1232570 -8100319 -11577503 -8561209 -4724482
37612 -4724482 -4317907 -5616904 -5198266 -2646332 1344479 7522056 15133081 19653703
37604 19653703 17704302 12026570 7603452 5119797 2709063 1727059 4790932 9186993
37596 9186993 8983457 4442850 2805947 7426491 12072058 9860228 3186528 -174851
37588 -174851 1943664 4071347 1087474 -5912651 -11832005 -12797221 -9080510 -4791798
37580 -4791798 -4178587 -6484643 -5923871 508407 6924365 4826385 -4717095 -10762891
37572 -10762891 -6539999 1330216 1969708 -5152321 -10669420 -8800228 -3855884 -2349499
37564 -2349499 -4376161 -5597361 -3687267 254485 3662871 3281079 -2755105 -10665379
37556 -10665379 -12425347 -5452085 2191367 1147567 -6945364 -11793241 -7564294 1701540
37548 1701540 8676265 9110587 2479421 -7468612 -12890261 -9058726 -1852559 -1319981
37540 -1319981 -7146805 -8511982 -494644 8037927 7186119 -1204437 -8958478 -12601605
37532 -12601605 -12663559 -8725639 -2773689 -1725432 -8154559 -13309448 -8472867 899459
37524 899459 2562907 -4174452 -8913075 -7356619 -5364326 -4997920 -42356 10094414
37516 10094414 14503458 6431268 -5144393 -8733464 -7140446 -10316849 -17030047 -16274303
37508 -16274303 -5776129 2878114 445469 -7784948 -10780003 -6452353 -1938180 -2589622
37500 -2589622 -6114036 -7186631 -4363405 -1382647 -2412810 -6555596 -8421078 -5577838
37492 -5577838 -3153134 -6688427 -11699671 -7620318 5688200 13505668 4744958 -11590984
37484 -11590984 -17899877 -11868082 -6862522 -9148941 -8840988 1679097 13492868 14730026
37476 14730026 8485783 5565369 6527726 4057402 -1325834 -2123950 1233112 571762
37468 571762 -4302369 -4210646 2368474 4969122 -1013361 -5414387 438604 10264544 14067614
37459 14067614 12286660 9490873 3998840 -5367268 -10893514 -6496002 109326 -1927263
37451 -1927263 -9203138 -9793388 -1961409 5450340 7837097 7376087 3782848 -4110051
37443 -4110051 -9628625 -5183527 2965988 1544758 -7796412 -9159711 2218104 11465959
37435 11465959 7013918 -2860466 -5071735 -579646 2188604 2536660 4651176 6807023
37427 6807023 4668228 676878 125453 1302663 -1184801 -5698129 -5086476 1908881
37419 1908881 8515854 9555339 6993533 5017897 4627793 4797340 5739893 8908916 14388807
37410 14388807 19117260 18891070 13490914 8245722 7448273 7847432 3531817 -3814410
37402 -3814410 -6202974 -1468495 3225800 2367117 -499918 -85442 2253699 2266586 219524
37393 219524 -89814 3504499 10170673 16143433 14830640 2886173 -11648656 -14741708
37385 -14741708 -3888496 7283749 7072021 503229 -977215 2827634 3211148 -2161635
37377 -2161635 -6753716 -6310697 -3499351 -1444735 11129 999353 388285 -1448565 -2840020
37368 -2840020 -3649060 -4538358 -4672463 -3505438 -2909837 -4054337 -4655289 -2952898 -1264892
37359 -1264892 -1578231 -1632722 -554208 -3841786 -15399576 -27842865 -29451501 -19864282
37351 -19864282 -10447721 -8344439 -8100248 -1809979 8805069 14705063 10651499 531898
37343 531898 -7336167 -8277255 -4518594 -850757 1478050 4085515 5769006 2886541
37335 2886541 -3053028 -4305373 2484636 9610322 7509445 -3001421 -12673412 -14770215
37327 -14770215 -9539864 -1425176 3392290 536901 -6363260 -7041601 2579875 13477534
37319 13477534 15238690 9445310 4291960 1329411 -3387235 -9120365 -11336919 -10208568
37311 -10208568 -8972808 -6349515 -8222 5160824 2694293 -3718115 -5340435 -3542241
37303 -3542241 -7494030 -17148648 -21832681 -17485300 -12291418 -12037967 -12400771 -9891400
37295 -9891400 -8116153 -7967951 -3892019 3463134 2980567 -9841808 -22280030 -21077713
37287 -21077713 -10795012 -4383626 -3026575 1818072 10907541 15274580 11287866 6082036
37279 6082036 5760858 7033438 4316864 -706433 -1082151 5922178 14295234 15017751 6222857
37270 6222857 -3920578 -6713674 -3512827 -2113191 -3883441 -2173950 5106690 10216501
37262 10216501 7505729 2626783 2937349 5127478 1072193 -7798468 -11063314 -3544770
37254 -3544770 8178643 14138428 11014694 3463513 -1156945 489036 4254477 3239539
37246 3239539 -2794567 -6329912 -2464840 4583923 8898154 11195686 14358023 15942919
37238 15942919 12553142 8031787 9100614 14485465 16049750 10211860 1409740 -5450140
37230 -5450140 -9324265 -9843349 -6608087 -2642250 -2364816 -4631837 -3384764 2984349
37222 2984349 8150178 6193182 -814016 -6195558 -6478272 -3487993 -1096272 -1955712
37214 -1955712 -5979663 -10727752 -13967665 -15673133 -16521338 -15794677 -12875777 -9508632
37206 -9508632 -8138101 -9273149 -12517149 -17558430 -21050269 -16254819 -1485196 13586900
37198 13586900 17053471 9460860 2385895 2361647 4087379 1415719 -3000296 -3382691
37190 -3382691 134784 3448592 5009582 5247934 3085541 -1538880 -4241199 -994034
37182 -994034 4816980 5601407 50788 -4383591 -1114098 6951591 11032134 7281826
37174 7281826 1234690 515483 4660280 5251144 -2479342 -11624653 -11965226 -4877013 -2723412
37165 -2723412 -11265928 -20178464 -17116707 -5673340 -491315 -6827897 -15046191 -16659658
37157 -16659658 -15672744 -18678173 -22048355 -17832044 -8053572 -3305430 -7512099 -12903229
37149 -12903229 -12213051 -8281105 -7422680 -9179498 -8340966 -3744305 667850 2185653
37141 2185653 1981801 1932786 2612892 4118501 5584332 4366602 -931492 -6913370 -8157760
37132 -8157760 -3470644 3487013 9145908 12166927 11449034 6553007 475341 -2342174
37124 -2342174 -1594557 -684646 -303467 2448497 7192785 8407254 3691356 -1318596 -964781
37115 -964781 1549060 -973422 -8226128 -11907468 -6924281 1648020 4388160 -2191595
37107 -2191595 -12284093 -16368003 -9923740 2241456 10293879 8689187 934154 -5080209
37099 -5080209 -5210341 -1808396 240146 -1200863 -3852303 -3936961 -572361 3469566 5658897
37090 5658897 6371402 6273426 4000358 -367794 -2542510 328397 3713828 1653790 -3224478
37081 -3224478 -3359002 1040651 2253392 -1249875 -1855358 3354352 6549080 2391444
37073 2391444 -2798983 -2416782 -838698 -4421609 -9281297 -8145325 -2841032 488776
37065 488776 2769251 7489789 10133450 4487922 -4304967 -5873274 -1116201 674048
37057 674048 -764791 3286429 13054483 18088573 14934567 12060206 12894023 8843491
37049 8843491 -3913341 -14430484 -12994793 -5637685 -2519149 -1754172 3702546 10728230
37041 10728230 10013180 1132472 -7205921 -9385354 -6424894 -179276 7141263 9953334
37033 9953334 4640743 -3169220 -4389464 1474885 7162763 9025464 9698658 10234071
37025 10234071 8070299 3849018 2487996 5125450 6328914 2060234 -4707993 -8950967
37017 -8950967 -9673530 -8298104 -4980412 -23194 3497595 1929292 -4753032 -12753678
37009 -12753678 -18055956 -19301914 -17653870 -14715113 -10974750 -6505977 -2511156 -552149
37001 -552149 -204584 444711 1619270 1751300 1061899 1758737 3437576 2502103 -1480806
36992 -1480806 -3386859 -188728 3248117 893600 -5444610 -9434130 -9648277 -9310378
36984 -9310378 -8572318 -4229459 3029137 7903480 8298936 8287444 11587593 16630007 19650246
36975 19650246 18856841 14506600 8524439 4587465 4619117 4862181 -148245 -9346910 -15869163
36966 -15869163 -16692263 -15874623 -16662747 -16537681 -13098607 -9103169 -7370346 -5293763 716775
36957 716775 8614563 13027141 11625903 5509654 -3612320 -12408453 -15366511 -10576693
36949 -10576693 -3894507 -1994681 -3150989 -930764 4142850 3869032 -5429689 -16455407
36941 -16455407 -19859321 -15155905 -9333295 -7725589 -9630680 -11064882 -8993646 -3782905
36933 -3782905 894409 1690857 -159967 -341728 2073390 3015130 198220 -2305692 38627
36924 38627 4826885 6145847 3646247 2628498 5470276 8739204 9693833 9750644 9217620
36915 9217620 4520277 -4944336 -11871594 -8918152 890598 7456757 6282313 2274879
36907 2274879 1023847 2031428 2232530 1459835 1499092 2447696 2504457 149524 -4318219
36898 -4318219 -8108762 -7410176 -2166930 1585282 -1611473 -7981655 -8051068 186829 7884774
36889 7884774 7800197 3858070 3761537 7532205 9387311 7089455 3077778 -884021 -3832056
36880 -3832056 -2647986 4282717 11761602 12764170 8124098 4908874 5664067 5962778
36872 5962778 2585508 -2928456 -9471762 -17830035 -25718159 -28711171 -27751677 -27893471
36864 -27893471 -27579856 -18675980 -1567456 9712492 5171364 -6249642 -8809442 -1094989
36856 -1094989 5208693 3557615 -1614998 -5701722 -9394880 -12290771 -10861515 -5662284
36848 -5662284 -2747058 -4778003 -7220594 -6172624 -3717075 -2404142 -485195 3399199
36840 3399199 5859294 3443662 -1907903 -5628400 -5710686 -2693409 1956508 5233942
36832 5233942 4403993 1574296 1878294 4963703 4021022 -3661278 -11686747 -14363483 -14403825
36823 -14403825 -14934683 -11666819 -2047722 4587717 -1776685 -14170577 -15711785 -3909956
36815 -3909956 5818352 3356033 -3016903 -2463693 1955479 1851130 -1053936 617875
36807 617875 5696652 6098565 174348 -5702039 -8114596 -9953754 -12220537 -11153472
36799 -11153472 -6055985 -2946410 -6573759 -13460348 -16465286 -13152061 -6776334 -1462976
36791 -1462976 909048 602053 -930264 -2337317 -3443745 -4327110 -3709605 -269004 4295305
36782 4295305 5931188 3131881 -506678 -102772 4751747 9086400 7564775 155987
36774 155987 -7752674 -11352911 -11315677 -10914141 -9960787 -6005811 -1315659 -2276850 -9163777
36765 -9163777 -12768388 -6120648 5776111 13801322 16871469 18430292 15979108 5221822
36757 5221822 -7541555 -9673257 -237657 7822004 6683402 3429290 5669739 8484910
36749 8484910 3911375 -5193957 -10212804 -9610127 -7680968 -5440290 -1896470 -449622
36741 -449622 -4721470 -10853805 -12930059 -13376626 -18213659 -23899138 -20105166 -6275775
36733 -6275775 5354469 6083887 740252 -2333844 -2650717 -3793300 -5422059 -5308442
36725 -5308442 -4596863 -5404590 -6556206 -6294001 -6040760 -7218164 -7558837 -5227894 -3837215
36716 -3837215 -8038770 -15398639 -17639658 -10283687 2218644 11231064 11630780 5249944
36708 5249944 -1147415 -1677625 2982094 6050215 2149572 -6444989 -12466482 -11418145
36700 -11418145 -4911088 2549172 7551561 8761239 6509158 2700237 111024 397479
36692 397479 2377036 2819880 -49319 -3695511 -3398497 1801466 7025959 7298225 3584051
36683 3584051 296456 -1448213 -3736157 -5713162 -3002832 5215167 13164926 14962954
36675 14962954 10605343 3393552 -4605948 -11560598 -14206745 -11414623 -6969374 -4804246
36667 -4804246 -3483074 467223 5476263 6060670 767989 -5450863 -7648777 -6192431
36659 -6192431 -4408694 -3653205 -2560513 120523 3525864 5520870 5167794 3998900
36651 3998900 4164364 5513329 5875567 4283208 2077265 688197 799678 3933619 11125005
36642 11125005 18584515 18962506 10090763 -901615 -5639610 -3494686 1023283 5732837
36634 5732837 10032396 10126853 2724170 -7311832 -10635410 -5811696 -1286981 -3108833
36626 -3108833 -7185913 -6953197 -3001899 -585169 -1528896 -3253570 -3392865 -1438054 2514945
36617 2514945 7357367 10494290 10168704 7069259 2346507 -3512278 -8338631 -8411500 -3747324
36608 -3747324 187283 -431005 -2497701 -2220640 -2795351 -9136409 -17365219 -18150497 -11013748
36599 -11013748 -6466389 -10568062 -15494801 -11640171 -2831663 -957963 -8473310 -15460451
36591 -15460451 -14308042 -8813354 -6123010 -7058458 -8917984 -11704397 -15342488 -15166842
36583 -15166842 -7812333 517436 -279283 -10138409 -18056798 -16896070 -11360597 -8149706
36575 -8149706 -6090786 -1975215 518556 -3609085 -9907389 -8841241 -387348 4631341
36567 4631341 -446856 -9305115 -11885889 -6361768 1686912 6985949 7468835 3457920
36559 3457920 -1982255 -4641263 -4157731 -4490298 -7025076 -7493316 -3279385 942935 120367
36550 120367 -2757184 -1855599 845856 -1748459 -9222061 -12293902 -6095844 2533474
36542 2533474 4684883 610081 -3104487 -3373177 -2737244 -4098825 -7646223 -11699678
36534 -11699678 -13337589 -9568959 -994109 6970857 9566160 8219345 7626347 8832008
36526 8832008 9192302 8290986 8840757 10926120 10509981 6371322 4147432 8894535 16151952
36517 16151952 16130869 6941637 -1751579 -768402 6972534 11020099 7274706 1915744
36509 1915744 1146689 2514423 -177209 -6898977 -11420009 -10433594 -7738524 -8153403 -11225762
36500 -11225762 -13286796 -12819408 -10910124 -8421749 -5861622 -4653660 -5165170 -4419794
36492 -4419794 318565 5879471 5585259 -1577891 -8672735 -9983205 -8048348 -7842652
36484 -7842652 -8218231 -5136877 -759256 -1422199 -6241648 -5960664 3365039 12588629 11233465
36475 11233465 1960458 -4011036 -2938535 -1655331 -5011441 -8725853 -7418830 -2890107
36467 -2890107 -162536 -370284 -2292630 -6831253 -14292206 -19762839 -17363390 -8663081
36459 -8663081 -1622702 -711204 -2674297 -3065938 -2350608 -3159281 -5151427 -6058269 -5873271
36450 -5873271 -6515911 -7956074 -7967368 -6414860 -6942604 -12133307 -18379814 -18733116 -11437277
36441 -11437277 -2712840 882739 131638 -227504 -102592 -3380085 -8942446 -9678940 -3414384
36432 -3414384 1963973 -313236 -5173458 -3468073 3370828 5158084 -1918352 -10677661
36424 -10677661 -13896176 -11806229 -7338699 -1831349 2184931 1539951 -1238771 476115
36416 476115 6346804 7825684 2096362 -2120780 864242 3074996 -3665437 -12375480
36408 -12375480 -11625566 -5097309 -5322667 -11253918 -9124434 3336009 10948132 5013417
36400 5013417 -2617473 1003611 9534819 9121278 1136425 -1502555 4188240 8296759
36392 8296759 5859135 4060525 8483831 13208456 10632743 4039461 3399953 11509799
36384 11509799 19914370 18893036 8635967 -1024246 -1824856 3807434 7461728 7374196
36376 7374196 10322963 18766029 23450045 15410892 -107493 -10460480 -12797836 -14314635
36368 -14314635 -17159851 -15215203 -7578434 -2968170 -5534412 -7139547 -1269831 4738134
36360 4738134 1156586 -7460372 -8441417 72759 7900261 9104929 8103717 8378501
36352 8378501 5892265 -2168395 -10488288 -12787003 -10092529 -7079273 -5013872 -3105165
36344 -3105165 -2602590 -4304972 -5172056 -2596734 498195 55226 -1928134 -619166 2747887
36335 2747887 2369512 -1331318 -201598 9078707 17722083 15859288 6274549 260681
36327 260681 2295628 6433924 7379247 6708324 5740383 483585 -10474418 -19017193 -16372428
36318 -16372428 -6107740 -131472 -2221928 -3491876 3994217 16007181 21923186 16702277
36310 16702277 3956090 -8459843 -12798458 -6056514 5656502 11266519 7324742 2552318
36302 2552318 5474461 12234442 13159992 7661068 4256516 7151020 11332134 11768062
36294 11768062 9638964 7308520 4180845 768552 638819 4050267 4644492 -2571124
36286 -2571124 -13208548 -18034034 -13450867 -3858761 4407746 7965946 6950555 4394614
36278 4394614 4332879 7678357 10496088 8510112 2572998 -2247763 -2212550 2053952 6908152
36269 6908152 8302634 4203238 -3470802 -9614950 -10097139 -5230636 1087746 4889252
36261 4889252 4814694 2743915 1918469 3110190 3239999 -141599 -4177272 -4091446 -682339
36252 -682339 116244 -4447275 -10756521 -14595879 -14859323 -10770738 -2153233 5470600 3940339
36243 3940339 -5100186 -8790223 -579248 8282720 3703810 -10635529 -18515871 -13795799
36235 -13795799 -6061460 -4005501 -4725030 -2450294 1579010 2667179 -311973 -5469890
36227 -5469890 -10756966 -13539584 -11794259 -7813051 -6473827 -8575038 -10478631 -10788418
36219 -10788418 -11505063 -12004373 -9138548 -4913169 -5868456 -11651739 -12644235 -3848458 6828038
36210 6828038 10248398 8373154 7412706 5911500 -504971 -7754475 -7991854 -3258372
36202 -3258372 -3198406 -9368897 -12673921 -8222297 -2567346 -2308545 -4267331 -2490176 1755529
36193 1755529 3261183 1544857 258999 1023116 3098145 6646900 11119596 12348752
36185 12348752 6742146 -2326719 -7300199 -5639926 -1843203 -125954 119736 404554
36177 404554 -511084 -3595970 -6427662 -6438682 -4967527 -4879681 -5953710 -5963210 -5070328 -5633349
36167 -5633349 -8200362 -10921737 -12624429 -13424160 -12771737 -10285633 -8040325 -8096013 -8190961
36158 -8190961 -4723516 118859 471304 -2853076 -1620494 6765143 13068422 9046928
36150 9046928 1086 -3193287 367573 2868584 1183291 -638758 -829874 -2155244
36142 -2155244 -4441706 -3833443 -654311 340474 -1021255 562094 5783285 8160234
36134 8160234 4236871 -1723192 -5992232 -9771053 -12060233 -7638971 2764326 9487691
36126 9487691 7570031 4758696 8485036 13351485 10909547 4525339 3331896 6347414
36118 6347414 4428617 -4110613 -10628925 -8720027 -1101915 5822703 7243893 1206463
36110 1206463 -8181031 -10715405 -996346 12583727 17640323 13913305 10335135 8939587
36102 8939587 3790021 -4508464 -6547666 639342 7947228 8275713 5515694 4398616
36094 4398616 2200974 -2387036 -2209792 6994395 15751108 12119732 -663730 -8106548
36086 -8106548 -3707886 5210826 10089952 10397476 9004541 6205643 1823961 -1803210
36078 -1803210 -2665074 -2234917 -3083294 -4951324 -5249376 -2643871 1273365 3626959 2794248
36069 2794248 -586729 -4522126 -7143533 -7512991 -5928227 -3934622 -3010730 -2377368 578853
36060 578853 6227150 10429463 8611619 1317747 -6440978 -10573523 -10532125 -7877971 -5157706
36051 -5157706 -5178025 -7968279 -8930388 -3463242 6641677 14618095 16508507 14546850
36043 14546850 12937862 13153329 13144877 8813233 -2329129 -15941731 -21748902 -14449677
36035 -14449677 -1822076 3796602 652326 -2486421 -630788 1421804 -1140538 -5174484
36027 -5174484 -4854169 698624 7977169 12509883 9926662 -753443 -12667411 -15675602
36019 -15675602 -8083399 1317083 4736442 2851089 -952956 -5985884 -10232180 -8767423
36011 -8767423 -1714122 2736908 -897726 -7427834 -9603362 -8562644 -8756070 -8264827
36003 -8264827 -2918573 3649091 3145351 -5481017 -14802799 -18883116 -18056769 -14573890
35995 -14573890 -9888342 -6355999 -6071119 -7397874 -6788357 -3990174 -1802839 -1294154
35987 -1294154 -897747 471534 2748811 6019340 9080728 8079132 441119 -10427118
35979 -10427118 -17526714 -17046165 -10971883 -4325925 -1329202 -2197965 -2500030 1454569
35971 1454569 6029067 3896485 -4550617 -10123790 -8159786 -5360178 -8328123 -13010329
35963 -13010329 -12688113 -9372616 -8307782 -7185661 -1391974 4419426 1727448 -6975227
35955 -6975227 -10351741 -5024932 862256 1827870 1855579 4284425 5037739 837358 -3499627
35946 -3499627 -1537137 5750316 11611233 10929953 3657632 -5866935 -11368082 -9350060
35938 -9350060 -2282543 5020617 10836877 15051511 14925442 7949515 -2589189 -10447100
35930 -10447100 -13308746 -11790478 -5178764 4463105 7943825 -817521 -12250336 -10770425
35922 -10770425 3023034 12454912 8967256 2634273 3706303 7161230 4218929 -1856156
35914 -1856156 -2443224 1502052 2543049 255451 824034 5154729 7087273 3650911
35906 3650911 -862213 -2720286 -4490453 -9879273 -16376129 -16939332 -9183771 -267019
35898 -267019 484804 -6321939 -10226440 -5621979 -289165 -3046880 -8921014 -7054828
35890 -7054828 254823 -125920 -10661334 -18176337 -13982836 -5300880 -643168 2873220
35882 2873220 9089590 12072288 7024089 1793527 4898345 10148978 6734113 -1682061
35874 -1682061 -2655029 4026790 6253354 -166052 -5691151 -3600626 424881 -574056
35866 -574056 -4502552 -6079537 -5099139 -3807937 -1968054 1038094 3487288 3987234 3622005
35857 3622005 3758229 4881478 7752822 11525998 11231041 2883754 -8662141 -13446687
35849 -13446687 -9326200 -4727820 -6390094 -10864408 -11538687 -8090032 -4361156 -1564660
35841 -1564660 1198425 2833067 1715351 -616747 -1526867 -1575782 -2721015 -3413522 -57860
35832 -57860 6434237 9914139 6670194 628870 -1987931 -1172861 -2287858 -6851297 -8930593
35823 -8930593 -3539316 4973461 7735273 2845844 -3486495 -6947039 -9794642 -13924535
35815 -13924535 -15894477 -12800413 -7822709 -5170901 -3803696 -1153261 948626 -254230
35807 -254230 -2522519 -2290989 -1138118 -1896896 -1278948 5463997 14166008 15200821 7804737
35798 7804737 2063701 4479523 9853572 10984542 8668025 6926627 4848362 4230
35790 4230 -4079095 -1242458 7430240 12862563 8080180 -4222679 -14971454 -17532624
35782 -17532624 -12761024 -6618922 -3653943 -3216483 -2256968 -316178 438499 -689701
35774 -689701 -1932165 -2404939 -3278912 -4659939 -4385761 -1660202 583006 -900206 -5346141
35765 -5346141 -8821921 -8388136 -4182091 1713781 7223996 11314193 13607775 13315083
35757 13315083 9668616 4101092 267483 82485 1229086 848288 16577 1422849
35749 1422849 3949980 3484115 -1273185 -7444728 -12134539 -14266594 -12671355 -6686525
35741 -6686525 918985 5680231 6691744 6448923 5548635 2192029 -2761912 -5575479
35733 -5575479 -5493530 -5397515 -5323401 -1513343 5740243 9841120 7199130 2742815 1685541
35724 1685541 1769686 -697875 -2761779 99454 5157519 6512140 4876730 5225299 7015656
35715 7015656 5565695 2064943 2753881 7502978 8781080 4419473 2069794 6591147
35707 6591147 11557930 9612559 4162237 2918743 4948552 3125202 -3080665 -6256840
35699 -6256840 -2509581 3418195 5907384 4997398 3103902 629536 -2424324 -4662494
35691 -4662494 -5799008 -7587930 -10008416 -9885563 -5725661 -756785 1319785 442536
35683 442536 -2421961 -8104400 -15650409 -19523904 -15638654 -8053741 -4269622 -5209261
35675 -5209261 -5507856 -2870831 -444408 826073 4910287 12554629 16773059 11857215
35667 11857215 2726848 -1003603 1638501 2048406 -5124963 -13986607 -15053480 -7300848
35659 -7300848 1239107 3607056 917656 -1385436 -1062006 -181634 -129994 798957 3828971
35650 3828971 6523386 5313266 -173398 -6845949 -10891662 -9882001 -4618520 -348630
35642 -348630 -2721106 -9894583 -12707702 -6878556 -578808 -3316778 -11073461 -11700003
35634 -11700003 -3632712 1532808 -3236608 -10910635 -13034355 -11892620 -13011510 -13677938
35626 -13677938 -8036505 1518516 7290030 7875557 8470860 11065101 12187948 10384541
35618 10384541 8967006 9925928 10229097 6084491 -1968725 -9160766 -10361309 -4772820
35610 -4772820 2061596 3212681 -1336508 -4866263 -3983839 -3058125 -5212173 -5433690 983143
35601 983143 8517529 8121314 560312 -5222025 -5201736 -3834532 -5496862 -9590447 -13574850
35592 -13574850 -14582054 -9469872 178308 5347414 -349916 -10007752 -11692732 -5630884
35584 -5630884 -2726969 -6416727 -7987656 -2367251 3206139 1470539 -3715343 -5021598
35576 -5021598 -2886403 -2487914 -5113628 -8407451 -10803862 -11089117 -7794189 -2821891
35568 -2821891 -1245386 -4239893 -6947439 -6006590 -3480293 -704197 4480299 10317066
35560 10317066 8926566 -2185021 -13157544 -13653169 -6352651 -1270196 -1588283 -3242873
35552 -3242873 -4383051 -6042545 -5758794 152063 8320089 10685134 5955287 1439395
35544 1439395 2096292 4562865 4421852 3142551 3695393 3642586 -1976028 -11830240 -16918646
35535 -16918646 -10060611 4904931 16207612 17043385 12561382 11480924 13654505 11402299
35527 11402299 2356101 -6080534 -7246378 -3732794 -1410992 -584128 1270110 1987485
35519 1987485 -3237492 -13560900 -21934911 -23149429 -18732448 -13749649 -11524030 -11565757
35511 -11565757 -10932372 -7893987 -4707882 -5006338 -8252760 -10150506 -9354097 -9159037 -10510506
35502 -10510506 -8792913 -1638587 4922514 3822317 -2517766 -4726100 1912425 12933661
35494 12933661 20357458 18923556 8610428 -4550042 -11453972 -8100500 -301934 2961695
35486 2961695 -225861 -4125376 -3370319 1770053 6907688 7406662 2056786 -4874063
35478 -4874063 -7335119 -5261007 -5405390 -11678217 -18586531 -18344344 -11042787 -3206820
35470 -3206820 711459 741540 -1687562 -4199374 -3368785 990091 3870268 1796365 -1744421
35461 -1744421 -2418931 -2560062 -6362425 -11356296 -12110260 -9638529 -9160815 -10359152 -8080184
35452 -8080184 -1931175 2709096 3164213 1912835 1011589 923567 3799715 10199810 13549066
35443 13549066 6581348 -6829740 -15175096 -14772754 -12271782 -11464960 -8860614 -4646428
35435 -4646428 -5999223 -14354707 -20305242 -17800576 -13441765 -13840868 -13394830 -4920279
35427 -4920279 5266010 5276747 -3492621 -7875886 -2420098 3924525 2297212 -4383180
35419 -4383180 -8050679 -7071699 -6340115 -9107689 -12614653 -11291072 -3119647 6995601
35411 6995601 11219805 7346198 1472425 83476 2149223 2673079 1444461 2757192
35403 2757192 7414554 11142895 11745819 11961842 13092971 11444456 4970229 -1143934
35395 -1143934 -867558 3619779 5324791 3472533 4094167 8692438 9880233 2645252
35387 2645252 -6091658 -6080491 1441206 5371610 207298 -8161546 -12957911 -14417011
35379 -14417011 -14142518 -9914957 -1927354 2592198 -1475564 -8126044 -8299047 -3324870
35371 -3324870 -1698001 -4989617 -6616086 -3909151 -1366000 -689996 2389859 8142477
35363 8142477 9110148 1739111 -5941524 -4832742 2645808 7033566 4590408 -892716
35355 -892716 -5666587 -8651262 -8324454 -3290891 4249753 10014442 12075567 10561814
35347 10561814 5167467 -2493901 -6348538 -1906318 5827856 7092621 819106 -3453245
35339 -3453245 265328 5027035 1143085 -8920653 -13268376 -6825895 2562240 5609677
35331 5609677 2459526 -1341120 -3748828 -5147307 -2539913 6974458 17771901 19227384
35323 19227384 9815657 462095 274265 5363340 6437531 1407058 -5594894 -12295262
35315 -12295262 -17684717 -17279330 -7829779 4822090 10797516 8441025 3996319 190716
35307 190716 -5778798 -12556244 -12915913 -4670450 5367464 11922304 17368531 22783875
35299 22783875 21671829 10152943 -2869654 -4622677 5189782 14417464 13725250 5756042
35291 5756042 -677889 -594050 3629352 5662035 1665324 -5479332 -9370006 -8091172
35283 -8091172 -6329869 -8174309 -11333284 -11113552 -6971531 -1881450 2266999 5237038
35275 5237038 6331004 5024228 2601282 627032 -1258869 -4155129 -7592221 -9950779
35267 -9950779 -10459590 -10320757 -12710332 -20457548 -31184730 -36439765 -30132713 -16998977
35259 -16998977 -7511560 -4964597 -3639620 703472 6157068 11053903 16302181 19338463
35251 19338463 15066784 6268502 3415548 9266499 13582292 9517153 4905346 8546544
35243 8546544 15139214 15091643 11117601 11979324 15641381 12814055 4030593 -814106 1133544
35234 1133544 2928423 1610476 2009322 5210967 5202993 29365 -4058070 -2796396 792179
35225 792179 3710736 6429971 6812551 519821 -9263145 -12281555 -5522140 2047417
35217 2047417 3213539 1555422 1848823 1312539 -2769166 -5573361 -2973398 90468
35209 90468 -2063007 -5360722 -2672726 3859827 6113989 2156592 -3117647 -6637694
35201 -6637694 -8475359 -6979630 -843464 5137528 3973349 -4070013 -12087749 -15721257
35193 -15721257 -15603226 -11978251 -4187350 4387779 7887561 5815490 3661043 4636216
35185 4636216 6161263 5624044 4194763 3276328 2043166 298154 -519501 -575553 -1584982
35176 -1584982 -2534923 -558139 2567635 872889 -6025268 -9839206 -4990662 2335155
35168 2335155 2785198 -2436922 -3906246 1757343 7802253 8115732 4885418 2919818
35160 2919818 2259418 607536 -909418 736302 5066982 8436152 9112591 8702308 8872233
35151 8872233 9741007 11552198 14905082 18494437 19101953 15306342 9863906 7163665
35143 7163665 8738606 11631781 11001239 5063999 -1850390 -2763295 3568532 9510678
35135 9510678 7007238 -2120293 -8653627 -8183761 -5249111 -4328120 -3272121 577592
35127 577592 3451081 311787 -6394323 -9489054 -7061561 -3869389 -3285572 -3453265 -1950019
35118 -1950019 804193 4078348 8359681 12442913 12527882 6653340 -2003925 -8028369
35110 -8028369 -8696390 -5201241 -404516 3711650 6896048 9063783 8303996 2708183
35102 2708183 -4990234 -8163604 -4447730 331898 372893 -1554773 623563 5648805
35094 5648805 7079500 4468944 3734081 6000782 5133972 -1092134 -5858032 -3527982
35086 -3527982 2273815 5710363 7256094 9480031 10184725 6445317 1055993 -1744803
35078 -1744803 -3257690 -6220067 -7261178 -1606421 6519115 6976542 -2075759 -10779670
35070 -10779670 -10736776 -5198970 -2560657 -4519931 -5511113 -1746934 3849945 6379814
35062 6379814 5739481 6312701 10236856 13684879 12059960 7136018 5045347 7246587
35054 7246587 8165990 3363547 -4439079 -9944775 -11593541 -10204831 -5736323 335386
35046 335386 3144882 -99073 -5417731 -7189105 -5146878 -2100599 1461945 5038228
35038 5038228 4364177 -2892775 -10579994 -10953157 -6077019 -4141101 -6040173 -5139799 -290845
35029 -290845 1285290 -3674024 -8933529 -9200485 -7287650 -6406253 -3936255 1105796 2132846
35020 2132846 -5720134 -15785793 -17201516 -8658508 1826364 7711033 8021078 3599241
35012 3599241 -3610727 -8894796 -8639553 -5291883 -3704803 -4128688 -3739289 -2795358 -3090013
35003 -3090013 -2074198 4237797 12891779 15903097 11506680 6565171 5940911 6317060
34995 6317060 3773609 1175584 2981245 6939092 6505600 -325397 -8945631 -13828606
34987 -13828606 -12910462 -7287875 -53597 4511269 3398038 -2402703 -8492769 -10450522
34979 -10450522 -6476276 1714711 9043433 9581091 1920644 -7638748 -9955402 -2793214
34971 -2793214 5818436 6155350 -1886431 -8691568 -6657377 938183 4904830 1393874
34963 1393874 -5431233 -10307223 -11507988 -8768290 -2443427 3362327 2487398 -4963933
34955 -4963933 -10941758 -10321733 -8331665 -11332190 -15215544 -11373998 -1175761 5352863
34947 5352863 4694477 3508644 5730073 6576350 3531585 3227472 10294950 17381353 15274249
34938 15274249 7637582 5954255 12525687 18108951 16117948 10309275 6522267 4154684
34930 4154684 -531956 -7405065 -12607160 -13514727 -11111944 -8353580 -6929982 -5030664
34922 -5030664 762819 10090361 17424936 18527130 15644543 12611150 8005892 -845924
34914 -845924 -9448150 -9909988 -3359561 -78955 -4884174 -10568186 -10004370 -6781400 -7274623
34905 -7274623 -8727464 -3907083 6110221 12763945 12185619 8271914 3911934 -2410217
34897 -2410217 -9727439 -12287920 -7730075 -1520748 535310 -955747 -3309205 -7025409
34889 -7025409 -11449593 -10640681 -1283562 8506279 7239651 -3524188 -9716962 -3659076
34881 -3659076 6045164 7836475 2961824 1024275 4958056 9056252 10017331 11206165
34873 11206165 14855134 17567278 16693235 15359968 16880286 18174267 13626757 3673970
34865 3673970 -4595169 -5164815 820994 6124017 3473250 -7571048 -18414044 -18741775
34857 -18741775 -8274538 1669093 1401124 -5435606 -7841299 -2560979 2936765 2097850
34849 2097850 -2488472 -4249002 -986420 4505100 8528399 8774094 5538070 2723718
34841 2723718 4631955 9730196 11006339 5263044 -1316968 -750592 6008803 10314044
34833 10314044 6668612 -1858192 -8794137 -10956672 -9365134 -6624633 -4684220 -3538230
34825 -3538230 -1752761 474946 -269297 -6559965 -15051090 -18796118 -15039545 -7549921
34817 -7549921 -705864 4894185 9447768 10844144 7949965 4053628 2942817 3237521
34809 3237521 798830 -4081081 -6312228 -3226832 1692862 3466622 966964 -3554295
34801 -3554295 -7534723 -9319508 -8591255 -6802741 -5357192 -3148720 1347072 5627938
34793 5627938 5090599 248956 -3198428 -3561320 -6275295 -13800765 -18829272 -14348455
34785 -14348455 -5506959 -2915021 -7209731 -9775598 -7551084 -6796477 -10843049 -13946737
34777 -13946737 -10829604 -4161793 1522013 6148316 10010284 10047796 5158085 -341273
34769 -341273 -3039733 -4945477 -7768098 -8652178 -5939398 -2977403 -1496180 2265732
34761 2265732 9704425 15220496 15348442 14970080 17587160 17625127 10907874 4304371 4408856
34752 4408856 4820858 -2500918 -10613554 -7809130 772446 -672061 -12733837 -19309502
34744 -19309502 -13426386 -6954638 -10163562 -17437097 -19436230 -15655868 -8595566 1589625
34736 1589625 10190711 8596838 -964808 -3951187 5336774 13849071 10308960 2897171
34728 2897171 4690247 12499150 13778242 6354582 -2280726 -8969513 -14947139 -16934891
34720 -16934891 -11212319 -3279196 -1565255 -4187319 -3005697 1929773 3381773 475820
34712 475820 -38999 4480232 9681873 12774827 14716995 14278379 8989464 2026080 -258563
34703 -258563 2204585 3794673 2810089 2940123 5630332 8214316 8999643 7559091 1697067
34694 1697067 -8638693 -16637010 -15816311 -9796051 -6621093 -6061184 -2181753 3776619
34686 3776619 4123411 -2353815 -8887505 -12091338 -14444622 -15680754 -12836667 -9258355
34678 -9258355 -11822476 -17858810 -16808617 -7113015 708880 885102 -247310 1910220
34670 1910220 1721197 -4765385 -10740414 -9351917 -4251861 -1969685 -2077280 -1876955 -2553197
34661 -2553197 -3654794 19965 8470091 12135516 6169045 567160 5755738 15532819
34653 15532819 16334908 8043355 2554438 4454261 6344352 3598033 1395648 3747869
34645 3747869 5456317 461387 -8229016 -12666712 -10658972 -7322471 -6768738 -6193681
34637 -6193681 -244939 9956921 15655680 10859079 1528205 -488928 7731733 17071108
34629 17071108 19002405 15174781 11826963 10738568 10066907 9416411 9061048 7186743
34621 7186743 2183894 -4447028 -10195735 -13809991 -13711968 -8416066 -804555 3085339
34613 3085339 2556060 3984082 10270394 14656502 10468635 1558670 -3412313 -2610149
34605 -2610149 -134174 2520502 6349873 8720132 5361576 -2160351 -7783650 -9667983
34597 -9667983 -11491975 -14837698 -16241500 -13308116 -9067509 -8028075 -10685853 -13819667
34589 -13819667 -14908612 -14905374 -16259575 -18295881 -16667279 -10000621 -4676931 -7378184
34581 -7378184 -13982217 -13776197 -5757319 -1345235 -7104269 -14754483 -15320322 -13800764
$$ [...]
##END NTUPLES=NMR SPECTRUM
##END=
