##TITLE=31Pdec_LR-0154-C2-EtOAc
 CD3CN, 64 sc
 9.2.2023
##JCAMPDX= 6.0         $$ Bruker NMR JCAMP-DX V2.0
##DATA TYPE= NMR SPECTRUM
##DATA CLASS= NTUPLES
##ORIGIN= UXNMR, Bruker Analytische Messtechnik GmbH
##OWNER= root
$$ XWIN-NMR		Version 3.5
$$ Thu Feb  9 17:49:25 2023 Russian Standard Time (UT+4h)  she@DPX200
##.OBSERVE FREQUENCY= 81.013821
##.OBSERVE NUCLEUS= ^31P
##.ACQUISITION MODE= SIMULTANEOUS
##.ACQUISITION SCHEME= undefined
##.AVERAGES= 64
##.DIGITISER RES= 16
##SPECTROMETER/DATA SYSTEM= spect
##.PULSE SEQUENCE= zgpg30
##.SOLVENT NAME= CD3CN
##.SHIFT REFERENCE= (INTERNAL, CD3CN, 0, 248.564)
##AUDIT TRAIL= $$ (NUMBER, WHEN, WHO, WHERE, WHAT)
$$ ##TITLE= Audit trail, XWIN-NMR		Version 3.5
$$ ##JCAMPDX= 5.01
$$ ##ORIGIN= Bruker BioSpin GmbH
$$ ##OWNER= she
$$ F:/spectra/data/she/nmr/P31/1/pdata/1/auditp.txt
$$ ##AUDIT TRAIL=  $$ (NUMBER, WHEN, WHO, WHERE, WHAT)
(   1,<2023-02-09 17:48:19.59 +0400>,<she>,<DPX200>,
      <continue with go, POWCHK disabled, PULCHK disabled
       configuration hash MD5:
       00 E9 B6 7A A2 85 ED C7 34 08 36 98 17 FE 4E 26
       data hash MD5: 32K
       70 7A B9 36 13 53 0F 3B 6D 5C F5 7A 04 F9 D3 F6>)
(   2,<2023-02-09 17:48:21.92 +0400>,<she>,<DPX200>,
      <Start of raw data processing
       efp BC_mod = 2 LB = 1 FT_mod = 6 PKNL = 1 PHC0 = -10969.83 PHC1 = 16.21271 SI = 64K 
       data hash MD5: 64K
       18 F8 6C 73 43 37 3C 7B F1 31 6D 06 A7 08 A7 9F>)
(   3,<2023-02-09 17:48:35.18 +0400>,<she>,<DPX200>,
      <pk PHC0 = 7.084474 PHC1 = 0 
       data hash MD5: 64K
       47 3B 6B 72 09 C6 AE C7 7D AE 07 D6 80 BC 31 7E>)
(   4,<2023-02-09 17:48:49.25 +0400>,<she>,<DPX200>,
      <abs ABSG = 5 
       data hash MD5: 64K
       0B 57 71 1F CF 89 72 F3 0B C7 76 E6 45 9C 8B D0>)
$$ ##END=
$$ 
$$ hash MD5
$$ B9 0C 82 31 5E 83 F4 D4 9C FE 26 A4 26 F7 4A CF
##$RELAX= 
##$RELAX= 
##$RELAX= 
##$RELAX= 
##$RELAX= 
##$RELAX= 
##$RELAX= 
##$RELAX= 
##$RELAX= 
$$ Bruker specific parameters
$$ --------------------------
##$DU= <F:/spectra>
##$EXPNO= 1
##$NAME= <P31>
##$PROCNO= 1
##$TYPE= <nmr>
##$USER= <she>
##$AMP= (0..31)
100 100 100 100 100 100 100 100 100 100 100 100 100 100 100 100 100 100 
100 100 100 100 100 100 100 100 100 100 100 100 100 100 
##$AQSEQ= 0
##$AQ_mod= 1
##$AUNM= <au_zg>
##$AUTOPOS= <>
##$BF1= 81.014009
##$BF2= 200.13
##$BF3= 200.13
##$BF4= 200.13
##$BF5= 200.13
##$BF6= 200.13
##$BF7= 200.13
##$BF8= 200.13
##$BYTORDA= 1
##$CFDGTYP= 0
##$CFRGTYP= 5
##$CHEMSTR= <none>
##$CNST= (0..31)
1 1 145 1 1 1 1 1 1 1 1 1 1 1 1 1 1 1 1 1 1 1 1 1 1 1 1 1 1 1 1 1 
##$CPDPRG= <waltz16>
##$CPDPRG1= <>
##$CPDPRG2= <waltz16>
##$CPDPRG3= <>
##$CPDPRG4= <mlev>
##$CPDPRG5= <mlev>
##$CPDPRG6= <mlev>
##$CPDPRG7= <mlev>
##$CPDPRG8= <mlev>
##$CPDPRGB= <>
##$CPDPRGT= <>
##$D= (0..31)
0 1 0 0 0 0 0 0 0 0 0 0.03 2e-05 3e-06 0 0 0 0 0 0 0 0 0 0 0 0 0 0 0 0 
0 0 
##$DATE= 1675950419
##$DBL= (0..7)
120 120 120 11 120 120 24 19 
##$DBP= (0..7)
150 150 150 150 150 150 150 150 
##$DBP07= 0
##$DBPNAM0= <>
##$DBPNAM1= <>
$$ [...]
##$SUBNAM3= <"">
##$SUBNAM4= <"">
##$SUBNAM5= <"">
##$SUBNAM6= <"">
##$SUBNAM7= <"">
##$SUBNAM8= <"">
##$SUBNAM9= <"">
##$SW= 501.771253377433
##$SWIBOX= (0..15)
0 1 3 0 0 0 0 0 0 0 0 0 0 0 0 0 
##$SW_h= 40650.406504065
##$TD= 32768
##$TD0= 1
##$TE= 0
##$TE2= 300
##$TE3= 300
##$TEG= 300
##$TL= (0..7)
0 120 53 12 22 120 120 120 
##$TP= (0..7)
150 150 150 150 150 150 150 150 
##$TP07= 0
##$TPNAME0= <>
##$TPNAME1= <>
##$TPNAME2= <>
##$TPNAME3= <>
##$TPNAME4= <>
##$TPNAME5= <>
##$TPNAME6= <>
##$TPNAME7= <>
##$TPOAL= (0..7)
0.5 0.5 0.5 0.5 0.5 0.5 0.5 0.5 
##$TPOFFS= (0..7)
0 0 0 0 0 0 0 0 
##$TUNHIN= 0
##$TUNHOUT= 0
##$TUNXOUT= 0
##$USERA1= <user>
##$USERA2= <user>
##$USERA3= <user>
##$USERA4= <user>
##$USERA5= <user>
##$V9= 5
##$VALIST= <valist>
##$VCLIST= <CCCCCCCCCCCCCCC>
##$VD= 0
##$VDLIST= <DDDDDDDDDDDDDDD>
##$VPLIST= <PPPPPPPPPPPPPPP>
##$VTLIST= <TTTTTTTTTTTTTTT>
##$WBST= 1024
##$WBSW= 4
##$XGAIN= (0..3)
0 0 0 0 
##$XL= 0
##$YL= 0
##$YMAX_a= 2613
##$YMIN_a= -2619
##$ZGOPTNS= <>
##$ZL1= 120
##$ZL2= 120
##$ZL3= 120
##$ZL4= 120
##$ABSF1= 248.5645
##$ABSF2= -253.2056
##$ABSG= 5
##$ABSL= 3
##$ALPHA= 0
##$AQORDER= 0
##$ASSFAC= 0
##$ASSFACI= 0
##$ASSFACX= 0
##$ASSWID= 0
##$AUNMP= <proc_1d>
##$AZFE= 0.1
##$AZFW= 0.5
##$BCFW= 0
##$BC_mod= 2
##$BYTORDP= 0
##$COROFFS= 0
##$CY= -3
##$DATMOD= 1
##$DC= 0
##$DFILT= <>
##$DTYPP= 0
##$F1P= 0
##$F2P= 0
##$FCOR= 1
##$FTSIZE= 65536
##$FT_mod= 6
##$GAMMA= 0
##$GB= 0
##$INTBC= 1
##$INTSCL= 6.047779e-11
##$ISEN= 30
##$LB= 1
##$LEV0= 0
##$LPBIN= 0
##$MAXI= 10000
##$MC2= 0
##$MEAN= 0
##$ME_mod= 0
##$MI= 50
##$NCOEF= 0
##$NC_proc= -8
##$NLEV= 6
##$NOISF1= 182.463
##$NOISF2= 159.3651
##$NSP= 0
##$NTH_PI= 0
##$NZP= 0
##$OFFSET= 248.5645
##$PC= 4
##$PHC0= -10962.75
##$PHC1= 16.21271
##$PH_mod= 1
##$PKNL= yes
##$PPARMOD= 0
##$PSCAL= 0
##$PSIGN= 0
##$REVERSE= no
##$SF= 81.0140089999694
##$SI= 65536
##$SIGF1= 159.3651
##$SIGF2= -187.1042
##$SINO= 113.3802
##$SIOLD= 16384
##$SREGLST= <1H.CDCl3>
##$SSB= 0
##$STSI= 65536
##$STSR= 0
##$SW_p= 40650.406504065
##$SYMM= 0
##$S_DEV= 0
##$TDeff= 32768
##$TDoff= 0
##$TI= <>
##$TILT= no
##$TM1= 0
##$TM2= 0
##$TOPLEV= 0
##$USERP1= <user>
##$USERP2= <user>
##$USERP3= <user>
##$USERP4= <user>
##$USERP5= <user>
##$WDW= 1
##$XDIM= 65536
##$YMAX_p= 296313689
##$YMIN_p= -189357743
$$ End of Bruker specific parameters
$$ ---------------------------------
##NTUPLES= NMR SPECTRUM
##VAR_NAME=  FREQUENCY,     SPECTRUM/REAL,   SPECTRUM/IMAG
##SYMBOL=    X,             R,               I
##VAR_TYPE=  INDEPENDENT,   DEPENDENT,       DEPENDENT
##VAR_FORM=  AFFN,          ASDF,            ASDF
##VAR_DIM=   65536,         65536,           65536
##UNITS=     HZ,            ARBITRARY UNITS, ARBITRARY UNITS
##FACTOR=    0.620285442955139, 1,           1
##FIRST=     20137.2065510682, 0,            0
##LAST=      -20513.1999529968, 0,           0
##MIN=       -20513.1999529968, -189357743,  0
##MAX=       20137.2065510682, 296313689,    0
$$ Real data points
##PAGE= N=1
##DATA TABLE= (X++(R..R)), XYDATA
$$ [...]
42513c002451K249682J3491410R975795m089501j0524407n343994o77462k625302
42505e46230l966856N37120N314479M069883q18768l334075k162853o4561J343897
42496C72036K500327L020590J006443l597919o438711k891528M070275M617087
42488B658600m888486j3624186q644370O467238J4632538P708161l892877p210431
42480f793813k841108Q13208J351559K281137L988044L178429k92448k473695
42472g88687j011545K321493M434905L695562R43924o64399J167133L729836J552675
42463A5380897n642796j1097719r415957k988203K463351M652110M074657R75349
42455a598311k985629l686985L28491M423358L783030K59880r92394N52577J020601
$$ y = [-3002451, -752769, 12738641, 22714436, 18624935, 8100528, 2756534, 2079072, -546230, -4513086, -3975966, 1338513, 5408396, 4589628, 1255553, -907300, -971861, 372036, 2872363, 5892953, 6899396, 3301477, -3137234, -6028762, -1958487, 2658600, -2229886, -15854072, -24498442, -18031204, -3398666, 4309495, 416618, -6793813, -9634921, -8821713, -7470154, -5189017, -1200973, 1977456, 1685008, -788687, -1800232, 521261, 4956166, 8651728, 9595652, 8931253, 10098386, 13828222, 15380897, 9738101, -1359618, -10775575, -13763778, -11300427, -6648317, -2573660, -1598311, -4583940, -8270925, -7942434, -3519076, 263954, 523834, -468560, 84017, 1104618]
42446A104618j026746k768798k067231k73541O14964P84258J540255K965437L579510
42437D452726K137368m22884j564730n15131K68047j072373k234824m90198J627334
42428B185335m39249m842857m641440J169919M858381J483012l216069j584384
42420e027352M342278O283108J734071l710508m809297k046598J346647L451509
42412A563858L976118L102674Q37928k953349p047119p827391k859589M062555
42404g144315N764421J183010k851571j813506K46061j179110k602223J176601
42396g220632O926901P275004K528343m07346J00369j264296n638660o430312
42388d130629m74281N196467L309654k751093m489621q55406J752015K53776j392480
$$ y = [1104618, 77872, -2690926, -4758157, -5031698, -4416734, -3632476, -2092221, 873216, 4452726, 6590094, 6167210, 4602480, 4087349, 4355396, 3283023, 1048199, 558001, 2185335, 1746086, -3096771, -7738211, -6568292, -1709911, -226899, -3442968, -5027352, -685074, 5598034, 7332105, 3621597, -1187700, -3234298, -1887651, 1563858, 5539976, 8642650, 9480578, 6527229, -519890, -8347281, -11206870, -7144315, -1379894, -196884, -3048455, -4861961, -4615900, -5795010, -8397233, -7220632, -293731, 6981273, 9509616, 9102270, 9202639, 7938343, 2299683, -4130629, -4604910, 591557, 3901211, 1150118, -3339503, -4194909, -2442894, -2189118, -3581598]
42379c581598J70548K395739J563007j478753l353926l082625j815594L11410
42371h871792L527723N631212L612974j528599m795714l227584N23969K138783
42363b989028J099285L14180J587017L424706L049865m26312m616998n638796
42355d196081k261812K102786L336858J891806J293299K072434J684458P05642
42347F629390L039033P649764O737798k947392j2568951j1609228k029882M978841
42339a20627L879650o44629k488815n89955K871769M758449K064805l994180o628576
42330h92109j997136L451803J487185m587946m376121L154740Q295648O353976
42322A0890040L572420M335885L376851l747125j1355479j1546126n107534J274517
$$ y = [-3581598, -3411050, -1015311, 547696, -931057, -4284983, -7367608, -9183202, -8871792, -5344069, 287143, 3900117, 2371518, -2424196, -5651780, -5127811, -2989028, -1889743, -1575563, 11454, 3436160, 6486025, 6059713, 1442715, -4196081, -6457893, -4355107, -1018249, 873557, 2166856, 4239290, 5923748, 6629390, 9668423, 17318187, 24055985, 21108593, 8539642, -3069586, -5099468, -120627, 3759023, 3114394, 625579, 35624, 2907393, 7665842, 9730647, 5736467, -892109, -2889245, 562558, 2049743, -2538203, -6914324, -3759584, 4536064, 10890040, 14462460, 18798345, 22175196, 18428071, 7072592, -4473534, -9581068, -8306551]
42314h306551L665026K186773j298856k900591P79488O420327N858897k484526
42306C919987j0002456r133578k119577M609255Q017655P108519J517969m520011
42298f02237m433760M83980J547530k701439k853368M554110Q542038J217425
42290E754279p593854n438277K619902L306435k599859l247819L018502N579811
42282A399120J97354m939884l540391Q14686L396841M422276M142681J338027
42274G230710j292949R39885N792142N733932n8071m191534l208831k134696m300882
42265D509706n498498k196786J821579J476720k251845m399787j671585N218648
42257b991848J1013075Q588832k375385j1103902p447287L524487P554298J115383
$$ y = [-8306551, -4641525, -2454752, -3753608, -6654199, -5874711, 545616, 6404513, 3919987, -6082469, -15216047, -17335624, -12726369, -4708714, 2399805, 3917774, -602237, -5035997, -4552017, -3004487, -5705926, -8559294, -4005184, 4536854, 5754279, -1839575, -7277852, -4657950, -1351515, -3951374, -7199193, -4180691, 1399120, 1596474, -3343410, -6883801, -6069115, -2672274, 1750002, 5892683, 7230710, 5937761, 6877646, 12669788, 18403720, 18345649, 14154115, 10945284, 8810588, 4509706, -988792, -3185578, -1363999, 112721, -2139124, -6538911, -8210496, -2991848, 8021227, 16610059, 14234674, 3130772, -4316515, -792028, 6762270, 7877653]
42249G877653n165427l881423q7527K69598o0232K416510L781570j01445n067705
42240a8428m571073N87974M477451M329563J925971j30519k22163J029082k38130
42231G169728o363695j1784230q089488L116066J0339668P764399K083187J60737
42223D396372n52817l490999m304465R39868O350444M334000k180960m641525
42215H49918j855228N97507O11554O81195J110212J09195q97451P87626L331642
42206E326170K957838N27841o74007j302221l376917m162214m92551L193163K57033
42197B254135n941665n291176L057911Q138482L197592n250416q400172o365660
42189a4600969l135247J414155P295442R023577L217549l078559j190336M910069
$$ y = [7877653, 2712226, -1169197, -1256724, -987126, -1047358, 1369152, 5150722, 5049277, -18428, -4589501, -4001527, 475924, 4805487, 6731458, 6600939, 6378776, 7407858, 7169728, 806033, -10978197, -19067685, -15951619, -5611951, 2152448, 4235635, 4396372, 3843555, 352556, -3951909, -3012041, 3338403, 7672403, 5491443, 849918, -1005310, -407803, 203751, 884946, 1995158, 2104353, 1206902, 1994528, 5326170, 8284008, 8811849, 8137842, 6835621, 3458704, -703510, -1196061, 1997102, 2254135, -3687530, -8978706, -5920795, 2217687, 5415279, 164863, -8235309, -14600969, -17736216, -16322061, -9026619, -3042, 3214507, 135948, -1054388, 3855681]
42181C855681L578582n796276j0509762l933789L974557K424984l338195j410246
42173a1154464O584294P728898j110680p811577l666393M282162N638967J576763
42165B067970o58964l75811j223387j992016O06463L823432K986932N08295J253398
42156F996312K155215k730143r221303p411674J481835N657816J456880j614244
42148c229306K283815O522619M969083J340580n13994l650675q145021o298199
42140f721098L177734P798102o28828j0844163q094592L207084P350130J794727
42132b960904j814651J841765N546156L951858O87709q15381k257957l900523
42124B78072k702642P92794K076265O00215K06716J079220l34063k965389j852348
$$ y = [3855681, 7434263, 1637987, -8871775, -12805564, -8831007, -6406023, -9744218, -11154464, -4570170, 3158728, 2048048, -5763529, -9429922, -5147760, 491207, 2067970, 1409006, 1033195, -190192, -2182208, -1575745, 2247687, 5234619, 5742914, 6996312, 9151527, 6421384, -2799919, -10211593, -8729758, -3071942, -1615062, -3229306, -945491, 5577128, 10546211, 11886791, 11372797, 7722122, -422899, -6721098, -3543364, 4254738, 3625910, -7218253, -15312845, -12105761, -4755631, -2960904, -4775555, -2933790, 2612366, 6564224, 7251933, 6436552, 4178595, 278072, -2424570, -1631776, 444489, 1044704, 1251420, 2330640, 1996577, -968812, -2821160]
42115b821160J897922J600167k789899l073047L447322Q477253N470597j043650
42107A1165505l979770l394744k123209O28244N023992O637454L299988J762N88968
42098A7848190P29957l586727o832135k577924L522570P50758q603237j0260715
42090i009263J219422J3600305J3646257L826932m179715n997735o392110q337098
42082a623005q951966n919388q12233M645834R395613R552605J579888q791974
42074i24626r258319K188444J1019844M892900q079775j0635842j379324M895050
42066g281648P65234m538031k292463L169250M919540M102172K864939j774814
42058f5821q421445p162622M334235J1457182K591138j0932252j0249894K820138
$$ y = [-2821160, -923238, 676929, -2112970, -5186017, -1738695, 6738558, 12209155, 11165505, 7185735, 3790991, 1667782, 2296026, 7320018, 13957472, 17257460, 17259222, 17848190, 18578147, 14991420, 8159285, 5581361, 9103931, 9854689, 1251452, -9009263, -7789841, 5810464, 19456721, 23283653, 19103938, 13106203, 6714093, -1623005, -10574971, -16494359, -17306592, -12660758, -3265145, 6287460, 7867348, -924626, -10182945, -7994501, 3025343, 7918243, -161532, -10797374, -12176698, -7281648, -6516414, -11054445, -13346908, -10177658, -5258118, -1155946, 1708993, -65821, -8487266, -15649888, -11315653, 141529, 2732667, -8199585, -18449479, -15629341]
42050a5629341J0079879N009811j532154k223081j816958l231464j903260K444850
42042h801718L339177N81874J541521N954031M352752m056811p699153k515667
42034g303994Q16462k959902l520453M583897Q558717j081218j0864214m161522
42026a5932227J1115582J4369224L893288l806955j830236M68943k062618k742877
42018C472124J253623K492624k500729o559547m556611o99580J520110M892123
42010f85863Q837575N996968m618427j1622788o666551K899257N520378K031712
42002A692261R76306L258023K601443j457297k130844K454963N024375K06555
41994A2625785o925920p835470k187913K107462m99428o208591o671180Q11627
$$ y = [-15629341, -5549462, -539651, -2071805, -4294886, -6111844, -9343308, -11246568, -8801718, -5462541, -4880667, -3339146, 2614885, 6967637, 2910826, -4788327, -7303994, -6487532, -9447434, -12967887, -8383990, 174727, -906491, -11770705, -15932227, -4816645, 9552579, 13445867, 9638912, 7808676, 8277619, 6215001, 3472124, 4725747, 7218371, 4717642, -1841905, -6398516, -7098096, -5577986, -685863, 8151712, 14148680, 9530253, -2092535, -8759086, -5859829, -339451, 1692261, 2668567, 5926590, 8528033, 7070736, 4939892, 7394855, 12419230, 12625785, 5699865, -2135605, -4323518, -2216056, -2715484, -8924075, -15595255, -14783628]
41986a4783628R842861J2070816O215808j563811n245665m375812k057340n48111
41978d44882k59790r53103j924948j968836n61382J492131L226562M274314M021556
41969F901622J843345p26714k58205L849833O574306K554317o185133j1415605
41961C137766q563997k038381J169458p1774k080252k882055k969277j344629
41953a5643141L263997P449370N914735M32842j040383L151656M654100j280318
41945F902858o764074l724638K136729O42795n315255m872392J262462J688641
41937h042874m846577n804271L417158R861588L634175n475831l449269O401352
41929d304549J0275688N039383n22110j105744O11353K186450L305925J484858
$$ y = [-14783628, -4940767, 7130049, 13345857, 11782046, 6536381, 2160569, 103229, -444882, -704672, -1657775, -3582723, -5551559, -6112941, -4620810, -1394248, 2880066, 6901622, 8744967, 8018253, 7760048, 11609881, 18184187, 20738504, 14553371, 3137766, -5426231, -7464612, -6295154, -6366928, -8447180, -11329235, -14298512, -15643141, -12379144, -4929774, 984961, 1417803, 377420, 3529076, 8183176, 6902858, 138784, -3585854, -1449125, -806330, -6121585, -10993977, -9731515, -8042874, -12889451, -18693722, -15276564, -5414976, -1780801, -7256632, -10705901, -4304549, 5971139, 11010522, 10488412, 9382668, 9994021, 12180471, 15486396, 16971254]
41921A6971254m362647q265394m669679J088055K19783m189503j591992P084057
41913B283934Q578853j963209j2187282j0023806M45105P616879Q602549Q482050
41905A1835073Q539523M239383n599331j3946170j2391964j332145Q600872P168328
41897G113569l299467r857033m952582M307730P026524L216527O15021J232224
41889E402513M07604k745155l694603j212125J126817K484978N173506P095354
41881A4038889K922801n775062j0417984p394827k039057Q36473J940319J776060
41873d112388q98048l219864l64007M769657M281046o67382m77593N569114O487168
41864A1367703r61385m988197Q29473M752425l612631j3961848j0402231L437910
$$ y = [16971254, 12608607, 4343213, -326466, 761589, 981372, -3208131, -4800123, 2283934, 10862787, 8899578, -3287704, -13311510, -12866405, -5249526, 3353023, 11835073, 20374596, 24613979, 19014648, 5068478, -7323486, -8655631, -54759, 7113569, 3814102, -6042931, -10995513, -6687783, 338741, 3555268, 4170289, 5402513, 5810117, 3064962, -629641, -1841766, -714949, 1770029, 6943535, 14038889, 16961690, 11186628, 768644, -6626183, -8665240, -7828767, -5888448, -4112388, -5010436, -8230300, -8594307, -3824650, 456396, -210986, -688579, 4880535, 11367703, 10406318, 5418121, 6247594, 11000019, 7387388, -6574460, -16976691, -13538781]
41856a3538781J0292969M477745l760708n575729j612689M806175J0227730Q863138
41848A4179850o94074q844327o229488J464862K082631l047626k280134M847347
41840A479041N759092l373733r999253m965541L753796M768016j77955j894301
41832d650838J828297N560363N012181M86588m710820n862981j077650M372186
41824I57326L533282j661189k870270P96106J319396l323325m343917K362667
41816c229924P419051K835081m572208m731671n48289r00270m405947l311360
41808a1445537J058710P11593l177097j043428P597099J1095154L868363m263086
41800D401771k956949L964449N994524J148969l994883m993780l022505p3443
$$ y = [-13538781, -3245812, 1231933, -2528775, -8104504, -9717193, -4911018, 5316712, 14179850, 13485776, 4641449, -1588039, -123177, 1959454, -1088172, -3368306, 1479041, 7238133, 3864400, -6134853, -11100394, -7346598, -2578582, -2756537, -4650838, -2822541, 2737822, 7750003, 8236591, 3525771, -2337210, -3414860, 957326, 4490608, 2829419, -40851, 755255, 2074651, -1248674, -5592591, -3229924, 4189127, 7024208, 2452000, -2279671, -2827960, -3728230, -8134177, -11445537, -10386827, -9675234, -12852331, -13895759, -6298660, 4796494, 8664857, 4401771, 1444822, 5409271, 11403795, 12552764, 8557881, 3564101, 541596, 468153]
41792D68153L038454M614498K750366j685475n387126n767386k721771J249445
41784c440842K065208j919408o038102l595319M196060P826364K597936l539882
41776a847985j239297N887293O353243k124138r630051q338793j478616L643930
41768h774414M073624L50404n487045p997779j772180R096698J2204746K933319
41760D627373p502304o902552J305047M759397M43054l719636k745148K69326
41752i465443K253922L780358L979752O72601l311201k242614K900435N210986
41744C778796L223159K322486L403622Q14932n282394o179766K31279L356773
41736E668887k887430q009521j310569R163426Q156997k502362o930296l92781
$$ y = [468153, 3506607, 8121105, 10871471, 9185996, 3798870, -1968516, -4690287, -3440842, -1375634, -3295042, -9333144, -12928463, -8732403, -906039, 1691897, -1847985, -3087282, 2800011, 9153254, 7029116, -2600935, -10939728, -12418344, -8774414, -4700790, -4350386, -9837431, -17835210, -19607390, -10510692, 1694054, 4627373, -2874931, -9777483, -8472436, -3713039, -3269985, -6989621, -9734769, -9465443, -7211521, -3431163, 548589, 1221190, -2090011, -4332625, -1432190, 3778796, 7001955, 9324441, 12728063, 13542995, 8260601, 2080835, 2312114, 5668887, 2781457, -5228064, -6538633, 2624793, 10781790, 8279428, 1349132, 956351]
41728I56351M424301j422781r835625r307491j180720M986150N081581K227058
41720d071176o02688l035101m266140k748996J016417M038609L589385o3159l308285
41711i451134k260513K643103O354280N186131J207364j508840k299788k265302
41703b394699m12971L546462N177921M53066o331544o498184R98849P749846O943837
41694I232583O34721n016503o382323l149934K260979M703767P14802n717495
41686b719403o631740n78627N417345N755674K714448R38050Q02137L49214m55220
41677E591878p51224j079454j954756k297949r76865J763169M678482N508683
41669A0481964J999405l972004n784272m81555M982874K666128l881613n056263
$$ y = [956351, 5380652, 3957871, -5877754, -15185245, -16365965, -11379815, -6298234, -4071176, -4673864, -7708965, -11975105, -14724101, -13707684, -9669075, -6079690, -6142849, -9451134, -11711647, -9068544, -2714264, 2471867, 3679231, 2170391, -129397, -2394699, -2807670, 738792, 5916713, 6369779, 38235, -6459949, -5461100, 2288746, 9232583, 9867304, 4850801, -1531522, -4681456, -2420477, 2283290, 2998092, -2719403, -9351143, -9929770, -4512425, 1243249, 3957697, 4895747, 5697884, 6047098, 5591878, 4840654, 3761200, 1806444, -491505, -1468370, 294799, 4973281, 10481964, 12481369, 8509365, 2725093, 2243538, 7226412, 9892540, 6010927, 954664]
41661I54664j323788k269676q739913r260251R39418J0031214O878615k244078
41653e033795m223256J626952N677566L681520l83556l407892n087528l483564
41645a0633553K017222N524821J511072n042473m650154J861079M404213m99523
41637e507296m915181k420465L224329N513063L718628M21152l005875m772498
41629g744143k229152L192036N556226K542272p76306l0202J453942j281741n809312
41620e126380n582339k60255L504586J744551j707236j465608K049872M286064
41612b556745L305805J659490J891729K958491K350145J73050r83428j10263M32578
41603I120852j527279l932016k238488M339613J0000849P622871k862320j2804205
$$ y = [954664, -369124, -2638800, -11378713, -20638964, -19699546, -9668332, -2789717, -5033795, -9257051, -7630099, -1952533, 1728987, 1345431, -2062461, -7149989, -10633553, -8616331, -3091510, -1580438, -6622911, -11273065, -9411986, -5007773, -5507296, -10422477, -12842942, -9618613, -4105550, -386922, 34230, -2971645, -7744143, -9973295, -6781259, -1225033, 1317239, 540933, 510731, 1964673, 682932, -5126380, -10708719, -10968974, -7464388, -5719837, -7427073, -8892681, -6842809, -2556745, 749060, 2408550, 4300279, 7258770, 9608915, 9781965, 8798537, 8688274, 9120852, 7593573, 3661557, 1423069, 5762682, 15763531, 23386402, 20524082, 7719877]
41595G719877j3201975m618052L152895K225518m329830o487985O88449J1372299
41587c478804J5497767R300154j207202o638283l955467O10395m39965n880738
41579C807857p455049k027765L539807K946543M2374J672536N671862M628902
41571A2827067q96108k895519L21998J221865l548643o766674k736505K665028
41563A92509J123414m944586o227079k43280O093829O645664K929914K81981R44888
41554F797254K360403J184115j877265k620325K25611K002928q25315l775081
41546C472325o78005N395412N782876k4902l868498k953011l697577q492456r612322
41537a4676158k177874O311593O671725Q31916l090597k253918P33359L368972
$$ y = [7719877, -5482098, -10100150, -6947255, -4721737, -9051567, -15539552, -14851103, -3478804, 12018963, 21319117, 20111915, 13473632, 9518165, 10128560, 9688595, 3807857, -3647192, -5674957, -2135150, 811393, 853767, 2526303, 8198165, 12827067, 11930959, 9035440, 9357438, 10579303, 7030660, 263986, -2472519, 192509, 1315923, -3628663, -9855742, -10099022, -4005193, 2640471, 5570385, 5852366, 6797254, 9157657, 10341772, 8464507, 5844182, 6069793, 8072721, 7247406, 3472325, 2794320, 8189732, 13972608, 13947706, 10079208, 7126197, 3428620, -5063836, -14676158, -16854032, -10542439, -3870714, -3038798, -6129395, -8383313, -7649954, -4280982]
41529d280982L533732K011l085503O65721Q583874R791626J786423m763618l593201
41520H640083k481926p063082q812335r29747O910459M127366k198534n50960
41512b358676M024511N29688n765799k390210O059671M872841m068845n631530
41504d728349P45177P29602o769303o095365O140674J2782894M679124m844755
41496B639699m031584n04642l130182n095183Q83800O777596L627914j971473
41488h04055o35292K575864j246614p289440n361447K133049M989132J711581
41480c927222j668437l450446m966584l244706L345743P678930L498292l022247
41472e756677k599312K028144K264654n25609J352710O302470N236335k313016
$$ y = [-4280982, -747250, -745239, -3830742, -3165021, 5418853, 15210479, 16996902, 12233284, 8640083, 6158157, -904925, -9717260, -10647007, -3736548, 390818, -1807716, -2358676, 1665835, 2195523, -3570276, -5960486, 99185, 4972026, 903181, -4728349, -3983172, -3253570, -10022873, -16118238, -9977564, 2805330, 7484454, 2639699, -1391885, -1896527, -5026709, -10121892, -9238092, -2460496, 1167418, -804055, -1439347, 1136517, -110097, -7399537, -12760984, -10627935, -5638803, -3927222, -5595659, -9046105, -14012689, -17257395, -13911652, -6232722, -2734430, -5756677, -8355989, -6327845, -4063191, -4588800, -3236090, 3066380, 8302715, 5989699]
41464E989699o503537k155047M846639O972390K926032l733453p387252l688917
41456b733446L943650N243255k713507q293325j548757Q925600P903760k667969
41448H059261o829118J13085N361324O0333p516568o050432K419055P238115L596561
41439F451616l495815n978890n75100P547272R157811K265640l788232r24976
41431A0659326N156499L429691n077803r162952n071176m15445j14117l41656
41423i37633J404935J629624n63307q84066O24338j749047p180581o290594K929667
41414a1016664Q705632K912606n646626n188982R61922J825678k633571l288081
41406a3368086J600957M482594K244090J98523J389480K187995P25728N38918
$$ y = [5989699, -513838, -2668885, 2177754, 9150144, 12076176, 8342723, 955471, -2733446, 1210204, 6453459, 3739952, -4553373, -6102130, 2823470, 10727230, 8059261, 1230143, 1343228, 6704552, 6764885, -751683, -6802115, -4383060, 2855055, 6451616, 2955801, -3023089, -3598189, 3949083, 13106894, 15372534, 11584302, 10659326, 15815825, 19245516, 14167713, 5004761, -66415, -481860, -595977, -937633, 467302, 2096926, 1533619, 649553, 1273891, -475156, -7655737, -13946331, -11016664, -2311032, 601574, -5045052, -10234034, -9272112, -7446434, -10080005, -13368086, -11767129, -7284535, -5040445, -4841922, -3452442, -1264447, -538719, 199]
41398A99K659440K391130j813565l744115P57007N622707L154935l564381m814735
41389F48622J148915N805983L265849k149909m018172l035708l388712m557766
41381f280898k755902J741364M616508M257411L272695L119748K114064l37061
41373I747929j986622j624495q63760p38484k12319O49001j37380k551780l485338
41364a203248j165610K629363N640992O592496L413107m556706j1721676j0175593
41356a0546875p41146O504445N512616J088948p74611j206363k144726k92457
41348b600169N439322Q049827K546466m449876m228126O21505J948786k03484
41340G124251l03582P04743k064379n898097l642055K985578N023085P93658k401682
$$ y = [199, 2659639, 5050769, 3237204, -506911, 250096, 5872803, 9027738, 5463357, 648622, 1797537, 7603520, 10869369, 8719460, 4701288, 1665580, -1723132, -6280898, -9036800, -7295436, -2678928, 1578483, 4851178, 7970926, 10084990, 9747929, 7761307, 6136812, 5273052, 4534568, 4322249, 4971250, 4833870, 2282090, -1203248, -2368858, 260505, 5901497, 12493993, 15907100, 11350394, -371282, -10546875, -11288021, -4783576, 729040, 1817988, 1043377, -162986, -2307712, -2600169, 2839153, 10888980, 13435446, 8985570, 4757444, 5378949, 7327735, 7124251, 6820669, 7525412, 5461033, -437064, -4079119, -1093541, 3929544, 4723202, 2321520]
41331B321520r43945J777332M305130P639709P156074k596920j3892141j1386670
41323e619911M440940J4008870N247228r809863j3228061m119374O040015J0618081
41315G577925R708063L273126o252784j0542299n174966J778277O23153n046507
41307d056012m489740K625459N793948K1220p208587o844086P50655P562453O669646
41298H24956j198597p661860n128936L214987O561266K015710o72840M605866
41290B560552Q469717O88718j0875754j0158814J948093Q257948J725876m885223
41282b268887p07571O723646N707562p37677k072799J574291J295874m543527
41274D970912q515876p190205m636909k447769K583376Q402403O511310l771147
$$ y = [2321520, 1377575, 3154907, 7460037, 15099746, 22255820, 19658900, 5766759, -5619911, -1178971, 12829899, 18077127, 8267264, -4960797, -9080171, -3040156, 7577925, 17285988, 20559114, 14306330, 3764031, -1410935, 367342, 990495, -4056012, -8545752, -5920293, -126345, -105125, -7313712, -14157798, -13407143, -5844690, 824956, -373641, -8035501, -13164437, -9949450, -3388184, -1372474, -2045314, 2560552, 11030269, 11718987, 843233, -9315581, -7367488, 890460, 2616336, -2268887, -2976458, 3747188, 9454750, 8717073, 6644274, 8218565, 9514439, 4970912, -3544964, -10735169, -15372078, -17819847, -15236471, -6834068, -322758, -4093905]
41266d093905r855445k863795P777839P069763l422233q201825r74449P357127
41258g206923O097403r49161l793573l63925M069799N595932L822630j32272k887443
41249D252467m60937N079696N856673n13873o056540m218042M91377J453267R06924
41240F791012K902203K854751l903421r244113k507447R665964R903388l320611
41232A3141726j1916307m567013Q176660J1441090N513478l99747l205543n430889
41224A2753455p197064p125808o191837m763918j006851L469098K953931k913407
41216a0022401o251056k371960L209076M129201J754731o17019l330090m316479
41208a7815997K473160J4600927J7359002L232789j3532763j4362351j672046
$$ y = [-4093905, -13949350, -16813145, -9035306, -1965543, -5387776, -13589601, -14564050, -7206923, -1109520, -2058681, -5852254, -6216179, -2146380, 3449552, 7272182, 7139910, 4252467, 3791530, 8871226, 14727899, 14214026, 8157486, 3939444, 4430821, 5884088, 6791012, 9693215, 12547966, 8644545, -599568, -3107015, 6558949, 16462337, 13141726, 1225419, -3341594, 4835066, 16276156, 21789634, 21389887, 18184344, 12753455, 5556391, -1569417, -7761254, -12525172, -13532023, -10062925, -7108994, -10022401, -16273457, -18645417, -15436341, -11307140, -9552409, -10169428, -13499518, -17815997, -15342837, -741910, 16617092, 19849881, 6317118, -8045233, -9717279]
41201i717279O779467M091177l3740J732746M257152J384505m128755o508209
41193b142936n012722k353215k42634J186969K908213O015238Q462520N365764
41185A4187197l401761r780312p335799m77025K691473K208558K921559L898707
41177D912597J192928k217340n04567L017839J23706o639610n619788M635787
41169a098448J0795114M150593o942379j0496213o946276l966025l006952n1321
41161a7561907M690747O319427L094144j198648k421846j42638K873222L256085
41153a091414K89858k578061j456099K639757N124869M392601K944283J785213
41145A2051007j217898n933524p896480m257192J868183N375425M712537J968118
$$ y = [-9717279, -2937812, 1153365, 1119625, 2852371, 7109523, 8494028, 4365273, -2142936, -7155658, -9508873, -9751507, -8564538, -5656325, 358913, 8821433, 14187197, 10785436, 1005124, -6330675, -6807700, -4116227, -1907669, 1013890, 4912597, 6105525, 3888185, 3383618, 6401457, 6525163, -114447, -5734235, -1098448, 9696666, 13847259, 6904880, -3591333, -10537609, -14503634, -17510586, -17561907, -12871160, -6551733, -3457589, -4656237, -7078083, -7220721, -4347499, -1091414, -801556, -3379617, -4835716, -2195959, 2928910, 7321511, 10265794, 12051007, 10833109, 4899585, -2996895, -7254087, -5385904, -10479, 4702058, 6670176]
41137F670176J93739J496309M899414N895843J471280m813580o934600m865710
41129D012871l510594l723982j487474K999017L408587k238164o483618k834926
41121i858283M487841O914739L338565m28659j163015j127759k340984k986770
41113c164325n02286M222365O725011L261960l840238o473422J23058R249201
41105I601324R176862j323672j0149736p605345J120184M349626j02280m292435
41097G74528l078981j87269n82464k751353j651905L550327P800731N921357j425531
41088H369440q050005q265858k169199N074792Q198324N578802l85699n118725
41080C231872n330799k234450P7695N85745K559580O438874O093837k330677j1547519
$$ y = [6670176, 6863915, 8360224, 13259638, 19155481, 20626761, 15813181, 8878581, 4012871, 502277, -3221705, -4709179, -1710162, 1698425, -539739, -7023357, -9858283, -5370442, 1544297, 4882862, 4454203, 3291188, 2163429, -177555, -3164325, -3666611, 555754, 7280765, 10542725, 6702487, 229065, 352123, 9601324, 18778186, 17454514, 7304778, -300567, 819617, 5169243, 5066963, 774528, -2304453, -2491722, -3074186, -5825539, -7477444, -3927117, 3873614, 9794971, 8369440, 319435, -7946423, -10115622, -5040830, 3157494, 8736296, 8350597, 3231872, -2098927, -4333377, -4255682, -3669937, -1110357, 5328517, 11422354, 9091677, -2455842]
41071b455842j0927521j629329M692652K586508r11902R47709M596632L791570
41063F90477O9798o58619K679910O044704O072570K213884l716632p336135n167607
41054H92350o25949r20875n260939l738823O937405J4827025Q252811o513177
41046A3849828j3332002p899687m02921J429930K94073j79533j462352l396380
41038a1099044j274059N300653Q620455L888268k462625k145205K431622K678473
41030E938538k351483n082941j741720K473740K259609o28991k374134l426340
41022d933722n057875m313890J089285N804522K749509m749783n668022J948138
41014a3131838O557724P90822n851077j362987Q923887R775825n2933o103642
$$ y = [-2455842, -13383363, -15012692, -10320040, -7733532, -8645434, -7697725, -3101093, 690477, 760275, 101656, 2781566, 8826270, 14898840, 17112724, 13396092, 6059957, 892350, 266401, -654474, -5915413, -9654236, -2716831, 12110194, 20363005, 13849828, 517826, -7381861, -7784782, -6354852, -6060779, -6240312, -7702664, -11099044, -12373103, -7072450, 1548005, 5436273, 2973648, 828443, 3260065, 5938538, 3587055, -1495886, -3237606, -763866, 1495743, 866752, -1507382, -4933722, -9991597, -14305487, -13216202, -7411680, -4662171, -9411954, -15079976, -13131838, -6574114, -5783292, -11634369, -12997356, -4073469, 5702356, 5649423, -454219]
41006d54219j396615L669551K0626n245543k139205M969844N380267N0542j361082
40997C494166K510519L446778j725024o746949o917379m414446j289053L415268
40989h226120P475540N564008j296092m649001q12515L480902J938695k178572
40981A296845k959446j002353L48334J717048L817888K552897l905855p807537
40973e942179j209270R978594J1762301J690410p656695o903974j640035j268261
40965a189109m838294n350653k244705r12038k390834j931852K016634M500320
40957a2340531J883748k181397j824617K944132O346401M036091j943761n485730
40949h565664k879572L414724P685919P171771L857736K83692l352340o531082
$$ y = [-454219, -1850834, 1818717, 1839343, -3406200, -5545405, -575561, 4804706, 4855248, 3494166, 6004685, 9451463, 7726439, 979490, -5937889, -10352335, -11641388, -8226120, -750580, 4813428, 3517336, -1131665, -1944180, 1536722, 3475417, 1296845, -1662601, -2664954, -2316620, -599572, 3218316, 5771213, 1865358, -5942179, -7151449, 2827145, 14589446, 16279856, 8623161, 1719187, 79152, -1189109, -6027403, -11378056, -13622761, -14534799, -16925633, -18857485, -16840851, -12340531, -10456783, -12638180, -14462797, -11518665, -5172264, -1136173, -3079934, -8565664, -11445236, -8030512, -344593, 6827178, 10684914, 10968606, 7616266, 1085184]
40941A085184o567846k761635O16037k13074k480597j227829K452413L529229
40933e568118J805886J447633K324249L2500m430163l825054L437904Q852607
40925D077444N753301j586505n695582n708072l945156K07400O247093Q571755
40917G921678L813931k994135o048136o638590o836342k945210N976479J0901406
40909C151081N257486k428339j026146M579391K333490m993443m482093K990663
40901E382090L198356o197112j1021464n304090o44103l772825m292900M733214
40893a7918834J2013942P178900j012620o64333K807870j126233p281595m589023
40885a0591926K381984J343111m614374k239989O913175P692602k146059p050576
$$ y = [1085184, -5482662, -8244297, -7628260, -7841334, -10321931, -11549760, -9097347, -5568118, -3762232, -2314599, 9650, 42150, -4388013, -8213067, -4775163, 4077444, 9830745, 8244240, 2548658, -3159414, -7104570, -6897170, -650077, 7921678, 11735609, 8741474, 2693338, -3945252, -10781594, -13726804, -7750325, 3151081, 8408567, 5980228, 4954082, 9533473, 11866963, 6873520, 2391427, 5382090, 8580446, 2383334, -8638130, -13942220, -14586323, -18359148, -22652048, -17918834, -5904892, 1274008, 261388, -402945, 2404925, 1278692, -6002903, -10591926, -8209942, -6866831, -11481205, -13721194, -6808019, 884583, -1261476, -8312052]
40877h312052N29944Q033166L946982m603813n297556M00023K705964r4032j492794
40868d184168J243332L909120K883727j74890j159898J685081N443158M989915
40860A4635377k74107l858325o76790L975812R24096q211468j1701787m757027
40852i944219L326112L300403j156145j289365K455256K391480l252318p405003
40844a1573799m699503J225857L240144P0673k724193l15235N278520Q045462
40836a452074N750300J855616n96545k771022n405772n220303p16585K619343
40828e937042l76047n000684k606990N330121Q320981K753627k895507j726991
40820b138532J795517Q85315k500755k541941J36853P00947p53991R1828L319636
$$ y = [-8312052, -7782108, 251058, 4198040, -405773, -5703329, -5303306, -2597342, -2691374, -4184168, -2940836, 968284, 3852011, 3677121, 2517223, 4202304, 9645462, 14635377, 14361270, 10502945, 9826155, 13801967, 14726063, 6514595, -5187192, -9944219, -6618107, -3317704, -4473849, -5763214, -3307958, -916478, -4168796, -11573799, -16273302, -15047445, -11807301, -11736628, -14460821, -14776056, -9497536, -1452074, 4298226, 6153842, 5557297, 2786275, -2619497, -7839800, -8556385, -5937042, -6313089, -11313773, -13920763, -8590642, -269661, 2483966, -411541, -2138532, -343015, 542300, -1958455, -4500396, -4363543, -3662596, -4416587, -4324759, -1005123]
40811a005123M034751N45442k559923j358764J667724J539247k170092n224000
40803d530738m703615j999954P70067M190471Q619409J0153190M561062m837310
40795A2222582r214548o168470l233592n543468o962950n49051Q126242P991513
40787c331742n38786o503431n147393k278738j174834K541680R238768J0356330
40779C161854J954998o459568m945684K468778N129015J572677j377145j109946
40771C94979q87483j046890J602384N258186L032185n915125j2304369q250246
40763a8116379J687622O085727J447384l725554q66201O637753P713745q98510
40755c4413r095323o395548M214623J1003944Q983495L497006k98414l097093
$$ y = [-1005123, 3029628, 3575070, 1015147, -343617, 1324107, 2863354, 693262, -4530738, -9234353, -11234307, -10464240, -6273769, 2345640, 12498830, 17059892, 12222582, 3008034, -3160436, -6394028, -11937496, -18900446, -19449497, -11323255, -3331742, -3870528, -10373959, -15521352, -17800090, -18974924, -16433244, -7194476, 3161854, 5116852, -1342716, -6288400, -3819622, 1309393, 2882070, 1504925, 394979, -492504, -1539394, 62990, 5321176, 8353361, 2438236, -9866133, -18116379, -16428757, -10343030, -8895646, -12621200, -13487401, -6849648, 864097, -34413, -9129736, -15525284, -11310661, -306717, 8676778, 12173784, 11875370, 8778277]
40747H778277n527027m932801j247986J004293K99141J175594N651357Q068970
40739A3269818L571982l995190q042384p895364o061094k150837M003422P624899
40731C25252M483879j792329m212523j813147R78197J757787J526687J066677
40723B320480P18120J188201Q94921l239136q586949o934598K515564Q041553
40715c081844J832613o197333k610146P925639R657851Q20885m545032O4121M829079
40706H695833J793793l300261l673675k754495m714841n024136L61154N566307
40698c050321M112869J03063M89989K726697L56541m193700l251477K654724N439771
40689E388156K408766r49527j184168j183208k892797l295243k77505L039044
$$ y = [8778277, 3251250, -1681551, -2929537, -1925244, -1626103, -450509, 5200848, 13269818, 16841800, 12846610, 4804226, -3091138, -9152232, -11303069, -7299647, 325252, 4809131, 3016802, -1195721, -3008868, -2030671, -272884, 1253803, 2320480, 3038600, 4226801, 5121722, 1882586, -6704363, -13638961, -11123397, -3081844, -1249231, -7446564, -10056710, -2131071, 7526780, 8347665, 3802633, 3866754, 8695833, 10489626, 7189365, 3515690, 761195, -3953646, -8977782, -8616628, -3050321, 1062548, 1165611, 1655600, 4382297, 4738838, 545138, -2706339, -51615, 5388156, 7796922, 6847395, 5663227, 4480019, 1587222, -1708021, -1985526, 1053518]
40681A053518K703392p24680l121019j147062M470527Q350415M826688m506037
40673A1905742j0304591o465245J394167L787455P44588K8860L639059N087168
40665I817203J219877k175239k28959K990110J433968l516621o120673m729838
40657a310172j866819J014035L598859L871580M07880l819839m558254k257688
40649d920418p57006r73689l81141J651208K600338J334788j75142n89772j020750
40640c231584k040051k277866j404386j310628k463902j963057K248770P214838
40632e227866P865363L500176q56822p4055M981971P755898L286593m852109p361729
40623I017420j064845M887185m02431j3806800j9670261r162578Q035161J5799007
$$ y = [1053518, 3756910, 3032230, -88789, -1235851, 3234676, 11585091, 16411779, 11905742, 1601151, -4864094, -3469927, 317528, 1062116, 1090976, 4730035, 9817203, 11037080, 8861841, 8632882, 11622992, 13056960, 9540339, 3419666, -1310172, -3176991, -2162956, 1435903, 5307483, 5715363, 1895524, -2662730, -4920418, -5677424, -6651113, -7032254, -5381046, -2780708, -1445920, -1621062, -2210834, -3231584, -5271635, -7549501, -8953887, -10264515, -12728417, -14691474, -12442704, -5227866, 2637497, 6137673, 5280851, 5206796, 10188767, 17944665, 21231258, 16379149, 9017420, 7952575, 12839760, 12437329, -1369471, -21039732, -30202310, -22167149, -6368142]
40615f368142J0568841K427422J99603K462822L230933L70086l703491n839550
40607C348524m563856q93366K125152K384907J338137J571250K247898K26100
40599G784746l979004n196745n79135N187246M675221k901156r500157o694796
40591a1203780M052202J1379930O450231n566727j0686661l748394M918391M376516
40583b8292j480104j139280N914930Q475681J481852o327653o232695j596555
40575i32116k85121k460264l016496r34964J032249K474285M407920M859425J561803
40566F706721k933354m398487l170293k091516r26765J322128J581220k485183
40558f395529n232683N21312J0480139J2048733K295196o770617m972815K414296
$$ y = [-6368142, 4200699, 6628121, 6827724, 9290546, 12521479, 12891565, 9188074, 3348524, -1215332, -2108698, 16454, 2401361, 3739498, 5310748, 7558646, 7784746, 3805742, -1391003, -1970138, 3217108, 7892329, 4991173, -4508984, -11203780, -7151578, 4228352, 10678583, 5111856, -5574805, -9323199, -4404808, -28292, -1508396, -2647676, 3267254, 11742935, 13224787, 6897134, 664439, -932116, -1217237, -3677501, -6693997, -7628961, -6596712, -4122427, 285493, 5144918, 6706721, 3773367, -625120, -3795413, -5886929, -6813694, -5491566, -3910346, -6395529, -11628212, -11106900, -626761, 11421972, 13717168, 6946551, 1973736, 4388032]
40550D388032M053397r32709l729250J51215N409233N412602L68115m380847m971422
40541E768366k519055j182081l038286m949304k173722M524812Q374533N031218
40533I836481j430636l844228q58627K962286M055968K733670J23339l214852
40525A0363401n331801l828476o3815J255941j393351l528572j034413L398387
40517a62699L859778l00681l632133k003374K931281P186679Q513929N788405
40509B2181185j281658q881447r656574j582943O397439M016126n847862r677235
40501d332969j872113O881227M515771n484710r547087l064129M636867M597356
40493c669787m33995k328347M10361K280928J21985k590915j721543J066302J038214
$$ y = [4388032, 8441429, 7508720, 3779470, 3930685, 9339918, 14752520, 15120635, 10739788, 5768366, 3249311, 2067230, -971056, -5920360, -8094082, -3569270, 4805263, 9836481, 8405845, 4561617, 3702990, 6665276, 10721244, 13454914, 13578253, 10363401, 5031600, 1203124, 1139309, 2395250, 1001899, -2526673, -3561086, -162699, 3697079, 3396398, -235735, -2239109, 692172, 7878851, 16392780, 22181185, 20899527, 12018080, 2361506, 778563, 7176002, 11192128, 5344266, -4332969, -6205082, 676145, 5191916, -292794, -9839881, -12904010, -8267143, -3669787, -4103782, -6432129, -6021768, -3740840, -3618855, -6209770, -7931313, -6865011, -5826797]
40484e826797j725422j616830L484838O826300J604501p358151q449129p8212
40476a3138902O276934L191591j949579j33654M164806J648774m437363l027536
40468g404929N426451Q723241K723767k836315j808044r48179n367290p683286
40460i174584j239785O555649N622762j41971j41227M697322M378712k261715
40452H295163n515126j008335L956187K769678j567024l342744k140525l53896
40444A093378J151025J750924L75841j679537j628024M1327L09325o20262J35343
40435I29340J804408Q27166j465738L07569N575894O858408J526633l765217m152294
40426H446169l626007n970628o971282k463645L093695L851913K169541K728773
$$ y = [-5826797, -7552219, -9169049, -5684211, 1142089, 2746590, -4611561, -13060690, -13138902, -6861968, -3670377, -5619956, -5753610, -1588804, 59970, -4377393, -7404929, -1978478, 6744763, 9468530, 6632215, 4824171, 3875992, -1491298, -9174584, -10414369, -3858720, 1764042, 1622071, 1480844, 6178166, 10556878, 8295163, 2780037, 1771702, 5727889, 8497567, 6930543, 3587799, 1447274, 1093378, 2244403, 3995327, 4371168, 2691631, 1063607, 1104934, 1414259, 793997, 929340, 2733748, 3560914, 2095176, 2402745, 7978639, 14837047, 16363680, 12598463, 8446169, 4820162, -1150466, -8121748, -10585393, -7491698, -3639785, -1470244, 1258529]
40418A258529K814904k051918p391461n273974K164221N439949K681476J122606
40410G64332L647870M782653J833740n57083k68465k095055p500398r214265k591736
40401a1198407N296072N587167P76219l61959L102339M106210n5628l733828k194357
40392A323828J855144L336089J681119j61491o65820p47212r42961o5913K531970
40383H144753M461577K128078l974509p944954n253450O23098K425723o43902
40375c3586k155194J343787N300188M791674J415309j161519l033060m620977
40367A846622k756623L371515O827569J460898o975055p064803J833005Q514599
40359G057727O252221J050322L91407K135176L09465m218113n823648l488806
$$ y = [1258529, 4073433, 2021515, -5369946, -10643920, -8479699, -3039750, -358274, 764332, 4412202, 9194855, 11028595, 10471512, 10203047, 8107992, 607594, -8606671, -11198407, -5902335, -315168, 461051, 99092, 3201431, 7307641, 7252013, 3518185, 1323828, 3178972, 6515061, 8196180, 8034689, 7368869, 6621657, 5678696, 5612783, 8144753, 12606330, 14734408, 10759899, 2814945, -2438505, -1815407, 610316, -33586, -2188780, -844993, 4455195, 9246869, 10662178, 9500659, 6467599, 1846622, -910001, 2461514, 9289083, 10749981, 3774926, -3289877, -1456872, 7057727, 13309948, 14360270, 14751677, 16886853, 17196318, 12978205, 7154557, 3665751]
40351C665751j431921j715664j973245n50189Q11080M42965n56508m77200N15606
40342a269325J281466J353477O33412j016518k672131k236998Q32143L576280
40334D81806K589064r92908k174818J103310M511294L126539j459736l512360
40326C672191j445543P94122O35538R9895P65073O96876q98094q16976K522307
40317F025389M875724K261295k246375k977449j14431J751876J191119L28773
40309A1095921m67931k239882l073150l69798L242992K654191j298812k551906
40301F991625Q28955M432214N102133M119337K004673k697410p727552p413190
40293E640785j483145K900924J095137k996298m027750k493945j404143j195097
$$ y = [3665751, 2233830, 518166, -1455079, -2005268, -1194188, -751223, -1307731, -1784931, -1269325, 12141, 1365618, 1999030, 982512, -1689619, -3926617, -3094474, 481806, 3070870, 2077962, -96856, 1006454, 5517748, 8644287, 7184551, 3672191, 2226648, 3020770, 3656308, 3756203, 4521276, 5218152, 4320058, 3503082, 6025389, 10901113, 13162408, 10916033, 7938584, 7824153, 9576029, 10767148, 11095921, 10627990, 8388108, 5314958, 4945160, 8188152, 10842343, 9543531, 6991625, 7820580, 12252794, 17354927, 21474264, 23478937, 20781527, 13053975, 5640785, 4157640, 7058564, 8153701, 5157403, 1129653, -1364292, -2768435, -3963532]
40285c963532j545284l036920l688785O23592Q768154J3145044R749455L709693
40277B3761417R02833K77180j152148k364070k432575l695497n428694k065944
40269G802502N903305Q226720P71121m371882L274242J3170943Q092537p604473
40261C5265015j2768804j769534P568924K688845n777120m228996J730978p15556
40253B1993752q399375p227931M235654J1594043N464444o570518j1796828p269694
40245B023547Q40718O151961O138206J889150k257485j922995J475659J297328
40237A5636089m719142r190827m614792M601925O900290N7926n473651k431924
40229G65894K758928J532618k687877j666475K140051J18944n024988j513983
$$ y = [-3963532, -5508816, -8545736, -12234521, -11610929, -2842775, 10302269, 20051724, 23761417, 24664250, 24941430, 23789282, 21425212, 18992637, 15297140, 9868446, 7802502, 13705807, 21932527, 22703648, 18331766, 21606008, 34776951, 42869488, 35265015, 22496211, 20726677, 28295601, 30984446, 25207326, 20978330, 22709308, 21993752, 13594377, 6366446, 10602100, 22196143, 27660587, 21090069, 9293241, 2023547, 2864265, 9016226, 15154432, 17043582, 14786097, 12863102, 14338761, 15636089, 10916947, 1726120, -2888672, 1713253, 8613543, 8671469, 3197818, 765894, 3524822, 5057440, 2369563, 703088, 2843139, 2962083, -2062905, -3576888]
40221c576888R982900J3009398J73999j3152969j0414803K791847R540396O130462
40213A4484342J630161J38081j159869r74666L452405N695596k009446j1948650
40205I307954q843577N014521J0318820j85326j0830706p700568K314011O253469
40197E648598M211897K485782k437n667238q270645k185373N413547M381799j818437
40188D197493k016456M040355N787893o29513o628916m364845L194588P645668
40180A1226267N029331j025669l076077K278983Q693595O325282m038970j0023367
40172A5389375n058887J974950J609760j203751K271719P435405M140893m078215
40164B2481249m814107J676593K852474l484228m338811O217000J6013407J3604457
$$ y = [-3576888, 6406012, 19415410, 19589409, 6436440, -3978363, -1186516, 8353880, 14484342, 16114503, 16252584, 15092715, 14118049, 17570454, 23266050, 21256604, 9307954, 464377, 5478898, 15797718, 15612392, 4781686, -2918882, -604871, 5648598, 9860495, 12346277, 12343840, 6676602, -1594043, -3779416, 1634131, 6015930, 4197493, 2181037, 6221392, 12009285, 11379772, 4750856, 386011, 3580599, 11226267, 16255598, 15229929, 12153852, 14432835, 23126430, 29451712, 25412742, 15389375, 10330488, 12305438, 13915198, 12711447, 14983166, 22418571, 26559464, 22481249, 17667142, 19343735, 22196209, 18711981, 14373170, 20590170, 36603577, 50208034]
40156E0208034M584541J6353N8862n85245m17063M192730Q813607O682919J65766
40147G3720504l550411m352158o911380r847033p763743k361783q95494l801086
40139C4237416m268872j108225j324820o843036r169783l062006L483386R69034
40131A2913094o477398p344553l96730M286399J402455k633637j485181J420013
40123A684462M95225j741587K29735L830328J559126n656579p631974J36456Q898817
40114A804009Q995363L248467R72743K996839J611388n396683r788200m907966
40106d64040M281392Q181576N135001J300762K83392p93410m300119o745161l788431
40097C090962K280711M448953K97211m412059l436182J438027L212591j15359
$$ y = [50208034, 54792575, 54808928, 54867790, 54282545, 53865482, 58058212, 66871819, 73554738, 73720504, 70170093, 65817935, 58906555, 49059522, 41295779, 38933996, 38038502, 34237416, 29968544, 28860319, 27535499, 20692463, 11522680, 8460674, 11944060, 12913094, 6435696, -908857, -1305587, 2980812, 4383267, 1749630, 264449, 1684462, 2179687, 438100, 667835, 4498163, 6057289, 400710, -7231264, -7094808, 1804009, 10799372, 14047839, 15020582, 18017421, 19628809, 14232126, 4443926, -464040, 3817352, 11998928, 17133929, 18434691, 18718083, 17924673, 13624554, 6879393, 3090962, 5371673, 9820626, 10117837, 5705778, 2269596, 3707623, 6920214, 6804855]
40089F804855k900777o17152L390232L410671J63414r73569J127841J973767o56074
40080A1723208k989443j567127J331333J838811O45747J045754L005670L407471
40072A8441424J354797p44539j535413k503688m304042m433824q23026M056255
40064I507944N358737J966969j738826j208128K408540L595148r905l492553m65932
40055A5921994P631069J1633151N786122m323010q457007m345772J084099K366716
40047B7297362J416061J301507N34548k102303k422564K910832Q621835P319871
40039D4877149K044537L119240J1840801J7248165J2745344O337100P838343J4235375
40031A20286054J6714791J5870301J8936541K5382440K6989397K1766317J6701644
$$ y = [6804855, 3904078, 3286926, 6677158, 10087829, 10251243, 9277674, 10405515, 12379282, 11723208, 8733765, 7166638, 8497971, 10336782, 10982529, 12028283, 15033953, 18441424, 19796221, 19051682, 17516269, 15012581, 10708539, 6274715, 5451689, 9507944, 14866681, 16833650, 15094824, 13886696, 16295236, 19890384, 19880479, 16387926, 15921994, 23553063, 35186214, 40972336, 36649326, 28192319, 23846547, 24930646, 27297362, 28713423, 30014930, 30549478, 28447175, 26024611, 28935443, 37557278, 44877149, 46921686, 50040926, 61881727, 79129892, 91875236, 98212336, 106050679, 120286054, 137000845, 152871146, 171807687, 197190127, 224179524, 245945841, 262647485]
40024B62647485J5265567J2567666N832971j883j320151j698315l875933m065714
40016B85351693K6123L191195J143948k455191m620981j0843173k4505406l5225513
40008B12062695l0491669j5816182r777873j8384858k7101673k2111605q406650
40001G9972185k71669k144737p095516r356367r733216r687607p270245j104046
39993C3308782N325720O252251J19249p879221j0670084o673739j100953N86277
39985A9268282j391314l133623k692858r76238J172389L221850L232977k51626
39977A8449839m614905n045720o89247L937039M433843J141753k312313l117251
39969A2183038j305135R96619J888278J500091Q62129l72312k430459k184659
$$ y = [262647485, 277913052, 290480718, 296313689, 296311806, 294991655, 293293340, 289417407, 285351693, 285377816, 288569011, 289712959, 287257768, 282636787, 271793614, 247288208, 212062695, 181571026, 165754844, 155976971, 137592113, 110490440, 88378835, 79972185, 79700516, 77555779, 70460263, 61103896, 51370680, 41683073, 34412828, 33308782, 38634502, 44886753, 45006002, 37126781, 26456697, 19782958, 18682005, 19268282, 17876968, 14743345, 12050487, 11074249, 12246638, 15468488, 18701465, 18449839, 13834934, 8789214, 8099967, 12037006, 16470849, 17612602, 15300289, 12183038, 10877903, 11874522, 13762800, 15262891, 16125020, 15752708, 13322249, 11137590]
39961A1137590L481715J0076315Q375772j439919o666802n4821P187100J226038
39953C3322988j1854135j3871143k444540N415818l8473p419676m015972M774354
39945C869221O496811J464416q70480J515613K664804P69205n93999j392761m765497
39936I157333q235556n118222M144279J0445969P994413J140991l034838l291969
39928A3202400k793516l571207n119535n698632l401258J868939O819910P414772
39920H721873L432671j425144l549463j897217K019150M477497K200835k542728
39912A1437474k707401L598129P847592K129727p769382q937726J35684P455803
39904A3189900N421915O27732J200873L650842K24498o860735q006587q10486
$$ y = [11137590, 14619305, 24695620, 33071392, 31631473, 24964671, 24909850, 32096950, 33322988, 21468853, 7597710, 5153170, 10568988, 10530515, 3110839, -905133, 3869221, 10366032, 11830448, 10959968, 12475581, 15140385, 15909590, 15315591, 13922830, 9157333, 921777, -4196445, -52166, 10393803, 18388216, 19529207, 16494369, 13202400, 10408884, 6837677, 1718142, -3980490, -7381748, -5512809, 1307101, 8721873, 12154544, 10729400, 7179937, 5282720, 7301870, 11779367, 13980202, 11437474, 8730073, 12328202, 20175794, 22305521, 14536139, 5598413, 5734097, 13189900, 18611815, 19239547, 20440420, 24091262, 24315760, 17455025, 9448438, 8637952]
39896H637952O434089O305203Q43387l118558k486666N82699K746807K610958
39888B2555871Q92006r70042k147327k403452j207683J639601M205942L480872
39880B6045788m71707l612046l027026p26771N3674r37J630263L761267K579068
39871B6231573j815055m330628j696510K970552M244506Q03567l880671n693158
39863A6834176l479296K55995J520341j116207m579934n052467l161198k506134
39855a284724l200279j270020M021860P037088L472923k529483l589390J075883
39847C733858N805829O595054L886392j126299o782998q189941j492518P841815
39839A0271192Q610884j046898r448231p217034m10387l91430o096777o411654
$$ y = [8637952, 15072041, 21377244, 22220631, 19102073, 16615407, 17198106, 19944913, 22555871, 23447877, 22477835, 20330508, 17927056, 16719373, 18358974, 22564916, 26045788, 25574081, 21962035, 18935009, 18208238, 18261912, 18260975, 19891238, 23652505, 26231573, 24416518, 20085890, 18389380, 21359932, 25604438, 26408005, 22527334, 16834176, 13354880, 13610875, 15131216, 14015009, 9435075, 4382608, 1221410, -1284724, -4485003, -5755023, -1733163, 5303925, 8776848, 6247365, 2657975, 3733858, 9539687, 16134741, 20021133, 18894834, 12111836, 3921895, 2429377, 10271192, 18882076, 17835178, 8386947, 1169913, 759526, 368096, -5728681, -12140335]
39831a2140335J875166R162797P616021J330477j966792j874736k552040m347176
39823b896618m288898j960570M74339K409719M560104N919123M841643K103437
39815A1162279m00953k572967m480422m004460m91074J396109k489191p050729
39807h931408k689491R535638J5473570N819358r629523j3395803k996422O603146
39799b10935L664565n771659q140088o54265P412322Q581803M763609R74378j451820
39790I167910k634807p94414M149568P153919L698850k803592m769308j196093
39782A1972033J139048j700386m966255l195339R85953J019335l597423o905190
39774e248224m918758M11440N356730P951091P122608K866257j608908k132566
$$ y = [-12140335, -10265169, -1102372, 6513649, 7844126, 5877334, 4002598, 1450558, -2896618, -7185516, -9146086, -8671747, -6262028, -1701924, 4217199, 9058842, 11162279, 10761326, 8188359, 3707937, -296523, -787597, 608512, -1880679, -8931408, -11620899, -2085261, 13388309, 19207667, 9578144, -3817659, -6814081, -210935, 3453630, -2318029, -10458117, -11112382, -3700060, 4881743, 9645352, 10619730, 9167910, 6533103, 5738689, 9888257, 17042176, 20741026, 17937434, 13168126, 11972033, 13111081, 11410695, 6444440, 3249101, 4235054, 5254389, 1656966, -5248224, -10166982, -9755542, -4398812, 3552279, 10674887, 13541144, 11932236, 9799670]
39766I799670M28015N19293l700011o784413m220557M0053n18384m420648m096537
39757a2953519K273316P506179N696643P0831k543610p20582J890103K621848
39749C841209J375180j488537m514116m188043O87217M813363J950783n456708
39741b979652q130308k806997K906209J797768k620882k546813J727736L316143
39733i336796Q39160O89691N749315R391908M982888l998114q745983o681371
39725g109302k393655J035391M985996R085528Q527799R81438p983931j0598766
39717c469502o011336q7294K509768K248130J328823M91958J41223J216712L126200
39708A494682L293038P68916j730382j682288r38132l050490p157400p987985
$$ y = [9799670, 10227685, 10746978, 7046967, 262554, -3958003, -3917950, -4436334, -8856982, -12953519, -10680203, -3174024, 2522619, 2593450, 49840, -670742, 1219361, 3841209, 5216389, 3727852, -786264, -4974307, -4287090, 526273, 2477056, -2979652, -11109960, -13916957, -11010748, -9212980, -11833862, -14380675, -12652939, -9336796, -8497636, -7807945, -2058630, 7333278, 12316166, 8318052, -427931, -7109302, -9502957, -8467566, -3481570, 5603958, 14131757, 15113195, 7129264, -3469502, -9480838, -9568132, -7058364, -4810234, -3481411, -2989453, -2848230, -1631518, 1494682, 4787720, 5556636, 3826254, 2143966, 1205834, -1844656, -9002056, -16990041]
39700a6990041k942709L540559N001623J256207j068830K812296Q818918Q433455
39692H861478j23311q718419r194839l125956J998004L539931M820319O547923
39684D605130M647890j493183n702493l707630Q71090L346710M441005M881945
39676A1890464Q80038p428684j0256688j412043Q565287N598373n407610o832556
39668d403419L575147Q562154o50380j0055651n697899M731007O220790L72856
39660B654605n07631M567478N520025K8045l210944j9169L412150J993950j378966
39651A3059543k687851k214540j236596r9996m73439l438108n601639l247081
39643e939707R15538J835692Q30819K261346L836178j10767o990483q189089k853087
$$ y = [-16990041, -19932750, -16392191, -11390568, -10134361, -11203191, -8390895, 428023, 8861478, 8738167, 19748, -9175091, -12301047, -10303043, -6763112, -1942793, 4605130, 9253020, 7759837, 2057344, -1650286, -779196, 2567514, 7008519, 11890464, 12770502, 5341818, -4914870, -6326913, 2238374, 7836747, 2429137, -4403419, -828272, 7733882, 7083502, -2972149, -8670048, -3939041, 2281749, 2654605, 2146974, 6714452, 12234477, 12262522, 9051578, 9032409, 12444559, 14438509, 13059543, 10371692, 8157152, 6920556, 6820560, 6347121, 2909013, -2692626, -5939707, -5024169, -3188477, -2357658, -96312, 3739866, 3629099, -3361384, -11550473, -14403560]
39634a4403560J266149J206910J670437L309690O37363n361780n396580K251409
39626a4819962O416111N32297o123163l292034M332886N985433J429637j657116
39618g195911n52602K103955N426415Q513964O634098j546904p712792m379002
39610A291221K947501M079504J14311l26775K658205R32176n515291o631655R25468
39601D74665P167444L871785l414595m605323R09131N812433N467528J241538
39593A6924606l461993n779850m340700j257557j061798m705826o948339k963909
39585a3595366M242750O696111J456885n199103m756422L581482J1344450R877242
39577A3648029L29703p343176o029921M33583L249376N39834j283571J909742
$$ y = [-14403560, -13137411, -11930501, -10260064, -6950374, -6313011, -11674791, -17071371, -14819962, -8403851, -7871554, -13994717, -17286751, -12953865, -6968432, -5538795, -7195911, -7748513, -5644558, -218143, 8295821, 14929919, 13383015, 5670223, 1291221, 4238722, 8318226, 8432537, 8105762, 10763967, 11696143, 6180852, -450803, 474665, 7642109, 11513894, 8099299, 3493976, 4403107, 10215540, 15683068, 16924606, 13462613, 7682763, 3342063, 2084506, 1022708, -3683118, -10631457, -13595366, -9352616, -2656505, -1199620, -6398723, -11155145, -7573663, 3770787, 13648029, 13977732, 6634556, 604635, 1038218, 4287594, 4827428, 3543857, 5453599]
39569E453599N176006J644756o539592r645542l211778N309406O184222M89311
39561D860388k142610J865169N060004J449528l430135j522194M167591M120058
39553A4427799k203775n469409j185481M304354M469980N69442l607913o772837
39545D532160p051431k119331M368731M954955L44805k52584N161068O331681
39537A6270054k121900r899746o579271K182641M967843K200653J188436J370707
39529I579417j814565m539221o80204M263723N81725p423189o593552L006903
39521c618963P754870L107669j71257M063896P302345K453073m275705n400164
39513A1215764l918611m484520l394989L103087R011507P075919J152511P94203
$$ y = [5453599, 10629605, 12274361, 5734769, -3910773, -7122551, -1813145, 4371077, 4860388, 2717778, 4582947, 9642951, 11092479, 7662344, 6140150, 10307741, 14427799, 12224024, 6754615, 5569134, 9873488, 14343468, 14912910, 11304997, 4532160, -2519271, -4638602, -269871, 4685084, 5029889, 4777305, 9938373, 16270054, 14148154, 4248408, -2330863, -148222, 4819621, 7020274, 8208710, 9579417, 7764852, 3225631, 2545427, 6809150, 7390875, -32314, -6625866, -3618963, 4135907, 7243576, 7072319, 11136215, 18438560, 20891633, 16615928, 11215764, 7297153, 2812633, -582356, 2520731, 11532238, 18608157, 19760668, 20554871]
39505B0554871P242679J2526511J0064650N62031j0065050j4411193q580298K544331
39497B0438532Q297564L796523m853758r102480p144886k404561J684485K627198
39489A3338617J38515j064470L927363J0362120P184326n735027j3404118n893897
39481H853429O312991P214245j536512m874721J925250P585661L867038k624264
39473B6723117l067001r03188m807486j2468126j1985105j17280J0187634O244410
39465I806975o288118j0701061k632083M849519K120955k945786K57631O772834
39457A240866N147217k351185l965799O67086P21711m943495m951773L096938
39449e338434O256127j344538o662480P50286J0175894O559120n493034r889724
$$ y = [20554871, 27797550, 40324061, 50388711, 50950742, 40885692, 26474499, 17894201, 20438532, 28736096, 32532619, 27678861, 18576381, 11431495, 9026934, 10711419, 13338617, 13477132, 12412662, 16340025, 26702145, 33886471, 28151444, 14747326, 8853429, 15166420, 22380665, 20844153, 15969432, 17894682, 25480343, 29347381, 26723117, 23656116, 22752928, 17945442, 5477316, -6507789, -6625069, 3562565, 9806975, 3518857, -7182204, -9814287, -4964768, -2843813, -5789599, -5531968, 1240866, 6388083, 4036898, 71099, 738185, 1459896, -3483599, -8435372, -5338434, 917693, -426845, -7089325, -6339039, 3836855, 10395975, 4902941, -4986783]
39441d986783l480234K955174L449989K328817L068940L867279L562866K551913
39433A3317961o22710n630285o656655p43325M523398J271876n090438l544355
39425c174533M833200Q789942M505415q34908k451930l149118m415080l402222
39417G00766m79116n9479k109585j622387J995315L496546J112241r30212o35865
39408A468224j125648l722900n290521l806961m72201L802550P985579Q428484
39400G266606L584668j186182j198989j079139o242325j0455135m770244M875792
39392i204948M823496l061277l239912O948515J1922345M262191k922245P66519
39384A0294684N370674j093119j1669607j2543333m529338K188483N275968P666221
$$ y = [-4986783, -8467017, -5511843, -2061854, 266963, 3335903, 7203182, 10766048, 13317961, 12695251, 7064966, 408311, -335014, 4188384, 5460260, 369822, -3174533, 1658667, 10448609, 14954024, 14119116, 11667186, 8518068, 4102988, 700766, 221650, 162171, -1947414, -3569801, -1574486, 1922060, 3034301, 2104089, 1468224, 342576, -3380324, -8670845, -12477806, -12950007, -9147457, -1161878, 7266606, 10851274, 9665092, 8466103, 7386964, 1144639, -9310496, -14080740, -9204948, -4381452, -7442729, -10682641, -3734126, 8188219, 12450410, 9528165, 10294684, 15665358, 14572239, 2902632, -9640701, -14170039, -11981556, -6705588, 960633]
39376I60633O199926j827970p424233j008205R849648R555900j504370p934952
39368F866377l527853J274461j734067o534827m736634J773161N915329N266307
39360D562254J803919k316276m864561l961345r29751J023767J787438L718459
39352H23904O018845M982743M54776l082868k950453j438958j490870k678124
39344F38995k308332J397193O550543P283637o1540q883521p173977N329112J3048663
39335A5820773N201504p817940r552094j432201K613928o4847J18557M120632
39327I008312J718627p443425r268806J335410R511009L008054q800785j0370642
39319a1302246k625181K742197K311540J012040l9515k929647m794976j659292
$$ y = [960633, 7160559, 5332589, -2091644, -3099849, 6749799, 16305699, 14801329, 6866377, 3338524, 4612985, 2878918, -3655909, -8392543, -6619382, -704053, 4562254, 6366173, 4049897, -814664, -4776009, -5705760, -4681993, -2894555, 823904, 6842749, 11825492, 12280268, 9197400, 6246947, 4807989, 3317119, 638995, -1669337, -272144, 6278399, 13562036, 13500496, 4616975, -2557002, 2772110, 15820773, 21022277, 13204337, 3652243, 2220042, 4833970, 4769123, 4887680, 9008312, 10726939, 3283514, -5985292, -4649882, 4861127, 7869181, -931604, -11302246, -13927427, -11185230, -8873690, -7861650, -7901165, -10830812, -15625788, -17285080]
39311a7285080L271466M837711M914066O688549N719926k085613q938636m603564
39303g481175O236264R589411L040389k678739k043787m56130r38547M80973L461320
39294I209979J303269n550152p013945K01381N933302K838319k333277j496483
39286C092393J491909n04859n044773n701146l153455j210589J616930P071854
39278b341736R876309N415692q74297j962618j535173o470574j1978407p720283
39270a7591087L769821R039732M214028m84994J025959J931438k769500n697716
39262f562319K41090Q481357Q259372J021932l008420j091062m68486m996483
39254A876981q518760m541020L769260P857819N135123J324666J506013L094691
$$ y = [-17285080, -14013614, -9175903, -4261837, 2426712, 8146638, 6061025, -2877611, -7481175, -1244911, 8344500, 11384889, 8706150, 6662363, 6206233, 5267686, 5748659, 9209979, 10513248, 4963096, -2050849, -1849468, 4083834, 6922153, 4588876, 3092393, 4584302, 4079443, -965330, -6666476, -9819931, -11030520, -9413590, -2341736, 7534573, 12950265, 12075968, 10113350, 8578177, 2107603, -9870804, -17591087, -13821266, -4781534, -567506, -1052500, -26541, 1904897, -864603, -6562319, -6321229, 2160128, 10419500, 11441432, 8433012, 7341950, 6873464, 1876981, -6641779, -11182799, -7413539, 444280, 5579403, 6904069, 8410082, 11504773]
39246A1504773P94171l975586m220500J314768M397535q98825q161317p317175
39238f562156L37157M446800J417328j768497m50180J016675r61610k045935J467913
39229c102505M552730J509534l392701j771917N500443R107235M504256l042248
39221A3864827p087435p177952n540526k003705M045567R238320P908806q46684
39213A2401218r777154r821359n86571Q133912P706858Q52956l576488l237587
39205B095785k952630m026994j918617L695987N848225J605497k020017O36420
39197B963656M519637K967319j011658j177222M52097j646621n234898m376086
39189b543776r33507q82103k151253J729584P683437O047573k434288o285754
$$ y = [11504773, 12298944, 8323358, 4102858, 5417626, 9815161, 8916336, 755019, -6562156, -6224999, -1778199, -360871, -2129368, -2579548, -1562873, -2524483, -4570418, -3102505, 1450225, 2959759, -432942, -2204859, 3295584, 12402819, 16907075, 13864827, 6777392, -400560, -5941086, -7944791, -3899224, 5339096, 13247902, 12401218, 2624064, -7197295, -7783866, 350046, 8056904, 8909860, 5333372, 2095785, -856845, -4883839, -6802456, -3106469, 2741756, 4347253, 2327236, 2963656, 7483293, 10450612, 9438954, 8261732, 8713829, 7067208, 1832310, -2543776, -3477283, -4359386, -6510639, -4781055, 2902382, 8949955, 6515667, 229913]
39181B29913j874933J638024m23571n96928M759608O281874k033486j0146714
39173b166213p707472j393293k239167m903133K943032J5906042J5284461j375062
39165A4349195j4076209r200697J954453K736865m260672m989334K391365O242028
39157d853006R88582n284489m334073J362897M963861N058873M264129K997871
39149E164645J56922k323825p76201M225104O938413L106230m248028p552299
39141D690961l197365L946904N713100J82083n758331m708467K057531O528378
39133I454794M420889k29089j983846j235960j429807k561344k174343q47622
39125C413672j255339k421495p81981K461109J459989m454832p422707j949408
$$ y = [229913, -1645020, -6996, -430567, -1027495, 3732113, 10013987, 7980501, -2166213, -9873685, -11266978, -13506145, -18409278, -15466246, 439796, 15724257, 14349195, 272986, -8927711, -6973258, -4236393, -8497065, -13486399, -11095034, -4853006, -3864424, -9148913, -13482986, -12120089, -7156228, -2097355, 2166774, 5164645, 5321567, 2997742, 2221541, 6446645, 13385058, 16491288, 12243260, 4690961, 1493596, 5440500, 11153600, 11335683, 5577352, 868885, 2926416, 9454794, 13875683, 13646594, 11662748, 10426788, 8996981, 6435637, 4261294, 3413672, 2158333, -263162, -1045143, 1415966, 2875955, -1578877, -9001584, -10950992]
39117a0950992O092568P240920J497261l059231k467089m70452l42610k62664
39109b722289J584315L169340K446449P43542l7383k19485n03104m72278m00389
39100C588718j290045j963642L4013L263247K728466k257465n429390k549043
39092c875141J399608p78725p303408r287802k822953O313713J0428902P921106
39084A995300K574808j392756k043299j23138J744495J794396J384732K583825
39076H518363L679833M88569o598756j0515384n869289K666333M885825j758213
39068d502719q042722m681100N335304J0730921O749763O4061k058392j075874
39060B519242j690621k622545K12587M300054K629960m677636q660450l591739
$$ y = [-10950992, -4858424, 2382496, 3879757, 820526, -1646563, -2117015, -2459625, -2722289, -1137974, 2031366, 4477815, 5221357, 5183974, 4964489, 4461385, 3989107, 3588718, 2298673, 335031, 369044, 3632291, 6360757, 4103292, -1326098, -3875141, -2475533, -3254258, -10557666, -19845468, -22668421, -16354708, -5925806, 1995300, 4570108, 3177352, 1134053, 1010915, 2755410, 4549806, 5934538, 8518363, 12198196, 12686765, 6088009, -4427375, -10296664, -7630331, -2744506, -4502719, -12545441, -17226541, -11891237, -1160316, 5589447, 5653508, 3595116, 2519242, 828621, -1793924, -1581337, 2718717, 5348677, 671041, -7989409, -11581148]
39052a1581148N769899J1656929J1741207P025505j734052j0559701j1835050
39045D83589m232815K214696j153250q172347o375461L976814J0183709O105755
39037C030690k71560p04006K341893L312350K973432L646429K514643k580435
39029A4263436o356981l490694J347538j99173o361319p275463m43538N354601
39021c161593L635459q58229r58882K008567J892611j872976l681458l76664M242285
39012H69120M231475j351237o829399n480675K612214R346511P598080K65079
39004A1261168l680728j460134R79189n43073k436491r44645J162311N65357j07033
38995D795921J873431K608910j558971n428117k542550K478584L24480o438661
$$ y = [-11581148, -5811249, 5845680, 17586887, 24612392, 22878340, 12318639, 483589, -3749226, -1534530, -2687780, -10860127, -17235588, -13258774, -3075065, 3030690, 2759130, 2055124, 4397017, 7709367, 10682799, 14329228, 16843871, 14263436, 7906455, 4415761, 5763299, 5564126, -797193, -8072656, -8516194, -3161593, 473866, -384363, -1343245, 665322, 2557933, 684957, -2996501, -3373165, 869120, 5100595, 3749358, -3080041, -8560716, -5948502, 3398009, 10996089, 11261168, 7580440, 6120306, 7099495, 6556422, 4119931, 3175286, 4337597, 4902954, 4795921, 6669352, 9278262, 7719291, 2291174, -251376, 2227208, 2551688, -3886973]
38987c886973n903150L450523Q845713K729550o314313q078900m588344j776304
38979a5522198J798338P965001J0002819K624736n995156m849985K218824K665414
38971I07793m286282p373523k437203K523182K861297L810219P583611P086384
38963A0675478j017976p992767n687715J148577L302039O48277j073839j102062
38955a099988k383463l586736j115502L203209M170014J563541l15864l03384
38947A31827j105415k985987k888036m9518K819689M247209N011612M319032K34861
38938I735274n097440n921097q68665L799761K246053k652020l105398K603941
38930G40409P208748L911557m341170q469639n201493q32111j338913l505754
$$ y = [-3886973, -9790123, -6339600, 2506113, 5235663, -1078650, -9157550, -13745894, -15522198, -13723860, -5758859, 4243960, 6868696, 873540, -3976445, -1757621, 907793, -3378489, -10752012, -13189215, -10666033, -7804736, -3994517, 3589094, 10675478, 9657502, 1664735, -4022980, -2874403, 427636, 1075913, 2074, -1099988, -3483451, -7070187, -8185689, -4982480, -812466, 751075, 435211, 131827, -973588, -3959575, -6847611, -6897129, -4077440, 169769, 5181381, 9500413, 9735274, 4637834, -1283263, -2151928, 1647833, 3893886, 1241866, -1863532, 740409, 7949157, 11860714, 7519544, -950095, -6151588, -6983699, -8322612, -11828366]
38922a1828366p33941N601808P778859L979666Q75397K183630K800736j308824
38914I348965m762739j075073O032451P642292K890838j008286q10587j117152
38906A7140709n121596q575920o082907J101657O632518N962762j34641o871393
38898D051189q985296m686904K765526Q022563Q064001L400260l275396q131751
38890A224192q150698m537699k215712l289051l528517J093087P088024P686114
38882d630260K638376j884726k512409j838239j996440j149414J746965L862258
38874e763889K884217N85129n65275j044078k029142k411988q01557J484428J928366
38865e733789K60127j241291l67020K546460M249920J731043k823859k486432
$$ y = [-11828366, -12562307, -6960499, 818360, 4798026, 5673423, 7857053, 10657789, 9348965, 4586226, 3511153, 9543604, 17185896, 20076734, 19068448, 18257861, 17140709, 12019113, 3443193, -2639714, -1538057, 5094461, 11057223, 10922582, 4051189, -4934107, -9621011, -6855485, 1167078, 9231079, 12631339, 9355943, 1224192, -6926506, -11464205, -13679917, -16968968, -20497485, -19404398, -12316374, -4630260, -1991884, -3876610, -6389019, -8227258, -10223698, -11373112, -9626147, -5763889, -2879672, -2294543, -2859818, -3903896, -5933038, -8345026, -9146583, -7662155, -5733789, -5473662, -6714953, -7081973, -4535513, -285593, 1445450, -1378409, -3864841]
38857c864841N486167J3268266J0544870j540861j0794583r333370k223013J369076
38849B911711o98722m640143o967818n179797K311670J1594601J3470982M427173
38841A7229657o726288r765613o475168n182910n744091q61793Q503915J1350346
38833B328055L589479m235243k414088L847968L996875j378430l617177j084710
38825A032729k18234k848026l220322R49663M049917K403743K63545J597507L055403
38816G065925N70975k960576k759047j78835P83663J021245L399184N496612K895626
38807A5334772k278841l959707k163515k226204m277285k453728L855580P013240
38799H844312K920588k249441j997693O73519p12220n476523p421356l818748
$$ y = [-3864841, 1621326, 14889592, 25434462, 23893601, 13099018, 3765648, 1542635, 2911711, 2212989, -2427154, -9394972, -14574769, -12263099, -668498, 12802484, 17229657, 10503369, 737756, -5737412, -10920322, -16664413, -17526206, -9022291, 2328055, 5917534, 1682291, -731797, 3116171, 7113046, 5734616, 2117439, 1032729, 814495, -2033531, -5253853, -4304190, -254273, 2149470, 2413015, 4010522, 7065925, 7636900, 4676324, 1917277, 1738442, 2522105, 3543350, 6942534, 12439146, 15334772, 13055931, 9096224, 6932709, 4706505, 429220, -2024508, 1831072, 8844312, 11764900, 9515459, 7517766, 8191285, 7479065, 2002542, -5418814, -9237562]
38791i237562K265956O059433M135655k938762q155544l642852P480152J1482133
38783G448609K071501q930480p316547L221292P372105R18908n297126l582041
38775d093779Q38285R42647j799551k852708k088066r33624J396461M219907L607924
38766g62504j208307m578883j973084L437625N762290M039742J051573j677141
38758D091311l529282k772179O75842K756240l40536o542737r653695n926739
38750b1241775K539517R386077Q487751j33753q205506o917223K124039Q151365
38742e809508M970061j918082m452031k405092n08666m76486j151698k448303
38734a4199805l665183j317449N751863J1915506J0963637M518570q37579k479839
$$ y = [-9237562, -6971606, -912173, 3223482, 284720, -7870824, -11513676, -4033524, 7448609, 9520110, 589630, -6726917, -3505625, 3866480, 4785388, -511738, -4093779, -3255494, -2312847, -4112398, -6965106, -9053172, -9986796, -8590335, -4370428, -762504, -1970811, -6549694, -8522778, -5085153, 677137, 4716879, 5768452, 4091311, 562029, -2210150, -1534308, 1221932, 881396, -5661341, -15315036, -21241775, -18702258, -9316181, -828430, -962183, -9167689, -16084912, -13960873, -5809508, -839447, -2757529, -7209560, -9614652, -10123318, -10599804, -11751502, -14199805, -17864988, -19182437, -13430574, -1515068, 9448569, 13967139, 13129560, 10649721]
38726A0649721k672164l090380l877265n873540q338539p001151j59986O303123
38718a4060181O613548M270592N329157O288357j55406r248906p870821M165773
38710d667887J0893914L791130n184105l209737L158784L25266q878695r888140
38702a3659470m38311O217429K589496l118726k141817K076480K271180r69675
38694g173414k777854k275611p94642K504661P094891Q188591L518800j539272
38686F746150j795702n13209k743318m998876p14250O848581P653200O28319m188436
38677F922459j365618K221644n9425l509100p15339N415117N893152n59327o317548
38668G926015o423589l936085k944609k469005J86691M046158N448783K829405
$$ y = [10649721, 7977557, 4887177, 1009912, -4863628, -13202167, -20203318, -20363304, -14060181, -7446633, -3176041, 2153116, 8441473, 8286067, -962839, -8833660, -4667887, 6226027, 10017157, 4833052, 1623315, 4782099, 5107365, -3771330, -13659470, -14097781, -7880352, -5290856, -8409582, -10551399, -8474919, -6203739, -7173414, -9951268, -12226879, -13021521, -10516860, -3421969, 4766622, 8285422, 6746150, 4950448, 4437239, 1693921, -3304955, -4019205, 2829376, 10482576, 11110895, 6922459, 5556841, 7778485, 7719060, 4209960, 3494621, 8909738, 14802890, 14243563, 7926015, 1502426, -2433659, -5378268, -7847273, -7660582, -3614424, 1834359, 4663764]
38660D663764j420970l538703k280298k19538n50829k557002k075633K547993
38652e431216P161442O503735O76437n219885o765062l638318J361917M629346
38644g21604M061843R50645j152507n32490J119950J982315K361238K227541k53842
38635A0043089n000140p610702m096092L722529J0147805J1011841N349902m763519
38627A8804713j3147234j2429106k427545P705901R953029O186033J988650k688854
38619A3945587r402711j2893073p128421K747229N403226j3281l011754J309904
38611i043294N684340M310791K127109M552179P133873L136324m912326r008578
38603C980418o997349l457807k030854k409966l047827k578482j23904L034175
$$ y = [4663764, 3242794, -295909, -2576207, -2795745, -3346574, -5903576, -7979209, -5431216, 1730226, 8233961, 8910398, 3690513, -3074549, -6712867, -5350950, -721604, 3340239, 4290884, 3138377, 2605887, 3725837, 5708152, 8069390, 10296931, 10043089, 5042949, -2567753, -6663845, -2941316, 7206489, 18218330, 23568232, 18804713, 5657479, -6771627, -9199172, -1493271, 8459758, 14645791, 16634441, 13945587, 4542876, -8350197, -15478618, -12731389, -7328163, -7341444, -10353198, -9043294, -3358954, 951837, 3078946, 7631125, 14764998, 17901322, 12988996, 3980418, -3016931, -6474738, -8505592, -10915558, -13963385, -16541867, -16665771, -13631596]
38595a3631596M179853L192548K645307K767792R46168k314566k725857K36705
38587d703646J628870q316P37808O000434Q591213K623662o279913q940358n417653
38578e767899j853792O71047M922608Q369292N173935l279596q491173o234577
38570f490155r53590J987969K307393J852123P59450j589654m516893n622809
38562a2266166j738416P194018J4098894R950067l603287j3011184r653072j299941
38554a0329087O27169j775756R15383P616053Q525696K698997j30456L643400
38546A1791399N936702J365454m571589o077568n299945n022044k891192J429861
38538c338922K444323j572698l548104R94308N411168K487035l607568m501459
$$ y = [-13631596, -9451743, -6259195, -3613888, -846096, 100072, -2214494, -4940351, -4703646, -3074776, -3083092, -2345284, 3655150, 12246363, 14870025, 8590112, -350246, -5767899, -7621691, -6950644, -2028036, 6341256, 11515191, 8235595, -255578, -6490155, -7443745, -5455776, -3148383, -1296260, -536810, -2126464, -6643357, -12266166, -14004582, -6810564, 7288330, 17238397, 13635110, 623926, -9029146, -10329087, -9701918, -11477674, -10562291, -2946238, 5579458, 8278455, 8147999, 11791399, 17728101, 19093555, 14521966, 8444398, 3144453, -1877591, -4768783, -3338922, -894599, -2467297, -6015401, -5021093, 390075, 2877110, -730458, -5231917]
38530e231917q51184Q40373J2446Q75688K448497j79967n492397n835409Q69279
38521a2544591P441533P368661K303327k219573l352307j334466K177561M178556
38513D018701K341592j321513k006190J268414L777895J550954l172401n209353
38505A248099l186129n51524n41712k166621j870895J426727M204142K588685
38497A150772j791437l095284M38851L001399n94476o030009m321155M941220
38489f300119J1399682P288322k212913o284359k584921J690904J565018L88928
38481D950542K243582M122740Q24303n493780p157090k366003J585293q73766
38473b164179m847048k028365O574280J1133626O013147l187049p281684m135589
$$ y = [-5231917, -6083101, -5242728, -5230282, -4354594, -1906097, -2086064, -7578461, -13413870, -12544591, -5103058, 2265603, 4568930, 2349357, -1002950, -2337416, -159855, 4018701, 6360293, 5038780, 3032590, 4301004, 8078899, 9629853, 6457452, 1248099, -1938030, -2489554, -3031266, -5197887, -7068782, -5642055, -1437913, 1150772, -640665, -3735949, -3297098, -295699, -890175, -6920184, -11241339, -6300119, 5099563, 12387885, 10174972, 3890613, 1305692, 2996596, 4561614, 4950542, 7194124, 11316864, 12141167, 6647387, -509703, -2875706, -1290413, -2164179, -7011227, -9039592, -2465312, 8668314, 14681461, 11494412, 4212728, 77139]
38465G7139R09806K587535P75799j012231r1624K535447L274087K40349l923641
38456E372666m926557k219007N68347P04872o18029j126165p30567l92988N0740
38447c316688Q09175N35066j696347l759520k547470J346908L576315J564994
38439c487567j997395k856825q86735M45872k45319m89485J093172J733350n12504
38430g203436j797309K428012Q798930Q824458J055415n865339m843719P27850
38422B124862L287422J151706k179868m124967l524499O03416N540220M545109
38414G423401l886626j0882152q293459n00700L097198K880537N771089J0344104
38406E953392P890125j631865p419705m177650Q64249R29211j136320j187056
$$ y = [77139, 986945, 3574480, 4350279, 3338048, 3246424, 5781871, 9055958, 9296307, 5372666, 446109, -1772898, -1204551, -499679, -1117708, -2243873, -2974440, -3367428, -3316688, -2507513, -1972447, -3668794, -7428314, -9975784, -8628876, -5052561, -3487567, -5484962, -8341787, -9228522, -8782650, -9027969, -9517454, -8424282, -6690932, -7203436, -9000745, -6572733, 2226197, 11050655, 12106070, 6240731, 1397012, 2124862, 5412284, 6563990, 4384122, 259155, -3265344, -2661928, 2878292, 7423401, 3536775, -7345377, -15638836, -16139536, -13042338, -10161801, -4390712, 5953392, 13843517, 12211652, 4791947, 614297, 1478546, 2407757, 1271437, 84381]
38398H4381r62064j670588j64892K931727J264159m920509n345299L329454Q386227
38389B932596N0713j0443213o146567R078868J5428542N848584o052271p796783
38381B900469l106758p45618m45094K650378P239448P478564K141321l670724
38373A4441986n352375l906306l401910m531913l019710L302796Q188599L932266
38365I653433n563068p580324N79867N905472n90603r018997o051741L922665
38357h743296O912665K052856J82024L091385J482810o033435q811537k433734
38349a2300262M229557N130605N823118R823825R918739J432392p602237q645853
38341G809884m996113l103666j268419L381393N683789R83353m584240l221559
$$ y = [84381, -877683, -2548271, -2713163, 218564, 1482723, -3437786, -8783085, -5453631, 2932596, 2983309, -7459904, -13606471, -4527603, 10900939, 16749523, 10697252, 2900469, -206289, -951907, -1397001, 1253377, 8492825, 15971389, 18112710, 14441986, 9089611, 5183305, 1781395, -2750518, -5770228, -2467432, 5721167, 9653433, 4090365, -3489959, -2910092, 2995380, 2404777, -6614220, -12665961, -8743296, -1830631, 222225, 404249, 3495634, 4978444, -1054991, -9866528, -12300262, -8070705, -2940100, 2883018, 12706843, 22625582, 24057974, 16455737, 7809884, 2813771, -289895, -1558314, 1823079, 7506868, 8490221, 3905981, 684422]
38333F84422J510631J570365j732306k198129j527655n015091q534132l495823
38325a8737718O941554J0246992L546751k518961r61430K598996J766058p94576
38317B087666o16643M09055r71115l074940l339260k954985k839721n99581L851403
38308h048121N298742J259449k187267R27928O017064L716248n766071j1777204
38300a0559232p382279K070877P037691N595663L302533L892979M781064K173304
38292A0912600k945169o242245n709596l124659m51320K077335L876116L438928
38284A831990J414577J011394L008545L574952K77336k905003j141125L025995
38276A0098661K773622k394821n285962j581453L565131K530556m460645r437018
$$ y = [684422, 2195053, 3765418, 2033112, -165017, -1692672, -6707763, -15241895, -18737718, -11796164, -1549172, 1997579, -521382, -1482812, 1116184, 2882242, 2087666, 1471023, 1880078, 908963, -2165977, -5505237, -8460222, -11299943, -11899524, -8048121, -2749379, -1489930, -3677197, -2749269, 3267795, 6984043, 1217972, -10559232, -17941511, -15870634, -8832943, -3237280, 65253, 3958232, 8739296, 10912600, 7967431, 1725186, -3984410, -7109069, -7560389, -5483054, -1606938, 1831990, 3246567, 4257961, 7266506, 10841458, 11118794, 8213791, 7072666, 10098661, 12872283, 10477462, 5191500, 3610047, 7175178, 9705734, 5245089, -4191929]
38268d191929o224526K230113O771484K478019m714056m685829L175513Q141500
38260B980289L312179l519791j492074N679522M760905n416237j0357486j700468
38252e753161R367121Q423565j650159o948034l538634k56627k297079l854840
38244f507848L60478N705907M939179r37049m875880l639216j38138K665464M997005
38235B569902O704164N005030j113726o816094o153829o58820J558869k863096
38227a767600o969337l480558L811453N446172Q81181j023769L131604N316515
38219E345661p07927q285507p092669J881851Q467888P327710K094733k793277
38211F238463o438253p486905l343316M290806Q666660N710377j126152n761230
$$ y = [-4191929, -10416455, -8186342, -1414858, 1063161, -3650895, -8336724, -5161211, 2980289, 6292468, 2772677, 1280603, 6960125, 11721030, 6304793, -4052693, -5753161, 3613960, 12037525, 10387366, 3439332, -99302, -355929, -2653008, -6507848, -6147370, -441463, 4497716, 3560667, -1315213, -4954429, -5092567, -2427103, 2569902, 9274066, 14279096, 13165370, 6349276, 195447, -463373, 1095496, -1767600, -8736937, -12217495, -8406042, -2959870, -2078689, -3102458, 29146, 5345661, 4637734, -3647773, -10740442, -8858591, -390703, 6937007, 9031740, 6238463, -199790, -7686695, -11030011, -6739205, 1927455, 7637832, 6511680, 750450]
38203G50450n933024l005355J244411N081475O395192M450519J120040j078809
38195I024899j402245p51845l28278r16837k316421l115060k145627k57158N41054
38186a667518l53145j582602j607434M6866K697058M441385L201773n37922l117816
38177A520645j793522J543967K802836Q24162k052454l395853k392294N22641
38169b419872L344241L367030P78123q66381m76782k141632p542578r915188k942769
38160a8815808P275639Q737335J421057k164477L506815Q314429L077946n542161
38152E810775n878591N15498K574160k317648n533387j861353L421541M253403
38144I84398K166260J334381J483061j0218k955008n006546m950133k855966O09650
$$ y = [750450, -5182574, -8187929, -6943518, -1862043, 4533149, 8983668, 10103708, 9024899, 7622654, 6870809, 6542531, 5625694, 3309273, 194213, -1951414, -2208572, -1667518, -2020663, -3603265, -5210699, -5163833, -2466775, 1974610, 5176383, 4638461, 1520645, -272877, 1271090, 4073926, 4898088, 2845634, -550219, -2942513, -2419872, 924369, 4291399, 5069522, 4203141, 3726359, 1584727, -5957851, -15873039, -18815808, -11540169, -2802834, -1381777, -3546254, -39439, 8274990, 11352936, 5810775, -67816, 447682, 3021842, 704194, -4829193, -6690546, -3269005, 984398, 3150658, 4485039, 5968100, 5957882, 3002874, -2003672, -6953805, -9809771, -9200121]
38135i200121L148872J958500j950812l473115j06151L851684L189309n44163
38127c125997j672992P03859J833272l01293j461956J357481M094326K009160
38119C435860j914314j499339J647106j94921p350054r727516j746193P491566
38111i857805O434742j981236n001633J125594P282946O470000K355546J52742
38103F980896j508892m502748m979751p8897M881133L354627k069523l591884
38095a515039r4759K202230J04797k542993k070454l25279o29969k505138l029293
38086a0405897j146491J598832L580796M623194M902919L487076l81718m250958
38078B007753l577209J518257L729224k011222q979002o311819M315599R459055
$$ y = [-9200121, -6051249, -4092749, -6043561, -9516676, -9622827, -5771143, -2581834, -3125997, -4798989, -4095130, -2261858, -2563151, -4025107, -2667626, 1426700, 3435860, 1521546, 22207, 1669313, 1474392, -5875662, -15603178, -17349371, -9857805, -3423063, -5404299, -10405932, -9280338, -1997392, 4472608, 6828154, 6980896, 5472004, 969256, -4010495, -4089392, 791741, 4146368, 2076845, -1515039, -1609798, 592432, 697229, -1845764, -3916218, -4241497, -4871466, -7376604, -10405897, -11552388, -9953556, -6372760, -1749566, 3153353, 6640429, 6258711, 2007753, -1569456, -51199, 3678025, 1666803, -7312199, -13624018, -9308419, 150636]
38070A50636L521335l307211k005831J647605o28993l948384M67796P756490O108909
38061I762352k888910o210389p81869K743723o38621k708036J436493L873115
38053D587858j387216o593164k924914M664711N641151k02490n022648n619564
38045f856276m367504j903190J948566L467670m6320l699929j714651K406216
38037a0765418J385269k840873j701094N486967R798373O244737l40101m460560
38029B807300o048038n276612l63686N971703O399199J3201m202110l93544M877334
38020C784747L028987l251673n268317k148883l00343j620819j587107J281491
38012f081917K744154R08746n55433O11485J686333Q29200L38701J176424L14862
$$ y = [150636, 3671971, 364760, -1641071, 6534, -622459, -4570843, -4103047, 3653443, 9762352, 6873442, 663053, -118816, 2624907, 1986286, -721750, 714743, 4587858, 3200642, -3392522, -6317436, -1652725, 3988426, 3785936, -1236712, -6856276, -11223780, -13126970, -11178404, -7710734, -7757054, -11456983, -13171634, -10765418, -9380149, -12221022, -13922116, -8435149, 1363224, 7607961, 7267860, 2807300, -3240738, -8517350, -8881036, -2909333, 3489866, 3503067, -699043, -1092587, 3784747, 6813734, 3562061, -1706256, -3855139, -4155482, -5776301, -7363408, -6081917, -3337763, -2429017, -2984450, -2372965, -686632, 142568, 481269, 1657693, 1972555]
38003A972555k891952l675236L18743L868337K315141n43621N99937K690254j51788
37994D502370m800345k911382M576690P177846M94746p521033q965016n923058
37986a3369182l796584k414134Q36586M965080P600236Q517880P132176J816228
37978A1288286m779551o142069j742965O01305k985067n835390k632888R31646
37970a1296693j138810l500904O20049N665151K931876k765702o22786O235751
37962c872068N016577m120572p289353k26892N169663K018697r52769K754094
37954a502623N028115j106700p082243k647686O347702P296423M89917l568752
37946C254153j524984M38067j109237k880777k182942N5577K508127L550287P10693
$$ y = [1972555, -919397, -4594633, -4275890, -407553, 1907588, 1363967, 1963904, 4654158, 4502370, -297975, -3209357, 1367333, 8545179, 9039925, 1518892, -7446124, -13369182, -17165766, -19579900, -18743314, -13778234, -6177998, 2339882, 9472058, 11288286, 6508735, 366666, -1376299, -774994, -3760061, -9595451, -12228339, -11296693, -12435503, -15936407, -15316358, -9651207, -6719331, -9485033, -10107819, -3872068, 1144509, -2976063, -10265416, -10492308, -5322645, -3303948, -4256717, -1502623, 3525492, 2418792, -4663451, -7311137, -963435, 6332988, 6822905, 3254153, 1729169, 2167236, 1057999, -1822778, -4005720, -3950143, -1442016, 2108271, 2818964]
37937B818964m289082m129065L736209J0031936N284352n562081r570820m135662
37929e815249J123496j76266l686516l403821J64656L285151M252812L135762
37921a119975O72968j259872j321852p84164j064849o87212J823341M120261L234508
37912C613154N02961q51708p48011p75400n54766K37259k77285j844176r9421
37903g97393N706537Q301566K617467m914604n647007k190485k670397n956202
37895e550518m442676R85506J566599l926730o741979k625728K634090M409436
37887a3692000N176230O333491M392661r07096l874299j925407R55673K378211
37879a162536M101957M337375j645733r868286q702839K877857J0406546N037852
$$ y = [2818964, -1470118, -5599183, -1862974, 8168962, 13453314, 7891233, -1679587, -5815249, -4691753, -4868019, -8554535, -11958356, -11793700, -8508549, -4255737, -1119975, -447007, -1706879, -3028731, -3812895, -4877744, -5564956, -3741615, 378646, 3613154, 4116115, 3264407, 2516396, 1740996, 1186230, 1423489, 1146204, -697972, -797393, 4909144, 13210710, 15828177, 10913573, 5266566, 3076081, 405684, -5550518, -9993194, -9007688, -7441089, -11367819, -18109798, -20735526, -18101436, -13692000, -8515770, -2182279, 2210382, 1303286, -2571013, -4496420, -3540747, -1162536, 2939421, 7276796, 5631063, -4237223, -12940062, -10062205, 344341, 5382193]
37871E382193k542127J82086P027953M196351o005330q677671m37486N891827
37863E017796J848717n389306o482789l149680j521877j065028J870695M969455
37855c902017L053475j954678k458722K733950N246762m91826p841641p011510
37847a2626207M79050M514464K009000M8598K066644J958261k921135m170552
37839h641877L181031Q891498K954020n618675j796311R191210Q147425o485324
37831I822997j4517891n797115M752108K902743l393925j722344K247081k692706
37823h399052j0338790o229872O996624J2455629M874557l404096k660699K724799
37815c980900N166638L799008M45988m183249p145759m354270K400765O304920
$$ y = [5382193, 2840066, 3022152, 10050105, 14246456, 8241126, -436545, -874031, 5017796, 6866513, 1477207, -5005582, -8155262, -9677139, -10742167, -8871472, -3902017, -848542, -2803220, -5261942, -2527992, 2718770, 2226944, -5614697, -12626207, -12147157, -7632693, -5623693, -5575095, -3508451, -1550190, -4471325, -8641877, -5460846, 3430652, 6384672, 765997, -1030314, 8160896, 16308321, 9822997, -4694894, -10492009, -5739901, -2837158, -6231083, -7953427, -5706346, -8399052, -18737842, -24967714, -17971090, -5515461, -640904, -4045000, -6705699, -3980900, 1185738, 4984746, 5430734, 1247485, -5898274, -10252544, -7851779, -1546859]
37807a546859M807634J704745m04980k766480n002037m003618M71906M834967
37799a904722O687852N694765P74048p157445j1328364n865470M365923Q680627
37791e2786M801012o5437j592574k294306l072450j199612J779080N21067l434024
37782d610030k084181M791166P038390N00987n396895l034715J437598P2189l088578
37773d374069q51924K956062N12217m905589m023888J961730L484045m60790j141969
37764f844175L498948M983556J76838k131441L244824P657609L044982l278185
37756A0352956l50979O501384K203895j2998044k0351127r127584O682723P733590
37748i353186l539833p948578J862241J2009824R191550o58595l426677K122390
$$ y = [-1546859, 3260775, 4965520, 4560540, 1794060, -3207977, -7211595, -6739689, -1904722, 4783130, 10477895, 11251943, 4094498, -7233866, -13099336, -8733413, -52786, 4748226, 4682789, 3090215, 795909, -2276541, -3476153, -1697073, -1176006, -4610030, -6694211, -1903045, 5135345, 5636332, 239437, -2795278, -1357680, -1285491, -4374069, -5225993, -2269931, -1757714, -6663303, -10687191, -8725461, -5241416, -5702206, -6844175, -3345227, 1638329, 1815167, -316274, 2928550, 10586159, 13631141, 10352956, 10001977, 16503361, 18707256, 5709212, -14641915, -23769499, -17086776, -9353186, -12893019, -20841597, -18979356, -6969532, 2222018, 1563423, -1863254, 259136]
37740B59136N310937J675534j777074k33487J007022k944718o777435l249482
37732f729567M240091O152267J441971j473784J256930L088447j154894n713242
37724A108219k795809M340931N763229L4039m128117k021482K84270k941622p137850
37715g494192m898072K205983O557277N643489K826635l59197m478330o254652
37707f251059j473044N804576O169362r84655n388742j438179L352429Q44850
37699F35538n199551o338476k298371J548109L969291O351879N861293k94523
37691D235189o601918m975038K531332N973709J983397l055563m335274l733182
37683g977348k444097J818087P363447P415802R70898l187598J093805P571847
$$ y = [259136, 5570073, 7245607, 5468533, 5235046, 6242068, 3297350, -3480085, -6729567, -2489476, 3662791, 5104762, 3630978, 4887908, 7976355, 6821461, 1108219, -1687590, 2653341, 8416570, 8450609, 4322492, 2301010, 2585280, -356342, -7494192, -12392264, -10186281, -3629004, 2014485, 4841120, 4481923, 3593, -6251059, -7724103, -1919527, 4249835, 3265180, -2123562, -3561741, -209312, 635538, -4564013, -10902489, -13200860, -11652751, -7683460, -1331581, 4529712, 4235189, -2366729, -7341767, -4810435, 1163274, 3146671, 91108, -4244166, -7977348, -10421445, -8603358, -1239911, 6175891, 7146789, 3959191, 5052996, 12624843]
37675A2624843O657595r40865o540987n993630k918572j108369j87965R51883
37667B543933J515690R98269P78970J950319L193576K039783k052377o234305
37659D733858o437975j917595K886304K807183j767453n215235l683782M77385
37651h117310K258440Q2813k949328k895237Q08115M570357M304572L89194k210758
37642c759142q1581M003077M802162J487846k019999k533373m57407J983790K565676
37633E991049J43564l281725l134633J846032O249091M515297j263932m797963
37625F266780m606263l759986k721605K44400K590989j34297m949434l434773
37617a0504189M697596Q946329K995785n813311p527028l018636L87650R91496
$$ y = [12624843, 19282438, 18341573, 11800586, 5806956, 2888384, 1780015, 1592050, 2543933, 4059623, 5057892, 5836862, 7787181, 10980757, 13020540, 10968163, 4733858, -1704117, -3621712, -735408, 2071775, 304322, -4910913, -8594695, -8117310, -5858870, -5776057, -8725385, -11620622, -10812507, -6242150, -1937578, -1548384, -3759142, -3840723, 162354, 4964516, 6452362, 4432363, 1898990, 1441583, 3425373, 5991049, 6134613, 2852888, -281745, 1564287, 7813378, 12328675, 11064743, 6266780, 1660517, -2099469, -4821074, -4576674, -1985685, -2119982, -7069416, -10504189, -5806593, 3139736, 6135521, 322210, -7204818, -10223454, -9835804, -8844308]
37609h844308K277740L730799P48063o210981r452306l646521O362814J0636417
37601d398283N945580m92268n97003L578004L127138l452857o719012j123039
37593d131740M796399J772443l752057L49093R616355P477620p206437j4930444
37585f008768m176872J0886698J1552179J99079p599637o377892k627797l51569
37577d504579J785702K767424K86216k929007k967556j832035k808962l279645
37569a3482442k18327K673998K006509K317422O787935P909298k89051q109265
37561d03923l303898P598578Q193786j464390o189297j895118l63218n823580
37553c651060p136605R83529P850355N913442K615956L670703J278868q905336
$$ y = [-8844308, -6566568, -2835769, -2087706, -8298687, -17750993, -21397514, -15034700, -4398283, 1547297, 1055029, 458026, 4036030, 7163168, 3710311, -3008701, -4131740, 664659, 2437102, -1314955, -965862, 8650493, 16128113, 8921676, -6008768, -10185640, 701058, 12253237, 12452316, 4852679, -1525213, -4153010, -4504579, -2718877, 48547, 334763, -2594244, -5561800, -7393835, -10202797, -13482442, -13700769, -11026771, -9020262, -6702840, 85095, 7994393, 7705342, -403923, -3707821, 3890757, 12084543, 10620153, 4430856, 2535738, 2172520, -3651060, -10787665, -9804136, -1953781, 3959661, 6575617, 10246320, 11525188, 2619852]
37545B619852j4385438m359035J0380246J2138854K046033m933188l903280k407870
37537b803826l058960n96287M325658L777631k884002o060525j072768M495974
37529c877105K988811k622272n147782l402635q00940J418178M370325P362814
$$ y = [2619852, -11765586, -16124621, -5744375, 6394479, 8440512, 3507324, -395956, -2803826, -5862786, -6459073, -2133415, 1644216, -1239786, -7300311, -8373079, -3877105, -888294, -3510566, -8658348, -12060983, -12861923, -11443745, -7073420, 289394]
$$ [...]
##END NTUPLES=NMR SPECTRUM
##END=
